lucene-dev mailing list archives

Site index · List index
Message view « Date » · « Thread »
Top « Date » · « Thread »
From Policeman Jenkins Server <jenk...@thetaphi.de>
Subject [JENKINS] Lucene-Solr-5.x-MacOSX (64bit/jdk1.8.0) - Build # 2152 - Failure!
Date Sun, 19 Apr 2015 20:27:45 GMT
Build: http://jenkins.thetaphi.de/job/Lucene-Solr-5.x-MacOSX/2152/
Java: 64bit/jdk1.8.0 -XX:-UseCompressedOops -XX:+UseG1GC

1 tests failed.
FAILED:  org.apache.solr.client.solrj.impl.CloudSolrClientTest.test

Error Message:
Error from server at http://127.0.0.1:58892/checkStateVerCol: no servers hosting shard: 

Stack Trace:
org.apache.solr.client.solrj.impl.HttpSolrClient$RemoteSolrException: Error from server at http://127.0.0.1:58892/checkStateVerCol: no servers hosting shard: 
	at __randomizedtesting.SeedInfo.seed([8D862054902A223F:5D21F8E3ED64FC7]:0)
	at org.apache.solr.client.solrj.impl.HttpSolrClient.executeMethod(HttpSolrClient.java:560)
	at org.apache.solr.client.solrj.impl.HttpSolrClient.request(HttpSolrClient.java:235)
	at org.apache.solr.client.solrj.impl.HttpSolrClient.request(HttpSolrClient.java:227)
	at org.apache.solr.client.solrj.SolrRequest.process(SolrRequest.java:135)
	at org.apache.solr.client.solrj.SolrClient.query(SolrClient.java:943)
	at org.apache.solr.client.solrj.SolrClient.query(SolrClient.java:958)
	at org.apache.solr.client.solrj.impl.CloudSolrClientTest.stateVersionParamTest(CloudSolrClientTest.java:554)
	at org.apache.solr.client.solrj.impl.CloudSolrClientTest.test(CloudSolrClientTest.java:127)
	at sun.reflect.NativeMethodAccessorImpl.invoke0(Native Method)
	at sun.reflect.NativeMethodAccessorImpl.invoke(NativeMethodAccessorImpl.java:62)
	at sun.reflect.DelegatingMethodAccessorImpl.invoke(DelegatingMethodAccessorImpl.java:43)
	at java.lang.reflect.Method.invoke(Method.java:497)
	at com.carrotsearch.randomizedtesting.RandomizedRunner.invoke(RandomizedRunner.java:1627)
	at com.carrotsearch.randomizedtesting.RandomizedRunner$6.evaluate(RandomizedRunner.java:836)
	at com.carrotsearch.randomizedtesting.RandomizedRunner$7.evaluate(RandomizedRunner.java:872)
	at com.carrotsearch.randomizedtesting.RandomizedRunner$8.evaluate(RandomizedRunner.java:886)
	at org.junit.rules.ExpectedException$ExpectedExceptionStatement.evaluate(ExpectedException.java:110)
	at org.apache.solr.BaseDistributedSearchTestCase$ShardsRepeatRule$ShardsFixedStatement.callStatement(BaseDistributedSearchTestCase.java:960)
	at org.apache.solr.BaseDistributedSearchTestCase$ShardsRepeatRule$ShardsStatement.evaluate(BaseDistributedSearchTestCase.java:935)
	at com.carrotsearch.randomizedtesting.rules.SystemPropertiesRestoreRule$1.evaluate(SystemPropertiesRestoreRule.java:57)
	at org.apache.lucene.util.TestRuleSetupTeardownChained$1.evaluate(TestRuleSetupTeardownChained.java:50)
	at org.apache.lucene.util.AbstractBeforeAfterRule$1.evaluate(AbstractBeforeAfterRule.java:46)
	at org.apache.lucene.util.TestRuleThreadAndTestName$1.evaluate(TestRuleThreadAndTestName.java:49)
	at org.apache.lucene.util.TestRuleIgnoreAfterMaxFailures$1.evaluate(TestRuleIgnoreAfterMaxFailures.java:65)
	at org.apache.lucene.util.TestRuleMarkFailure$1.evaluate(TestRuleMarkFailure.java:48)
	at com.carrotsearch.randomizedtesting.rules.StatementAdapter.evaluate(StatementAdapter.java:36)
	at com.carrotsearch.randomizedtesting.ThreadLeakControl$StatementRunner.run(ThreadLeakControl.java:365)
	at com.carrotsearch.randomizedtesting.ThreadLeakControl.forkTimeoutingTask(ThreadLeakControl.java:798)
	at com.carrotsearch.randomizedtesting.ThreadLeakControl$3.evaluate(ThreadLeakControl.java:458)
	at com.carrotsearch.randomizedtesting.RandomizedRunner.runSingleTest(RandomizedRunner.java:845)
	at com.carrotsearch.randomizedtesting.RandomizedRunner$3.evaluate(RandomizedRunner.java:747)
	at com.carrotsearch.randomizedtesting.RandomizedRunner$4.evaluate(RandomizedRunner.java:781)
	at com.carrotsearch.randomizedtesting.RandomizedRunner$5.evaluate(RandomizedRunner.java:792)
	at com.carrotsearch.randomizedtesting.rules.StatementAdapter.evaluate(StatementAdapter.java:36)
	at com.carrotsearch.randomizedtesting.rules.SystemPropertiesRestoreRule$1.evaluate(SystemPropertiesRestoreRule.java:57)
	at org.apache.lucene.util.AbstractBeforeAfterRule$1.evaluate(AbstractBeforeAfterRule.java:46)
	at com.carrotsearch.randomizedtesting.rules.StatementAdapter.evaluate(StatementAdapter.java:36)
	at org.apache.lucene.util.TestRuleStoreClassName$1.evaluate(TestRuleStoreClassName.java:42)
	at com.carrotsearch.randomizedtesting.rules.NoShadowingOrOverridesOnMethodsRule$1.evaluate(NoShadowingOrOverridesOnMethodsRule.java:39)
	at com.carrotsearch.randomizedtesting.rules.NoShadowingOrOverridesOnMethodsRule$1.evaluate(NoShadowingOrOverridesOnMethodsRule.java:39)
	at com.carrotsearch.randomizedtesting.rules.StatementAdapter.evaluate(StatementAdapter.java:36)
	at com.carrotsearch.randomizedtesting.rules.StatementAdapter.evaluate(StatementAdapter.java:36)
	at com.carrotsearch.randomizedtesting.rules.StatementAdapter.evaluate(StatementAdapter.java:36)
	at org.apache.lucene.util.TestRuleAssertionsRequired$1.evaluate(TestRuleAssertionsRequired.java:54)
	at org.apache.lucene.util.TestRuleMarkFailure$1.evaluate(TestRuleMarkFailure.java:48)
	at org.apache.lucene.util.TestRuleIgnoreAfterMaxFailures$1.evaluate(TestRuleIgnoreAfterMaxFailures.java:65)
	at org.apache.lucene.util.TestRuleIgnoreTestSuites$1.evaluate(TestRuleIgnoreTestSuites.java:55)
	at com.carrotsearch.randomizedtesting.rules.StatementAdapter.evaluate(StatementAdapter.java:36)
	at com.carrotsearch.randomizedtesting.ThreadLeakControl$StatementRunner.run(ThreadLeakControl.java:365)
	at java.lang.Thread.run(Thread.java:745)




Build Log:
[...truncated 11367 lines...]
   [junit4] Suite: org.apache.solr.client.solrj.impl.CloudSolrClientTest
   [junit4]   2> log4j:WARN No such property [conversionPattern] in org.apache.solr.util.SolrLogLayout.
   [junit4]   2> Creating dataDir: /Users/jenkins/workspace/Lucene-Solr-5.x-MacOSX/solr/build/solr-solrj/test/J0/temp/solr.client.solrj.impl.CloudSolrClientTest 8D862054902A223F-001/init-core-data-001
   [junit4]   2> 2826 T12 oas.SolrTestCaseJ4.buildSSLConfig Randomized ssl (false) and clientAuth (false)
   [junit4]   2> 2946 T12 oas.BaseDistributedSearchTestCase.initHostContext Setting hostContext system property: /
   [junit4]   2> 2953 T12 oasc.AbstractZkTestCase.<clinit> WARN TEST_HOME() does not exist - solrj test?
   [junit4]   2> 3088 T12 oasc.ZkTestServer.run STARTING ZK TEST SERVER
   [junit4]   2> 3099 T13 oasc.ZkTestServer$2$1.setClientPort client port:0.0.0.0/0.0.0.0:0
   [junit4]   2> 3103 T13 oasc.ZkTestServer$ZKServerMain.runFromConfig Starting server
   [junit4]   2> 3404 T12 oasc.ZkTestServer.run start zk server on port:58847
   [junit4]   2> 3597 T12 oascc.SolrZkClient.createZkCredentialsToAddAutomatically Using default ZkCredentialsProvider
   [junit4]   2> 3790 T12 oascc.ConnectionManager.waitForConnected Waiting for client to connect to ZooKeeper
   [junit4]   2> 4435 T20 oascc.ConnectionManager.process Watcher org.apache.solr.common.cloud.ConnectionManager@1a9dd6aa name:ZooKeeperConnection Watcher:127.0.0.1:58847 got event WatchedEvent state:SyncConnected type:None path:null path:null type:None
   [junit4]   2> 4437 T12 oascc.ConnectionManager.waitForConnected Client is connected to ZooKeeper
   [junit4]   2> 4447 T12 oascc.SolrZkClient.createZkACLProvider Using default ZkACLProvider
   [junit4]   2> 4454 T12 oascc.SolrZkClient.makePath makePath: /solr
   [junit4]   2> 4528 T12 oascc.SolrZkClient.createZkCredentialsToAddAutomatically Using default ZkCredentialsProvider
   [junit4]   2> 4531 T12 oascc.ConnectionManager.waitForConnected Waiting for client to connect to ZooKeeper
   [junit4]   2> 4541 T23 oascc.ConnectionManager.process Watcher org.apache.solr.common.cloud.ConnectionManager@761c2158 name:ZooKeeperConnection Watcher:127.0.0.1:58847/solr got event WatchedEvent state:SyncConnected type:None path:null path:null type:None
   [junit4]   2> 4544 T12 oascc.ConnectionManager.waitForConnected Client is connected to ZooKeeper
   [junit4]   2> 4545 T12 oascc.SolrZkClient.createZkACLProvider Using default ZkACLProvider
   [junit4]   2> 4562 T12 oascc.SolrZkClient.makePath makePath: /collections/collection1
   [junit4]   2> 4573 T12 oascc.SolrZkClient.makePath makePath: /collections/collection1/shards
   [junit4]   2> 4581 T12 oascc.SolrZkClient.makePath makePath: /collections/control_collection
   [junit4]   2> 4587 T12 oascc.SolrZkClient.makePath makePath: /collections/control_collection/shards
   [junit4]   2> 4596 T12 oasc.AbstractZkTestCase.putConfig put /Users/jenkins/workspace/Lucene-Solr-5.x-MacOSX/solr/solrj/src/test-files/solrj/solr/collection1/conf/solrconfig.xml to /configs/conf1/solrconfig.xml
   [junit4]   2> 4631 T12 oascc.SolrZkClient.makePath makePath: /configs/conf1/solrconfig.xml
   [junit4]   2> 4651 T12 oasc.AbstractZkTestCase.putConfig put /Users/jenkins/workspace/Lucene-Solr-5.x-MacOSX/solr/solrj/src/test-files/solrj/solr/collection1/conf/schema.xml to /configs/conf1/schema.xml
   [junit4]   2> 4653 T12 oascc.SolrZkClient.makePath makePath: /configs/conf1/schema.xml
   [junit4]   2> 4663 T12 oasc.AbstractZkTestCase.putConfig skipping /Users/jenkins/workspace/Lucene-Solr-5.x-MacOSX/solr/solrj/src/test-files/solrj/solr/collection1/conf/solrconfig.snippet.randomindexconfig.xml because it doesn't exist
   [junit4]   2> 4664 T12 oasc.AbstractZkTestCase.putConfig skipping /Users/jenkins/workspace/Lucene-Solr-5.x-MacOSX/solr/solrj/src/test-files/solrj/solr/collection1/conf/stopwords.txt because it doesn't exist
   [junit4]   2> 4665 T12 oasc.AbstractZkTestCase.putConfig skipping /Users/jenkins/workspace/Lucene-Solr-5.x-MacOSX/solr/solrj/src/test-files/solrj/solr/collection1/conf/protwords.txt because it doesn't exist
   [junit4]   2> 4666 T12 oasc.AbstractZkTestCase.putConfig skipping /Users/jenkins/workspace/Lucene-Solr-5.x-MacOSX/solr/solrj/src/test-files/solrj/solr/collection1/conf/currency.xml because it doesn't exist
   [junit4]   2> 4668 T12 oasc.AbstractZkTestCase.putConfig skipping /Users/jenkins/workspace/Lucene-Solr-5.x-MacOSX/solr/solrj/src/test-files/solrj/solr/collection1/conf/enumsConfig.xml because it doesn't exist
   [junit4]   2> 4669 T12 oasc.AbstractZkTestCase.putConfig skipping /Users/jenkins/workspace/Lucene-Solr-5.x-MacOSX/solr/solrj/src/test-files/solrj/solr/collection1/conf/open-exchange-rates.json because it doesn't exist
   [junit4]   2> 4670 T12 oasc.AbstractZkTestCase.putConfig skipping /Users/jenkins/workspace/Lucene-Solr-5.x-MacOSX/solr/solrj/src/test-files/solrj/solr/collection1/conf/mapping-ISOLatin1Accent.txt because it doesn't exist
   [junit4]   2> 4671 T12 oasc.AbstractZkTestCase.putConfig skipping /Users/jenkins/workspace/Lucene-Solr-5.x-MacOSX/solr/solrj/src/test-files/solrj/solr/collection1/conf/old_synonyms.txt because it doesn't exist
   [junit4]   2> 4673 T12 oasc.AbstractZkTestCase.putConfig skipping /Users/jenkins/workspace/Lucene-Solr-5.x-MacOSX/solr/solrj/src/test-files/solrj/solr/collection1/conf/synonyms.txt because it doesn't exist
   [junit4]   2> 4812 T12 oas.SolrTestCaseJ4.writeCoreProperties Writing core.properties file to /Users/jenkins/workspace/Lucene-Solr-5.x-MacOSX/solr/build/solr-solrj/test/J0/temp/solr.client.solrj.impl.CloudSolrClientTest 8D862054902A223F-001/control-001/cores/collection1
   [junit4]   2> 5619 T12 oejs.Server.doStart jetty-8.1.10.v20130312
   [junit4]   2> 6126 T12 oejs.AbstractConnector.doStart Started SelectChannelConnector@127.0.0.1:58850
   [junit4]   2> 6128 T12 oascse.JettySolrRunner$1.lifeCycleStarted Jetty properties: {solr.data.dir=/Users/jenkins/workspace/Lucene-Solr-5.x-MacOSX/solr/build/solr-solrj/test/J0/temp/solr.client.solrj.impl.CloudSolrClientTest 8D862054902A223F-001/tempDir-001/control/data, hostContext=/, hostPort=58850, coreRootDirectory=/Users/jenkins/workspace/Lucene-Solr-5.x-MacOSX/solr/build/solr-solrj/test/J0/temp/solr.client.solrj.impl.CloudSolrClientTest 8D862054902A223F-001/control-001/cores}
   [junit4]   2> 6345 T12 oass.SolrDispatchFilter.init SolrDispatchFilter.init()sun.misc.Launcher$AppClassLoader@677327b6
   [junit4]   2> 6453 T12 oasc.SolrResourceLoader.<init> new SolrResourceLoader for directory: '/Users/jenkins/workspace/Lucene-Solr-5.x-MacOSX/solr/build/solr-solrj/test/J0/temp/solr.client.solrj.impl.CloudSolrClientTest 8D862054902A223F-001/control-001/'
   [junit4]   2> 7102 T12 oasc.SolrXmlConfig.fromFile Loading container configuration from /Users/jenkins/workspace/Lucene-Solr-5.x-MacOSX/solr/build/solr-solrj/test/J0/temp/solr.client.solrj.impl.CloudSolrClientTest 8D862054902A223F-001/control-001/solr.xml
   [junit4]   2> 7384 T12 oasc.CorePropertiesLocator.<init> Config-defined core root directory: /Users/jenkins/workspace/Lucene-Solr-5.x-MacOSX/solr/build/solr-solrj/test/J0/temp/solr.client.solrj.impl.CloudSolrClientTest 8D862054902A223F-001/control-001/cores
   [junit4]   2> 7629 T12 oasc.CoreContainer.<init> New CoreContainer 1323454553
   [junit4]   2> 7630 T12 oasc.CoreContainer.load Loading cores into CoreContainer [instanceDir=/Users/jenkins/workspace/Lucene-Solr-5.x-MacOSX/solr/build/solr-solrj/test/J0/temp/solr.client.solrj.impl.CloudSolrClientTest 8D862054902A223F-001/control-001/]
   [junit4]   2> 7631 T12 oasc.CoreContainer.load loading shared library: /Users/jenkins/workspace/Lucene-Solr-5.x-MacOSX/solr/build/solr-solrj/test/J0/temp/solr.client.solrj.impl.CloudSolrClientTest 8D862054902A223F-001/control-001/lib
   [junit4]   2> 7632 T12 oasc.SolrResourceLoader.addToClassLoader WARN Can't find (or read) directory to add to classloader: lib (resolved as: /Users/jenkins/workspace/Lucene-Solr-5.x-MacOSX/solr/build/solr-solrj/test/J0/temp/solr.client.solrj.impl.CloudSolrClientTest 8D862054902A223F-001/control-001/lib).
   [junit4]   2> 7814 T12 oashc.HttpShardHandlerFactory.init created with socketTimeout : 90000,urlScheme : ,connTimeout : 15000,maxConnectionsPerHost : 20,maxConnections : 10000,corePoolSize : 0,maximumPoolSize : 2147483647,maxThreadIdleTime : 5,sizeOfQueue : -1,fairnessPolicy : false,useRetries : false,
   [junit4]   2> 8418 T12 oasu.UpdateShardHandler.<init> Creating UpdateShardHandler HTTP client with params: socketTimeout=340000&connTimeout=45000&retry=true
   [junit4]   2> 8443 T12 oasl.LogWatcher.createWatcher SLF4J impl is org.slf4j.impl.Log4jLoggerFactory
   [junit4]   2> 8451 T12 oasl.LogWatcher.newRegisteredLogWatcher Registering Log Listener [Log4j (org.slf4j.impl.Log4jLoggerFactory)]
   [junit4]   2> 8462 T12 oasc.CoreContainer.load Node Name: 127.0.0.1
   [junit4]   2> 8463 T12 oasc.ZkContainer.initZooKeeper Zookeeper client=127.0.0.1:58847/solr
   [junit4]   2> 8540 T12 oasc.ZkController.checkChrootPath zkHost includes chroot
   [junit4]   2> 8541 T12 oascc.SolrZkClient.createZkCredentialsToAddAutomatically Using default ZkCredentialsProvider
   [junit4]   2> 8547 T12 oascc.ConnectionManager.waitForConnected Waiting for client to connect to ZooKeeper
   [junit4]   2> 8558 T36 oascc.ConnectionManager.process Watcher org.apache.solr.common.cloud.ConnectionManager@4abedc73 name:ZooKeeperConnection Watcher:127.0.0.1:58847 got event WatchedEvent state:SyncConnected type:None path:null path:null type:None
   [junit4]   2> 8559 T12 oascc.ConnectionManager.waitForConnected Client is connected to ZooKeeper
   [junit4]   2> 8561 T12 oascc.SolrZkClient.createZkACLProvider Using default ZkACLProvider
   [junit4]   2> 8597 T12 N:127.0.0.1:58850_ oascc.ConnectionManager.waitForConnected Waiting for client to connect to ZooKeeper
   [junit4]   2> 8604 T39 N:127.0.0.1:58850_ oascc.ConnectionManager.process Watcher org.apache.solr.common.cloud.ConnectionManager@20352231 name:ZooKeeperConnection Watcher:127.0.0.1:58847/solr got event WatchedEvent state:SyncConnected type:None path:null path:null type:None
   [junit4]   2> 8606 T12 N:127.0.0.1:58850_ oascc.ConnectionManager.waitForConnected Client is connected to ZooKeeper
   [junit4]   2> 8640 T12 N:127.0.0.1:58850_ oascc.SolrZkClient.makePath makePath: /overseer/queue
   [junit4]   2> 8665 T12 N:127.0.0.1:58850_ oascc.SolrZkClient.makePath makePath: /overseer/collection-queue-work
   [junit4]   2> 8686 T12 N:127.0.0.1:58850_ oascc.SolrZkClient.makePath makePath: /overseer/collection-map-running
   [junit4]   2> 8694 T12 N:127.0.0.1:58850_ oascc.SolrZkClient.makePath makePath: /overseer/collection-map-completed
   [junit4]   2> 8702 T12 N:127.0.0.1:58850_ oascc.SolrZkClient.makePath makePath: /overseer/collection-map-failure
   [junit4]   2> 8739 T12 N:127.0.0.1:58850_ oascc.SolrZkClient.makePath makePath: /live_nodes
   [junit4]   2> 8747 T12 N:127.0.0.1:58850_ oascc.SolrZkClient.makePath makePath: /aliases.json
   [junit4]   2> 8755 T12 N:127.0.0.1:58850_ oascc.SolrZkClient.makePath makePath: /clusterstate.json
   [junit4]   2> 8767 T12 N:127.0.0.1:58850_ oasc.ZkController.createEphemeralLiveNode Register node as live in ZooKeeper:/live_nodes/127.0.0.1:58850_
   [junit4]   2> 8773 T12 N:127.0.0.1:58850_ oascc.SolrZkClient.makePath makePath: /live_nodes/127.0.0.1:58850_
   [junit4]   2> 8781 T12 N:127.0.0.1:58850_ oascc.SolrZkClient.makePath makePath: /overseer_elect
   [junit4]   2> 8787 T12 N:127.0.0.1:58850_ oascc.SolrZkClient.makePath makePath: /overseer_elect/election
   [junit4]   2> 8792 T12 N:127.0.0.1:58850_ oasc.Overseer.close Overseer (id=null) closing
   [junit4]   2> 8818 T12 N:127.0.0.1:58850_ oasc.OverseerElectionContext.runLeaderProcess I am going to be the leader 127.0.0.1:58850_
   [junit4]   2> 8819 T12 N:127.0.0.1:58850_ oascc.SolrZkClient.makePath makePath: /overseer_elect/leader
   [junit4]   2> 8828 T12 N:127.0.0.1:58850_ oasc.Overseer.start Overseer (id=93682077239410691-127.0.0.1:58850_-n_0000000000) starting
   [junit4]   2> 8853 T12 N:127.0.0.1:58850_ oascc.SolrZkClient.makePath makePath: /overseer/queue-work
   [junit4]   2> 8943 T12 N:127.0.0.1:58850_ oasc.OverseerAutoReplicaFailoverThread.<init> Starting OverseerAutoReplicaFailoverThread autoReplicaFailoverWorkLoopDelay=10000 autoReplicaFailoverWaitAfterExpiration=30000 autoReplicaFailoverBadNodeExpiration=60000
   [junit4]   2> 9250 T41 N:127.0.0.1:58850_ oasc.OverseerCollectionProcessor.run Process current queue of collection creations
   [junit4]   2> 9252 T12 N:127.0.0.1:58850_ oascc.ZkStateReader.createClusterStateWatchersAndUpdate Updating cluster state from ZooKeeper... 
   [junit4]   2> 9457 T40 N:127.0.0.1:58850_ oasc.Overseer$ClusterStateUpdater.run Starting to work on the main queue
   [junit4]   2> 9672 T12 N:127.0.0.1:58850_ oasc.CorePropertiesLocator.discover Looking for core definitions underneath /Users/jenkins/workspace/Lucene-Solr-5.x-MacOSX/solr/build/solr-solrj/test/J0/temp/solr.client.solrj.impl.CloudSolrClientTest 8D862054902A223F-001/control-001/cores
   [junit4]   2> 9922 T12 N:127.0.0.1:58850_ oasc.CoreDescriptor.<init> CORE DESCRIPTOR: {name=collection1, config=solrconfig.xml, transient=false, schema=schema.xml, loadOnStartup=true, instanceDir=/Users/jenkins/workspace/Lucene-Solr-5.x-MacOSX/solr/build/solr-solrj/test/J0/temp/solr.client.solrj.impl.CloudSolrClientTest 8D862054902A223F-001/control-001/cores/collection1, collection=control_collection, absoluteInstDir=/Users/jenkins/workspace/Lucene-Solr-5.x-MacOSX/solr/build/solr-solrj/test/J0/temp/solr.client.solrj.impl.CloudSolrClientTest 8D862054902A223F-001/control-001/cores/collection1/, coreNodeName=, dataDir=data/, shard=}
   [junit4]   2> 9929 T12 N:127.0.0.1:58850_ oasc.CorePropertiesLocator.discoverUnder Found core collection1 in /Users/jenkins/workspace/Lucene-Solr-5.x-MacOSX/solr/build/solr-solrj/test/J0/temp/solr.client.solrj.impl.CloudSolrClientTest 8D862054902A223F-001/control-001/cores/collection1/
   [junit4]   2> 9930 T12 N:127.0.0.1:58850_ oasc.CorePropertiesLocator.discover Found 1 core definitions
   [junit4]   2> 9948 T43 N:127.0.0.1:58850_ C:control_collection c:collection1 oasc.ZkController.publish publishing core=collection1 state=down collection=control_collection
   [junit4]   2> 9949 T43 N:127.0.0.1:58850_ C:control_collection c:collection1 oasc.ZkController.publish numShards not found on descriptor - reading it from system property
   [junit4]   2> 9963 T43 N:127.0.0.1:58850_ oasc.ZkController.waitForCoreNodeName look for our core node name
   [junit4]   2> 9963 T39 N:127.0.0.1:58850_ oasc.DistributedQueue$LatchWatcher.process NodeChildrenChanged fired on path /overseer/queue state SyncConnected
   [junit4]   2> 9974 T40 N:127.0.0.1:58850_ oasc.Overseer$ClusterStateUpdater.run processMessage: queueSize: 1, message = {
   [junit4]   2> 	  "core":"collection1",
   [junit4]   2> 	  "roles":null,
   [junit4]   2> 	  "base_url":"http://127.0.0.1:58850",
   [junit4]   2> 	  "node_name":"127.0.0.1:58850_",
   [junit4]   2> 	  "numShards":"1",
   [junit4]   2> 	  "state":"down",
   [junit4]   2> 	  "shard":null,
   [junit4]   2> 	  "collection":"control_collection",
   [junit4]   2> 	  "operation":"state"} current state version: 0
   [junit4]   2> 10044 T40 N:127.0.0.1:58850_ oasco.ReplicaMutator.updateState Update state numShards=1 message={
   [junit4]   2> 	  "core":"collection1",
   [junit4]   2> 	  "roles":null,
   [junit4]   2> 	  "base_url":"http://127.0.0.1:58850",
   [junit4]   2> 	  "node_name":"127.0.0.1:58850_",
   [junit4]   2> 	  "numShards":"1",
   [junit4]   2> 	  "state":"down",
   [junit4]   2> 	  "shard":null,
   [junit4]   2> 	  "collection":"control_collection",
   [junit4]   2> 	  "operation":"state"}
   [junit4]   2> 10052 T40 N:127.0.0.1:58850_ oasco.ClusterStateMutator.createCollection building a new cName: control_collection
   [junit4]   2> 10135 T40 N:127.0.0.1:58850_ oasco.ReplicaMutator.updateState Assigning new node to shard shard=shard1
   [junit4]   2> 10155 T39 N:127.0.0.1:58850_ oascc.ZkStateReader$2.process A cluster state change: WatchedEvent state:SyncConnected type:NodeDataChanged path:/clusterstate.json, has occurred - updating... (live nodes size: 1)
   [junit4]   2> 10966 T43 N:127.0.0.1:58850_ oasc.ZkController.waitForShardId waiting to find shard id in clusterstate for collection1
   [junit4]   2> 10966 T43 N:127.0.0.1:58850_ oasc.ZkController.createCollectionZkNode Check for collection zkNode:control_collection
   [junit4]   2> 10968 T43 N:127.0.0.1:58850_ oasc.ZkController.createCollectionZkNode Collection zkNode exists
   [junit4]   2> 10968 T43 N:127.0.0.1:58850_ oascc.ZkStateReader.readConfigName Load collection config from:/collections/control_collection
   [junit4]   2> 10971 T43 N:127.0.0.1:58850_ oascc.ZkStateReader.readConfigName path=/collections/control_collection configName=conf1 specified config exists in ZooKeeper
   [junit4]   2> 10976 T43 N:127.0.0.1:58850_ oasc.SolrResourceLoader.<init> new SolrResourceLoader for directory: '/Users/jenkins/workspace/Lucene-Solr-5.x-MacOSX/solr/build/solr-solrj/test/J0/temp/solr.client.solrj.impl.CloudSolrClientTest 8D862054902A223F-001/control-001/cores/collection1/'
   [junit4]   2> 11047 T43 N:127.0.0.1:58850_ oasc.ZkController.watchZKConfDir watch zkdir /configs/conf1
   [junit4]   2> 11067 T43 N:127.0.0.1:58850_ oasc.Config.<init> loaded config solrconfig.xml with version 0 
   [junit4]   2> 11102 T43 N:127.0.0.1:58850_ oasc.SolrConfig.refreshRequestParams current version of requestparams : -1
   [junit4]   2> 11140 T43 N:127.0.0.1:58850_ oasc.SolrConfig.<init> Using Lucene MatchVersion: 5.2.0
   [junit4]   2> 11296 T43 N:127.0.0.1:58850_ oasc.SolrConfig.<init> Loaded SolrConfig: solrconfig.xml
   [junit4]   2> 11367 T43 N:127.0.0.1:58850_ oass.IndexSchema.readSchema Reading Solr Schema from /configs/conf1/schema.xml
   [junit4]   2> 11471 T43 N:127.0.0.1:58850_ oass.IndexSchema.readSchema [collection1] Schema name=test
   [junit4]   2> 12286 T43 N:127.0.0.1:58850_ oass.IndexSchema.readSchema default search field in schema is text
   [junit4]   2> 12291 T43 N:127.0.0.1:58850_ oass.IndexSchema.readSchema unique key field: id
   [junit4]   2> 12302 T43 N:127.0.0.1:58850_ oass.IndexSchema.loadCopyFields WARN Field lowerfilt1and2 is not multivalued and destination for multiple copyFields (2)
   [junit4]   2> 12302 T43 N:127.0.0.1:58850_ oass.IndexSchema.loadCopyFields WARN Field text is not multivalued and destination for multiple copyFields (3)
   [junit4]   2> 12381 T43 N:127.0.0.1:58850_ oasc.CoreContainer.create Creating SolrCore 'collection1' using configuration from collection control_collection
   [junit4]   2> 12383 T43 N:127.0.0.1:58850_ c:collection1 oasc.SolrCore.initDirectoryFactory org.apache.solr.core.MockDirectoryFactory
   [junit4]   2> 12400 T43 N:127.0.0.1:58850_ c:collection1 oasc.SolrCore.<init> [collection1] Opening new SolrCore at /Users/jenkins/workspace/Lucene-Solr-5.x-MacOSX/solr/build/solr-solrj/test/J0/temp/solr.client.solrj.impl.CloudSolrClientTest 8D862054902A223F-001/control-001/cores/collection1/, dataDir=/Users/jenkins/workspace/Lucene-Solr-5.x-MacOSX/solr/build/solr-solrj/test/J0/temp/solr.client.solrj.impl.CloudSolrClientTest 8D862054902A223F-001/control-001/cores/collection1/data/
   [junit4]   2> 12404 T43 N:127.0.0.1:58850_ c:collection1 oasc.SolrCore.<init> JMX monitoring not detected for core: collection1
   [junit4]   2> 12515 T43 N:127.0.0.1:58850_ c:collection1 oasc.CachingDirectoryFactory.get return new directory for /Users/jenkins/workspace/Lucene-Solr-5.x-MacOSX/solr/build/solr-solrj/test/J0/temp/solr.client.solrj.impl.CloudSolrClientTest 8D862054902A223F-001/control-001/cores/collection1/data
   [junit4]   2> 12516 T43 N:127.0.0.1:58850_ c:collection1 oasc.SolrCore.getNewIndexDir New index directory detected: old=null new=/Users/jenkins/workspace/Lucene-Solr-5.x-MacOSX/solr/build/solr-solrj/test/J0/temp/solr.client.solrj.impl.CloudSolrClientTest 8D862054902A223F-001/control-001/cores/collection1/data/index/
   [junit4]   2> 12517 T43 N:127.0.0.1:58850_ c:collection1 oasc.SolrCore.initIndex WARN [collection1] Solr index directory '/Users/jenkins/workspace/Lucene-Solr-5.x-MacOSX/solr/build/solr-solrj/test/J0/temp/solr.client.solrj.impl.CloudSolrClientTest 8D862054902A223F-001/control-001/cores/collection1/data/index' doesn't exist. Creating new index...
   [junit4]   2> 12544 T43 N:127.0.0.1:58850_ c:collection1 oasc.CachingDirectoryFactory.get return new directory for /Users/jenkins/workspace/Lucene-Solr-5.x-MacOSX/solr/build/solr-solrj/test/J0/temp/solr.client.solrj.impl.CloudSolrClientTest 8D862054902A223F-001/control-001/cores/collection1/data/index
   [junit4]   2> 12729 T43 N:127.0.0.1:58850_ c:collection1 oasc.SolrDeletionPolicy.onCommit SolrDeletionPolicy.onCommit: commits: num=1
   [junit4]   2> 		commit{dir=MockDirectoryWrapper(RAMDirectory@7be9c2d5 lockFactory=org.apache.lucene.store.SingleInstanceLockFactory@44faa499),segFN=segments_1,generation=1}
   [junit4]   2> 12733 T43 N:127.0.0.1:58850_ c:collection1 oasc.SolrDeletionPolicy.updateCommits newest commit generation = 1
   [junit4]   2> 13945 T43 N:127.0.0.1:58850_ c:collection1 oasc.SolrCore.loadUpdateProcessorChains no updateRequestProcessorChain defined as default, creating implicit default
   [junit4]   2> 14423 T43 N:127.0.0.1:58850_ c:collection1 oashl.XMLLoader.init xsltCacheLifetimeSeconds=60
   [junit4]   2> 14503 T43 N:127.0.0.1:58850_ c:collection1 oashl.XMLLoader.init xsltCacheLifetimeSeconds=60
   [junit4]   2> 14506 T43 N:127.0.0.1:58850_ c:collection1 oashl.XMLLoader.init xsltCacheLifetimeSeconds=60
   [junit4]   2> 14508 T43 N:127.0.0.1:58850_ c:collection1 oashl.XMLLoader.init xsltCacheLifetimeSeconds=60
   [junit4]   2> 14515 T43 N:127.0.0.1:58850_ c:collection1 oasc.PluginBag.createPlugin requestHandler : '/replication' created with startup=lazy 
   [junit4]   2> 14727 T43 N:127.0.0.1:58850_ c:collection1 oasc.SolrResourceLoader.findClass WARN Solr loaded a deprecated plugin/analysis class [org.apache.solr.handler.admin.AdminHandlers]. Please consult documentation how to replace it accordingly.
   [junit4]   2> 14727 T43 N:127.0.0.1:58850_ c:collection1 oasc.SolrResourceLoader.findClass WARN Solr loaded a deprecated plugin/analysis class [org.apache.solr.handler.admin.AdminHandlers]. Please consult documentation how to replace it accordingly.
   [junit4]   2> 14728 T43 N:127.0.0.1:58850_ c:collection1 oasc.RequestHandlers.initHandlersFromConfig Registered paths: /admin/mbeans,standard,,/update/csv,/update/json/docs,/admin/luke,/admin/segments,/get,/admin/system,/replication,/admin/properties,/config,/schema,/admin/plugins,/admin/logging,/update/json,/admin,/admin/threads,/admin/ping,/update,/admin/file
   [junit4]   2> 14729 T43 N:127.0.0.1:58850_ c:collection1 oasc.RequestHandlers.initHandlersFromConfig WARN no default request handler is registered (either '/select' or 'standard')
   [junit4]   2> 14741 T43 N:127.0.0.1:58850_ c:collection1 oasc.SolrCore.initStatsCache Using default statsCache cache: org.apache.solr.search.stats.LocalStatsCache
   [junit4]   2> 14968 T43 N:127.0.0.1:58850_ c:collection1 oasu.UpdateHandler.<init> Using UpdateLog implementation: org.apache.solr.update.UpdateLog
   [junit4]   2> 14969 T43 N:127.0.0.1:58850_ c:collection1 oasu.UpdateLog.init Initializing UpdateLog: dataDir= defaultSyncLevel=FLUSH numRecordsToKeep=100 maxNumLogsToKeep=10
   [junit4]   2> 15070 T43 N:127.0.0.1:58850_ c:collection1 oasu.CommitTracker.<init> Hard AutoCommit: disabled
   [junit4]   2> 15071 T43 N:127.0.0.1:58850_ c:collection1 oasu.CommitTracker.<init> Soft AutoCommit: disabled
   [junit4]   2> 15122 T43 N:127.0.0.1:58850_ c:collection1 oasc.SolrDeletionPolicy.onInit SolrDeletionPolicy.onInit: commits: num=1
   [junit4]   2> 		commit{dir=MockDirectoryWrapper(RAMDirectory@7be9c2d5 lockFactory=org.apache.lucene.store.SingleInstanceLockFactory@44faa499),segFN=segments_1,generation=1}
   [junit4]   2> 15123 T43 N:127.0.0.1:58850_ c:collection1 oasc.SolrDeletionPolicy.updateCommits newest commit generation = 1
   [junit4]   2> 15297 T43 N:127.0.0.1:58850_ c:collection1 oass.SolrIndexSearcher.<init> Opening Searcher@23bea2db[collection1] main
   [junit4]   2> 15363 T43 N:127.0.0.1:58850_ c:collection1 oascc.ZkStateReader.readConfigName Load collection config from:/collections/control_collection
   [junit4]   2> 15369 T43 N:127.0.0.1:58850_ c:collection1 oascc.ZkStateReader.readConfigName path=/collections/control_collection configName=conf1 specified config exists in ZooKeeper
   [junit4]   2> 15369 T43 N:127.0.0.1:58850_ c:collection1 oasr.ManagedResourceStorage.newStorageIO Setting up ZooKeeper-based storage for the RestManager with znodeBase: /configs/conf1
   [junit4]   2> 15388 T43 N:127.0.0.1:58850_ c:collection1 oasr.ManagedResourceStorage$ZooKeeperStorageIO.configure Configured ZooKeeperStorageIO with znodeBase: /configs/conf1
   [junit4]   2> 15389 T43 N:127.0.0.1:58850_ c:collection1 oasr.RestManager.init Initializing RestManager with initArgs: {}
   [junit4]   2> 15496 T43 N:127.0.0.1:58850_ c:collection1 oasr.ManagedResourceStorage.load Reading _rest_managed.json using ZooKeeperStorageIO:path=/configs/conf1
   [junit4]   2> 15498 T43 N:127.0.0.1:58850_ c:collection1 oasr.ManagedResourceStorage$ZooKeeperStorageIO.openInputStream No data found for znode /configs/conf1/_rest_managed.json
   [junit4]   2> 15499 T43 N:127.0.0.1:58850_ c:collection1 oasr.ManagedResourceStorage.load Loaded null at path _rest_managed.json using ZooKeeperStorageIO:path=/configs/conf1
   [junit4]   2> 15499 T43 N:127.0.0.1:58850_ c:collection1 oasr.RestManager.init Initializing 0 registered ManagedResources
   [junit4]   2> 15631 T43 N:127.0.0.1:58850_ c:collection1 oasha.AdminHandlers.inform WARN <requestHandler name="/admin/" 
   [junit4]   2> 	 class="solr.admin.AdminHandlers" /> is deprecated . It is not required anymore
   [junit4]   2> 15633 T44 N:127.0.0.1:58850_ c:collection1 oasc.SolrCore.registerSearcher [collection1] Registered new searcher Searcher@23bea2db[collection1] main{ExitableDirectoryReader(UninvertingDirectoryReader())}
   [junit4]   2> 15640 T43 N:127.0.0.1:58850_ c:collection1 oasc.CoreContainer.registerCore registering core: collection1
   [junit4]   2> 15648 T47 N:127.0.0.1:58850_ C:control_collection S:shard1 c:collection1 oasc.ZkController.register Register replica - core:collection1 address:http://127.0.0.1:58850 collection:control_collection shard:shard1
   [junit4]   2> 15653 T12 N:127.0.0.1:58850_ oass.SolrDispatchFilter.init user.dir=/Users/jenkins/workspace/Lucene-Solr-5.x-MacOSX/solr/build/solr-solrj/test/J0
   [junit4]   2> 15654 T12 N:127.0.0.1:58850_ oass.SolrDispatchFilter.init SolrDispatchFilter.init() done
   [junit4]   2> 15686 T47 N:127.0.0.1:58850_ C:control_collection S:shard1 c:collection1 oascc.SolrZkClient.makePath makePath: /collections/control_collection/leader_elect/shard1/election
   [junit4]   2> 15712 T47 N:127.0.0.1:58850_ C:control_collection S:shard1 c:collection1 oasc.ShardLeaderElectionContext.runLeaderProcess Running the leader process for shard shard1
   [junit4]   2> 15721 T39 N:127.0.0.1:58850_ oasc.DistributedQueue$LatchWatcher.process NodeChildrenChanged fired on path /overseer/queue state SyncConnected
   [junit4]   2> 15722 T47 N:127.0.0.1:58850_ C:control_collection S:shard1 c:collection1 oasc.ShardLeaderElectionContext.waitForReplicasToComeUp Enough replicas found to continue.
   [junit4]   2> 15722 T47 N:127.0.0.1:58850_ C:control_collection S:shard1 c:collection1 oasc.ShardLeaderElectionContext.runLeaderProcess I may be the new leader - try and sync
   [junit4]   2> 15729 T40 N:127.0.0.1:58850_ oasc.Overseer$ClusterStateUpdater.run processMessage: queueSize: 1, message = {
   [junit4]   2> 	  "operation":"leader",
   [junit4]   2> 	  "shard":"shard1",
   [junit4]   2> 	  "collection":"control_collection"} current state version: 1
   [junit4]   2> 15744 T12 oascc.SolrZkClient.createZkCredentialsToAddAutomatically Using default ZkCredentialsProvider
   [junit4]   2> 15752 T12 oascc.ConnectionManager.waitForConnected Waiting for client to connect to ZooKeeper
   [junit4]   2> ASYNC  NEW_CORE C0 name=collection1 org.apache.solr.core.SolrCore@7ef93606 url=http://127.0.0.1:58850/collection1 node=127.0.0.1:58850_ C0_STATE=coll:control_collection core:collection1 props:{core=collection1, base_url=http://127.0.0.1:58850, node_name=127.0.0.1:58850_, state=down}
   [junit4]   2> 15759 T47 N:127.0.0.1:58850_ C:control_collection S:shard1 c:collection1 C0 oasc.SyncStrategy.sync Sync replicas to http://127.0.0.1:58850/collection1/
   [junit4]   2> 15765 T50 oascc.ConnectionManager.process Watcher org.apache.solr.common.cloud.ConnectionManager@560b3698 name:ZooKeeperConnection Watcher:127.0.0.1:58847/solr got event WatchedEvent state:SyncConnected type:None path:null path:null type:None
   [junit4]   2> 15759 T39 N:127.0.0.1:58850_ oascc.ZkStateReader$2.process A cluster state change: WatchedEvent state:SyncConnected type:NodeDataChanged path:/clusterstate.json, has occurred - updating... (live nodes size: 1)
   [junit4]   2> 15772 T12 oascc.ConnectionManager.waitForConnected Client is connected to ZooKeeper
   [junit4]   2> 15777 T12 oascc.SolrZkClient.createZkACLProvider Using default ZkACLProvider
   [junit4]   2> 15778 T12 oascc.ZkStateReader.createClusterStateWatchersAndUpdate Updating cluster state from ZooKeeper... 
   [junit4]   2> 15772 T47 N:127.0.0.1:58850_ C:control_collection S:shard1 c:collection1 C0 oasc.SyncStrategy.syncReplicas Sync Success - now sync replicas to me
   [junit4]   2> 15780 T47 N:127.0.0.1:58850_ C:control_collection S:shard1 c:collection1 C0 oasc.SyncStrategy.syncToMe http://127.0.0.1:58850/collection1/ has no replicas
   [junit4]   2> 15781 T47 N:127.0.0.1:58850_ C:control_collection S:shard1 c:collection1 oasc.ShardLeaderElectionContext.runLeaderProcess I am the new leader: http://127.0.0.1:58850/collection1/ shard1
   [junit4]   2> 15794 T47 N:127.0.0.1:58850_ C:control_collection S:shard1 c:collection1 oascc.SolrZkClient.makePath makePath: /collections/control_collection/leaders/shard1
   [junit4]   2> 15795 T12 oasc.ChaosMonkey.monkeyLog monkey: init - expire sessions:false cause connection loss:false
   [junit4]   2> 15796 T12 oasc.AbstractFullDistribZkTestBase.createJettys Creating collection1 with stateFormat=2
   [junit4]   2> 15797 T12 oascc.SolrZkClient.createZkCredentialsToAddAutomatically Using default ZkCredentialsProvider
   [junit4]   2> 15800 T12 oascc.ConnectionManager.waitForConnected Waiting for client to connect to ZooKeeper
   [junit4]   2> 15808 T53 oascc.ConnectionManager.process Watcher org.apache.solr.common.cloud.ConnectionManager@6b2e41c5 name:ZooKeeperConnection Watcher:127.0.0.1:58847/solr got event WatchedEvent state:SyncConnected type:None path:null path:null type:None
   [junit4]   2> 15809 T12 oascc.ConnectionManager.waitForConnected Client is connected to ZooKeeper
   [junit4]   2> 15810 T12 oascc.SolrZkClient.createZkACLProvider Using default ZkACLProvider
   [junit4]   2> 15821 T39 N:127.0.0.1:58850_ oasc.DistributedQueue$LatchWatcher.process NodeChildrenChanged fired on path /overseer/queue state SyncConnected
   [junit4]   2> 15833 T14 oazs.NIOServerCnxn.doIO WARN caught end of stream exception EndOfStreamException: Unable to read additional data from client sessionid 0x14cd35a57ad0005, likely client has closed socket
   [junit4]   2> 	at org.apache.zookeeper.server.NIOServerCnxn.doIO(NIOServerCnxn.java:228)
   [junit4]   2> 	at org.apache.zookeeper.server.NIOServerCnxnFactory.run(NIOServerCnxnFactory.java:208)
   [junit4]   2> 	at java.lang.Thread.run(Thread.java:745)
   [junit4]   2> 
   [junit4]   2> 15840 T40 N:127.0.0.1:58850_ oasc.Overseer$ClusterStateUpdater.run processMessage: queueSize: 1, message = {
   [junit4]   2> 	  "operation":"create",
   [junit4]   2> 	  "name":"collection1",
   [junit4]   2> 	  "numShards":"2",
   [junit4]   2> 	  "stateFormat":"2"} current state version: 2
   [junit4]   2> 15840 T40 N:127.0.0.1:58850_ oasco.ClusterStateMutator.createCollection building a new cName: collection1
   [junit4]   2> 15888 T40 N:127.0.0.1:58850_ oasc.Overseer$ClusterStateUpdater.run processMessage: queueSize: 1, message = {
   [junit4]   2> 	  "operation":"leader",
   [junit4]   2> 	  "shard":"shard1",
   [junit4]   2> 	  "collection":"control_collection",
   [junit4]   2> 	  "base_url":"http://127.0.0.1:58850",
   [junit4]   2> 	  "core":"collection1",
   [junit4]   2> 	  "state":"active"} current state version: 2
   [junit4]   2> 15901 T40 N:127.0.0.1:58850_ oasco.ZkStateWriter.writePendingUpdates going to create_collection /collections/collection1/state.json
   [junit4]   2> 15932 T50 oascc.ZkStateReader$2.process A cluster state change: WatchedEvent state:SyncConnected type:NodeDataChanged path:/clusterstate.json, has occurred - updating... (live nodes size: 1)
   [junit4]   2> 15932 T39 N:127.0.0.1:58850_ oascc.ZkStateReader$2.process A cluster state change: WatchedEvent state:SyncConnected type:NodeDataChanged path:/clusterstate.json, has occurred - updating... (live nodes size: 1)
   [junit4]   2> 15966 T12 oas.SolrTestCaseJ4.writeCoreProperties Writing core.properties file to /Users/jenkins/workspace/Lucene-Solr-5.x-MacOSX/solr/build/solr-solrj/test/J0/temp/solr.client.solrj.impl.CloudSolrClientTest 8D862054902A223F-001/shard-1-001/cores/collection1
   [junit4]   2> 15973 T12 oasc.AbstractFullDistribZkTestBase.createJettys create jetty 1 in directory /Users/jenkins/workspace/Lucene-Solr-5.x-MacOSX/solr/build/solr-solrj/test/J0/temp/solr.client.solrj.impl.CloudSolrClientTest 8D862054902A223F-001/shard-1-001
   [junit4]   2> 15981 T12 oejs.Server.doStart jetty-8.1.10.v20130312
   [junit4]   2> 15987 T12 oejs.AbstractConnector.doStart Started SelectChannelConnector@127.0.0.1:58855
   [junit4]   2> 15988 T12 oascse.JettySolrRunner$1.lifeCycleStarted Jetty properties: {solr.data.dir=/Users/jenkins/workspace/Lucene-Solr-5.x-MacOSX/solr/build/solr-solrj/test/J0/temp/solr.client.solrj.impl.CloudSolrClientTest 8D862054902A223F-001/tempDir-001/jetty1, solrconfig=solrconfig.xml, hostContext=/, hostPort=58855, coreRootDirectory=/Users/jenkins/workspace/Lucene-Solr-5.x-MacOSX/solr/build/solr-solrj/test/J0/../../../../../../../../../Users/jenkins/workspace/Lucene-Solr-5.x-MacOSX/solr/build/solr-solrj/test/J0/temp/solr.client.solrj.impl.CloudSolrClientTest 8D862054902A223F-001/shard-1-001/cores}
   [junit4]   2> 15990 T12 oass.SolrDispatchFilter.init SolrDispatchFilter.init()sun.misc.Launcher$AppClassLoader@677327b6
   [junit4]   2> 15990 T12 oasc.SolrResourceLoader.<init> new SolrResourceLoader for directory: '/Users/jenkins/workspace/Lucene-Solr-5.x-MacOSX/solr/build/solr-solrj/test/J0/../../../../../../../../../Users/jenkins/workspace/Lucene-Solr-5.x-MacOSX/solr/build/solr-solrj/test/J0/temp/solr.client.solrj.impl.CloudSolrClientTest 8D862054902A223F-001/shard-1-001/'
   [junit4]   2> 16007 T39 N:127.0.0.1:58850_ oasc.DistributedQueue$LatchWatcher.process NodeChildrenChanged fired on path /overseer/queue state SyncConnected
   [junit4]   2> 16056 T12 oasc.SolrXmlConfig.fromFile Loading container configuration from /Users/jenkins/workspace/Lucene-Solr-5.x-MacOSX/solr/build/solr-solrj/test/J0/../../../../../../../../../Users/jenkins/workspace/Lucene-Solr-5.x-MacOSX/solr/build/solr-solrj/test/J0/temp/solr.client.solrj.impl.CloudSolrClientTest 8D862054902A223F-001/shard-1-001/solr.xml
   [junit4]   2> 16074 T12 oasc.CorePropertiesLocator.<init> Config-defined core root directory: /Users/jenkins/workspace/Lucene-Solr-5.x-MacOSX/solr/build/solr-solrj/test/J0/../../../../../../../../../Users/jenkins/workspace/Lucene-Solr-5.x-MacOSX/solr/build/solr-solrj/test/J0/temp/solr.client.solrj.impl.CloudSolrClientTest 8D862054902A223F-001/shard-1-001/cores
   [junit4]   2> 16075 T12 oasc.CoreContainer.<init> New CoreContainer 17468595
   [junit4]   2> 16076 T12 oasc.CoreContainer.load Loading cores into CoreContainer [instanceDir=/Users/jenkins/workspace/Lucene-Solr-5.x-MacOSX/solr/build/solr-solrj/test/J0/../../../../../../../../../Users/jenkins/workspace/Lucene-Solr-5.x-MacOSX/solr/build/solr-solrj/test/J0/temp/solr.client.solrj.impl.CloudSolrClientTest 8D862054902A223F-001/shard-1-001/]
   [junit4]   2> 16076 T12 oasc.CoreContainer.load loading shared library: /Users/jenkins/workspace/Lucene-Solr-5.x-MacOSX/solr/build/solr-solrj/test/J0/../../../../../../../../../Users/jenkins/workspace/Lucene-Solr-5.x-MacOSX/solr/build/solr-solrj/test/J0/temp/solr.client.solrj.impl.CloudSolrClientTest 8D862054902A223F-001/shard-1-001/lib
   [junit4]   2> 16077 T12 oasc.SolrResourceLoader.addToClassLoader WARN Can't find (or read) directory to add to classloader: lib (resolved as: /Users/jenkins/workspace/Lucene-Solr-5.x-MacOSX/solr/build/solr-solrj/test/J0/../../../../../../../../../Users/jenkins/workspace/Lucene-Solr-5.x-MacOSX/solr/build/solr-solrj/test/J0/temp/solr.client.solrj.impl.CloudSolrClientTest 8D862054902A223F-001/shard-1-001/lib).
   [junit4]   2> 16105 T12 oashc.HttpShardHandlerFactory.init created with socketTimeout : 90000,urlScheme : ,connTimeout : 15000,maxConnectionsPerHost : 20,maxConnections : 10000,corePoolSize : 0,maximumPoolSize : 2147483647,maxThreadIdleTime : 5,sizeOfQueue : -1,fairnessPolicy : false,useRetries : false,
   [junit4]   2> 16109 T12 oasu.UpdateShardHandler.<init> Creating UpdateShardHandler HTTP client with params: socketTimeout=340000&connTimeout=45000&retry=true
   [junit4]   2> 16111 T12 oasl.LogWatcher.createWatcher SLF4J impl is org.slf4j.impl.Log4jLoggerFactory
   [junit4]   2> 16111 T12 oasl.LogWatcher.newRegisteredLogWatcher Registering Log Listener [Log4j (org.slf4j.impl.Log4jLoggerFactory)]
   [junit4]   2> 16111 T12 oasc.CoreContainer.load Node Name: 127.0.0.1
   [junit4]   2> 16112 T12 oasc.ZkContainer.initZooKeeper Zookeeper client=127.0.0.1:58847/solr
   [junit4]   2> 16112 T12 oasc.ZkController.checkChrootPath zkHost includes chroot
   [junit4]   2> 16113 T12 oascc.SolrZkClient.createZkCredentialsToAddAutomatically Using default ZkCredentialsProvider
   [junit4]   2> 16122 T12 oascc.ConnectionManager.waitForConnected Waiting for client to connect to ZooKeeper
   [junit4]   2> 16131 T50 oascc.ZkStateReader$2.process A cluster state change: WatchedEvent state:SyncConnected type:NodeDataChanged path:/clusterstate.json, has occurred - updating... (live nodes size: 1)
   [junit4]   2> 16135 T39 N:127.0.0.1:58850_ oascc.ZkStateReader$2.process A cluster state change: WatchedEvent state:SyncConnected type:NodeDataChanged path:/clusterstate.json, has occurred - updating... (live nodes size: 1)
   [junit4]   2> 16138 T65 oascc.ConnectionManager.process Watcher org.apache.solr.common.cloud.ConnectionManager@5eada6ee name:ZooKeeperConnection Watcher:127.0.0.1:58847 got event WatchedEvent state:SyncConnected type:None path:null path:null type:None
   [junit4]   2> 16140 T12 oascc.ConnectionManager.waitForConnected Client is connected to ZooKeeper
   [junit4]   2> 16140 T12 oascc.SolrZkClient.createZkACLProvider Using default ZkACLProvider
   [junit4]   2> 16150 T12 N:127.0.0.1:58855_ oascc.ConnectionManager.waitForConnected Waiting for client to connect to ZooKeeper
   [junit4]   2> 16157 T68 N:127.0.0.1:58855_ oascc.ConnectionManager.process Watcher org.apache.solr.common.cloud.ConnectionManager@450f5b1c name:ZooKeeperConnection Watcher:127.0.0.1:58847/solr got event WatchedEvent state:SyncConnected type:None path:null path:null type:None
   [junit4]   2> 16158 T12 N:127.0.0.1:58855_ oascc.ConnectionManager.waitForConnected Client is connected to ZooKeeper
   [junit4]   2> 16189 T12 N:127.0.0.1:58855_ oascc.ZkStateReader.createClusterStateWatchersAndUpdate Updating cluster state from ZooKeeper... 
   [junit4]   2> 16204 T47 N:127.0.0.1:58850_ C:control_collection S:shard1 c:collection1 oasc.ZkController.register We are http://127.0.0.1:58850/collection1/ and leader is http://127.0.0.1:58850/collection1/
   [junit4]   2> 16209 T47 N:127.0.0.1:58850_ C:control_collection S:shard1 c:collection1 oasc.ZkController.register No LogReplay needed for core=collection1 baseURL=http://127.0.0.1:58850
   [junit4]   2> 16210 T47 N:127.0.0.1:58850_ C:control_collection S:shard1 c:collection1 oasc.ZkController.checkRecovery I am the leader, no recovery necessary
   [junit4]   2> 16210 T47 N:127.0.0.1:58850_ C:control_collection S:shard1 c:collection1 oasc.ZkController.publish publishing core=collection1 state=active collection=control_collection
   [junit4]   2> 16210 T47 N:127.0.0.1:58850_ C:control_collection S:shard1 c:collection1 oasc.ZkController.publish numShards not found on descriptor - reading it from system property
   [junit4]   2> 16213 T39 N:127.0.0.1:58850_ oasc.DistributedQueue$LatchWatcher.process NodeChildrenChanged fired on path /overseer/queue state SyncConnected
   [junit4]   2> 16218 T40 N:127.0.0.1:58850_ oasc.Overseer$ClusterStateUpdater.run processMessage: queueSize: 1, message = {
   [junit4]   2> 	  "core":"collection1",
   [junit4]   2> 	  "core_node_name":"core_node1",
   [junit4]   2> 	  "roles":null,
   [junit4]   2> 	  "base_url":"http://127.0.0.1:58850",
   [junit4]   2> 	  "node_name":"127.0.0.1:58850_",
   [junit4]   2> 	  "numShards":"2",
   [junit4]   2> 	  "state":"active",
   [junit4]   2> 	  "shard":"shard1",
   [junit4]   2> 	  "collection":"control_collection",
   [junit4]   2> 	  "operation":"state"} current state version: 4
   [junit4]   2> 16220 T40 N:127.0.0.1:58850_ oasco.ReplicaMutator.updateState Update state numShards=2 message={
   [junit4]   2> 	  "core":"collection1",
   [junit4]   2> 	  "core_node_name":"core_node1",
   [junit4]   2> 	  "roles":null,
   [junit4]   2> 	  "base_url":"http://127.0.0.1:58850",
   [junit4]   2> 	  "node_name":"127.0.0.1:58850_",
   [junit4]   2> 	  "numShards":"2",
   [junit4]   2> 	  "state":"active",
   [junit4]   2> 	  "shard":"shard1",
   [junit4]   2> 	  "collection":"control_collection",
   [junit4]   2> 	  "operation":"state"}
   [junit4]   2> 16329 T50 oascc.ZkStateReader$2.process A cluster state change: WatchedEvent state:SyncConnected type:NodeDataChanged path:/clusterstate.json, has occurred - updating... (live nodes size: 1)
   [junit4]   2> 16330 T68 N:127.0.0.1:58855_ oascc.ZkStateReader$2.process A cluster state change: WatchedEvent state:SyncConnected type:NodeDataChanged path:/clusterstate.json, has occurred - updating... (live nodes size: 1)
   [junit4]   2> 16330 T39 N:127.0.0.1:58850_ oascc.ZkStateReader$2.process A cluster state change: WatchedEvent state:SyncConnected type:NodeDataChanged path:/clusterstate.json, has occurred - updating... (live nodes size: 1)
   [junit4]   2> 17213 T12 N:127.0.0.1:58855_ oasc.ZkController.createEphemeralLiveNode Register node as live in ZooKeeper:/live_nodes/127.0.0.1:58855_
   [junit4]   2> 17216 T12 N:127.0.0.1:58855_ oascc.SolrZkClient.makePath makePath: /live_nodes/127.0.0.1:58855_
   [junit4]   2> 17229 T12 N:127.0.0.1:58855_ oasc.Overseer.close Overseer (id=null) closing
   [junit4]   2> 17239 T12 N:127.0.0.1:58855_ oasc.CorePropertiesLocator.discover Looking for core definitions underneath /Users/jenkins/workspace/Lucene-Solr-5.x-MacOSX/solr/build/solr-solrj/test/J0/../../../../../../../../../Users/jenkins/workspace/Lucene-Solr-5.x-MacOSX/solr/build/solr-solrj/test/J0/temp/solr.client.solrj.impl.CloudSolrClientTest 8D862054902A223F-001/shard-1-001/cores
   [junit4]   2> 17242 T12 N:127.0.0.1:58855_ oasc.CoreDescriptor.<init> CORE DESCRIPTOR: {name=collection1, config=solrconfig.xml, transient=false, schema=schema.xml, loadOnStartup=true, instanceDir=/Users/jenkins/workspace/Lucene-Solr-5.x-MacOSX/solr/build/solr-solrj/test/J0/../../../../../../../../../Users/jenkins/workspace/Lucene-Solr-5.x-MacOSX/solr/build/solr-solrj/test/J0/temp/solr.client.solrj.impl.CloudSolrClientTest 8D862054902A223F-001/shard-1-001/cores/collection1, collection=collection1, absoluteInstDir=/Users/jenkins/workspace/Lucene-Solr-5.x-MacOSX/solr/build/solr-solrj/test/J0/../../../../../../../../../Users/jenkins/workspace/Lucene-Solr-5.x-MacOSX/solr/build/solr-solrj/test/J0/temp/solr.client.solrj.impl.CloudSolrClientTest 8D862054902A223F-001/shard-1-001/cores/collection1/, coreNodeName=, dataDir=data/, shard=}
   [junit4]   2> 17242 T12 N:127.0.0.1:58855_ oasc.CorePropertiesLocator.discoverUnder Found core collection1 in /Users/jenkins/workspace/Lucene-Solr-5.x-MacOSX/solr/build/solr-solrj/test/J0/../../../../../../../../../Users/jenkins/workspace/Lucene-Solr-5.x-MacOSX/solr/build/solr-solrj/test/J0/temp/solr.client.solrj.impl.CloudSolrClientTest 8D862054902A223F-001/shard-1-001/cores/collection1/
   [junit4]   2> 17243 T12 N:127.0.0.1:58855_ oasc.CorePropertiesLocator.discover Found 1 core definitions
   [junit4]   2> 17250 T69 N:127.0.0.1:58855_ C:collection1 c:collection1 oasc.ZkController.publish publishing core=collection1 state=down collection=collection1
   [junit4]   2> 17251 T69 N:127.0.0.1:58855_ C:collection1 c:collection1 oasc.ZkController.publish numShards not found on descriptor - reading it from system property
   [junit4]   2> 17257 T39 N:127.0.0.1:58850_ oasc.DistributedQueue$LatchWatcher.process NodeChildrenChanged fired on path /overseer/queue state SyncConnected
   [junit4]   2> 17261 T69 N:127.0.0.1:58855_ oasc.ZkController.preRegister Registering watch for external collection collection1
   [junit4]   2> 17261 T40 N:127.0.0.1:58850_ oasc.Overseer$ClusterStateUpdater.run processMessage: queueSize: 1, message = {
   [junit4]   2> 	  "core":"collection1",
   [junit4]   2> 	  "roles":null,
   [junit4]   2> 	  "base_url":"http://127.0.0.1:58855",
   [junit4]   2> 	  "node_name":"127.0.0.1:58855_",
   [junit4]   2> 	  "numShards":"2",
   [junit4]   2> 	  "state":"down",
   [junit4]   2> 	  "shard":null,
   [junit4]   2> 	  "collection":"collection1",
   [junit4]   2> 	  "operation":"state"} current state version: 5
   [junit4]   2> 17262 T69 N:127.0.0.1:58855_ oascc.ZkStateReader.addZkWatch addZkWatch collection1
   [junit4]   2> 17264 T69 N:127.0.0.1:58855_ oascc.ZkStateReader.addZkWatch Updating collection state at /collections/collection1/state.json from ZooKeeper... 
   [junit4]   2> 17264 T40 N:127.0.0.1:58850_ oasco.ReplicaMutator.updateState Update state numShards=2 message={
   [junit4]   2> 	  "core":"collection1",
   [junit4]   2> 	  "roles":null,
   [junit4]   2> 	  "base_url":"http://127.0.0.1:58855",
   [junit4]   2> 	  "node_name":"127.0.0.1:58855_",
   [junit4]   2> 	  "numShards":"2",
   [junit4]   2> 	  "state":"down",
   [junit4]   2> 	  "shard":null,
   [junit4]   2> 	  "collection":"collection1",
   [junit4]   2> 	  "operation":"state"}
   [junit4]   2> 17267 T40 N:127.0.0.1:58850_ oasco.ReplicaMutator.updateState Collection already exists with numShards=2
   [junit4]   2> 17267 T40 N:127.0.0.1:58850_ oasco.ReplicaMutator.updateState Assigning new node to shard shard=shard2
   [junit4]   2> 17278 T69 N:127.0.0.1:58855_ oascc.ZkStateReader.updateWatchedCollection Updating data for collection1 to ver 0 
   [junit4]   2> 17280 T69 N:127.0.0.1:58855_ oasc.ZkController.waitForCoreNodeName look for our core node name
   [junit4]   2> 17385 T40 N:127.0.0.1:58850_ oasco.ZkStateWriter.writePendingUpdates going to update_collection /collections/collection1/state.json version: 0
   [junit4]   2> 17392 T68 N:127.0.0.1:58855_ oascc.ZkStateReader$7.process A cluster state change: WatchedEvent state:SyncConnected type:NodeDataChanged path:/collections/collection1/state.json for collection collection1 has occurred - updating... (live nodes size: 2)
   [junit4]   2> 17398 T68 N:127.0.0.1:58855_ oascc.ZkStateReader.updateWatchedCollection Updating data for collection1 to ver 1 
   [junit4]   2> 18283 T69 N:127.0.0.1:58855_ oasc.ZkController.waitForShardId waiting to find shard id in clusterstate for collection1
   [junit4]   2> 18283 T69 N:127.0.0.1:58855_ oasc.ZkController.createCollectionZkNode Check for collection zkNode:collection1
   [junit4]   2> 18286 T69 N:127.0.0.1:58855_ oasc.ZkController.createCollectionZkNode Collection zkNode exists
   [junit4]   2> 18286 T69 N:127.0.0.1:58855_ oascc.ZkStateReader.readConfigName Load collection config from:/collections/collection1
   [junit4]   2> 18289 T69 N:127.0.0.1:58855_ oascc.ZkStateReader.readConfigName path=/collections/collection1 configName=conf1 specified config exists in ZooKeeper
   [junit4]   2> 18289 T69 N:127.0.0.1:58855_ oasc.SolrResourceLoader.<init> new SolrResourceLoader for directory: '/Users/jenkins/workspace/Lucene-Solr-5.x-MacOSX/solr/build/solr-solrj/test/J0/../../../../../../../../../Users/jenkins/workspace/Lucene-Solr-5.x-MacOSX/solr/build/solr-solrj/test/J0/temp/solr.client.solrj.impl.CloudSolrClientTest 8D862054902A223F-001/shard-1-001/cores/collection1/'
   [junit4]   2> 18346 T69 N:127.0.0.1:58855_ oasc.ZkController.watchZKConfDir watch zkdir /configs/conf1
   [junit4]   2> 18350 T69 N:127.0.0.1:58855_ oasc.Config.<init> loaded config solrconfig.xml with version 0 
   [junit4]   2> 18364 T69 N:127.0.0.1:58855_ oasc.SolrConfig.refreshRequestParams current version of requestparams : -1
   [junit4]   2> 18369 T69 N:127.0.0.1:58855_ oasc.SolrConfig.<init> Using Lucene MatchVersion: 5.2.0
   [junit4]   2> 18422 T69 N:127.0.0.1:58855_ oasc.SolrConfig.<init> Loaded SolrConfig: solrconfig.xml
   [junit4]   2> 18441 T69 N:127.0.0.1:58855_ oass.IndexSchema.readSchema Reading Solr Schema from /configs/conf1/schema.xml
   [junit4]   2> 18527 T69 N:127.0.0.1:58855_ oass.IndexSchema.readSchema [collection1] Schema name=test
   [junit4]   2> 18851 T69 N:127.0.0.1:58855_ oass.IndexSchema.readSchema default search field in schema is text
   [junit4]   2> 18852 T69 N:127.0.0.1:58855_ oass.IndexSchema.readSchema unique key field: id
   [junit4]   2> 18853 T69 N:127.0.0.1:58855_ oass.IndexSchema.loadCopyFields WARN Field lowerfilt1and2 is not multivalued and destination for multiple copyFields (2)
   [junit4]   2> 18854 T69 N:127.0.0.1:58855_ oass.IndexSchema.loadCopyFields WARN Field text is not multivalued and destination for multiple copyFields (3)
   [junit4]   2> 18856 T69 N:127.0.0.1:58855_ oasc.CoreContainer.create Creating SolrCore 'collection1' using configuration from collection collection1
   [junit4]   2> 18856 T69 N:127.0.0.1:58855_ c:collection1 oasc.SolrCore.initDirectoryFactory org.apache.solr.core.MockDirectoryFactory
   [junit4]   2> 18856 T69 N:127.0.0.1:58855_ c:collection1 oasc.SolrCore.<init> [collection1] Opening new SolrCore at /Users/jenkins/workspace/Lucene-Solr-5.x-MacOSX/solr/build/solr-solrj/test/J0/../../../../../../../../../Users/jenkins/workspace/Lucene-Solr-5.x-MacOSX/solr/build/solr-solrj/test/J0/temp/solr.client.solrj.impl.CloudSolrClientTest 8D862054902A223F-001/shard-1-001/cores/collection1/, dataDir=/Users/jenkins/workspace/Lucene-Solr-5.x-MacOSX/solr/build/solr-solrj/test/J0/../../../../../../../../../Users/jenkins/workspace/Lucene-Solr-5.x-MacOSX/solr/build/solr-solrj/test/J0/temp/solr.client.solrj.impl.CloudSolrClientTest 8D862054902A223F-001/shard-1-001/cores/collection1/data/
   [junit4]   2> 18857 T69 N:127.0.0.1:58855_ c:collection1 oasc.SolrCore.<init> JMX monitoring not detected for core: collection1
   [junit4]   2> 18858 T69 N:127.0.0.1:58855_ c:collection1 oasc.CachingDirectoryFactory.get return new directory for /Users/jenkins/workspace/Lucene-Solr-5.x-MacOSX/solr/build/solr-solrj/test/J0/../../../../../../../../../Users/jenkins/workspace/Lucene-Solr-5.x-MacOSX/solr/build/solr-solrj/test/J0/temp/solr.client.solrj.impl.CloudSolrClientTest 8D862054902A223F-001/shard-1-001/cores/collection1/data
   [junit4]   2> 18860 T69 N:127.0.0.1:58855_ c:collection1 oasc.SolrCore.getNewIndexDir New index directory detected: old=null new=/Users/jenkins/workspace/Lucene-Solr-5.x-MacOSX/solr/build/solr-solrj/test/J0/../../../../../../../../../Users/jenkins/workspace/Lucene-Solr-5.x-MacOSX/solr/build/solr-solrj/test/J0/temp/solr.client.solrj.impl.CloudSolrClientTest 8D862054902A223F-001/shard-1-001/cores/collection1/data/index/
   [junit4]   2> 18860 T69 N:127.0.0.1:58855_ c:collection1 oasc.SolrCore.initIndex WARN [collection1] Solr index directory '/Users/jenkins/workspace/Lucene-Solr-5.x-MacOSX/solr/build/solr-solrj/test/J0/../../../../../../../../../Users/jenkins/workspace/Lucene-Solr-5.x-MacOSX/solr/build/solr-solrj/test/J0/temp/solr.client.solrj.impl.CloudSolrClientTest 8D862054902A223F-001/shard-1-001/cores/collection1/data/index' doesn't exist. Creating new index...
   [junit4]   2> 18861 T69 N:127.0.0.1:58855_ c:collection1 oasc.CachingDirectoryFactory.get return new directory for /Users/jenkins/workspace/Lucene-Solr-5.x-MacOSX/solr/build/solr-solrj/test/J0/../../../../../../../../../Users/jenkins/workspace/Lucene-Solr-5.x-MacOSX/solr/build/solr-solrj/test/J0/temp/solr.client.solrj.impl.CloudSolrClientTest 8D862054902A223F-001/shard-1-001/cores/collection1/data/index
   [junit4]   2> 18864 T69 N:127.0.0.1:58855_ c:collection1 oasc.SolrDeletionPolicy.onCommit SolrDeletionPolicy.onCommit: commits: num=1
   [junit4]   2> 		commit{dir=MockDirectoryWrapper(RAMDirectory@39e28cc2 lockFactory=org.apache.lucene.store.SingleInstanceLockFactory@494516fd),segFN=segments_1,generation=1}
   [junit4]   2> 18864 T69 N:127.0.0.1:58855_ c:collection1 oasc.SolrDeletionPolicy.updateCommits newest commit generation = 1
   [junit4]   2> 18870 T69 N:127.0.0.1:58855_ c:collection1 oasc.SolrCore.loadUpdateProcessorChains no updateRequestProcessorChain defined as default, creating implicit default
   [junit4]   2> 18880 T69 N:127.0.0.1:58855_ c:collection1 oashl.XMLLoader.init xsltCacheLifetimeSeconds=60
   [junit4]   2> 18885 T69 N:127.0.0.1:58855_ c:collection1 oashl.XMLLoader.init xsltCacheLifetimeSeconds=60
   [junit4]   2> 18887 T69 N:127.0.0.1:58855_ c:collection1 oashl.XMLLoader.init xsltCacheLifetimeSeconds=60
   [junit4]   2> 18889 T69 N:127.0.0.1:58855_ c:collection1 oashl.XMLLoader.init xsltCacheLifetimeSeconds=60
   [junit4]   2> 18892 T69 N:127.0.0.1:58855_ c:collection1 oasc.PluginBag.createPlugin requestHandler : '/replication' created with startup=lazy 
   [junit4]   2> 18900 T69 N:127.0.0.1:58855_ c:collection1 oasc.SolrResourceLoader.findClass WARN Solr loaded a deprecated plugin/analysis class [org.apache.solr.handler.admin.AdminHandlers]. Please consult documentation how to replace it accordingly.
   [junit4]   2> 18902 T69 N:127.0.0.1:58855_ c:collection1 oasc.SolrResourceLoader.findClass WARN Solr loaded a deprecated plugin/analysis class [org.apache.solr.handler.admin.AdminHandlers]. Please consult documentation how to replace it accordingly.
   [junit4]   2> 18902 T69 N:127.0.0.1:58855_ c:collection1 oasc.RequestHandlers.initHandlersFromConfig Registered paths: /admin/mbeans,standard,,/update/csv,/update/json/docs,/admin/luke,/admin/segments,/get,/admin/system,/replication,/admin/properties,/config,/schema,/admin/plugins,/admin/logging,/update/json,/admin,/admin/threads,/admin/ping,/update,/admin/file
   [junit4]   2> 18904 T69 N:127.0.0.1:58855_ c:collection1 oasc.RequestHandlers.initHandlersFromConfig WARN no default request handler is registered (either '/select' or 'standard')
   [junit4]   2> 18906 T69 N:127.0.0.1:58855_ c:collection1 oasc.SolrCore.initStatsCache Using default statsCache cache: org.apache.solr.search.stats.LocalStatsCache
   [junit4]   2> 18910 T69 N:127.0.0.1:58855_ c:collection1 oasu.UpdateHandler.<init> Using UpdateLog implementation: org.apache.solr.update.UpdateLog
   [junit4]   2> 18910 T69 N:127.0.0.1:58855_ c:collection1 oasu.UpdateLog.init Initializing UpdateLog: dataDir= defaultSyncLevel=FLUSH numRecordsToKeep=100 maxNumLogsToKeep=10
   [junit4]   2> 18912 T69 N:127.0.0.1:58855_ c:collection1 oasu.CommitTracker.<init> Hard AutoCommit: disabled
   [junit4]   2> 18913 T69 N:127.0.0.1:58855_ c:collection1 oasu.CommitTracker.<init> Soft AutoCommit: disabled
   [junit4]   2> 18915 T69 N:127.0.0.1:58855_ c:collection1 oasc.SolrDeletionPolicy.onInit SolrDeletionPolicy.onInit: commits: num=1
   [junit4]   2> 		commit{dir=MockDirectoryWrapper(RAMDirectory@39e28cc2 lockFactory=org.apache.lucene.store.SingleInstanceLockFactory@494516fd),segFN=segments_1,generation=1}
   [junit4]   2> 18916 T69 N:127.0.0.1:58855_ c:collection1 oasc.SolrDeletionPolicy.updateCommits newest commit generation = 1
   [junit4]   2> 18917 T69 N:127.0.0.1:58855_ c:collection1 oass.SolrIndexSearcher.<init> Opening Searcher@379207c5[collection1] main
   [junit4]   2> 18919 T69 N:127.0.0.1:58855_ c:collection1 oascc.ZkStateReader.readConfigName Load collection config from:/collections/collection1
   [junit4]   2> 18922 T69 N:127.0.0.1:58855_ c:collection1 oascc.ZkStateReader.readConfigName path=/collections/collection1 configName=conf1 specified config exists in ZooKeeper
   [junit4]   2> 18923 T69 N:127.0.0.1:58855_ c:collection1 oasr.ManagedResourceStorage.newStorageIO Setting up ZooKeeper-based storage for the RestManager with znodeBase: /configs/conf1
   [junit4]   2> 18924 T69 N:127.0.0.1:58855_ c:collection1 oasr.ManagedResourceStorage$ZooKeeperStorageIO.configure Configured ZooKeeperStorageIO with znodeBase: /configs/conf1
   [junit4]   2> 18924 T69 N:127.0.0.1:58855_ c:collection1 oasr.RestManager.init Initializing RestManager with initArgs: {}
   [junit4]   2> 18924 T69 N:127.0.0.1:58855_ c:collection1 oasr.ManagedResourceStorage.load Reading _rest_managed.json using ZooKeeperStorageIO:path=/configs/conf1
   [junit4]   2> 18926 T69 N:127.0.0.1:58855_ c:collection1 oasr.ManagedResourceStorage$ZooKeeperStorageIO.openInputStream No data found for znode /configs/conf1/_rest_managed.json
   [junit4]   2> 18926 T69 N:127.0.0.1:58855_ c:collection1 oasr.ManagedResourceStorage.load Loaded null at path _rest_managed.json using ZooKeeperStorageIO:path=/configs/conf1
   [junit4]   2> 18927 T69 N:127.0.0.1:58855_ c:collection1 oasr.RestManager.init Initializing 0 registered ManagedResources
   [junit4]   2> 18929 T69 N:127.0.0.1:58855_ c:collection1 oasha.AdminHandlers.inform WARN <requestHandler name="/admin/" 
   [junit4]   2> 	 class="solr.admin.AdminHandlers" /> is deprecated . It is not required anymore
   [junit4]   2> 18929 T69 N:127.0.0.1:58855_ c:collection1 oasc.CoreContainer.registerCore registering core: collection1
   [junit4]   2> 18929 T70 N:127.0.0.1:58855_ c:collection1 oasc.SolrCore.registerSearcher [collection1] Registered new searcher Searcher@379207c5[collection1] main{ExitableDirectoryReader(UninvertingDirectoryReader())}
   [junit4]   2> 18932 T73 N:127.0.0.1:58855_ C:collection1 S:shard2 c:collection1 oasc.ZkController.register Register replica - core:collection1 address:http://127.0.0.1:58855 collection:collection1 shard:shard2
   [junit4]   2> 18935 T73 N:127.0.0.1:58855_ C:collection1 S:shard2 c:collection1 oascc.SolrZkClient.makePath makePath: /collections/collection1/leader_elect/shard2/election
   [junit4]   2> 18937 T12 N:127.0.0.1:58855_ oass.SolrDispatchFilter.init user.dir=/Users/jenkins/workspace/Lucene-Solr-5.x-MacOSX/solr/build/solr-solrj/test/J0
   [junit4]   2> 18939 T12 N:127.0.0.1:58855_ oass.SolrDispatchFilter.init SolrDispatchFilter.init() done
   [junit4]   2> 18982 T73 N:127.0.0.1:58855_ C:collection1 S:shard2 c:collection1 oasc.ShardLeaderElectionContext.runLeaderProcess Running the leader process for shard shard2
   [junit4]   2> 18988 T39 N:127.0.0.1:58850_ oasc.DistributedQueue$LatchWatcher.process NodeChildrenChanged fired on path /overseer/queue state SyncConnected
   [junit4]   2> 18992 T73 N:127.0.0.1:58855_ C:collection1 S:shard2 c:collection1 oasc.ShardLeaderElectionContext.waitForReplicasToComeUp Enough replicas found to continue.
   [junit4]   2> 18992 T73 N:127.0.0.1:58855_ C:collection1 S:shard2 c:collection1 oasc.ShardLeaderElectionContext.runLeaderProcess I may be the new leader - try and sync
   [junit4]   2> ASYNC  NEW_CORE C1 name=collection1 org.apache.solr.core.SolrCore@35d1219c url=http://127.0.0.1:58855/collection1 node=127.0.0.1:58855_ C1_STATE=coll:collection1 core:collection1 props:{core=collection1, base_url=http://127.0.0.1:58855, node_name=127.0.0.1:58855_, state=down}
   [junit4]   2> 18992 T73 N:127.0.0.1:58855_ C:collection1 S:shard2 c:collection1 C1 oasc.SyncStrategy.sync Sync replicas to http://127.0.0.1:58855/collection1/
   [junit4]   2> 18993 T73 N:127.0.0.1:58855_ C:collection1 S:shard2 c:collection1 C1 oasc.SyncStrategy.syncReplicas Sync Success - now sync replicas to me
   [junit4]   2> 18993 T73 N:127.0.0.1:58855_ C:collection1 S:shard2 c:collection1 C1 oasc.SyncStrategy.syncToMe http://127.0.0.1:58855/collection1/ has no replicas
   [junit4]   2> 18993 T73 N:127.0.0.1:58855_ C:collection1 S:shard2 c:collection1 oasc.ShardLeaderElectionContext.runLeaderProcess I am the new leader: http://127.0.0.1:58855/collection1/ shard2
   [junit4]   2> 18994 T73 N:127.0.0.1:58855_ C:collection1 S:shard2 c:collection1 oascc.SolrZkClient.makePath makePath: /collections/collection1/leaders/shard2
   [junit4]   2> 19004 T40 N:127.0.0.1:58850_ oasc.Overseer$ClusterStateUpdater.run processMessage: queueSize: 1, message = {
   [junit4]   2> 	  "operation":"leader",
   [junit4]   2> 	  "shard":"shard2",
   [junit4]   2> 	  "collection":"collection1"} current state version: 5
   [junit4]   2> 19034 T40 N:127.0.0.1:58850_ oasco.ZkStateWriter.writePendingUpdates going to update_collection /collections/collection1/state.json version: 1
   [junit4]   2> 19040 T68 N:127.0.0.1:58855_ oascc.ZkStateReader$7.process A cluster state change: WatchedEvent state:SyncConnected type:NodeDataChanged path:/collections/collection1/state.json for collection collection1 has occurred - updating... (live nodes size: 2)
   [junit4]   2> 19045 T68 N:127.0.0.1:58855_ oascc.ZkStateReader.updateWatchedCollection Updating data for collection1 to ver 2 
   [junit4]   2> 19067 T12 oas.SolrTestCaseJ4.writeCoreProperties Writing core.properties file to /Users/jenkins/workspace/Lucene-Solr-5.x-MacOSX/solr/build/solr-solrj/test/J0/temp/solr.client.solrj.impl.CloudSolrClientTest 8D862054902A223F-001/shard-2-001/cores/collection1
   [junit4]   2> 19072 T12 oasc.AbstractFullDistribZkTestBase.createJettys create jetty 2 in directory /Users/jenkins/workspace/Lucene-Solr-5.x-MacOSX/solr/build/solr-solrj/test/J0/temp/solr.client.solrj.impl.CloudSolrClientTest 8D862054902A223F-001/shard-2-001
   [junit4]   2> 19075 T40 N:127.0.0.1:58850_ oasc.Overseer$ClusterStateUpdater.run processMessage: queueSize: 1, message = {
   [junit4]   2> 	  "operation":"leader",
   [junit4]   2> 	  "shard":"shard2",
   [junit4]   2> 	  "collection":"collection1",
   [junit4]   2> 	  "base_url":"http://127.0.0.1:58855",
   [junit4]   2> 	  "core":"collection1",
   [junit4]   2> 	  "state":"active"} current state version: 5
   [junit4]   2> 19075 T12 oejs.Server.doStart jetty-8.1.10.v20130312
   [junit4]   2> 19081 T40 N:127.0.0.1:58850_ oasco.ZkStateWriter.writePendingUpdates going to update_collection /collections/collection1/state.json version: 2
   [junit4]   2> 19084 T68 N:127.0.0.1:58855_ oascc.ZkStateReader$7.process A cluster state change: WatchedEvent state:SyncConnected type:NodeDataChanged path:/collections/collection1/state.json for collection collection1 has occurred - updating... (live nodes size: 2)
   [junit4]   2> 19087 T12 oejs.AbstractConnector.doStart Started SelectChannelConnector@127.0.0.1:58858
   [junit4]   2> 19087 T12 oascse.JettySolrRunner$1.lifeCycleStarted Jetty properties: {solr.data.dir=/Users/jenkins/workspace/Lucene-Solr-5.x-MacOSX/solr/build/solr-solrj/test/J0/temp/solr.client.solrj.impl.CloudSolrClientTest 8D862054902A223F-001/tempDir-001/jetty2, solrconfig=solrconfig.xml, hostContext=/, hostPort=58858, coreRootDirectory=/Users/jenkins/workspace/Lucene-Solr-5.x-MacOSX/solr/build/solr-solrj/test/J0/../../../../../../../../../Users/jenkins/workspace/Lucene-Solr-5.x-MacOSX/solr/build/solr-solrj/test/J0/temp/solr.client.solrj.impl.CloudSolrClientTest 8D862054902A223F-001/shard-2-001/cores}
   [junit4]   2> 19091 T12 oass.SolrDispatchFilter.init SolrDispatchFilter.init()sun.misc.Launcher$AppClassLoader@677327b6
   [junit4]   2> 19092 T12 oasc.SolrResourceLoader.<init> new SolrResourceLoader for directory: '/Users/jenkins/workspace/Lucene-Solr-5.x-MacOSX/solr/build/solr-solrj/test/J0/../../../../../../../../../Users/jenkins/workspace/Lucene-Solr-5.x-MacOSX/solr/build/solr-solrj/test/J0/temp/solr.client.solrj.impl.CloudSolrClientTest 8D862054902A223F-001/shard-2-001/'
   [junit4]   2> 19101 T68 N:127.0.0.1:58855_ oascc.ZkStateReader.updateWatchedCollection Updating data for collection1 to ver 3 
   [junit4]   2> 19113 T39 N:127.0.0.1:58850_ oasc.DistributedQueue$LatchWatcher.process NodeChildrenChanged fired on path /overseer/queue state SyncConnected
   [junit4]   2> 19132 T73 N:127.0.0.1:58855_ C:collection1 S:shard2 c:collection1 oasc.ZkController.register We are http://127.0.0.1:58855/collection1/ and leader is http://127.0.0.1:58855/collection1/
   [junit4]   2> 19132 T73 N:127.0.0.1:58855_ C:collection1 S:shard2 c:collection1 oasc.ZkController.register No LogReplay needed for core=collection1 baseURL=http://127.0.0.1:58855
   [junit4]   2> 19132 T73 N:127.0.0.1:58855_ C:collection1 S:shard2 c:collection1 oasc.ZkController.checkRecovery I am the leader, no recovery necessary
   [junit4]   2> 19133 T73 N:127.0.0.1:58855_ C:collection1 S:shard2 c:collection1 oasc.ZkController.publish publishing core=collection1 state=active collection=collection1
   [junit4]   2> 19133 T73 N:127.0.0.1:58855_ C:collection1 S:shard2 c:collection1 oasc.ZkController.publish numShards not found on descriptor - reading it from system property
   [junit4]   2> 19141 T39 N:127.0.0.1:58850_ oasc.DistributedQueue$LatchWatcher.process NodeChildrenChanged fired on path /overseer/queue state SyncConnected
   [junit4]   2> 19150 T12 oasc.SolrXmlConfig.fromFile Loading container configuration from /Users/jenkins/workspace/Lucene-Solr-5.x-MacOSX/solr/build/solr-solrj/test/J0/../../../../../../../../../Users/jenkins/workspace/Lucene-Solr-5.x-MacOSX/solr/build/solr-solrj/test/J0/temp/solr.client.solrj.impl.CloudSolrClientTest 8D862054902A223F-001/shard-2-001/solr.xml
   [junit4]   2> 19162 T40 N:127.0.0.1:58850_ oasc.Overseer$ClusterStateUpdater.run processMessage: queueSize: 1, message = {
   [junit4]   2> 	  "core":"collection1",
   [junit4]   2> 	  "core_node_name":"core_node1",
   [junit4]   2> 	  "roles":null,
   [junit4]   2> 	  "base_url":"http://127.0.0.1:58855",
   [junit4]   2> 	  "node_name":"127.0.0.1:58855_",
   [junit4]   2> 	  "numShards":"2",
   [junit4]   2> 	  "state":"active",
   [junit4]   2> 	  "shard":"shard2",
   [junit4]   2> 	  "collection":"collection1",
   [junit4]   2> 	  "operation":"state"} current state version: 5
   [junit4]   2> 19165 T40 N:127.0.0.1:58850_ oasco.ReplicaMutator.updateState Update state numShards=2 message={
   [junit4]   2> 	  "core":"collection1",
   [junit4]   2> 	  "core_node_name":"core_node1",
   [junit4]   2> 	  "roles":null,
   [junit4]   2> 	  "base_url":"http://127.0.0.1:58855",
   [junit4]   2> 	  "node_name":"127.0.0.1:58855_",
   [junit4]   2> 	  "numShards":"2",
   [junit4]   2> 	  "state":"active",
   [junit4]   2> 	  "shard":"shard2",
   [junit4]   2> 	  "collection":"collection1",
   [junit4]   2> 	  "operation":"state"}
   [junit4]   2> 19171 T40 N:127.0.0.1:58850_ oasco.ZkStateWriter.writePendingUpdates going to update_collection /collections/collection1/state.json version: 3
   [junit4]   2> 19190 T68 N:127.0.0.1:58855_ oascc.ZkStateReader$7.process A cluster state change: WatchedEvent state:SyncConnected type:NodeDataChanged path:/collections/collection1/state.json for collection collection1 has occurred - updating... (live nodes size: 2)
   [junit4]   2> 19192 T73 N:127.0.0.1:58855_ C:collection1 S:shard2 c:collection1 oascc.ZkStateReader.updateWatchedCollection Updating data for collection1 to ver 4 
   [junit4]   2> 19198 T68 N:127.0.0.1:58855_ oascc.ZkStateReader.updateWatchedCollection Updating data for collection1 to ver 4 
   [junit4]   2> 19221 T12 oasc.CorePropertiesLocator.<init> Config-defined core root directory: /Users/jenkins/workspace/Lucene-Solr-5.x-MacOSX/solr/build/solr-solrj/test/J0/../../../../../../../../../Users/jenkins/workspace/Lucene-Solr-5.x-MacOSX/solr/build/solr-solrj/test/J0/temp/solr.client.solrj.impl.CloudSolrClientTest 8D862054902A223F-001/shard-2-001/cores
   [junit4]   2> 19222 T12 oasc.CoreContainer.<init> New CoreContainer 1080990511
   [junit4]   2> 19222 T12 oasc.CoreContainer.load Loading cores into CoreContainer [instanceDir=/Users/jenkins/workspace/Lucene-Solr-5.x-MacOSX/solr/build/solr-solrj/test/J0/../../../../../../../../../Users/jenkins/workspace/Lucene-Solr-5.x-MacOSX/solr/build/solr-solrj/test/J0/temp/solr.client.solrj.impl.CloudSolrClientTest 8D862054902A223F-001/shard-2-001/]
   [junit4]   2> 19223 T12 oasc.CoreContainer.load loading shared library: /Users/jenkins/workspace/Lucene-Solr-5.x-MacOSX/solr/build/solr-solrj/test/J0/../../../../../../../../../Users/jenkins/workspace/Lucene-Solr-5.x-MacOSX/solr/build/solr-solrj/test/J0/temp/solr.client.solrj.impl.CloudSolrClientTest 8D862054902A223F-001/shard-2-001/lib
   [junit4]   2> 19224 T12 oasc.SolrResourceLoader.addToClassLoader WARN Can't find (or read) directory to add to classloader: lib (resolved as: /Users/jenkins/workspace/Lucene-Solr-5.x-MacOSX/solr/build/solr-solrj/test/J0/../../../../../../../../../Users/jenkins/workspace/Lucene-Solr-5.x-MacOSX/solr/build/solr-solrj/test/J0/temp/solr.client.solrj.impl.CloudSolrClientTest 8D862054902A223F-001/shard-2-001/lib).
   [junit4]   2> 19242 T12 oashc.HttpShardHandlerFactory.init created with socketTimeout : 90000,urlScheme : ,connTimeout : 15000,maxConnectionsPerHost : 20,maxConnections : 10000,corePoolSize : 0,maximumPoolSize : 2147483647,maxThreadIdleTime : 5,sizeOfQueue : -1,fairnessPolicy : false,useRetries : false,
   [junit4]   2> 19246 T12 oasu.UpdateShardHandler.<init> Creating UpdateShardHandler HTTP client with params: socketTimeout=340000&connTimeout=45000&retry=true
   [junit4]   2> 19250 T12 oasl.LogWatcher.createWatcher SLF4J impl is org.slf4j.impl.Log4jLoggerFactory
   [junit4]   2> 19251 T12 oasl.LogWatcher.newRegisteredLogWatcher Registering Log Listener [Log4j (org.slf4j.impl.Log4jLoggerFactory)]
   [junit4]   2> 19251 T12 oasc.CoreContainer.load Node Name: 127.0.0.1
   [junit4]   2> 19251 T12 oasc.ZkContainer.initZooKeeper Zookeeper client=127.0.0.1:58847/solr
   [junit4]   2> 19252 T12 oasc.ZkController.checkChrootPath zkHost includes chroot
   [junit4]   2> 19252 T12 oascc.SolrZkClient.createZkCredentialsToAddAutomatically Using default ZkCredentialsProvider
   [junit4]   2> 19256 T12 oascc.ConnectionManager.waitForConnected Waiting for client to connect to ZooKeeper
   [junit4]   2> 19260 T85 oascc.ConnectionManager.process Watcher org.apache.solr.common.cloud.ConnectionManager@51a463e3 name:ZooKeeperConnection Watcher:127.0.0.1:58847 got event WatchedEvent state:SyncConnected type:None path:null path:null type:None
   [junit4]   2> 19262 T12 oascc.ConnectionManager.waitForConnected Client is connected to ZooKeeper
   [junit4]   2> 19264 T12 oascc.SolrZkClient.createZkACLProvider Using default ZkACLProvider
   [junit4]   2> 19273 T12 N:127.0.0.1:58858_ oascc.ConnectionManager.waitForConnected Waiting for client to connect to ZooKeeper
   [junit4]   2> 19277 T88 N:127.0.0.1:58858_ oascc.ConnectionManager.process Watcher org.apache.solr.common.cloud.ConnectionManager@752d28b0 name:ZooKeeperConnection Watcher:127.0.0.1:58847/solr got event WatchedEvent state:SyncConnected type:None path:null path:null type:None
   [junit4]   2> 19278 T12 N:127.0.0.1:58858_ oascc.ConnectionManager.waitForConnected Client is connected to ZooKeeper
   [junit4]   2> 19335 T12 N:127.0.0.1:58858_ oascc.ZkStateReader.createClusterStateWatchersAndUpdate Updating cluster state from ZooKeeper... 
   [junit4]   2> 20365 T12 N:127.0.0.1:58858_ oasc.ZkController.createEphemeralLiveNode Register node as live in ZooKeeper:/live_nodes/127.0.0.1:58858_
   [junit4]   2> 20368 T12 N:127.0.0.1:58858_ oascc.SolrZkClient.makePath makePath: /live_nodes/127.0.0.1:58858_
   [junit4]   2> 20385 T12 N:127.0.0.1:58858_ oasc.Overseer.close Overseer (id=null) closing
   [junit4]   2> 20414 T12 N:127.0.0.1:58858_ oasc.CorePropertiesLocator.discover Looking for core definitions underneath /Users/jenkins/workspace/Lucene-Solr-5.x-MacOSX/solr/build/solr-solrj/test/J0/../../../../../../../../../Users/jenkins/workspace/Lucene-Solr-5.x-MacOSX/solr/build/solr-solrj/test/J0/temp/solr.client.solrj.impl.CloudSolrClientTest 8D862054902A223F-001/shard-2-001/cores
   [junit4]   2> 20419 T12 N:127.0.0.1:58858_ oasc.CoreDescriptor.<init> CORE DESCRIPTOR: {name=collection1, config=solrconfig.xml, transient=false, schema=schema.xml, loadOnStartup=true, instanceDir=/Users/jenkins/workspace/Lucene-Solr-5.x-MacOSX/solr/build/solr-solrj/test/J0/../../../../../../../../../Users/jenkins/workspace/Lucene-Solr-5.x-MacOSX/solr/build/solr-solrj/test/J0/temp/solr.client.solrj.impl.CloudSolrClientTest 8D862054902A223F-001/shard-2-001/cores/collection1, collection=collection1, absoluteInstDir=/Users/jenkins/workspace/Lucene-Solr-5.x-MacOSX/solr/build/solr-solrj/test/J0/../../../../../../../../../Users/jenkins/workspace/Lucene-Solr-5.x-MacOSX/solr/build/solr-solrj/test/J0/temp/solr.client.solrj.impl.CloudSolrClientTest 8D862054902A223F-001/shard-2-001/cores/collection1/, coreNodeName=, dataDir=data/, shard=}
   [junit4]   2> 20420 T12 N:127.0.0.1:58858_ oasc.CorePropertiesLocator.discoverUnder Found core collection1 in /Users/jenkins/workspace/Lucene-Solr-5.x-MacOSX/solr/build/solr-solrj/test/J0/../../../../../../../../../Users/jenkins/workspace/Lucene-Solr-5.x-MacOSX/solr/build/solr-solrj/test/J0/temp/solr.client.solrj.impl.CloudSolrClientTest 8D862054902A223F-001/shard-2-001/cores/collection1/
   [junit4]   2> 20421 T12 N:127.0.0.1:58858_ oasc.CorePropertiesLocator.discover Found 1 core definitions
   [junit4]   2> 20443 T89 N:127.0.0.1:58858_ C:collection1 c:collection1 oasc.ZkController.publish publishing core=collection1 state=down collection=collection1
   [junit4]   2> 20443 T89 N:127.0.0.1:58858_ C:collection1 c:collection1 oasc.ZkController.publish numShards not found on descriptor - reading it from system property
   [junit4]   2> 20450 T39 N:127.0.0.1:58850_ oasc.DistributedQueue$LatchWatcher.process NodeChildrenChanged fired on path /overseer/queue state SyncConnected
   [junit4]   2> 20460 T89 N:127.0.0.1:58858_ oasc.ZkController.preRegister Registering watch for external collection collection1
   [junit4]   2> 20461 T89 N:127.0.0.1:58858_ oascc.ZkStateReader.addZkWatch addZkWatch collection1
   [junit4]   2> 20460 T40 N:127.0.0.1:58850_ oasc.Overseer$ClusterStateUpdater.run processMessage: queueSize: 1, message = {
   [junit4]   2> 	  "core":"collection1",
   [junit4]   2> 	  "roles":null,
   [junit4]   2> 	  "base_url":"http://127.0.0.1:58858",
   [junit4]   2> 	  "node_name":"127.0.0.1:58858_",
   [junit4]   2> 	  "numShards":"2",
   [junit4]   2> 	  "state":"down",
   [junit4]   2> 	  "shard":null,
   [junit4]   2> 	  "collection":"collection1",
   [junit4]   2> 	  "operation":"state"} current state version: 5
   [junit4]   2> 20466 T89 N:127.0.0.1:58858_ oascc.ZkStateReader.addZkWatch Updating collection state at /collections/collection1/state.json from ZooKeeper... 
   [junit4]   2> 20466 T40 N:127.0.0.1:58850_ oasco.ReplicaMutator.updateState Update state numShards=2 message={
   [junit4]   2> 	  "core":"collection1",
   [junit4]   2> 	  "roles":null,
   [junit4]   2> 	  "base_url":"http://127.0.0.1:58858",
   [junit4]   2> 	  "node_name":"127.0.0.1:58858_",
   [junit4]   2> 	  "numShards":"2",
   [junit4]   2> 	  "state":"down",
   [junit4]   2> 	  "shard":null,
   [junit4]   2> 	  "collection":"collection1",
   [junit4]   2> 	  "operation":"state"}
   [junit4]   2> 20468 T40 N:127.0.0.1:58850_ oasco.ReplicaMutator.updateState Collection already exists with numShards=2
   [junit4]   2> 20468 T40 N:127.0.0.1:58850_ oasco.ReplicaMutator.updateState Assigning new node to shard shard=shard1
   [junit4]   2> 20494 T40 N:127.0.0.1:58850_ oasco.ZkStateWriter.writePendingUpdates going to update_collection /collections/collection1/state.json version: 4
   [junit4]   2> 20495 T89 N:127.0.0.1:58858_ oascc.ZkStateReader.updateWatchedCollection Updating data for collection1 to ver 4 
   [junit4]   2> 20495 T89 N:127.0.0.1:58858_ oasc.ZkController.waitForCoreNodeName look for our core node name
   [junit4]   2> 20497 T68 N:127.0.0.1:58855_ oascc.ZkStateReader$7.process A cluster state change: WatchedEvent state:SyncConnected type:NodeDataChanged path:/collections/collection1/state.json for collection collection1 has occurred - updating... (live nodes size: 3)
   [junit4]   2> 20497 T88 N:127.0.0.1:58858_ oascc.ZkStateReader$7.process A cluster state change: WatchedEvent state:SyncConnected type:NodeDataChanged path:/collections/collection1/state.json for collection collection1 has occurred - updating... (live nodes size: 3)
   [junit4]   2> 20501 T68 N:127.0.0.1:58855_ oascc.ZkStateReader.updateWatchedCollection Updating data for collection1 to ver 5 
   [junit4]   2> 20503 T88 N:127.0.0.1:58858_ oascc.ZkStateReader.updateWatchedCollection Updating data for collection1 to ver 5 
   [junit4]   2> 21497 T89 N:127.0.0.1:58858_ oasc.ZkController.waitForShardId waiting to find shard id in clusterstate for collection1
   [junit4]   2> 21498 T89 N:127.0.0.1:58858_ oasc.ZkController.createCollectionZkNode Check for collection zkNode:collection1
   [junit4]   2> 21501 T89 N:127.0.0.1:58858_ oasc.ZkController.createCollectionZkNode Collection zkNode exists
   [junit4]   2> 21501 T89 N:127.0.0.1:58858_ oascc.ZkStateReader.readConfigName Load collection config from:/collections/collection1
   [junit4]   2> 21503 T89 N:127.0.0.1:58858_ oascc.ZkStateReader.readConfigName path=/collections/collection1 configName=conf1 specified config exists in ZooKeeper
   [junit4]   2> 21504 T89 N:127.0.0.1:58858_ oasc.SolrResourceLoader.<init> new SolrResourceLoader for directory: '/Users/jenkins/workspace/Lucene-Solr-5.x-MacOSX/solr/build/solr-solrj/test/J0/../../../../../../../../../Users/jenkins/workspace/Lucene-Solr-5.x-MacOSX/solr/build/solr-solrj/test/J0/temp/solr.client.solrj.impl.CloudSolrClientTest 8D862054902A223F-001/shard-2-001/cores/collection1/'
   [junit4]   2> 21536 T89 N:127.0.0.1:58858_ oasc.ZkController.watchZKConfDir watch zkdir /configs/conf1
   [junit4]   2> 21540 T89 N:127.0.0.1:58858_ oasc.Config.<init> loaded config solrconfig.xml with version 0 
   [junit4]   2> 21558 T89 N:127.0.0.1:58858_ oasc.SolrConfig.refreshRequestParams current version of requestparams : -1
   [junit4]   2> 21591 T89 N:127.0.0.1:58858_ oasc.SolrConfig.<init> Using Lucene MatchVersion: 5.2.0
   [junit4]   2> 21656 T89 N:127.0.0.1:58858_ oasc.SolrConfig.<init> Loaded SolrConfig: solrconfig.xml
   [junit4]   2> 21659 T89 N:127.0.0.1:58858_ oass.IndexSchema.readSchema Reading Solr Schema from /configs/conf1/schema.xml
   [junit4]   2> 21685 T89 N:127.0.0.1:58858_ oass.IndexSchema.readSchema [collection1] Schema name=test
   [junit4]   2> 22255 T89 N:127.0.0.1:58858_ oass.IndexSchema.readSchema default search field in schema is text
   [junit4]   2> 22262 T89 N:127.0.0.1:58858_ oass.IndexSchema.readSchema unique key field: id
   [junit4]   2> 22268 T89 N:127.0.0.1:58858_ oass.IndexSchema.loadCopyFields WARN Field lowerfilt1and2 is not multivalued and destination for multiple copyFields (2)
   [junit4]   2> 22268 T89 N:127.0.0.1:58858_ oass.IndexSchema.loadCopyFields WARN Field text is not multivalued and destination for multiple copyFields (3)
   [junit4]   2> 22270 T89 N:127.0.0.1:58858_ oasc.CoreContainer.create Creating SolrCore 'collection1' using configuration from collection collection1
   [junit4]   2> 22270 T89 N:127.0.0.1:58858_ c:collection1 oasc.SolrCore.initDirectoryFactory org.apache.solr.core.MockDirectoryFactory
   [junit4]   2> 22282 T89 N:127.0.0.1:58858_ c:collection1 oasc.SolrCore.<init> [collection1] Opening new SolrCore at /Users/jenkins/workspace/Lucene-Solr-5.x-MacOSX/solr/build/solr-solrj/test/J0/../../../../../../../../../Users/jenkins/workspace/Lucene-Solr-5.x-MacOSX/solr/build/solr-solrj/test/J0/temp/solr.client.solrj.impl.CloudSolrClientTest 8D862054902A223F-001/shard-2-001/cores/collection1/, dataDir=/Users/jenkins/workspace/Lucene-Solr-5.x-MacOSX/solr/build/solr-solrj/test/J0/../../../../../../../../../Users/jenkins/workspace/Lucene-Solr-5.x-MacOSX/solr/build/solr-solrj/test/J0/temp/solr.client.solrj.impl.CloudSolrClientTest 8D862054902A223F-001/shard-2-001/cores/collection1/data/
   [junit4]   2> 22283 T89 N:127.0.0.1:58858_ c:collection1 oasc.SolrCore.<init> JMX monitoring not detected for core: collection1
   [junit4]   2> 22284 T89 N:127.0.0.1:58858_ c:collection1 oasc.CachingDirectoryFactory.get return new directory for /Users/jenkins/workspace/Lucene-Solr-5.x-MacOSX/solr/build/solr-solrj/test/J0/../../../../../../../../../Users/jenkins/workspace/Lucene-Solr-5.x-MacOSX/solr/build/solr-solrj/test/J0/temp/solr.client.solrj.impl.CloudSolrClientTest 8D862054902A223F-001/shard-2-001/cores/collection1/data
   [junit4]   2> 22284 T89 N:127.0.0.1:58858_ c:collection1 oasc.SolrCore.getNewIndexDir New index directory detected: old=null new=/Users/jenkins/workspace/Lucene-Solr-5.x-MacOSX/solr/build/solr-solrj/test/J0/../../../../../../../../../Users/jenkins/workspace/Lucene-Solr-5.x-MacOSX/solr/build/solr-solrj/test/J0/temp/solr.client.solrj.impl.CloudSolrClientTest 8D862054902A223F-001/shard-2-001/cores/collection1/data/index/
   [junit4]   2> 22284 T89 N:127.0.0.1:58858_ c:collection1 oasc.SolrCore.initIndex WARN [collection1] Solr index directory '/Users/jenkins/workspace/Lucene-Solr-5.x-MacOSX/solr/build/solr-solrj/test/J0/../../../../../../../../../Users/jenkins/workspace/Lucene-Solr-5.x-MacOSX/solr/build/solr-solrj/test/J0/temp/solr.client.solrj.impl.CloudSolrClientTest 8D862054902A223F-001/shard-2-001/cores/collection1/data/index' doesn't exist. Creating new index...
   [junit4]   2> 22285 T89 N:127.0.0.1:58858_ c:collection1 oasc.CachingDirectoryFactory.get return new directory for /Users/jenkins/workspace/Lucene-Solr-5.x-MacOSX/solr/build/solr-solrj/test/J0/../../../../../../../../../Users/jenkins/workspace/Lucene-Solr-5.x-MacOSX/solr/build/solr-solrj/test/J0/temp/solr.client.solrj.impl.CloudSolrClientTest 8D862054902A223F-001/shard-2-001/cores/collection1/data/index
   [junit4]   2> 22295 T89 N:127.0.0.1:58858_ c:collection1 oasc.SolrDeletionPolicy.onCommit SolrDeletionPolicy.onCommit: commits: num=1
   [junit4]   2> 		commit{dir=MockDirectoryWrapper(RAMDirectory@1ea0a7e6 lockFactory=org.apache.lucene.store.SingleInstanceLockFactory@685d5369),segFN=segments_1,generation=1}
   [junit4]   2> 22295 T89 N:127.0.0.1:58858_ c:collection1 oasc.SolrDeletionPolicy.updateCommits newest commit generation = 1
   [junit4]   2> 22307 T89 N:127.0.0.1:58858_ c:collection1 oasc.SolrCore.loadUpdateProcessorChains no updateRequestProcessorChain defined as default, creating implicit default
   [junit4]   2> 22313 T89 N:127.0.0.1:58858_ c:collection1 oashl.XMLLoader.init xsltCacheLifetimeSeconds=60
   [junit4]   2> 22318 T89 N:127.0.0.1:58858_ c:collection1 oashl.XMLLoader.init xsltCacheLifetimeSeconds=60
   [junit4]   2> 22319 T89 N:127.0.0.1:58858_ c:collection1 oashl.XMLLoader.init xsltCacheLifetimeSeconds=60
   [junit4]   2> 22320 T89 N:127.0.0.1:58858_ c:collection1 oashl.XMLLoader.init xsltCacheLifetimeSeconds=60
   [junit4]   2> 22320 T89 N:127.0.0.1:58858_ c:collection1 oasc.PluginBag.createPlugin requestHandler : '/replication' created with startup=lazy 
   [junit4]   2> 22326 T89 N:127.0.0.1:58858_ c:collection1 oasc.SolrResourceLoader.findClass WARN Solr loaded a deprecated plugin/analysis class [org.apache.solr.handler.admin.AdminHandlers]. Please consult documentation how to replace it accordingly.
   [junit4]   2> 22326 T89 N:127.0.0.1:58858_ c:collection1 oasc.SolrResourceLoader.findClass WARN Solr loaded a deprecated plugin/analysis class [org.apache.solr.handler.admin.AdminHandlers]. Please consult documentation how to replace it accordingly.
   [junit4]   2> 22327 T89 N:127.0.0.1:58858_ c:collection1 oasc.RequestHandlers.initHandlersFromConfig Registered paths: /admin/mbeans,standard,,/update/csv,/update/json/docs,/admin/luke,

[...truncated too long message...]

.SolrCore@675d3d53
   [junit4]   2> 108609 T468 N:127.0.0.1:59021_ oasc.ZkController.unRegisterConfListener  a listener was removed because of core close
   [junit4]   2> 108610 T468 N:127.0.0.1:59021_ oasu.DirectUpdateHandler2.close closing DirectUpdateHandler2{commits=0,autocommits=0,soft autocommits=0,optimizes=0,rollbacks=0,expungeDeletes=0,docsPending=0,adds=0,deletesById=0,deletesByQuery=0,errors=0,cumulative_adds=0,cumulative_deletesById=0,cumulative_deletesByQuery=0,cumulative_errors=0,transaction_logs_total_size=0,transaction_logs_total_number=0}
   [junit4]   2> 108610 T468 N:127.0.0.1:59021_ oasu.SolrCoreState.decrefSolrCoreState Closing SolrCoreState
   [junit4]   2> 108610 T468 N:127.0.0.1:59021_ oasu.DefaultSolrCoreState.closeIndexWriter SolrCoreState ref count has reached 0 - closing IndexWriter
   [junit4]   2> 108610 T468 N:127.0.0.1:59021_ oasu.DefaultSolrCoreState.closeIndexWriter closing IndexWriter with IndexWriterCloser
   [junit4]   2> 108613 T468 N:127.0.0.1:59021_ oasc.SolrCore.closeSearcher [collection1] Closing main searcher on request.
   [junit4]   2> 108613 T468 N:127.0.0.1:59021_ oasc.CachingDirectoryFactory.close Closing MockDirectoryFactory - 2 directories currently being tracked
   [junit4]   2> 108613 T468 N:127.0.0.1:59021_ oasc.CachingDirectoryFactory.closeCacheValue looking to close /Users/jenkins/workspace/Lucene-Solr-5.x-MacOSX/solr/build/solr-solrj/test/J0/../../../../../../../../../Users/jenkins/workspace/Lucene-Solr-5.x-MacOSX/solr/build/solr-solrj/test/J0/temp/solr.client.solrj.impl.CloudSolrClientTest 8D862054902A223F-001/shard-3-003/cores/collection1/data [CachedDir<<refCount=0;path=/Users/jenkins/workspace/Lucene-Solr-5.x-MacOSX/solr/build/solr-solrj/test/J0/../../../../../../../../../Users/jenkins/workspace/Lucene-Solr-5.x-MacOSX/solr/build/solr-solrj/test/J0/temp/solr.client.solrj.impl.CloudSolrClientTest 8D862054902A223F-001/shard-3-003/cores/collection1/data;done=false>>]
   [junit4]   2> 108613 T468 N:127.0.0.1:59021_ oasc.CachingDirectoryFactory.close Closing directory: /Users/jenkins/workspace/Lucene-Solr-5.x-MacOSX/solr/build/solr-solrj/test/J0/../../../../../../../../../Users/jenkins/workspace/Lucene-Solr-5.x-MacOSX/solr/build/solr-solrj/test/J0/temp/solr.client.solrj.impl.CloudSolrClientTest 8D862054902A223F-001/shard-3-003/cores/collection1/data
   [junit4]   2> 108613 T468 N:127.0.0.1:59021_ oasc.CachingDirectoryFactory.closeCacheValue looking to close /Users/jenkins/workspace/Lucene-Solr-5.x-MacOSX/solr/build/solr-solrj/test/J0/../../../../../../../../../Users/jenkins/workspace/Lucene-Solr-5.x-MacOSX/solr/build/solr-solrj/test/J0/temp/solr.client.solrj.impl.CloudSolrClientTest 8D862054902A223F-001/shard-3-003/cores/collection1/data/index [CachedDir<<refCount=0;path=/Users/jenkins/workspace/Lucene-Solr-5.x-MacOSX/solr/build/solr-solrj/test/J0/../../../../../../../../../Users/jenkins/workspace/Lucene-Solr-5.x-MacOSX/solr/build/solr-solrj/test/J0/temp/solr.client.solrj.impl.CloudSolrClientTest 8D862054902A223F-001/shard-3-003/cores/collection1/data/index;done=false>>]
   [junit4]   2> 108614 T468 N:127.0.0.1:59021_ oasc.CachingDirectoryFactory.close Closing directory: /Users/jenkins/workspace/Lucene-Solr-5.x-MacOSX/solr/build/solr-solrj/test/J0/../../../../../../../../../Users/jenkins/workspace/Lucene-Solr-5.x-MacOSX/solr/build/solr-solrj/test/J0/temp/solr.client.solrj.impl.CloudSolrClientTest 8D862054902A223F-001/shard-3-003/cores/collection1/data/index
   [junit4]   2> 108614 T468 N:127.0.0.1:59021_ oasc.LeaderElector$ElectionWatcher.process WARN  org.apache.solr.common.SolrException: org.apache.zookeeper.KeeperException$SessionExpiredException: KeeperErrorCode = Session expired for /overseer/queue
   [junit4]   2> 	at org.apache.solr.cloud.DistributedQueue.<init>(DistributedQueue.java:71)
   [junit4]   2> 	at org.apache.solr.cloud.Overseer.getInQueue(Overseer.java:904)
   [junit4]   2> 	at org.apache.solr.cloud.Overseer.getInQueue(Overseer.java:899)
   [junit4]   2> 	at org.apache.solr.cloud.ShardLeaderElectionContext.runLeaderProcess(ElectionContext.java:230)
   [junit4]   2> 	at org.apache.solr.cloud.LeaderElector.runIamLeaderProcess(LeaderElector.java:198)
   [junit4]   2> 	at org.apache.solr.cloud.LeaderElector.checkIfIamLeader(LeaderElector.java:159)
   [junit4]   2> 	at org.apache.solr.cloud.LeaderElector.joinElection(LeaderElector.java:348)
   [junit4]   2> 	at org.apache.solr.cloud.LeaderElector.joinElection(LeaderElector.java:256)
   [junit4]   2> 	at org.apache.solr.cloud.ShardLeaderElectionContext.rejoinLeaderElection(ElectionContext.java:492)
   [junit4]   2> 	at org.apache.solr.cloud.ShardLeaderElectionContext.runLeaderProcess(ElectionContext.java:248)
   [junit4]   2> 	at org.apache.solr.cloud.LeaderElector.runIamLeaderProcess(LeaderElector.java:198)
   [junit4]   2> 	at org.apache.solr.cloud.LeaderElector.checkIfIamLeader(LeaderElector.java:159)
   [junit4]   2> 	at org.apache.solr.cloud.LeaderElector.access$200(LeaderElector.java:56)
   [junit4]   2> 	at org.apache.solr.cloud.LeaderElector$ElectionWatcher.process(LeaderElector.java:390)
   [junit4]   2> 	at org.apache.solr.common.cloud.SolrZkClient$3$1.run(SolrZkClient.java:264)
   [junit4]   2> 	at java.util.concurrent.Executors$RunnableAdapter.call(Executors.java:511)
   [junit4]   2> 	at java.util.concurrent.FutureTask.run(FutureTask.java:266)
   [junit4]   2> 	at org.apache.solr.common.util.ExecutorUtil$MDCAwareThreadPoolExecutor$1.run(ExecutorUtil.java:147)
   [junit4]   2> 	at java.util.concurrent.ThreadPoolExecutor.runWorker(ThreadPoolExecutor.java:1142)
   [junit4]   2> 	at java.util.concurrent.ThreadPoolExecutor$Worker.run(ThreadPoolExecutor.java:617)
   [junit4]   2> 	at java.lang.Thread.run(Thread.java:745)
   [junit4]   2> Caused by: org.apache.zookeeper.KeeperException$SessionExpiredException: KeeperErrorCode = Session expired for /overseer/queue
   [junit4]   2> 	at org.apache.zookeeper.KeeperException.create(KeeperException.java:127)
   [junit4]   2> 	at org.apache.zookeeper.KeeperException.create(KeeperException.java:51)
   [junit4]   2> 	at org.apache.zookeeper.ZooKeeper.exists(ZooKeeper.java:1045)
   [junit4]   2> 	at org.apache.solr.common.cloud.SolrZkClient$5.execute(SolrZkClient.java:311)
   [junit4]   2> 	at org.apache.solr.common.cloud.SolrZkClient$5.execute(SolrZkClient.java:308)
   [junit4]   2> 	at org.apache.solr.common.cloud.ZkCmdExecutor.retryOperation(ZkCmdExecutor.java:61)
   [junit4]   2> 	at org.apache.solr.common.cloud.SolrZkClient.exists(SolrZkClient.java:308)
   [junit4]   2> 	at org.apache.solr.common.cloud.ZkCmdExecutor.ensureExists(ZkCmdExecutor.java:90)
   [junit4]   2> 	at org.apache.solr.common.cloud.ZkCmdExecutor.ensureExists(ZkCmdExecutor.java:84)
   [junit4]   2> 	at org.apache.solr.cloud.DistributedQueue.<init>(DistributedQueue.java:69)
   [junit4]   2> 	... 20 more
   [junit4]   2> 
   [junit4]   2> 108629 T12 oejsh.ContextHandler.doStop stopped o.e.j.s.ServletContextHandler{/,null}
   [junit4]   2> 108825 T12 C:control_collection S:shard1 c:collection1 oasc.ChaosMonkey.monkeyLog monkey: stop shard! 59009
   [junit4]   2> 108826 T12 C:control_collection S:shard1 c:collection1 oasc.ZkTestServer.send4LetterWord connecting to 127.0.0.1:59006 59006
   [junit4]   2> 108916 T359 C:control_collection S:shard1 c:collection1 oasc.ZkTestServer.send4LetterWord connecting to 127.0.0.1:59006 59006
   [junit4]   2> 109955 T359 C:control_collection S:shard1 c:collection1 oasc.ZkTestServer$ZKServerMain.runFromConfig WARN Watch limit violations: 
   [junit4]   2> 	Maximum concurrent create/delete watches above limit:
   [junit4]   2> 	
   [junit4]   2> 		5	/solr/aliases.json
   [junit4]   2> 		5	/solr/clusterstate.json
   [junit4]   2> 		4	/solr/configs/conf1
   [junit4]   2> 	
   [junit4]   2> 	Maximum concurrent children watches above limit:
   [junit4]   2> 	
   [junit4]   2> 		5	/solr/live_nodes
   [junit4]   2> 		4	/solr/overseer/collection-queue-work
   [junit4]   2> 		3	/solr/overseer/queue
   [junit4]   2> 	
   [junit4]   2> 109959 T12 C:control_collection S:shard1 c:collection1 oas.SolrTestCaseJ4.deleteCore ###deleteCore
   [junit4]   2> NOTE: leaving temporary files on disk at: /Users/jenkins/workspace/Lucene-Solr-5.x-MacOSX/solr/build/solr-solrj/test/J0/temp/solr.client.solrj.impl.CloudSolrClientTest 8D862054902A223F-001
   [junit4]   2> NOTE: test params are: codec=CheapBastard, sim=DefaultSimilarity, locale=zh_HK, timezone=America/Noronha
   [junit4]   2> NOTE: Mac OS X 10.8.5 x86_64/Oracle Corporation 1.8.0_40 (64-bit)/cpus=3,threads=1,free=64782808,total=198180864
   [junit4]   2> NOTE: All tests run in this JVM: [CloudSolrClientTest]
   [junit4] Completed [15/57] on J0 in 110.71s, 3 tests, 1 error <<< FAILURES!

[...truncated 136 lines...]
BUILD FAILED
/Users/jenkins/workspace/Lucene-Solr-5.x-MacOSX/build.xml:536: The following error occurred while executing this line:
/Users/jenkins/workspace/Lucene-Solr-5.x-MacOSX/build.xml:484: The following error occurred while executing this line:
/Users/jenkins/workspace/Lucene-Solr-5.x-MacOSX/build.xml:61: The following error occurred while executing this line:
/Users/jenkins/workspace/Lucene-Solr-5.x-MacOSX/extra-targets.xml:39: The following error occurred while executing this line:
/Users/jenkins/workspace/Lucene-Solr-5.x-MacOSX/solr/build.xml:242: The following error occurred while executing this line:
/Users/jenkins/workspace/Lucene-Solr-5.x-MacOSX/solr/common-build.xml:511: The following error occurred while executing this line:
/Users/jenkins/workspace/Lucene-Solr-5.x-MacOSX/lucene/common-build.xml:1434: The following error occurred while executing this line:
/Users/jenkins/workspace/Lucene-Solr-5.x-MacOSX/lucene/common-build.xml:991: There were test failures: 57 suites, 381 tests, 1 error

Total time: 76 minutes 8 seconds
Build step 'Invoke Ant' marked build as failure
Archiving artifacts
Recording test results
Email was triggered for: Failure - Any
Sending email for trigger: Failure - Any



Mime
View raw message