lucene-dev mailing list archives

Site index · List index
Message view « Date » · « Thread »
Top « Date » · « Thread »
From Policeman Jenkins Server <jenk...@thetaphi.de>
Subject [JENKINS] Lucene-Solr-trunk-MacOSX (64bit/jdk1.8.0) - Build # 2124 - Failure!
Date Wed, 01 Apr 2015 17:07:39 GMT
Build: http://jenkins.thetaphi.de/job/Lucene-Solr-trunk-MacOSX/2124/
Java: 64bit/jdk1.8.0 -XX:-UseCompressedOops -XX:+UseSerialGC

1 tests failed.
FAILED:  org.apache.lucene.analysis.uima.UIMABaseAnalyzerTest.testRandomStringsWithConfigurationParameters

Error Message:
some thread(s) failed

Stack Trace:
java.lang.RuntimeException: some thread(s) failed
	at org.apache.lucene.analysis.BaseTokenStreamTestCase.checkRandomData(BaseTokenStreamTestCase.java:531)
	at org.apache.lucene.analysis.BaseTokenStreamTestCase.checkRandomData(BaseTokenStreamTestCase.java:428)
	at org.apache.lucene.analysis.uima.UIMABaseAnalyzerTest.testRandomStringsWithConfigurationParameters(UIMABaseAnalyzerTest.java:134)
	at sun.reflect.NativeMethodAccessorImpl.invoke0(Native Method)
	at sun.reflect.NativeMethodAccessorImpl.invoke(NativeMethodAccessorImpl.java:62)
	at sun.reflect.DelegatingMethodAccessorImpl.invoke(DelegatingMethodAccessorImpl.java:43)
	at java.lang.reflect.Method.invoke(Method.java:497)
	at com.carrotsearch.randomizedtesting.RandomizedRunner.invoke(RandomizedRunner.java:1627)
	at com.carrotsearch.randomizedtesting.RandomizedRunner$6.evaluate(RandomizedRunner.java:836)
	at com.carrotsearch.randomizedtesting.RandomizedRunner$7.evaluate(RandomizedRunner.java:872)
	at com.carrotsearch.randomizedtesting.RandomizedRunner$8.evaluate(RandomizedRunner.java:886)
	at org.apache.lucene.util.TestRuleSetupTeardownChained$1.evaluate(TestRuleSetupTeardownChained.java:50)
	at org.apache.lucene.util.AbstractBeforeAfterRule$1.evaluate(AbstractBeforeAfterRule.java:46)
	at org.apache.lucene.util.TestRuleThreadAndTestName$1.evaluate(TestRuleThreadAndTestName.java:49)
	at org.apache.lucene.util.TestRuleIgnoreAfterMaxFailures$1.evaluate(TestRuleIgnoreAfterMaxFailures.java:65)
	at org.apache.lucene.util.TestRuleMarkFailure$1.evaluate(TestRuleMarkFailure.java:48)
	at com.carrotsearch.randomizedtesting.rules.StatementAdapter.evaluate(StatementAdapter.java:36)
	at com.carrotsearch.randomizedtesting.ThreadLeakControl$StatementRunner.run(ThreadLeakControl.java:365)
	at com.carrotsearch.randomizedtesting.ThreadLeakControl.forkTimeoutingTask(ThreadLeakControl.java:798)
	at com.carrotsearch.randomizedtesting.ThreadLeakControl$3.evaluate(ThreadLeakControl.java:458)
	at com.carrotsearch.randomizedtesting.RandomizedRunner.runSingleTest(RandomizedRunner.java:845)
	at com.carrotsearch.randomizedtesting.RandomizedRunner$3.evaluate(RandomizedRunner.java:747)
	at com.carrotsearch.randomizedtesting.RandomizedRunner$4.evaluate(RandomizedRunner.java:781)
	at com.carrotsearch.randomizedtesting.RandomizedRunner$5.evaluate(RandomizedRunner.java:792)
	at org.apache.lucene.util.AbstractBeforeAfterRule$1.evaluate(AbstractBeforeAfterRule.java:46)
	at com.carrotsearch.randomizedtesting.rules.StatementAdapter.evaluate(StatementAdapter.java:36)
	at org.apache.lucene.util.TestRuleStoreClassName$1.evaluate(TestRuleStoreClassName.java:42)
	at com.carrotsearch.randomizedtesting.rules.NoShadowingOrOverridesOnMethodsRule$1.evaluate(NoShadowingOrOverridesOnMethodsRule.java:39)
	at com.carrotsearch.randomizedtesting.rules.NoShadowingOrOverridesOnMethodsRule$1.evaluate(NoShadowingOrOverridesOnMethodsRule.java:39)
	at com.carrotsearch.randomizedtesting.rules.StatementAdapter.evaluate(StatementAdapter.java:36)
	at com.carrotsearch.randomizedtesting.rules.StatementAdapter.evaluate(StatementAdapter.java:36)
	at com.carrotsearch.randomizedtesting.rules.StatementAdapter.evaluate(StatementAdapter.java:36)
	at org.apache.lucene.util.TestRuleAssertionsRequired$1.evaluate(TestRuleAssertionsRequired.java:54)
	at org.apache.lucene.util.TestRuleMarkFailure$1.evaluate(TestRuleMarkFailure.java:48)
	at org.apache.lucene.util.TestRuleIgnoreAfterMaxFailures$1.evaluate(TestRuleIgnoreAfterMaxFailures.java:65)
	at org.apache.lucene.util.TestRuleIgnoreTestSuites$1.evaluate(TestRuleIgnoreTestSuites.java:55)
	at com.carrotsearch.randomizedtesting.rules.StatementAdapter.evaluate(StatementAdapter.java:36)
	at com.carrotsearch.randomizedtesting.ThreadLeakControl$StatementRunner.run(ThreadLeakControl.java:365)
	at java.lang.Thread.run(Thread.java:745)




Build Log:
[...truncated 4069 lines...]
   [junit4] Suite: org.apache.lucene.analysis.uima.UIMABaseAnalyzerTest
   [junit4]   2> abr 01, 2015 6:07:17 PM WhitespaceTokenizer initialize
   [junit4]   2> INFORMACIÓN: "Whitespace tokenizer successfully initialized"
   [junit4]   2> abr 01, 2015 6:07:21 PM WhitespaceTokenizer typeSystemInit
   [junit4]   2> INFORMACIÓN: "Whitespace tokenizer typesystem initialized"
   [junit4]   2> abr 01, 2015 6:07:21 PM WhitespaceTokenizer process
   [junit4]   2> INFORMACIÓN: "Whitespace tokenizer starts processing"
   [junit4]   2> abr 01, 2015 6:07:21 PM WhitespaceTokenizer process
   [junit4]   2> INFORMACIÓN: "Whitespace tokenizer finished processing"
   [junit4]   2> TEST FAIL: useCharFilter=false text=''
   [junit4]   2> abr 01, 2015 6:07:23 PM com.carrotsearch.randomizedtesting.RandomizedRunner$QueueUncaughtExceptionsHandler
uncaughtException
   [junit4]   2> ADVERTENCIA: Uncaught exception in thread: Thread[Thread-7,5,TGRP-UIMABaseAnalyzerTest]
   [junit4]   2> java.lang.AssertionError
   [junit4]   2> 	at __randomizedtesting.SeedInfo.seed([E5920128EDC36419]:0)
   [junit4]   2> 	at sun.reflect.generics.reflectiveObjects.WildcardTypeImpl.getUpperBoundASTs(WildcardTypeImpl.java:86)
   [junit4]   2> 	at sun.reflect.generics.reflectiveObjects.WildcardTypeImpl.getUpperBounds(WildcardTypeImpl.java:122)
   [junit4]   2> 	at com.sun.beans.TypeResolver.resolve(TypeResolver.java:175)
   [junit4]   2> 	at com.sun.beans.TypeResolver.resolve(TypeResolver.java:218)
   [junit4]   2> 	at com.sun.beans.TypeResolver.resolve(TypeResolver.java:169)
   [junit4]   2> 	at com.sun.beans.TypeResolver.resolveInClass(TypeResolver.java:81)
   [junit4]   2> 	at java.beans.FeatureDescriptor.getReturnType(FeatureDescriptor.java:370)
   [junit4]   2> 	at java.beans.Introspector.getTargetEventInfo(Introspector.java:1052)
   [junit4]   2> 	at java.beans.Introspector.getBeanInfo(Introspector.java:427)
   [junit4]   2> 	at java.beans.Introspector.getBeanInfo(Introspector.java:262)
   [junit4]   2> 	at java.beans.Introspector.<init>(Introspector.java:407)
   [junit4]   2> 	at java.beans.Introspector.getBeanInfo(Introspector.java:262)
   [junit4]   2> 	at java.beans.Introspector.<init>(Introspector.java:407)
   [junit4]   2> 	at java.beans.Introspector.getBeanInfo(Introspector.java:262)
   [junit4]   2> 	at java.beans.Introspector.getBeanInfo(Introspector.java:204)
   [junit4]   2> 	at org.apache.uima.resource.metadata.impl.MetaDataObject_impl.getPropertyDescriptors(MetaDataObject_impl.java:1269)
   [junit4]   2> 	at org.apache.uima.resource.metadata.impl.MetaDataObject_impl.listAttributes(MetaDataObject_impl.java:105)
   [junit4]   2> 	at org.apache.uima.resource.metadata.impl.MetaDataObject_impl.setSourceUrl(MetaDataObject_impl.java:289)
   [junit4]   2> 	at org.apache.uima.util.CasCreationUtils.mergeFeatures(CasCreationUtils.java:1628)
   [junit4]   2> 	at org.apache.uima.util.CasCreationUtils.addTypeToMergedTypeSystem(CasCreationUtils.java:1129)
   [junit4]   2> 	at org.apache.uima.util.CasCreationUtils.mergeTypeSystems(CasCreationUtils.java:1090)
   [junit4]   2> 	at org.apache.uima.util.CasCreationUtils.doCreateCas(CasCreationUtils.java:551)
   [junit4]   2> 	at org.apache.uima.util.CasCreationUtils.createCas(CasCreationUtils.java:355)
   [junit4]   2> 	at org.apache.uima.util.CasCreationUtils.createCas(CasCreationUtils.java:635)
   [junit4]   2> 	at org.apache.uima.analysis_engine.impl.AnalysisEngineImplBase.newCAS(AnalysisEngineImplBase.java:231)
   [junit4]   2> 	at org.apache.lucene.analysis.uima.BaseUIMATokenizer.analyzeInput(BaseUIMATokenizer.java:67)
   [junit4]   2> 	at org.apache.lucene.analysis.uima.UIMAAnnotationsTokenizer.initializeIterator(UIMAAnnotationsTokenizer.java:60)
   [junit4]   2> 	at org.apache.lucene.analysis.uima.UIMAAnnotationsTokenizer.incrementToken(UIMAAnnotationsTokenizer.java:72)
   [junit4]   2> 	at org.apache.lucene.analysis.BaseTokenStreamTestCase.checkAnalysisConsistency(BaseTokenStreamTestCase.java:700)
   [junit4]   2> 	at org.apache.lucene.analysis.BaseTokenStreamTestCase.checkRandomData(BaseTokenStreamTestCase.java:611)
   [junit4]   2> 	at org.apache.lucene.analysis.BaseTokenStreamTestCase.access$000(BaseTokenStreamTestCase.java:60)
   [junit4]   2> 	at org.apache.lucene.analysis.BaseTokenStreamTestCase$AnalysisThread.run(BaseTokenStreamTestCase.java:479)
   [junit4]   2> 
   [junit4]   2> NOTE: reproduce with: ant test  -Dtestcase=UIMABaseAnalyzerTest -Dtests.method=testRandomStringsWithConfigurationParameters
-Dtests.seed=E5920128EDC36419 -Dtests.slow=true -Dtests.locale=es -Dtests.timezone=Africa/Kinshasa
-Dtests.asserts=true -Dtests.file.encoding=UTF-8
   [junit4] ERROR   0.60s | UIMABaseAnalyzerTest.testRandomStringsWithConfigurationParameters
<<<
   [junit4]    > Throwable #1: java.lang.RuntimeException: some thread(s) failed
   [junit4]    > 	at org.apache.lucene.analysis.BaseTokenStreamTestCase.checkRandomData(BaseTokenStreamTestCase.java:531)
   [junit4]    > 	at org.apache.lucene.analysis.BaseTokenStreamTestCase.checkRandomData(BaseTokenStreamTestCase.java:428)
   [junit4]    > 	at org.apache.lucene.analysis.uima.UIMABaseAnalyzerTest.testRandomStringsWithConfigurationParameters(UIMABaseAnalyzerTest.java:134)
   [junit4]    > 	at java.lang.Thread.run(Thread.java:745)Throwable #2: com.carrotsearch.randomizedtesting.UncaughtExceptionError:
Captured an uncaught exception in thread: Thread[id=18, name=Thread-7, state=RUNNABLE, group=TGRP-UIMABaseAnalyzerTest]
   [junit4]    > Caused by: java.lang.AssertionError
   [junit4]    > 	at __randomizedtesting.SeedInfo.seed([E5920128EDC36419]:0)
   [junit4]    > 	at com.sun.beans.TypeResolver.resolve(TypeResolver.java:175)
   [junit4]    > 	at com.sun.beans.TypeResolver.resolve(TypeResolver.java:218)
   [junit4]    > 	at com.sun.beans.TypeResolver.resolve(TypeResolver.java:169)
   [junit4]    > 	at com.sun.beans.TypeResolver.resolveInClass(TypeResolver.java:81)
   [junit4]    > 	at java.beans.FeatureDescriptor.getReturnType(FeatureDescriptor.java:370)
   [junit4]    > 	at java.beans.Introspector.getTargetEventInfo(Introspector.java:1052)
   [junit4]    > 	at java.beans.Introspector.getBeanInfo(Introspector.java:427)
   [junit4]    > 	at java.beans.Introspector.getBeanInfo(Introspector.java:262)
   [junit4]    > 	at java.beans.Introspector.<init>(Introspector.java:407)
   [junit4]    > 	at java.beans.Introspector.getBeanInfo(Introspector.java:262)
   [junit4]    > 	at java.beans.Introspector.<init>(Introspector.java:407)
   [junit4]    > 	at java.beans.Introspector.getBeanInfo(Introspector.java:262)
   [junit4]    > 	at java.beans.Introspector.getBeanInfo(Introspector.java:204)
   [junit4]    > 	at org.apache.uima.resource.metadata.impl.MetaDataObject_impl.getPropertyDescriptors(MetaDataObject_impl.java:1269)
   [junit4]    > 	at org.apache.uima.resource.metadata.impl.MetaDataObject_impl.listAttributes(MetaDataObject_impl.java:105)
   [junit4]    > 	at org.apache.uima.resource.metadata.impl.MetaDataObject_impl.setSourceUrl(MetaDataObject_impl.java:289)
   [junit4]    > 	at org.apache.uima.util.CasCreationUtils.mergeFeatures(CasCreationUtils.java:1628)
   [junit4]    > 	at org.apache.uima.util.CasCreationUtils.addTypeToMergedTypeSystem(CasCreationUtils.java:1129)
   [junit4]    > 	at org.apache.uima.util.CasCreationUtils.mergeTypeSystems(CasCreationUtils.java:1090)
   [junit4]    > 	at org.apache.uima.util.CasCreationUtils.doCreateCas(CasCreationUtils.java:551)
   [junit4]    > 	at org.apache.uima.util.CasCreationUtils.createCas(CasCreationUtils.java:355)
   [junit4]    > 	at org.apache.uima.util.CasCreationUtils.createCas(CasCreationUtils.java:635)
   [junit4]    > 	at org.apache.uima.analysis_engine.impl.AnalysisEngineImplBase.newCAS(AnalysisEngineImplBase.java:231)
   [junit4]    > 	at org.apache.lucene.analysis.uima.BaseUIMATokenizer.analyzeInput(BaseUIMATokenizer.java:67)
   [junit4]    > 	at org.apache.lucene.analysis.uima.UIMAAnnotationsTokenizer.initializeIterator(UIMAAnnotationsTokenizer.java:60)
   [junit4]    > 	at org.apache.lucene.analysis.uima.UIMAAnnotationsTokenizer.incrementToken(UIMAAnnotationsTokenizer.java:72)
   [junit4]    > 	at org.apache.lucene.analysis.BaseTokenStreamTestCase.checkAnalysisConsistency(BaseTokenStreamTestCase.java:700)
   [junit4]    > 	at org.apache.lucene.analysis.BaseTokenStreamTestCase.checkRandomData(BaseTokenStreamTestCase.java:611)
   [junit4]    > 	at org.apache.lucene.analysis.BaseTokenStreamTestCase.access$000(BaseTokenStreamTestCase.java:60)
   [junit4]    > 	at org.apache.lucene.analysis.BaseTokenStreamTestCase$AnalysisThread.run(BaseTokenStreamTestCase.java:479)
   [junit4]   2> abr 01, 2015 6:07:23 PM WhitespaceTokenizer initialize
   [junit4]   2> INFORMACIÓN: "Whitespace tokenizer successfully initialized"
   [junit4]   2> abr 01, 2015 6:07:26 PM WhitespaceTokenizer typeSystemInit
   [junit4]   2> INFORMACIÓN: "Whitespace tokenizer typesystem initialized"
   [junit4]   2> abr 01, 2015 6:07:26 PM WhitespaceTokenizer process
   [junit4]   2> INFORMACIÓN: "Whitespace tokenizer starts processing"
   [junit4]   2> abr 01, 2015 6:07:26 PM WhitespaceTokenizer process
   [junit4]   2> INFORMACIÓN: "Whitespace tokenizer finished processing"
   [junit4]   2> abr 01, 2015 6:07:26 PM WhitespaceTokenizer process
   [junit4]   2> INFORMACIÓN: "Whitespace tokenizer starts processing"
   [junit4]   2> abr 01, 2015 6:07:26 PM WhitespaceTokenizer process
   [junit4]   2> INFORMACIÓN: "Whitespace tokenizer finished processing"
   [junit4]   2> abr 01, 2015 6:07:27 PM WhitespaceTokenizer process
   [junit4]   2> INFORMACIÓN: "Whitespace tokenizer starts processing"
   [junit4]   2> abr 01, 2015 6:07:27 PM WhitespaceTokenizer process
   [junit4]   2> INFORMACIÓN: "Whitespace tokenizer finished processing"
   [junit4]   2> abr 01, 2015 6:07:27 PM WhitespaceTokenizer process
   [junit4]   2> INFORMACIÓN: "Whitespace tokenizer starts processing"
   [junit4]   2> abr 01, 2015 6:07:27 PM WhitespaceTokenizer process
   [junit4]   2> INFORMACIÓN: "Whitespace tokenizer finished processing"
   [junit4]   2> NOTE: test params are: codec=DummyCompressingStoredFields(storedFieldsFormat=CompressingStoredFieldsFormat(compressionMode=DUMMY,
chunkSize=20899, maxDocsPerChunk=349, blockSize=36), termVectorsFormat=CompressingTermVectorsFormat(compressionMode=DUMMY,
chunkSize=20899, blockSize=36)), sim=DefaultSimilarity, locale=es, timezone=Africa/Kinshasa
   [junit4]   2> NOTE: Mac OS X 10.8.5 x86_64/Oracle Corporation 1.8.0_40 (64-bit)/cpus=3,threads=1,free=47974512,total=289366016
   [junit4]   2> NOTE: All tests run in this JVM: [UIMABaseAnalyzerTest]
   [junit4] Completed in 11.89s, 4 tests, 1 error <<< FAILURES!

[...truncated 18 lines...]
BUILD FAILED
/Users/jenkins/workspace/Lucene-Solr-trunk-MacOSX/build.xml:519: The following error occurred
while executing this line:
/Users/jenkins/workspace/Lucene-Solr-trunk-MacOSX/build.xml:467: The following error occurred
while executing this line:
/Users/jenkins/workspace/Lucene-Solr-trunk-MacOSX/build.xml:61: The following error occurred
while executing this line:
/Users/jenkins/workspace/Lucene-Solr-trunk-MacOSX/extra-targets.xml:39: The following error
occurred while executing this line:
/Users/jenkins/workspace/Lucene-Solr-trunk-MacOSX/lucene/build.xml:456: The following error
occurred while executing this line:
/Users/jenkins/workspace/Lucene-Solr-trunk-MacOSX/lucene/common-build.xml:2081: The following
error occurred while executing this line:
/Users/jenkins/workspace/Lucene-Solr-trunk-MacOSX/lucene/analysis/build.xml:106: The following
error occurred while executing this line:
/Users/jenkins/workspace/Lucene-Solr-trunk-MacOSX/lucene/analysis/build.xml:38: The following
error occurred while executing this line:
/Users/jenkins/workspace/Lucene-Solr-trunk-MacOSX/lucene/module-build.xml:58: The following
error occurred while executing this line:
/Users/jenkins/workspace/Lucene-Solr-trunk-MacOSX/lucene/common-build.xml:1351: The following
error occurred while executing this line:
/Users/jenkins/workspace/Lucene-Solr-trunk-MacOSX/lucene/common-build.xml:958: There were
test failures: 5 suites, 12 tests, 1 error

Total time: 10 minutes 43 seconds
Build step 'Invoke Ant' marked build as failure
[description-setter] Description set: Java: 64bit/jdk1.8.0 -XX:-UseCompressedOops -XX:+UseSerialGC
Archiving artifacts
Recording test results
Email was triggered for: Failure - Any
Sending email for trigger: Failure - Any



Mime
View raw message