lucene-dev mailing list archives

Site index · List index
Message view « Date » · « Thread »
Top « Date » · « Thread »
From Policeman Jenkins Server <jenk...@thetaphi.de>
Subject [JENKINS] Lucene-Solr-5.x-Windows (64bit/jdk1.8.0_40) - Build # 4578 - Failure!
Date Sun, 19 Apr 2015 06:19:42 GMT
Build: http://jenkins.thetaphi.de/job/Lucene-Solr-5.x-Windows/4578/
Java: 64bit/jdk1.8.0_40 -XX:-UseCompressedOops -XX:+UseSerialGC

1 tests failed.
FAILED:  org.apache.solr.update.HardAutoCommitTest.testCommitWithin

Error Message:
Exception during query

Stack Trace:
java.lang.RuntimeException: Exception during query
	at __randomizedtesting.SeedInfo.seed([97651BF49580BCBA:2DB7748C16AE52AF]:0)
	at org.apache.solr.SolrTestCaseJ4.assertQ(SolrTestCaseJ4.java:794)
	at org.apache.solr.update.HardAutoCommitTest.testCommitWithin(HardAutoCommitTest.java:100)
	at sun.reflect.NativeMethodAccessorImpl.invoke0(Native Method)
	at sun.reflect.NativeMethodAccessorImpl.invoke(NativeMethodAccessorImpl.java:62)
	at sun.reflect.DelegatingMethodAccessorImpl.invoke(DelegatingMethodAccessorImpl.java:43)
	at java.lang.reflect.Method.invoke(Method.java:497)
	at com.carrotsearch.randomizedtesting.RandomizedRunner.invoke(RandomizedRunner.java:1627)
	at com.carrotsearch.randomizedtesting.RandomizedRunner$6.evaluate(RandomizedRunner.java:836)
	at com.carrotsearch.randomizedtesting.RandomizedRunner$7.evaluate(RandomizedRunner.java:872)
	at com.carrotsearch.randomizedtesting.RandomizedRunner$8.evaluate(RandomizedRunner.java:886)
	at com.carrotsearch.randomizedtesting.rules.SystemPropertiesRestoreRule$1.evaluate(SystemPropertiesRestoreRule.java:57)
	at org.apache.lucene.util.TestRuleSetupTeardownChained$1.evaluate(TestRuleSetupTeardownChained.java:50)
	at org.apache.lucene.util.AbstractBeforeAfterRule$1.evaluate(AbstractBeforeAfterRule.java:46)
	at org.apache.lucene.util.TestRuleThreadAndTestName$1.evaluate(TestRuleThreadAndTestName.java:49)
	at org.apache.lucene.util.TestRuleIgnoreAfterMaxFailures$1.evaluate(TestRuleIgnoreAfterMaxFailures.java:65)
	at org.apache.lucene.util.TestRuleMarkFailure$1.evaluate(TestRuleMarkFailure.java:48)
	at com.carrotsearch.randomizedtesting.rules.StatementAdapter.evaluate(StatementAdapter.java:36)
	at com.carrotsearch.randomizedtesting.ThreadLeakControl$StatementRunner.run(ThreadLeakControl.java:365)
	at com.carrotsearch.randomizedtesting.ThreadLeakControl.forkTimeoutingTask(ThreadLeakControl.java:798)
	at com.carrotsearch.randomizedtesting.ThreadLeakControl$3.evaluate(ThreadLeakControl.java:458)
	at com.carrotsearch.randomizedtesting.RandomizedRunner.runSingleTest(RandomizedRunner.java:845)
	at com.carrotsearch.randomizedtesting.RandomizedRunner$3.evaluate(RandomizedRunner.java:747)
	at com.carrotsearch.randomizedtesting.RandomizedRunner$4.evaluate(RandomizedRunner.java:781)
	at com.carrotsearch.randomizedtesting.RandomizedRunner$5.evaluate(RandomizedRunner.java:792)
	at com.carrotsearch.randomizedtesting.rules.StatementAdapter.evaluate(StatementAdapter.java:36)
	at com.carrotsearch.randomizedtesting.rules.SystemPropertiesRestoreRule$1.evaluate(SystemPropertiesRestoreRule.java:57)
	at org.apache.lucene.util.AbstractBeforeAfterRule$1.evaluate(AbstractBeforeAfterRule.java:46)
	at com.carrotsearch.randomizedtesting.rules.StatementAdapter.evaluate(StatementAdapter.java:36)
	at org.apache.lucene.util.TestRuleStoreClassName$1.evaluate(TestRuleStoreClassName.java:42)
	at com.carrotsearch.randomizedtesting.rules.NoShadowingOrOverridesOnMethodsRule$1.evaluate(NoShadowingOrOverridesOnMethodsRule.java:39)
	at com.carrotsearch.randomizedtesting.rules.NoShadowingOrOverridesOnMethodsRule$1.evaluate(NoShadowingOrOverridesOnMethodsRule.java:39)
	at com.carrotsearch.randomizedtesting.rules.StatementAdapter.evaluate(StatementAdapter.java:36)
	at com.carrotsearch.randomizedtesting.rules.StatementAdapter.evaluate(StatementAdapter.java:36)
	at com.carrotsearch.randomizedtesting.rules.StatementAdapter.evaluate(StatementAdapter.java:36)
	at org.apache.lucene.util.TestRuleAssertionsRequired$1.evaluate(TestRuleAssertionsRequired.java:54)
	at org.apache.lucene.util.TestRuleMarkFailure$1.evaluate(TestRuleMarkFailure.java:48)
	at org.apache.lucene.util.TestRuleIgnoreAfterMaxFailures$1.evaluate(TestRuleIgnoreAfterMaxFailures.java:65)
	at org.apache.lucene.util.TestRuleIgnoreTestSuites$1.evaluate(TestRuleIgnoreTestSuites.java:55)
	at com.carrotsearch.randomizedtesting.rules.StatementAdapter.evaluate(StatementAdapter.java:36)
	at com.carrotsearch.randomizedtesting.ThreadLeakControl$StatementRunner.run(ThreadLeakControl.java:365)
	at java.lang.Thread.run(Thread.java:745)
Caused by: java.lang.RuntimeException: REQUEST FAILED: xpath=//result[@numFound=1]
	xml response was: <?xml version="1.0" encoding="UTF-8"?>
<response>
<lst name="responseHeader"><int name="status">0</int><int name="QTime">0</int></lst><result name="response" numFound="0" start="0"></result>
</response>

	request was:q=id:529&qt=standard&start=0&rows=20&version=2.2
	at org.apache.solr.SolrTestCaseJ4.assertQ(SolrTestCaseJ4.java:787)
	... 40 more




Build Log:
[...truncated 10234 lines...]
   [junit4] Suite: org.apache.solr.update.HardAutoCommitTest
   [junit4]   2> Creating dataDir: C:\Users\JenkinsSlave\workspace\Lucene-Solr-5.x-Windows\solr\build\solr-core\test\J0\temp\solr.update.HardAutoCommitTest 97651BF49580BCBA-001\init-core-data-001
   [junit4]   2> 1111617 T6043 oas.SolrTestCaseJ4.buildSSLConfig Randomized ssl (false) and clientAuth (false)
   [junit4]   2> 1111618 T6043 oas.SolrTestCaseJ4.initCore ####initCore
   [junit4]   2> 1111618 T6043 oasc.SolrResourceLoader.<init> new SolrResourceLoader for directory: 'C:\Users\JenkinsSlave\workspace\Lucene-Solr-5.x-Windows\solr\core\src\test-files\solr\collection1\'
   [junit4]   2> 1111619 T6043 oasc.SolrResourceLoader.replaceClassLoader Adding 'file:/C:/Users/JenkinsSlave/workspace/Lucene-Solr-5.x-Windows/solr/core/src/test-files/solr/collection1/lib/classes/' to classloader
   [junit4]   2> 1111620 T6043 oasc.SolrResourceLoader.replaceClassLoader Adding 'file:/C:/Users/JenkinsSlave/workspace/Lucene-Solr-5.x-Windows/solr/core/src/test-files/solr/collection1/lib/README' to classloader
   [junit4]   2> 1111666 T6043 oasc.SolrConfig.refreshRequestParams current version of requestparams : -1
   [junit4]   2> 1111672 T6043 oasc.SolrConfig.<init> Using Lucene MatchVersion: 5.2.0
   [junit4]   2> 1111692 T6043 oasc.SolrConfig.<init> Loaded SolrConfig: solrconfig.xml
   [junit4]   2> 1111693 T6043 oass.IndexSchema.readSchema Reading Solr Schema from C:\Users\JenkinsSlave\workspace\Lucene-Solr-5.x-Windows\solr\core\src\test-files\solr\collection1\conf\schema.xml
   [junit4]   2> 1111696 T6043 oass.IndexSchema.readSchema [null] Schema name=test
   [junit4]   2> 1111780 T6043 oass.OpenExchangeRatesOrgProvider.init Initialized with rates=open-exchange-rates.json, refreshInterval=1440.
   [junit4]   2> 1111792 T6043 oass.IndexSchema.readSchema default search field in schema is text
   [junit4]   2> 1111793 T6043 oass.IndexSchema.readSchema unique key field: id
   [junit4]   2> 1111796 T6043 oass.FileExchangeRateProvider.reload Reloading exchange rates from file currency.xml
   [junit4]   2> 1111798 T6043 oass.FileExchangeRateProvider.reload Reloading exchange rates from file currency.xml
   [junit4]   2> 1111800 T6043 oass.OpenExchangeRatesOrgProvider.reload Reloading exchange rates from open-exchange-rates.json
   [junit4]   2> 1111800 T6043 oass.OpenExchangeRatesOrgProvider$OpenExchangeRates.<init> WARN Unknown key IMPORTANT NOTE
   [junit4]   2> 1111800 T6043 oass.OpenExchangeRatesOrgProvider$OpenExchangeRates.<init> WARN Expected key, got STRING
   [junit4]   2> 1111800 T6043 oass.OpenExchangeRatesOrgProvider.reload Reloading exchange rates from open-exchange-rates.json
   [junit4]   2> 1111800 T6043 oass.OpenExchangeRatesOrgProvider$OpenExchangeRates.<init> WARN Unknown key IMPORTANT NOTE
   [junit4]   2> 1111800 T6043 oass.OpenExchangeRatesOrgProvider$OpenExchangeRates.<init> WARN Expected key, got STRING
   [junit4]   2> 1111801 T6043 oasc.SolrResourceLoader.locateSolrHome JNDI not configured for solr (NoInitialContextEx)
   [junit4]   2> 1111801 T6043 oasc.SolrResourceLoader.locateSolrHome using system property solr.solr.home: C:\Users\JenkinsSlave\workspace\Lucene-Solr-5.x-Windows\solr\core\src\test-files\solr
   [junit4]   2> 1111801 T6043 oasc.SolrResourceLoader.<init> new SolrResourceLoader for directory: 'C:\Users\JenkinsSlave\workspace\Lucene-Solr-5.x-Windows\solr\core\src\test-files\solr\'
   [junit4]   2> 1111812 T6043 oasc.CoreContainer.<init> New CoreContainer 559275122
   [junit4]   2> 1111813 T6043 oasc.CoreContainer.load Loading cores into CoreContainer [instanceDir=C:\Users\JenkinsSlave\workspace\Lucene-Solr-5.x-Windows\solr\core\src\test-files\solr\]
   [junit4]   2> 1111813 T6043 oasc.CoreContainer.load loading shared library: C:\Users\JenkinsSlave\workspace\Lucene-Solr-5.x-Windows\solr\core\src\test-files\solr\lib
   [junit4]   2> 1111819 T6043 oasc.SolrResourceLoader.addToClassLoader WARN Can't find (or read) directory to add to classloader: lib (resolved as: C:\Users\JenkinsSlave\workspace\Lucene-Solr-5.x-Windows\solr\core\src\test-files\solr\lib).
   [junit4]   2> 1111826 T6043 oashc.HttpShardHandlerFactory.init created with socketTimeout : 600000,connTimeout : 60000,maxConnectionsPerHost : 20,maxConnections : 10000,corePoolSize : 0,maximumPoolSize : 2147483647,maxThreadIdleTime : 5,sizeOfQueue : -1,fairnessPolicy : false,useRetries : false,
   [junit4]   2> 1111833 T6043 oasu.UpdateShardHandler.<init> Creating UpdateShardHandler HTTP client with params: socketTimeout=30000&connTimeout=30000&retry=true
   [junit4]   2> 1111834 T6043 oasl.LogWatcher.createWatcher SLF4J impl is org.slf4j.impl.Log4jLoggerFactory
   [junit4]   2> 1111835 T6043 oasl.LogWatcher.newRegisteredLogWatcher Registering Log Listener [Log4j (org.slf4j.impl.Log4jLoggerFactory)]
   [junit4]   2> 1111835 T6043 oasc.CoreContainer.load Node Name: testNode
   [junit4]   2> 1111836 T6043 oasc.CoreDescriptor.<init> CORE DESCRIPTOR: {name=collection1, config=solrconfig.xml, transient=false, schema=schema.xml, loadOnStartup=true, instanceDir=collection1, collection=collection1, absoluteInstDir=C:\Users\JenkinsSlave\workspace\Lucene-Solr-5.x-Windows\solr\core\src\test-files\solr\collection1\, dataDir=C:\Users\JenkinsSlave\workspace\Lucene-Solr-5.x-Windows\solr\build\solr-core\test\J0\temp\solr.update.HardAutoCommitTest 97651BF49580BCBA-001\init-core-data-001, shard=shard1}
   [junit4]   2> 1111836 T6044 oasc.SolrResourceLoader.<init> new SolrResourceLoader for directory: 'C:\Users\JenkinsSlave\workspace\Lucene-Solr-5.x-Windows\solr\core\src\test-files\solr\collection1\'
   [junit4]   2> 1111837 T6044 oasc.SolrResourceLoader.replaceClassLoader Adding 'file:/C:/Users/JenkinsSlave/workspace/Lucene-Solr-5.x-Windows/solr/core/src/test-files/solr/collection1/lib/classes/' to classloader
   [junit4]   2> 1111837 T6044 oasc.SolrResourceLoader.replaceClassLoader Adding 'file:/C:/Users/JenkinsSlave/workspace/Lucene-Solr-5.x-Windows/solr/core/src/test-files/solr/collection1/lib/README' to classloader
   [junit4]   2> 1111858 T6044 oasc.SolrConfig.refreshRequestParams current version of requestparams : -1
   [junit4]   2> 1111867 T6044 oasc.SolrConfig.<init> Using Lucene MatchVersion: 5.2.0
   [junit4]   2> 1111888 T6044 oasc.SolrConfig.<init> Loaded SolrConfig: solrconfig.xml
   [junit4]   2> 1111888 T6044 oass.IndexSchema.readSchema Reading Solr Schema from C:\Users\JenkinsSlave\workspace\Lucene-Solr-5.x-Windows\solr\core\src\test-files\solr\collection1\conf\schema.xml
   [junit4]   2> 1111900 T6044 oass.IndexSchema.readSchema [collection1] Schema name=test
   [junit4]   2> 1112001 T6044 oass.OpenExchangeRatesOrgProvider.init Initialized with rates=open-exchange-rates.json, refreshInterval=1440.
   [junit4]   2> 1112004 T6044 oass.IndexSchema.readSchema default search field in schema is text
   [junit4]   2> 1112005 T6044 oass.IndexSchema.readSchema unique key field: id
   [junit4]   2> 1112014 T6044 oass.FileExchangeRateProvider.reload Reloading exchange rates from file currency.xml
   [junit4]   2> 1112016 T6044 oass.FileExchangeRateProvider.reload Reloading exchange rates from file currency.xml
   [junit4]   2> 1112017 T6044 oass.OpenExchangeRatesOrgProvider.reload Reloading exchange rates from open-exchange-rates.json
   [junit4]   2> 1112018 T6044 oass.OpenExchangeRatesOrgProvider$OpenExchangeRates.<init> WARN Unknown key IMPORTANT NOTE
   [junit4]   2> 1112018 T6044 oass.OpenExchangeRatesOrgProvider$OpenExchangeRates.<init> WARN Expected key, got STRING
   [junit4]   2> 1112018 T6044 oass.OpenExchangeRatesOrgProvider.reload Reloading exchange rates from open-exchange-rates.json
   [junit4]   2> 1112018 T6044 oass.OpenExchangeRatesOrgProvider$OpenExchangeRates.<init> WARN Unknown key IMPORTANT NOTE
   [junit4]   2> 1112018 T6044 oass.OpenExchangeRatesOrgProvider$OpenExchangeRates.<init> WARN Expected key, got STRING
   [junit4]   2> 1112018 T6044 oasc.CoreContainer.create Creating SolrCore 'collection1' using configuration from instancedir C:\Users\JenkinsSlave\workspace\Lucene-Solr-5.x-Windows\solr\core\src\test-files\solr\collection1\
   [junit4]   2> 1112018 T6044 c:collection1 oasc.SolrCore.initDirectoryFactory org.apache.solr.core.MockDirectoryFactory
   [junit4]   2> 1112018 T6044 c:collection1 oasc.SolrCore.<init> [collection1] Opening new SolrCore at C:\Users\JenkinsSlave\workspace\Lucene-Solr-5.x-Windows\solr\core\src\test-files\solr\collection1\, dataDir=C:\Users\JenkinsSlave\workspace\Lucene-Solr-5.x-Windows\solr\build\solr-core\test\J0\temp\solr.update.HardAutoCommitTest 97651BF49580BCBA-001\init-core-data-001\
   [junit4]   2> 1112018 T6044 c:collection1 oasc.JmxMonitoredMap.<init> JMX monitoring is enabled. Adding Solr mbeans to JMX Server: com.sun.jmx.mbeanserver.JmxMBeanServer@1e406637
   [junit4]   2> 1112020 T6044 c:collection1 oasc.CachingDirectoryFactory.get return new directory for C:\Users\JenkinsSlave\workspace\Lucene-Solr-5.x-Windows\solr\build\solr-core\test\J0\temp\solr.update.HardAutoCommitTest 97651BF49580BCBA-001\init-core-data-001\
   [junit4]   2> 1112020 T6044 c:collection1 oasc.SolrCore.getNewIndexDir New index directory detected: old=null new=C:\Users\JenkinsSlave\workspace\Lucene-Solr-5.x-Windows\solr\build\solr-core\test\J0\temp\solr.update.HardAutoCommitTest 97651BF49580BCBA-001\init-core-data-001\index/
   [junit4]   2> 1112020 T6044 c:collection1 oasc.SolrCore.initIndex WARN [collection1] Solr index directory 'C:\Users\JenkinsSlave\workspace\Lucene-Solr-5.x-Windows\solr\build\solr-core\test\J0\temp\solr.update.HardAutoCommitTest 97651BF49580BCBA-001\init-core-data-001\index' doesn't exist. Creating new index...
   [junit4]   2> 1112021 T6044 c:collection1 oasc.CachingDirectoryFactory.get return new directory for C:\Users\JenkinsSlave\workspace\Lucene-Solr-5.x-Windows\solr\build\solr-core\test\J0\temp\solr.update.HardAutoCommitTest 97651BF49580BCBA-001\init-core-data-001\index
   [junit4]   2> 1112021 T6044 c:collection1 oasu.RandomMergePolicy.<init> RandomMergePolicy wrapping class org.apache.lucene.index.TieredMergePolicy: [TieredMergePolicy: maxMergeAtOnce=20, maxMergeAtOnceExplicit=23, maxMergedSegmentMB=77.1611328125, floorSegmentMB=2.1611328125, forceMergeDeletesPctAllowed=17.844023442348877, segmentsPerTier=45.0, maxCFSSegmentSizeMB=8.796093022207999E12, noCFSRatio=0.3321180872386218
   [junit4]   2> 1112021 T6044 c:collection1 oasc.SolrDeletionPolicy.onCommit SolrDeletionPolicy.onCommit: commits: num=1
   [junit4]   2> 		commit{dir=MockDirectoryWrapper(RAMDirectory@21a619a1 lockFactory=org.apache.lucene.store.SingleInstanceLockFactory@11b9c6c8),segFN=segments_1,generation=1}
   [junit4]   2> 1112021 T6044 c:collection1 oasc.SolrDeletionPolicy.updateCommits newest commit generation = 1
   [junit4]   2> 1112025 T6044 c:collection1 oasup.UpdateRequestProcessorChain.init creating updateRequestProcessorChain "dedupe"
   [junit4]   2> 1112026 T6044 c:collection1 oasup.UpdateRequestProcessorChain.init inserting DistributedUpdateProcessorFactory into updateRequestProcessorChain "dedupe"
   [junit4]   2> 1112026 T6044 c:collection1 oasup.UpdateRequestProcessorChain.init creating updateRequestProcessorChain "dedupe-allfields"
   [junit4]   2> 1112026 T6044 c:collection1 oasup.UpdateRequestProcessorChain.init inserting DistributedUpdateProcessorFactory into updateRequestProcessorChain "dedupe-allfields"
   [junit4]   2> 1112026 T6044 c:collection1 oasup.UpdateRequestProcessorChain.init creating updateRequestProcessorChain "stored_sig"
   [junit4]   2> 1112027 T6044 c:collection1 oasup.UpdateRequestProcessorChain.init inserting DistributedUpdateProcessorFactory into updateRequestProcessorChain "stored_sig"
   [junit4]   2> 1112027 T6044 c:collection1 oasup.UpdateRequestProcessorChain.init creating updateRequestProcessorChain "uniq-fields"
   [junit4]   2> 1112027 T6044 c:collection1 oasup.UpdateRequestProcessorChain.init inserting DistributedUpdateProcessorFactory into updateRequestProcessorChain "uniq-fields"
   [junit4]   2> 1112027 T6044 c:collection1 oasup.UpdateRequestProcessorChain.init creating updateRequestProcessorChain "distrib-dup-test-chain-explicit"
   [junit4]   2> 1112028 T6044 c:collection1 oasup.UpdateRequestProcessorChain.init creating updateRequestProcessorChain "distrib-dup-test-chain-implicit"
   [junit4]   2> 1112028 T6044 c:collection1 oasup.UpdateRequestProcessorChain.init inserting DistributedUpdateProcessorFactory into updateRequestProcessorChain "distrib-dup-test-chain-implicit"
   [junit4]   2> 1112028 T6044 c:collection1 oasc.SolrCore.loadUpdateProcessorChains no updateRequestProcessorChain defined as default, creating implicit default
   [junit4]   2> 1112032 T6044 c:collection1 oashl.XMLLoader.init xsltCacheLifetimeSeconds=60
   [junit4]   2> 1112033 T6044 c:collection1 oashl.XMLLoader.init xsltCacheLifetimeSeconds=60
   [junit4]   2> 1112035 T6044 c:collection1 oashl.XMLLoader.init xsltCacheLifetimeSeconds=60
   [junit4]   2> 1112035 T6044 c:collection1 oashl.XMLLoader.init xsltCacheLifetimeSeconds=60
   [junit4]   2> 1112039 T6044 c:collection1 oasc.PluginBag.createPlugin requestHandler : 'lazy' created with startup=lazy 
   [junit4]   2> 1112041 T6044 c:collection1 oasc.RequestHandlers.initHandlersFromConfig Registered paths: /admin/mbeans,standard,spellCheckCompRH,lazy,/update/json/docs,/admin/luke,spellCheckWithWordbreak_Direct,tvrh,/get,/admin/properties,/update/json,mltrh,/admin/threads,/search-facet-def,/update/csv,/search-facet-invariants,/admin/segments,spellCheckCompRH1,/mlt,/admin/system,/replication,dismax,defaults,/config,/schema,/admin/plugins,/admin/logging,spellCheckWithWordbreak,mock,/admin/ping,/update,/admin/file,/terms,spellCheckCompRH_Direct,/debug/dump
   [junit4]   2> 1112041 T6044 c:collection1 oasc.SolrCore.initDeprecatedSupport WARN solrconfig.xml uses deprecated <admin/gettableFiles>, Please update your config to use the ShowFileRequestHandler.
   [junit4]   2> 1112042 T6044 c:collection1 oasc.SolrCore.initStatsCache Using default statsCache cache: org.apache.solr.search.stats.LocalStatsCache
   [junit4]   2> 1112042 T6044 c:collection1 oasu.UpdateHandler.<init> Using UpdateLog implementation: org.apache.solr.update.UpdateLog
   [junit4]   2> 1112042 T6044 c:collection1 oasu.UpdateLog.init Initializing UpdateLog: dataDir= defaultSyncLevel=FLUSH numRecordsToKeep=100 maxNumLogsToKeep=10
   [junit4]   2> 1112042 T6044 c:collection1 oasu.CommitTracker.<init> Hard AutoCommit: disabled
   [junit4]   2> 1112043 T6044 c:collection1 oasu.CommitTracker.<init> Soft AutoCommit: disabled
   [junit4]   2> 1112043 T6044 c:collection1 oasu.RandomMergePolicy.<init> RandomMergePolicy wrapping class org.apache.lucene.index.AlcoholicMergePolicy: [AlcoholicMergePolicy: minMergeSize=0, mergeFactor=10, maxMergeSize=1651414505, maxMergeSizeForForcedMerge=9223372036854775807, calibrateSizeByDeletes=true, maxMergeDocs=2147483647, maxCFSSegmentSizeMB=8.796093022207999E12, noCFSRatio=0.1]
   [junit4]   2> 1112043 T6044 c:collection1 oasc.SolrDeletionPolicy.onInit SolrDeletionPolicy.onInit: commits: num=1
   [junit4]   2> 		commit{dir=MockDirectoryWrapper(RAMDirectory@21a619a1 lockFactory=org.apache.lucene.store.SingleInstanceLockFactory@11b9c6c8),segFN=segments_1,generation=1}
   [junit4]   2> 1112043 T6044 c:collection1 oasc.SolrDeletionPolicy.updateCommits newest commit generation = 1
   [junit4]   2> 1112044 T6044 c:collection1 oass.SolrIndexSearcher.<init> Opening Searcher@1f8e51d[collection1] main
   [junit4]   2> 1112045 T6044 c:collection1 oasr.RestManager.init Initializing RestManager with initArgs: {storageIO=org.apache.solr.rest.ManagedResourceStorage$InMemoryStorageIO}
   [junit4]   2> 1112045 T6044 c:collection1 oasr.ManagedResourceStorage.load Reading _rest_managed.json using InMemoryStorage
   [junit4]   2> 1112045 T6044 c:collection1 oasr.RestManager.init Initializing 0 registered ManagedResources
   [junit4]   2> 1112045 T6044 c:collection1 oashc.SpellCheckComponent.inform Initializing spell checkers
   [junit4]   2> 1112050 T6044 c:collection1 oass.DirectSolrSpellChecker.init init: {name=direct,classname=DirectSolrSpellChecker,field=lowerfilt,minQueryLength=3}
   [junit4]   2> 1112079 T6044 c:collection1 oash.ReplicationHandler.inform Commits will be reserved for  10000
   [junit4]   2> 1112080 T6044 c:collection1 oasc.CoreContainer.registerCore registering core: collection1
   [junit4]   2> 1112080 T6045 c:collection1 oashc.SpellCheckComponent$SpellCheckerListener.newSearcher Loading spell index for spellchecker: default
   [junit4]   2> 1112081 T6045 c:collection1 oashc.SpellCheckComponent$SpellCheckerListener.newSearcher Loading spell index for spellchecker: direct
   [junit4]   2> 1112081 T6045 c:collection1 oashc.SpellCheckComponent$SpellCheckerListener.newSearcher Loading spell index for spellchecker: wordbreak
   [junit4]   2> 1112081 T6045 c:collection1 oashc.SpellCheckComponent$SpellCheckerListener.newSearcher Loading spell index for spellchecker: multipleFields
   [junit4]   2> 1112081 T6045 c:collection1 oashc.SpellCheckComponent$SpellCheckerListener.newSearcher Loading spell index for spellchecker: jarowinkler
   [junit4]   2> 1112081 T6045 c:collection1 oashc.SpellCheckComponent$SpellCheckerListener.newSearcher Loading spell index for spellchecker: external
   [junit4]   2> 1112082 T6045 c:collection1 oashc.SpellCheckComponent$SpellCheckerListener.newSearcher Loading spell index for spellchecker: freq
   [junit4]   2> 1112082 T6045 c:collection1 oashc.SpellCheckComponent$SpellCheckerListener.newSearcher Loading spell index for spellchecker: fqcn
   [junit4]   2> 1112082 T6045 c:collection1 oashc.SpellCheckComponent$SpellCheckerListener.newSearcher Loading spell index for spellchecker: perDict
   [junit4]   2> 1112083 T6045 c:collection1 oasc.SolrCore.registerSearcher [collection1] Registered new searcher Searcher@1f8e51d[collection1] main{ExitableDirectoryReader(UninvertingDirectoryReader())}
   [junit4]   2> 1112085 T6043 oas.SolrTestCaseJ4.initCore ####initCore end
   [junit4]   2> 1112085 T6043 oas.SolrTestCaseJ4.setUp ###Starting testCommitWithin
   [junit4]   2> ASYNC  NEW_CORE C2359 name=collection1 org.apache.solr.core.SolrCore@6db3d43b
   [junit4]   2> 1112087 T6043 C2359 oasup.LogUpdateProcessor.finish [collection1] webapp=null path=null params={} {deleteByQuery=*:* (-1498858808923914240)} 0 2
   [junit4]   2> 1112088 T6043 oasc.SolrResourceLoader.<init> new SolrResourceLoader for directory: 'C:\Users\JenkinsSlave\workspace\Lucene-Solr-5.x-Windows\solr\core\src\test-files\solr\collection1\'
   [junit4]   2> 1112088 T6043 oasc.SolrResourceLoader.replaceClassLoader Adding 'file:/C:/Users/JenkinsSlave/workspace/Lucene-Solr-5.x-Windows/solr/core/src/test-files/solr/collection1/lib/classes/' to classloader
   [junit4]   2> 1112088 T6043 oasc.SolrResourceLoader.replaceClassLoader Adding 'file:/C:/Users/JenkinsSlave/workspace/Lucene-Solr-5.x-Windows/solr/core/src/test-files/solr/collection1/lib/README' to classloader
   [junit4]   2> 1112102 T6043 oasc.SolrConfig.refreshRequestParams current version of requestparams : -1
   [junit4]   2> 1112109 T6043 oasc.SolrConfig.<init> Using Lucene MatchVersion: 5.2.0
   [junit4]   2> 1112130 T6043 oasc.SolrConfig.<init> Loaded SolrConfig: solrconfig.xml
   [junit4]   2> 1112130 T6043 oass.IndexSchema.readSchema Reading Solr Schema from C:\Users\JenkinsSlave\workspace\Lucene-Solr-5.x-Windows\solr\core\src\test-files\solr\collection1\conf\schema.xml
   [junit4]   2> 1112135 T6043 oass.IndexSchema.readSchema [collection1] Schema name=test
   [junit4]   2> 1112227 T6043 oass.OpenExchangeRatesOrgProvider.init Initialized with rates=open-exchange-rates.json, refreshInterval=1440.
   [junit4]   2> 1112230 T6043 oass.IndexSchema.readSchema default search field in schema is text
   [junit4]   2> 1112231 T6043 oass.IndexSchema.readSchema unique key field: id
   [junit4]   2> 1112234 T6043 oass.FileExchangeRateProvider.reload Reloading exchange rates from file currency.xml
   [junit4]   2> 1112236 T6043 oass.FileExchangeRateProvider.reload Reloading exchange rates from file currency.xml
   [junit4]   2> 1112237 T6043 oass.OpenExchangeRatesOrgProvider.reload Reloading exchange rates from open-exchange-rates.json
   [junit4]   2> 1112237 T6043 oass.OpenExchangeRatesOrgProvider$OpenExchangeRates.<init> WARN Unknown key IMPORTANT NOTE
   [junit4]   2> 1112237 T6043 oass.OpenExchangeRatesOrgProvider$OpenExchangeRates.<init> WARN Expected key, got STRING
   [junit4]   2> 1112238 T6043 oass.OpenExchangeRatesOrgProvider.reload Reloading exchange rates from open-exchange-rates.json
   [junit4]   2> 1112238 T6043 oass.OpenExchangeRatesOrgProvider$OpenExchangeRates.<init> WARN Unknown key IMPORTANT NOTE
   [junit4]   2> 1112238 T6043 oass.OpenExchangeRatesOrgProvider$OpenExchangeRates.<init> WARN Expected key, got STRING
   [junit4]   2> 1112238 T6043 oasc.CoreContainer.reload Reloading SolrCore 'collection1' using configuration from instancedir C:\Users\JenkinsSlave\workspace\Lucene-Solr-5.x-Windows\solr\core\src\test-files\solr\collection1\
   [junit4]   2> 1112238 T6043 c:collection1 oasc.SolrCore.<init> [collection1] Opening new SolrCore at C:\Users\JenkinsSlave\workspace\Lucene-Solr-5.x-Windows\solr\core\src\test-files\solr\collection1\, dataDir=C:\Users\JenkinsSlave\workspace\Lucene-Solr-5.x-Windows\solr\build\solr-core\test\J0\temp\solr.update.HardAutoCommitTest 97651BF49580BCBA-001\init-core-data-001\
   [junit4]   2> 1112239 T6043 c:collection1 oasc.JmxMonitoredMap.<init> JMX monitoring is enabled. Adding Solr mbeans to JMX Server: com.sun.jmx.mbeanserver.JmxMBeanServer@1e406637
   [junit4]   2> 1112240 T6043 c:collection1 oasc.SolrCore.getNewIndexDir New index directory detected: old=null new=C:\Users\JenkinsSlave\workspace\Lucene-Solr-5.x-Windows\solr\build\solr-core\test\J0\temp\solr.update.HardAutoCommitTest 97651BF49580BCBA-001\init-core-data-001\index/
   [junit4]   2> 1112243 T6043 c:collection1 oasup.UpdateRequestProcessorChain.init creating updateRequestProcessorChain "dedupe"
   [junit4]   2> 1112243 T6043 c:collection1 oasup.UpdateRequestProcessorChain.init inserting DistributedUpdateProcessorFactory into updateRequestProcessorChain "dedupe"
   [junit4]   2> 1112243 T6043 c:collection1 oasup.UpdateRequestProcessorChain.init creating updateRequestProcessorChain "dedupe-allfields"
   [junit4]   2> 1112244 T6043 c:collection1 oasup.UpdateRequestProcessorChain.init inserting DistributedUpdateProcessorFactory into updateRequestProcessorChain "dedupe-allfields"
   [junit4]   2> 1112244 T6043 c:collection1 oasup.UpdateRequestProcessorChain.init creating updateRequestProcessorChain "stored_sig"
   [junit4]   2> 1112244 T6043 c:collection1 oasup.UpdateRequestProcessorChain.init inserting DistributedUpdateProcessorFactory into updateRequestProcessorChain "stored_sig"
   [junit4]   2> 1112244 T6043 c:collection1 oasup.UpdateRequestProcessorChain.init creating updateRequestProcessorChain "uniq-fields"
   [junit4]   2> 1112244 T6043 c:collection1 oasup.UpdateRequestProcessorChain.init inserting DistributedUpdateProcessorFactory into updateRequestProcessorChain "uniq-fields"
   [junit4]   2> 1112244 T6043 c:collection1 oasup.UpdateRequestProcessorChain.init creating updateRequestProcessorChain "distrib-dup-test-chain-explicit"
   [junit4]   2> 1112245 T6043 c:collection1 oasup.UpdateRequestProcessorChain.init creating updateRequestProcessorChain "distrib-dup-test-chain-implicit"
   [junit4]   2> 1112245 T6043 c:collection1 oasup.UpdateRequestProcessorChain.init inserting DistributedUpdateProcessorFactory into updateRequestProcessorChain "distrib-dup-test-chain-implicit"
   [junit4]   2> 1112245 T6043 c:collection1 oasc.SolrCore.loadUpdateProcessorChains no updateRequestProcessorChain defined as default, creating implicit default
   [junit4]   2> 1112246 T6043 c:collection1 oashl.XMLLoader.init xsltCacheLifetimeSeconds=60
   [junit4]   2> 1112247 T6043 c:collection1 oashl.XMLLoader.init xsltCacheLifetimeSeconds=60
   [junit4]   2> 1112248 T6043 c:collection1 oashl.XMLLoader.init xsltCacheLifetimeSeconds=60
   [junit4]   2> 1112249 T6043 c:collection1 oashl.XMLLoader.init xsltCacheLifetimeSeconds=60
   [junit4]   2> 1112252 T6043 c:collection1 oasc.PluginBag.createPlugin requestHandler : 'lazy' created with startup=lazy 
   [junit4]   2> 1112260 T6043 c:collection1 oasc.RequestHandlers.initHandlersFromConfig Registered paths: /admin/mbeans,standard,spellCheckCompRH,lazy,/update/json/docs,/admin/luke,spellCheckWithWordbreak_Direct,tvrh,/get,/admin/properties,/update/json,mltrh,/admin/threads,/search-facet-def,/update/csv,/search-facet-invariants,/admin/segments,spellCheckCompRH1,/mlt,/admin/system,/replication,dismax,defaults,/config,/schema,/admin/plugins,/admin/logging,spellCheckWithWordbreak,mock,/admin/ping,/update,/admin/file,/terms,spellCheckCompRH_Direct,/debug/dump
   [junit4]   2> 1112260 T6043 c:collection1 oasc.SolrCore.initDeprecatedSupport WARN solrconfig.xml uses deprecated <admin/gettableFiles>, Please update your config to use the ShowFileRequestHandler.
   [junit4]   2> 1112261 T6043 c:collection1 oasc.SolrCore.initStatsCache Using default statsCache cache: org.apache.solr.search.stats.LocalStatsCache
   [junit4]   2> 1112270 T6043 c:collection1 oasu.CommitTracker.<init> Hard AutoCommit: disabled
   [junit4]   2> 1112270 T6043 c:collection1 oasu.CommitTracker.<init> Soft AutoCommit: disabled
   [junit4]   2> 1112271 T6043 c:collection1 oass.SolrIndexSearcher.<init> Opening Searcher@3630fae1[collection1] main
   [junit4]   2> 1112271 T6043 c:collection1 oasr.RestManager.init Initializing RestManager with initArgs: {storageIO=org.apache.solr.rest.ManagedResourceStorage$InMemoryStorageIO}
   [junit4]   2> 1112271 T6043 c:collection1 oasr.ManagedResourceStorage.load Reading _rest_managed.json using InMemoryStorage
   [junit4]   2> 1112271 T6043 c:collection1 oasr.RestManager.init Initializing 0 registered ManagedResources
   [junit4]   2> 1112271 T6043 c:collection1 oashc.SpellCheckComponent.inform Initializing spell checkers
   [junit4]   2> 1112272 T6043 c:collection1 oass.DirectSolrSpellChecker.init init: {name=direct,classname=DirectSolrSpellChecker,field=lowerfilt,minQueryLength=3}
   [junit4]   2> 1112276 T6043 c:collection1 oash.ReplicationHandler.inform Commits will be reserved for  10000
   [junit4]   2> 1112277 T6043 c:collection1 oasu.DefaultSolrCoreState.newIndexWriter Creating new IndexWriter...
   [junit4]   2> 1112277 T6043 c:collection1 oasu.DefaultSolrCoreState.newIndexWriter Waiting until IndexWriter is unused... core=collection1
   [junit4]   2> 1112277 T6043 c:collection1 oasu.DefaultSolrCoreState.newIndexWriter Closing old IndexWriter... core=collection1
   [junit4]   2> 1112280 T6047 c:collection1 oashc.SpellCheckComponent$SpellCheckerListener.newSearcher Loading spell index for spellchecker: default
   [junit4]   2> 1112280 T6047 c:collection1 oashc.SpellCheckComponent$SpellCheckerListener.newSearcher Loading spell index for spellchecker: direct
   [junit4]   2> 1112280 T6043 c:collection1 oasu.RandomMergePolicy.<init> RandomMergePolicy wrapping class org.apache.lucene.index.LogByteSizeMergePolicy: [LogByteSizeMergePolicy: minMergeSize=1677721, mergeFactor=41, maxMergeSize=2147483648, maxMergeSizeForForcedMerge=9223372036854775807, calibrateSizeByDeletes=false, maxMergeDocs=2147483647, maxCFSSegmentSizeMB=8.796093022207999E12, noCFSRatio=0.7871130003693803]
   [junit4]   2> 1112280 T6047 c:collection1 oashc.SpellCheckComponent$SpellCheckerListener.newSearcher Loading spell index for spellchecker: wordbreak
   [junit4]   2> 1112281 T6047 c:collection1 oashc.SpellCheckComponent$SpellCheckerListener.newSearcher Loading spell index for spellchecker: multipleFields
   [junit4]   2> 1112281 T6047 c:collection1 oashc.SpellCheckComponent$SpellCheckerListener.newSearcher Loading spell index for spellchecker: jarowinkler
   [junit4]   2> 1112281 T6047 c:collection1 oashc.SpellCheckComponent$SpellCheckerListener.newSearcher Loading spell index for spellchecker: external
   [junit4]   2> 1112281 T6047 c:collection1 oashc.SpellCheckComponent$SpellCheckerListener.newSearcher Loading spell index for spellchecker: freq
   [junit4]   2> 1112281 T6047 c:collection1 oashc.SpellCheckComponent$SpellCheckerListener.newSearcher Loading spell index for spellchecker: fqcn
   [junit4]   2> 1112282 T6047 c:collection1 oashc.SpellCheckComponent$SpellCheckerListener.newSearcher Loading spell index for spellchecker: perDict
   [junit4]   2> 1112282 T6047 c:collection1 oasc.SolrCore.registerSearcher [collection1] Registered new searcher Searcher@3630fae1[collection1] main{ExitableDirectoryReader(UninvertingDirectoryReader())}
   [junit4]   2> 1112282 T6043 c:collection1 oasc.SolrDeletionPolicy.onInit SolrDeletionPolicy.onInit: commits: num=1
   [junit4]   2> 		commit{dir=MockDirectoryWrapper(RAMDirectory@21a619a1 lockFactory=org.apache.lucene.store.SingleInstanceLockFactory@11b9c6c8),segFN=segments_1,generation=1}
   [junit4]   2> 1112283 T6043 c:collection1 oasc.SolrDeletionPolicy.updateCommits newest commit generation = 1
   [junit4]   2> 1112283 T6043 c:collection1 oasu.DefaultSolrCoreState.newIndexWriter New IndexWriter is ready to be used.
   [junit4]   2> 1112284 T6043 c:collection1 oass.SolrIndexSearcher.<init> Opening Searcher@4e0d7105[collection1] main
   [junit4]   2> 1112284 T6043 c:collection1 oasc.CoreContainer.registerCore replacing core: collection1
   [junit4]   2> 1112284 T6043 c:collection1 oasc.SolrCore.close [collection1]  CLOSING SolrCore org.apache.solr.core.SolrCore@6db3d43b
   [junit4]   2> 1112284 T6043 c:collection1 oasu.DirectUpdateHandler2.close closing DirectUpdateHandler2{commits=0,autocommits=0,soft autocommits=0,optimizes=0,rollbacks=0,expungeDeletes=0,docsPending=0,adds=0,deletesById=0,deletesByQuery=1,errors=0,cumulative_adds=0,cumulative_deletesById=0,cumulative_deletesByQuery=1,cumulative_errors=0,transaction_logs_total_size=0,transaction_logs_total_number=0}
   [junit4]   2> 1112285 T6043 c:collection1 oasc.SolrCore.closeSearcher [collection1] Closing main searcher on request.
   [junit4]   2> 1112295 T6043 c:collection1 oasup.LogUpdateProcessor.finish [collection1] {add=[529 (1498858809144115200)]} 0 2
   [junit4]   2> ASYNC  NEW_CORE C2360 name=collection1 org.apache.solr.core.SolrCore@747e31be
   [junit4]   2> 1112296 T6043 c:collection1 C2360 oasc.SolrCore.execute [collection1] webapp=null path=null params={q=id:529&qt=standard&start=0&rows=20&version=2.2} hits=0 status=0 QTime=0 
   [junit4]   2> 1112297 T6047 c:collection1 oasc.SolrCore.registerSearcher [collection1] Registered new searcher Searcher@4e0d7105[collection1] main{ExitableDirectoryReader(UninvertingDirectoryReader())}
   [junit4]   2> 1112496 T6043 c:collection1 oasup.LogUpdateProcessor.finish [collection1] {add=[530 (1498858809354878976)]} 0 203
   [junit4]   2> 1112496 T6043 c:collection1 C2360 oasc.SolrCore.execute [collection1] webapp=null path=null params={q=id:530&qt=standard&start=0&rows=20&version=2.2} hits=0 status=0 QTime=0 
   [junit4]   2> 1112497 T6043 c:collection1 oasup.LogUpdateProcessor.finish [collection1] {delete=[529 (-1498858809355927552)]} 0 204
   [junit4]   2> 1112497 T6043 c:collection1 C2360 oasc.SolrCore.execute [collection1] webapp=null path=null params={q=id:529&qt=standard&start=0&rows=20&version=2.2} hits=0 status=0 QTime=0 
   [junit4]   2> 1112498 T6043 c:collection1 oas.SolrTestCaseJ4.assertQ ERROR REQUEST FAILED: xpath=//result[@numFound=1]
   [junit4]   2> 		xml response was: <?xml version="1.0" encoding="UTF-8"?>
   [junit4]   2> 	<response>
   [junit4]   2> 	<lst name="responseHeader"><int name="status">0</int><int name="QTime">0</int></lst><result name="response" numFound="0" start="0"></result>
   [junit4]   2> 	</response>
   [junit4]   2> 	
   [junit4]   2> 		request was:q=id:529&qt=standard&start=0&rows=20&version=2.2
   [junit4]   2> 1112498 T6043 c:collection1 oasc.SolrException.log ERROR REQUEST FAILED: q=id:529&qt=standard&start=0&rows=20&version=2.2:java.lang.RuntimeException: REQUEST FAILED: xpath=//result[@numFound=1]
   [junit4]   2> 		xml response was: <?xml version="1.0" encoding="UTF-8"?>
   [junit4]   2> 	<response>
   [junit4]   2> 	<lst name="responseHeader"><int name="status">0</int><int name="QTime">0</int></lst><result name="response" numFound="0" start="0"></result>
   [junit4]   2> 	</response>
   [junit4]   2> 	
   [junit4]   2> 		request was:q=id:529&qt=standard&start=0&rows=20&version=2.2
   [junit4]   2> 		at org.apache.solr.SolrTestCaseJ4.assertQ(SolrTestCaseJ4.java:787)
   [junit4]   2> 		at org.apache.solr.update.HardAutoCommitTest.testCommitWithin(HardAutoCommitTest.java:100)
   [junit4]   2> 		at sun.reflect.NativeMethodAccessorImpl.invoke0(Native Method)
   [junit4]   2> 		at sun.reflect.NativeMethodAccessorImpl.invoke(NativeMethodAccessorImpl.java:62)
   [junit4]   2> 		at sun.reflect.DelegatingMethodAccessorImpl.invoke(DelegatingMethodAccessorImpl.java:43)
   [junit4]   2> 		at java.lang.reflect.Method.invoke(Method.java:497)
   [junit4]   2> 		at com.carrotsearch.randomizedtesting.RandomizedRunner.invoke(RandomizedRunner.java:1627)
   [junit4]   2> 		at com.carrotsearch.randomizedtesting.RandomizedRunner$6.evaluate(RandomizedRunner.java:836)
   [junit4]   2> 		at com.carrotsearch.randomizedtesting.RandomizedRunner$7.evaluate(RandomizedRunner.java:872)
   [junit4]   2> 		at com.carrotsearch.randomizedtesting.RandomizedRunner$8.evaluate(RandomizedRunner.java:886)
   [junit4]   2> 		at com.carrotsearch.randomizedtesting.rules.SystemPropertiesRestoreRule$1.evaluate(SystemPropertiesRestoreRule.java:57)
   [junit4]   2> 		at org.apache.lucene.util.TestRuleSetupTeardownChained$1.evaluate(TestRuleSetupTeardownChained.java:50)
   [junit4]   2> 		at org.apache.lucene.util.AbstractBeforeAfterRule$1.evaluate(AbstractBeforeAfterRule.java:46)
   [junit4]   2> 		at org.apache.lucene.util.TestRuleThreadAndTestName$1.evaluate(TestRuleThreadAndTestName.java:49)
   [junit4]   2> 		at org.apache.lucene.util.TestRuleIgnoreAfterMaxFailures$1.evaluate(TestRuleIgnoreAfterMaxFailures.java:65)
   [junit4]   2> 		at org.apache.lucene.util.TestRuleMarkFailure$1.evaluate(TestRuleMarkFailure.java:48)
   [junit4]   2> 		at com.carrotsearch.randomizedtesting.rules.StatementAdapter.evaluate(StatementAdapter.java:36)
   [junit4]   2> 		at com.carrotsearch.randomizedtesting.ThreadLeakControl$StatementRunner.run(ThreadLeakControl.java:365)
   [junit4]   2> 		at com.carrotsearch.randomizedtesting.ThreadLeakControl.forkTimeoutingTask(ThreadLeakControl.java:798)
   [junit4]   2> 		at com.carrotsearch.randomizedtesting.ThreadLeakControl$3.evaluate(ThreadLeakControl.java:458)
   [junit4]   2> 		at com.carrotsearch.randomizedtesting.RandomizedRunner.runSingleTest(RandomizedRunner.java:845)
   [junit4]   2> 		at com.carrotsearch.randomizedtesting.RandomizedRunner$3.evaluate(RandomizedRunner.java:747)
   [junit4]   2> 		at com.carrotsearch.randomizedtesting.RandomizedRunner$4.evaluate(RandomizedRunner.java:781)
   [junit4]   2> 		at com.carrotsearch.randomizedtesting.RandomizedRunner$5.evaluate(RandomizedRunner.java:792)
   [junit4]   2> 		at com.carrotsearch.randomizedtesting.rules.StatementAdapter.evaluate(StatementAdapter.java:36)
   [junit4]   2> 		at com.carrotsearch.randomizedtesting.rules.SystemPropertiesRestoreRule$1.evaluate(SystemPropertiesRestoreRule.java:57)
   [junit4]   2> 		at org.apache.lucene.util.AbstractBeforeAfterRule$1.evaluate(AbstractBeforeAfterRule.java:46)
   [junit4]   2> 		at com.carrotsearch.randomizedtesting.rules.StatementAdapter.evaluate(StatementAdapter.java:36)
   [junit4]   2> 		at org.apache.lucene.util.TestRuleStoreClassName$1.evaluate(TestRuleStoreClassName.java:42)
   [junit4]   2> 		at com.carrotsearch.randomizedtesting.rules.NoShadowingOrOverridesOnMethodsRule$1.evaluate(NoShadowingOrOverridesOnMethodsRule.java:39)
   [junit4]   2> 		at com.carrotsearch.randomizedtesting.rules.NoShadowingOrOverridesOnMethodsRule$1.evaluate(NoShadowingOrOverridesOnMethodsRule.java:39)
   [junit4]   2> 		at com.carrotsearch.randomizedtesting.rules.StatementAdapter.evaluate(StatementAdapter.java:36)
   [junit4]   2> 		at com.carrotsearch.randomizedtesting.rules.StatementAdapter.evaluate(StatementAdapter.java:36)
   [junit4]   2> 		at com.carrotsearch.randomizedtesting.rules.StatementAdapter.evaluate(StatementAdapter.java:36)
   [junit4]   2> 		at org.apache.lucene.util.TestRuleAssertionsRequired$1.evaluate(TestRuleAssertionsRequired.java:54)
   [junit4]   2> 		at org.apache.lucene.util.TestRuleMarkFailure$1.evaluate(TestRuleMarkFailure.java:48)
   [junit4]   2> 		at org.apache.lucene.util.TestRuleIgnoreAfterMaxFailures$1.evaluate(TestRuleIgnoreAfterMaxFailures.java:65)
   [junit4]   2> 		at org.apache.lucene.util.TestRuleIgnoreTestSuites$1.evaluate(TestRuleIgnoreTestSuites.java:55)
   [junit4]   2> 		at com.carrotsearch.randomizedtesting.rules.StatementAdapter.evaluate(StatementAdapter.java:36)
   [junit4]   2> 		at com.carrotsearch.randomizedtesting.ThreadLeakControl$StatementRunner.run(ThreadLeakControl.java:365)
   [junit4]   2> 		at java.lang.Thread.run(Thread.java:745)
   [junit4]   2> 	
   [junit4]   2> 1112499 T6043 c:collection1 oas.SolrTestCaseJ4.tearDown ###Ending testCommitWithin
   [junit4]   2> NOTE: reproduce with: ant test  -Dtestcase=HardAutoCommitTest -Dtests.method=testCommitWithin -Dtests.seed=97651BF49580BCBA -Dtests.slow=true -Dtests.locale=ko_KR -Dtests.timezone=Europe/Vaduz -Dtests.asserts=true -Dtests.file.encoding=Cp1252
   [junit4] ERROR   0.42s J0 | HardAutoCommitTest.testCommitWithin <<<
   [junit4]    > Throwable #1: java.lang.RuntimeException: Exception during query
   [junit4]    > 	at __randomizedtesting.SeedInfo.seed([97651BF49580BCBA:2DB7748C16AE52AF]:0)
   [junit4]    > 	at org.apache.solr.SolrTestCaseJ4.assertQ(SolrTestCaseJ4.java:794)
   [junit4]    > 	at org.apache.solr.update.HardAutoCommitTest.testCommitWithin(HardAutoCommitTest.java:100)
   [junit4]    > 	at java.lang.Thread.run(Thread.java:745)
   [junit4]    > Caused by: java.lang.RuntimeException: REQUEST FAILED: xpath=//result[@numFound=1]
   [junit4]    > 	xml response was: <?xml version="1.0" encoding="UTF-8"?>
   [junit4]    > <response>
   [junit4]    > <lst name="responseHeader"><int name="status">0</int><int name="QTime">0</int></lst><result name="response" numFound="0" start="0"></result>
   [junit4]    > </response>
   [junit4]    > 	request was:q=id:529&qt=standard&start=0&rows=20&version=2.2
   [junit4]    > 	at org.apache.solr.SolrTestCaseJ4.assertQ(SolrTestCaseJ4.java:787)
   [junit4]    > 	... 40 more
   [junit4]   2> 1112502 T6043 c:collection1 oas.SolrTestCaseJ4.deleteCore ###deleteCore
   [junit4]   2> 1112502 T6043 c:collection1 oasc.CoreContainer.shutdown Shutting down CoreContainer instance=559275122
   [junit4]   2> 1112503 T6043 c:collection1 oasc.SolrCore.close [collection1]  CLOSING SolrCore org.apache.solr.core.SolrCore@747e31be
   [junit4]   2> 1112503 T6043 c:collection1 oasu.DirectUpdateHandler2.close closing DirectUpdateHandler2{commits=0,autocommits=0,soft autocommits=0,optimizes=0,rollbacks=0,expungeDeletes=0,docsPending=2,adds=2,deletesById=1,deletesByQuery=0,errors=0,cumulative_adds=2,cumulative_deletesById=1,cumulative_deletesByQuery=0,cumulative_errors=0,transaction_logs_total_size=0,transaction_logs_total_number=0}
   [junit4]   2> 1112503 T6043 c:collection1 oasu.SolrCoreState.decrefSolrCoreState Closing SolrCoreState
   [junit4]   2> 1112503 T6043 c:collection1 oasu.DefaultSolrCoreState.closeIndexWriter SolrCoreState ref count has reached 0 - closing IndexWriter
   [junit4]   2> 1112503 T6043 c:collection1 oasu.DefaultSolrCoreState.closeIndexWriter closing IndexWriter with IndexWriterCloser
   [junit4]   2> 1112503 T6043 c:collection1 C2360 oasu.DirectUpdateHandler2.closeWriter Committing on IndexWriter close.
   [junit4]   2> 1112504 T6043 c:collection1 C2360 oasc.SolrDeletionPolicy.onCommit SolrDeletionPolicy.onCommit: commits: num=2
   [junit4]   2> 		commit{dir=MockDirectoryWrapper(RAMDirectory@21a619a1 lockFactory=org.apache.lucene.store.SingleInstanceLockFactory@11b9c6c8),segFN=segments_1,generation=1}
   [junit4]   2> 		commit{dir=MockDirectoryWrapper(RAMDirectory@21a619a1 lockFactory=org.apache.lucene.store.SingleInstanceLockFactory@11b9c6c8),segFN=segments_2,generation=2}
   [junit4]   2> 1112504 T6043 c:collection1 C2360 oasc.SolrDeletionPolicy.updateCommits newest commit generation = 2
   [junit4]   2> 1112506 T6043 c:collection1 oasc.SolrCore.closeSearcher [collection1] Closing main searcher on request.
   [junit4]   2> 1112513 T6043 c:collection1 oasc.CachingDirectoryFactory.close Closing MockDirectoryFactory - 2 directories currently being tracked
   [junit4]   2> 1112513 T6043 c:collection1 oasc.CachingDirectoryFactory.closeCacheValue looking to close C:\Users\JenkinsSlave\workspace\Lucene-Solr-5.x-Windows\solr\build\solr-core\test\J0\temp\solr.update.HardAutoCommitTest 97651BF49580BCBA-001\init-core-data-001\index [CachedDir<<refCount=0;path=C:\Users\JenkinsSlave\workspace\Lucene-Solr-5.x-Windows\solr\build\solr-core\test\J0\temp\solr.update.HardAutoCommitTest 97651BF49580BCBA-001\init-core-data-001\index;done=false>>]
   [junit4]   2> 1112513 T6043 c:collection1 oasc.CachingDirectoryFactory.close Closing directory: C:\Users\JenkinsSlave\workspace\Lucene-Solr-5.x-Windows\solr\build\solr-core\test\J0\temp\solr.update.HardAutoCommitTest 97651BF49580BCBA-001\init-core-data-001\index
   [junit4]   2> 1112513 T6043 c:collection1 oasc.CachingDirectoryFactory.closeCacheValue looking to close C:\Users\JenkinsSlave\workspace\Lucene-Solr-5.x-Windows\solr\build\solr-core\test\J0\temp\solr.update.HardAutoCommitTest 97651BF49580BCBA-001\init-core-data-001\ [CachedDir<<refCount=0;path=C:\Users\JenkinsSlave\workspace\Lucene-Solr-5.x-Windows\solr\build\solr-core\test\J0\temp\solr.update.HardAutoCommitTest 97651BF49580BCBA-001\init-core-data-001\;done=false>>]
   [junit4]   2> 1112513 T6043 c:collection1 oasc.CachingDirectoryFactory.close Closing directory: C:\Users\JenkinsSlave\workspace\Lucene-Solr-5.x-Windows\solr\build\solr-core\test\J0\temp\solr.update.HardAutoCommitTest 97651BF49580BCBA-001\init-core-data-001\
   [junit4]   2> NOTE: leaving temporary files on disk at: C:\Users\JenkinsSlave\workspace\Lucene-Solr-5.x-Windows\solr\build\solr-core\test\J0\temp\solr.update.HardAutoCommitTest 97651BF49580BCBA-001
   [junit4]   2> NOTE: test params are: codec=Asserting(Lucene50): {_version_=PostingsFormat(name=Memory doPackFST= false), field_t=Lucene50(blocksize=128), multiDefault=PostingsFormat(name=Memory doPackFST= true), subject=PostingsFormat(name=Memory doPackFST= true), intDefault=PostingsFormat(name=Memory doPackFST= false), id=Lucene50(blocksize=128), text=FSTOrd50, range_facet_l=PostingsFormat(name=Memory doPackFST= true), timestamp=PostingsFormat(name=Memory doPackFST= true)}, docValues:{timestamp=DocValuesFormat(name=Direct)}, sim=DefaultSimilarity, locale=ko_KR, timezone=Europe/Vaduz
   [junit4]   2> NOTE: Windows 7 6.1 amd64/Oracle Corporation 1.8.0_40 (64-bit)/cpus=3,threads=1,free=86787768,total=208072704
   [junit4]   2> NOTE: All tests run in this JVM: [TestIndexSearcher, TestCollationFieldDocValues, ResponseLogComponentTest, PreAnalyzedFieldTest, SuggesterTest, DocumentAnalysisRequestHandlerTest, DistributedFacetPivotSmallTest, AlternateDirectoryTest, UnloadDistributedZkTest, TestExpandComponent, TestSolrIndexConfig, TestDistributedSearch, UUIDUpdateProcessorFallbackTest, DistributedQueueTest, SuggestComponentTest, StressHdfsTest, TestCSVResponseWriter, DistributedSuggestComponentTest, IndexSchemaRuntimeFieldTest, SoftAutoCommitTest, TestCoreContainer, TestComplexPhraseQParserPlugin, TestLFUCache, SolrCoreTest, OverseerTest, TestCSVLoader, TestMiniSolrCloudCluster, ConcurrentDeleteAndCreateCollectionTest, TestExtendedDismaxParser, ShowFileRequestHandlerTest, DefaultValueUpdateProcessorTest, DistanceUnitsTest, TestPhraseSuggestions, RequiredFieldsTest, BadCopyFieldTest, OutputWriterTest, TestElisionMultitermQuery, TestRandomDVFaceting, TestFieldResource, TestRestoreCore, TestEmbeddedSolrServerConstructors, SolrCoreCheckLockOnStartupTest, TestDynamicFieldResource, TestCloudInspectUtil, TestManagedResource, TestReRankQParserPlugin, OverriddenZkACLAndCredentialsProvidersTest, TestHashPartitioner, TestXIncludeConfig, HdfsRecoveryZkTest, TestDynamicFieldCollectionResource, SuggesterWFSTTest, TestCloudManagedSchema, HighlighterMaxOffsetTest, DistanceFunctionTest, TestExactSharedStatsCache, DistributedDebugComponentTest, TestManagedSchema, AddBlockUpdateTest, LeaderElectionTest, TestOmitPositions, TestReplicationHandler, MultiThreadedOCPTest, SimpleFacetsTest, QueryElevationComponentTest, CachingDirectoryFactoryTest, TestStressRecovery, SuggesterFSTTest, TestSolr4Spatial2, CoreAdminCreateDiscoverTest, TestNamedUpdateProcessors, TestTrackingShardHandlerFactory, TestBinaryField, EnumFieldTest, ActionThrottleTest, MigrateRouteKeyTest, TestConfigOverlay, TestReloadAndDeleteDocs, TestPostingsSolrHighlighter, TestAtomicUpdateErrorCases, TestJsonRequest, TestStressVersions, SolrCloudExampleTest, TestArbitraryIndexDir, PeerSyncTest, HdfsUnloadDistributedZkTest, TestFieldSortValues, TestSort, SampleTest, TestStressLucene, CoreAdminHandlerTest, SharedFSAutoReplicaFailoverTest, BJQParserTest, TestWriterPerf, DeleteReplicaTest, TestManagedSchemaFieldResource, TestShortCircuitedRequests, AnalysisAfterCoreReloadTest, SimpleCollectionCreateDeleteTest, PrimUtilsTest, BlockCacheTest, PathHierarchyTokenizerFactoryTest, TestBM25SimilarityFactory, TestDefaultSearchFieldResource, TestIndexingPerformance, TestNRTOpen, TestInitQParser, HdfsCollectionsAPIDistributedZkTest, TestJmxMonitoredMap, TestQueryUtils, TestManagedSchemaDynamicFieldResource, TestManagedResourceStorage, ZkControllerTest, TestGroupingSearch, CircularListTest, TestQueryTypes, URLClassifyProcessorTest, HardAutoCommitTest]
   [junit4] Completed [223/483] on J0 in 0.92s, 1 test, 1 error <<< FAILURES!

[...truncated 804 lines...]
BUILD FAILED
C:\Users\JenkinsSlave\workspace\Lucene-Solr-5.x-Windows\build.xml:536: The following error occurred while executing this line:
C:\Users\JenkinsSlave\workspace\Lucene-Solr-5.x-Windows\build.xml:484: The following error occurred while executing this line:
C:\Users\JenkinsSlave\workspace\Lucene-Solr-5.x-Windows\build.xml:61: The following error occurred while executing this line:
C:\Users\JenkinsSlave\workspace\Lucene-Solr-5.x-Windows\extra-targets.xml:39: The following error occurred while executing this line:
C:\Users\JenkinsSlave\workspace\Lucene-Solr-5.x-Windows\solr\build.xml:229: The following error occurred while executing this line:
C:\Users\JenkinsSlave\workspace\Lucene-Solr-5.x-Windows\solr\common-build.xml:511: The following error occurred while executing this line:
C:\Users\JenkinsSlave\workspace\Lucene-Solr-5.x-Windows\lucene\common-build.xml:1434: The following error occurred while executing this line:
C:\Users\JenkinsSlave\workspace\Lucene-Solr-5.x-Windows\lucene\common-build.xml:991: There were test failures: 483 suites, 1917 tests, 1 error, 60 ignored (32 assumptions)

Total time: 56 minutes 56 seconds
Build step 'Invoke Ant' marked build as failure
Archiving artifacts
Recording test results
Email was triggered for: Failure - Any
Sending email for trigger: Failure - Any



Mime
View raw message