lucene-dev mailing list archives

Site index · List index
Message view « Date » · « Thread »
Top « Date » · « Thread »
From Apache Jenkins Server <jenk...@builds.apache.org>
Subject [JENKINS] Lucene-Solr-Tests-5.x-Java7 - Build # 2893 - Still Failing
Date Sun, 05 Apr 2015 05:23:29 GMT
Build: https://builds.apache.org/job/Lucene-Solr-Tests-5.x-Java7/2893/

5 tests failed.
REGRESSION:  org.apache.solr.cloud.ChaosMonkeyNothingIsSafeTest.test

Error Message:
There were too many update fails (39 > 20) - we expect it can happen, but shouldn't easily

Stack Trace:
java.lang.AssertionError: There were too many update fails (39 > 20) - we expect it can happen, but shouldn't easily
	at __randomizedtesting.SeedInfo.seed([25E72E934121CB2B:ADB31149EFDDA6D3]:0)
	at org.junit.Assert.fail(Assert.java:93)
	at org.junit.Assert.assertTrue(Assert.java:43)
	at org.junit.Assert.assertFalse(Assert.java:68)
	at org.apache.solr.cloud.ChaosMonkeyNothingIsSafeTest.test(ChaosMonkeyNothingIsSafeTest.java:230)
	at sun.reflect.NativeMethodAccessorImpl.invoke0(Native Method)
	at sun.reflect.NativeMethodAccessorImpl.invoke(NativeMethodAccessorImpl.java:57)
	at sun.reflect.DelegatingMethodAccessorImpl.invoke(DelegatingMethodAccessorImpl.java:43)
	at java.lang.reflect.Method.invoke(Method.java:606)
	at com.carrotsearch.randomizedtesting.RandomizedRunner.invoke(RandomizedRunner.java:1627)
	at com.carrotsearch.randomizedtesting.RandomizedRunner$6.evaluate(RandomizedRunner.java:836)
	at com.carrotsearch.randomizedtesting.RandomizedRunner$7.evaluate(RandomizedRunner.java:872)
	at com.carrotsearch.randomizedtesting.RandomizedRunner$8.evaluate(RandomizedRunner.java:886)
	at org.apache.solr.BaseDistributedSearchTestCase$ShardsRepeatRule$ShardsFixedStatement.callStatement(BaseDistributedSearchTestCase.java:960)
	at org.apache.solr.BaseDistributedSearchTestCase$ShardsRepeatRule$ShardsStatement.evaluate(BaseDistributedSearchTestCase.java:935)
	at com.carrotsearch.randomizedtesting.rules.SystemPropertiesRestoreRule$1.evaluate(SystemPropertiesRestoreRule.java:53)
	at org.apache.lucene.util.TestRuleSetupTeardownChained$1.evaluate(TestRuleSetupTeardownChained.java:50)
	at org.apache.lucene.util.AbstractBeforeAfterRule$1.evaluate(AbstractBeforeAfterRule.java:46)
	at org.apache.lucene.util.TestRuleThreadAndTestName$1.evaluate(TestRuleThreadAndTestName.java:49)
	at org.apache.lucene.util.TestRuleIgnoreAfterMaxFailures$1.evaluate(TestRuleIgnoreAfterMaxFailures.java:65)
	at org.apache.lucene.util.TestRuleMarkFailure$1.evaluate(TestRuleMarkFailure.java:48)
	at com.carrotsearch.randomizedtesting.rules.StatementAdapter.evaluate(StatementAdapter.java:36)
	at com.carrotsearch.randomizedtesting.ThreadLeakControl$StatementRunner.run(ThreadLeakControl.java:365)
	at com.carrotsearch.randomizedtesting.ThreadLeakControl.forkTimeoutingTask(ThreadLeakControl.java:798)
	at com.carrotsearch.randomizedtesting.ThreadLeakControl$3.evaluate(ThreadLeakControl.java:458)
	at com.carrotsearch.randomizedtesting.RandomizedRunner.runSingleTest(RandomizedRunner.java:845)
	at com.carrotsearch.randomizedtesting.RandomizedRunner$3.evaluate(RandomizedRunner.java:747)
	at com.carrotsearch.randomizedtesting.RandomizedRunner$4.evaluate(RandomizedRunner.java:781)
	at com.carrotsearch.randomizedtesting.RandomizedRunner$5.evaluate(RandomizedRunner.java:792)
	at com.carrotsearch.randomizedtesting.rules.StatementAdapter.evaluate(StatementAdapter.java:36)
	at com.carrotsearch.randomizedtesting.rules.SystemPropertiesRestoreRule$1.evaluate(SystemPropertiesRestoreRule.java:53)
	at org.apache.lucene.util.AbstractBeforeAfterRule$1.evaluate(AbstractBeforeAfterRule.java:46)
	at com.carrotsearch.randomizedtesting.rules.StatementAdapter.evaluate(StatementAdapter.java:36)
	at org.apache.lucene.util.TestRuleStoreClassName$1.evaluate(TestRuleStoreClassName.java:42)
	at com.carrotsearch.randomizedtesting.rules.NoShadowingOrOverridesOnMethodsRule$1.evaluate(NoShadowingOrOverridesOnMethodsRule.java:39)
	at com.carrotsearch.randomizedtesting.rules.NoShadowingOrOverridesOnMethodsRule$1.evaluate(NoShadowingOrOverridesOnMethodsRule.java:39)
	at com.carrotsearch.randomizedtesting.rules.StatementAdapter.evaluate(StatementAdapter.java:36)
	at com.carrotsearch.randomizedtesting.rules.StatementAdapter.evaluate(StatementAdapter.java:36)
	at com.carrotsearch.randomizedtesting.rules.StatementAdapter.evaluate(StatementAdapter.java:36)
	at org.apache.lucene.util.TestRuleAssertionsRequired$1.evaluate(TestRuleAssertionsRequired.java:54)
	at org.apache.lucene.util.TestRuleMarkFailure$1.evaluate(TestRuleMarkFailure.java:48)
	at org.apache.lucene.util.TestRuleIgnoreAfterMaxFailures$1.evaluate(TestRuleIgnoreAfterMaxFailures.java:65)
	at org.apache.lucene.util.TestRuleIgnoreTestSuites$1.evaluate(TestRuleIgnoreTestSuites.java:55)
	at com.carrotsearch.randomizedtesting.rules.StatementAdapter.evaluate(StatementAdapter.java:36)
	at com.carrotsearch.randomizedtesting.ThreadLeakControl$StatementRunner.run(ThreadLeakControl.java:365)
	at java.lang.Thread.run(Thread.java:745)


REGRESSION:  org.apache.solr.handler.component.DistributedMLTComponentTest.test

Error Message:
Timeout occured while waiting response from server at: http://127.0.0.1:37002//collection1

Stack Trace:
org.apache.solr.client.solrj.SolrServerException: Timeout occured while waiting response from server at: http://127.0.0.1:37002//collection1
	at __randomizedtesting.SeedInfo.seed([25E72E934121CB2B:ADB31149EFDDA6D3]:0)
	at org.apache.solr.client.solrj.impl.HttpSolrClient.executeMethod(HttpSolrClient.java:566)
	at org.apache.solr.client.solrj.impl.HttpSolrClient.request(HttpSolrClient.java:233)
	at org.apache.solr.client.solrj.impl.HttpSolrClient.request(HttpSolrClient.java:225)
	at org.apache.solr.client.solrj.SolrRequest.process(SolrRequest.java:135)
	at org.apache.solr.client.solrj.SolrClient.query(SolrClient.java:943)
	at org.apache.solr.client.solrj.SolrClient.query(SolrClient.java:958)
	at org.apache.solr.BaseDistributedSearchTestCase.queryServer(BaseDistributedSearchTestCase.java:558)
	at org.apache.solr.BaseDistributedSearchTestCase.query(BaseDistributedSearchTestCase.java:606)
	at org.apache.solr.BaseDistributedSearchTestCase.query(BaseDistributedSearchTestCase.java:588)
	at org.apache.solr.BaseDistributedSearchTestCase.query(BaseDistributedSearchTestCase.java:567)
	at org.apache.solr.handler.component.DistributedMLTComponentTest.test(DistributedMLTComponentTest.java:126)
	at sun.reflect.NativeMethodAccessorImpl.invoke0(Native Method)
	at sun.reflect.NativeMethodAccessorImpl.invoke(NativeMethodAccessorImpl.java:57)
	at sun.reflect.DelegatingMethodAccessorImpl.invoke(DelegatingMethodAccessorImpl.java:43)
	at java.lang.reflect.Method.invoke(Method.java:606)
	at com.carrotsearch.randomizedtesting.RandomizedRunner.invoke(RandomizedRunner.java:1627)
	at com.carrotsearch.randomizedtesting.RandomizedRunner$6.evaluate(RandomizedRunner.java:836)
	at com.carrotsearch.randomizedtesting.RandomizedRunner$7.evaluate(RandomizedRunner.java:872)
	at com.carrotsearch.randomizedtesting.RandomizedRunner$8.evaluate(RandomizedRunner.java:886)
	at org.apache.solr.BaseDistributedSearchTestCase$ShardsRepeatRule$ShardsFixedStatement.callStatement(BaseDistributedSearchTestCase.java:960)
	at org.apache.solr.BaseDistributedSearchTestCase$ShardsRepeatRule$ShardsStatement.evaluate(BaseDistributedSearchTestCase.java:935)
	at com.carrotsearch.randomizedtesting.rules.SystemPropertiesRestoreRule$1.evaluate(SystemPropertiesRestoreRule.java:53)
	at org.apache.lucene.util.TestRuleSetupTeardownChained$1.evaluate(TestRuleSetupTeardownChained.java:50)
	at org.apache.lucene.util.AbstractBeforeAfterRule$1.evaluate(AbstractBeforeAfterRule.java:46)
	at org.apache.lucene.util.TestRuleThreadAndTestName$1.evaluate(TestRuleThreadAndTestName.java:49)
	at org.apache.lucene.util.TestRuleIgnoreAfterMaxFailures$1.evaluate(TestRuleIgnoreAfterMaxFailures.java:65)
	at org.apache.lucene.util.TestRuleMarkFailure$1.evaluate(TestRuleMarkFailure.java:48)
	at com.carrotsearch.randomizedtesting.rules.StatementAdapter.evaluate(StatementAdapter.java:36)
	at com.carrotsearch.randomizedtesting.ThreadLeakControl$StatementRunner.run(ThreadLeakControl.java:365)
	at com.carrotsearch.randomizedtesting.ThreadLeakControl.forkTimeoutingTask(ThreadLeakControl.java:798)
	at com.carrotsearch.randomizedtesting.ThreadLeakControl$3.evaluate(ThreadLeakControl.java:458)
	at com.carrotsearch.randomizedtesting.RandomizedRunner.runSingleTest(RandomizedRunner.java:845)
	at com.carrotsearch.randomizedtesting.RandomizedRunner$3.evaluate(RandomizedRunner.java:747)
	at com.carrotsearch.randomizedtesting.RandomizedRunner$4.evaluate(RandomizedRunner.java:781)
	at com.carrotsearch.randomizedtesting.RandomizedRunner$5.evaluate(RandomizedRunner.java:792)
	at com.carrotsearch.randomizedtesting.rules.StatementAdapter.evaluate(StatementAdapter.java:36)
	at com.carrotsearch.randomizedtesting.rules.SystemPropertiesRestoreRule$1.evaluate(SystemPropertiesRestoreRule.java:53)
	at org.apache.lucene.util.AbstractBeforeAfterRule$1.evaluate(AbstractBeforeAfterRule.java:46)
	at com.carrotsearch.randomizedtesting.rules.StatementAdapter.evaluate(StatementAdapter.java:36)
	at org.apache.lucene.util.TestRuleStoreClassName$1.evaluate(TestRuleStoreClassName.java:42)
	at com.carrotsearch.randomizedtesting.rules.NoShadowingOrOverridesOnMethodsRule$1.evaluate(NoShadowingOrOverridesOnMethodsRule.java:39)
	at com.carrotsearch.randomizedtesting.rules.NoShadowingOrOverridesOnMethodsRule$1.evaluate(NoShadowingOrOverridesOnMethodsRule.java:39)
	at com.carrotsearch.randomizedtesting.rules.StatementAdapter.evaluate(StatementAdapter.java:36)
	at com.carrotsearch.randomizedtesting.rules.StatementAdapter.evaluate(StatementAdapter.java:36)
	at com.carrotsearch.randomizedtesting.rules.StatementAdapter.evaluate(StatementAdapter.java:36)
	at org.apache.lucene.util.TestRuleAssertionsRequired$1.evaluate(TestRuleAssertionsRequired.java:54)
	at org.apache.lucene.util.TestRuleMarkFailure$1.evaluate(TestRuleMarkFailure.java:48)
	at org.apache.lucene.util.TestRuleIgnoreAfterMaxFailures$1.evaluate(TestRuleIgnoreAfterMaxFailures.java:65)
	at org.apache.lucene.util.TestRuleIgnoreTestSuites$1.evaluate(TestRuleIgnoreTestSuites.java:55)
	at com.carrotsearch.randomizedtesting.rules.StatementAdapter.evaluate(StatementAdapter.java:36)
	at com.carrotsearch.randomizedtesting.ThreadLeakControl$StatementRunner.run(ThreadLeakControl.java:365)
	at java.lang.Thread.run(Thread.java:745)
Caused by: java.net.SocketTimeoutException: Read timed out
	at java.net.SocketInputStream.socketRead0(Native Method)
	at java.net.SocketInputStream.read(SocketInputStream.java:152)
	at java.net.SocketInputStream.read(SocketInputStream.java:122)
	at org.apache.http.impl.io.AbstractSessionInputBuffer.fillBuffer(AbstractSessionInputBuffer.java:160)
	at org.apache.http.impl.io.SocketInputBuffer.fillBuffer(SocketInputBuffer.java:84)
	at org.apache.http.impl.io.AbstractSessionInputBuffer.readLine(AbstractSessionInputBuffer.java:273)
	at org.apache.http.impl.conn.DefaultHttpResponseParser.parseHead(DefaultHttpResponseParser.java:140)
	at org.apache.http.impl.conn.DefaultHttpResponseParser.parseHead(DefaultHttpResponseParser.java:57)
	at org.apache.http.impl.io.AbstractMessageParser.parse(AbstractMessageParser.java:261)
	at org.apache.http.impl.AbstractHttpClientConnection.receiveResponseHeader(AbstractHttpClientConnection.java:283)
	at org.apache.http.impl.conn.DefaultClientConnection.receiveResponseHeader(DefaultClientConnection.java:251)
	at org.apache.http.impl.conn.ManagedClientConnectionImpl.receiveResponseHeader(ManagedClientConnectionImpl.java:197)
	at org.apache.http.protocol.HttpRequestExecutor.doReceiveResponse(HttpRequestExecutor.java:272)
	at org.apache.http.protocol.HttpRequestExecutor.execute(HttpRequestExecutor.java:124)
	at org.apache.http.impl.client.DefaultRequestDirector.tryExecute(DefaultRequestDirector.java:685)
	at org.apache.http.impl.client.DefaultRequestDirector.execute(DefaultRequestDirector.java:487)
	at org.apache.http.impl.client.AbstractHttpClient.doExecute(AbstractHttpClient.java:882)
	at org.apache.http.impl.client.CloseableHttpClient.execute(CloseableHttpClient.java:82)
	at org.apache.http.impl.client.CloseableHttpClient.execute(CloseableHttpClient.java:107)
	at org.apache.http.impl.client.CloseableHttpClient.execute(CloseableHttpClient.java:55)
	at org.apache.solr.client.solrj.impl.HttpSolrClient.executeMethod(HttpSolrClient.java:462)
	... 51 more


FAILED:  org.apache.solr.cloud.LeaderInitiatedRecoveryOnCommitTest.test

Error Message:
IOException occured when talking to server at: http://127.0.0.1:22086/pd/l/c8n_1x3_commits_shard1_replica1

Stack Trace:
org.apache.solr.client.solrj.SolrServerException: IOException occured when talking to server at: http://127.0.0.1:22086/pd/l/c8n_1x3_commits_shard1_replica1
	at __randomizedtesting.SeedInfo.seed([25E72E934121CB2B:ADB31149EFDDA6D3]:0)
	at org.apache.solr.client.solrj.impl.HttpSolrClient.executeMethod(HttpSolrClient.java:570)
	at org.apache.solr.client.solrj.impl.HttpSolrClient.request(HttpSolrClient.java:233)
	at org.apache.solr.client.solrj.impl.HttpSolrClient.request(HttpSolrClient.java:225)
	at org.apache.solr.client.solrj.SolrRequest.process(SolrRequest.java:135)
	at org.apache.solr.client.solrj.SolrClient.commit(SolrClient.java:483)
	at org.apache.solr.client.solrj.SolrClient.commit(SolrClient.java:464)
	at org.apache.solr.cloud.LeaderInitiatedRecoveryOnCommitTest.oneShardTest(LeaderInitiatedRecoveryOnCommitTest.java:132)
	at org.apache.solr.cloud.LeaderInitiatedRecoveryOnCommitTest.test(LeaderInitiatedRecoveryOnCommitTest.java:64)
	at sun.reflect.NativeMethodAccessorImpl.invoke0(Native Method)
	at sun.reflect.NativeMethodAccessorImpl.invoke(NativeMethodAccessorImpl.java:57)
	at sun.reflect.DelegatingMethodAccessorImpl.invoke(DelegatingMethodAccessorImpl.java:43)
	at java.lang.reflect.Method.invoke(Method.java:606)
	at com.carrotsearch.randomizedtesting.RandomizedRunner.invoke(RandomizedRunner.java:1627)
	at com.carrotsearch.randomizedtesting.RandomizedRunner$6.evaluate(RandomizedRunner.java:836)
	at com.carrotsearch.randomizedtesting.RandomizedRunner$7.evaluate(RandomizedRunner.java:872)
	at com.carrotsearch.randomizedtesting.RandomizedRunner$8.evaluate(RandomizedRunner.java:886)
	at org.apache.solr.BaseDistributedSearchTestCase$ShardsRepeatRule$ShardsFixedStatement.callStatement(BaseDistributedSearchTestCase.java:960)
	at org.apache.solr.BaseDistributedSearchTestCase$ShardsRepeatRule$ShardsStatement.evaluate(BaseDistributedSearchTestCase.java:935)
	at com.carrotsearch.randomizedtesting.rules.SystemPropertiesRestoreRule$1.evaluate(SystemPropertiesRestoreRule.java:53)
	at org.apache.lucene.util.TestRuleSetupTeardownChained$1.evaluate(TestRuleSetupTeardownChained.java:50)
	at org.apache.lucene.util.AbstractBeforeAfterRule$1.evaluate(AbstractBeforeAfterRule.java:46)
	at org.apache.lucene.util.TestRuleThreadAndTestName$1.evaluate(TestRuleThreadAndTestName.java:49)
	at org.apache.lucene.util.TestRuleIgnoreAfterMaxFailures$1.evaluate(TestRuleIgnoreAfterMaxFailures.java:65)
	at org.apache.lucene.util.TestRuleMarkFailure$1.evaluate(TestRuleMarkFailure.java:48)
	at com.carrotsearch.randomizedtesting.rules.StatementAdapter.evaluate(StatementAdapter.java:36)
	at com.carrotsearch.randomizedtesting.ThreadLeakControl$StatementRunner.run(ThreadLeakControl.java:365)
	at com.carrotsearch.randomizedtesting.ThreadLeakControl.forkTimeoutingTask(ThreadLeakControl.java:798)
	at com.carrotsearch.randomizedtesting.ThreadLeakControl$3.evaluate(ThreadLeakControl.java:458)
	at com.carrotsearch.randomizedtesting.RandomizedRunner.runSingleTest(RandomizedRunner.java:845)
	at com.carrotsearch.randomizedtesting.RandomizedRunner$3.evaluate(RandomizedRunner.java:747)
	at com.carrotsearch.randomizedtesting.RandomizedRunner$4.evaluate(RandomizedRunner.java:781)
	at com.carrotsearch.randomizedtesting.RandomizedRunner$5.evaluate(RandomizedRunner.java:792)
	at com.carrotsearch.randomizedtesting.rules.StatementAdapter.evaluate(StatementAdapter.java:36)
	at com.carrotsearch.randomizedtesting.rules.SystemPropertiesRestoreRule$1.evaluate(SystemPropertiesRestoreRule.java:53)
	at org.apache.lucene.util.AbstractBeforeAfterRule$1.evaluate(AbstractBeforeAfterRule.java:46)
	at com.carrotsearch.randomizedtesting.rules.StatementAdapter.evaluate(StatementAdapter.java:36)
	at org.apache.lucene.util.TestRuleStoreClassName$1.evaluate(TestRuleStoreClassName.java:42)
	at com.carrotsearch.randomizedtesting.rules.NoShadowingOrOverridesOnMethodsRule$1.evaluate(NoShadowingOrOverridesOnMethodsRule.java:39)
	at com.carrotsearch.randomizedtesting.rules.NoShadowingOrOverridesOnMethodsRule$1.evaluate(NoShadowingOrOverridesOnMethodsRule.java:39)
	at com.carrotsearch.randomizedtesting.rules.StatementAdapter.evaluate(StatementAdapter.java:36)
	at com.carrotsearch.randomizedtesting.rules.StatementAdapter.evaluate(StatementAdapter.java:36)
	at com.carrotsearch.randomizedtesting.rules.StatementAdapter.evaluate(StatementAdapter.java:36)
	at org.apache.lucene.util.TestRuleAssertionsRequired$1.evaluate(TestRuleAssertionsRequired.java:54)
	at org.apache.lucene.util.TestRuleMarkFailure$1.evaluate(TestRuleMarkFailure.java:48)
	at org.apache.lucene.util.TestRuleIgnoreAfterMaxFailures$1.evaluate(TestRuleIgnoreAfterMaxFailures.java:65)
	at org.apache.lucene.util.TestRuleIgnoreTestSuites$1.evaluate(TestRuleIgnoreTestSuites.java:55)
	at com.carrotsearch.randomizedtesting.rules.StatementAdapter.evaluate(StatementAdapter.java:36)
	at com.carrotsearch.randomizedtesting.ThreadLeakControl$StatementRunner.run(ThreadLeakControl.java:365)
	at java.lang.Thread.run(Thread.java:745)
Caused by: org.apache.http.NoHttpResponseException: 127.0.0.1:22086 failed to respond
	at org.apache.http.impl.conn.DefaultHttpResponseParser.parseHead(DefaultHttpResponseParser.java:143)
	at org.apache.http.impl.conn.DefaultHttpResponseParser.parseHead(DefaultHttpResponseParser.java:57)
	at org.apache.http.impl.io.AbstractMessageParser.parse(AbstractMessageParser.java:261)
	at org.apache.http.impl.AbstractHttpClientConnection.receiveResponseHeader(AbstractHttpClientConnection.java:283)
	at org.apache.http.impl.conn.DefaultClientConnection.receiveResponseHeader(DefaultClientConnection.java:251)
	at org.apache.http.impl.conn.ManagedClientConnectionImpl.receiveResponseHeader(ManagedClientConnectionImpl.java:197)
	at org.apache.http.protocol.HttpRequestExecutor.doReceiveResponse(HttpRequestExecutor.java:272)
	at org.apache.http.protocol.HttpRequestExecutor.execute(HttpRequestExecutor.java:124)
	at org.apache.http.impl.client.DefaultRequestDirector.tryExecute(DefaultRequestDirector.java:685)
	at org.apache.http.impl.client.DefaultRequestDirector.execute(DefaultRequestDirector.java:487)
	at org.apache.http.impl.client.AbstractHttpClient.doExecute(AbstractHttpClient.java:882)
	at org.apache.http.impl.client.CloseableHttpClient.execute(CloseableHttpClient.java:82)
	at org.apache.http.impl.client.CloseableHttpClient.execute(CloseableHttpClient.java:107)
	at org.apache.http.impl.client.CloseableHttpClient.execute(CloseableHttpClient.java:55)
	at org.apache.solr.client.solrj.impl.HttpSolrClient.executeMethod(HttpSolrClient.java:462)
	... 48 more


FAILED:  org.apache.solr.cloud.RecoveryAfterSoftCommitTest.test

Error Message:
org.apache.solr.client.solrj.SolrServerException: IOException occured when talking to server at: http://127.0.0.1:38235/collection1

Stack Trace:
org.apache.solr.client.solrj.SolrServerException: org.apache.solr.client.solrj.SolrServerException: IOException occured when talking to server at: http://127.0.0.1:38235/collection1
	at __randomizedtesting.SeedInfo.seed([25E72E934121CB2B:ADB31149EFDDA6D3]:0)
	at org.apache.solr.client.solrj.impl.CloudSolrClient.directUpdate(CloudSolrClient.java:625)
	at org.apache.solr.client.solrj.impl.CloudSolrClient.sendRequest(CloudSolrClient.java:948)
	at org.apache.solr.client.solrj.impl.CloudSolrClient.requestWithRetryOnStaleState(CloudSolrClient.java:839)
	at org.apache.solr.client.solrj.impl.CloudSolrClient.request(CloudSolrClient.java:782)
	at org.apache.solr.client.solrj.SolrRequest.process(SolrRequest.java:135)
	at org.apache.solr.client.solrj.SolrClient.add(SolrClient.java:174)
	at org.apache.solr.client.solrj.SolrClient.add(SolrClient.java:139)
	at org.apache.solr.client.solrj.SolrClient.add(SolrClient.java:153)
	at org.apache.solr.cloud.RecoveryAfterSoftCommitTest.test(RecoveryAfterSoftCommitTest.java:88)
	at sun.reflect.NativeMethodAccessorImpl.invoke0(Native Method)
	at sun.reflect.NativeMethodAccessorImpl.invoke(NativeMethodAccessorImpl.java:57)
	at sun.reflect.DelegatingMethodAccessorImpl.invoke(DelegatingMethodAccessorImpl.java:43)
	at java.lang.reflect.Method.invoke(Method.java:606)
	at com.carrotsearch.randomizedtesting.RandomizedRunner.invoke(RandomizedRunner.java:1627)
	at com.carrotsearch.randomizedtesting.RandomizedRunner$6.evaluate(RandomizedRunner.java:836)
	at com.carrotsearch.randomizedtesting.RandomizedRunner$7.evaluate(RandomizedRunner.java:872)
	at com.carrotsearch.randomizedtesting.RandomizedRunner$8.evaluate(RandomizedRunner.java:886)
	at org.apache.solr.BaseDistributedSearchTestCase$ShardsRepeatRule$ShardsFixedStatement.callStatement(BaseDistributedSearchTestCase.java:960)
	at org.apache.solr.BaseDistributedSearchTestCase$ShardsRepeatRule$ShardsStatement.evaluate(BaseDistributedSearchTestCase.java:935)
	at com.carrotsearch.randomizedtesting.rules.SystemPropertiesRestoreRule$1.evaluate(SystemPropertiesRestoreRule.java:53)
	at org.apache.lucene.util.TestRuleSetupTeardownChained$1.evaluate(TestRuleSetupTeardownChained.java:50)
	at org.apache.lucene.util.AbstractBeforeAfterRule$1.evaluate(AbstractBeforeAfterRule.java:46)
	at org.apache.lucene.util.TestRuleThreadAndTestName$1.evaluate(TestRuleThreadAndTestName.java:49)
	at org.apache.lucene.util.TestRuleIgnoreAfterMaxFailures$1.evaluate(TestRuleIgnoreAfterMaxFailures.java:65)
	at org.apache.lucene.util.TestRuleMarkFailure$1.evaluate(TestRuleMarkFailure.java:48)
	at com.carrotsearch.randomizedtesting.rules.StatementAdapter.evaluate(StatementAdapter.java:36)
	at com.carrotsearch.randomizedtesting.ThreadLeakControl$StatementRunner.run(ThreadLeakControl.java:365)
	at com.carrotsearch.randomizedtesting.ThreadLeakControl.forkTimeoutingTask(ThreadLeakControl.java:798)
	at com.carrotsearch.randomizedtesting.ThreadLeakControl$3.evaluate(ThreadLeakControl.java:458)
	at com.carrotsearch.randomizedtesting.RandomizedRunner.runSingleTest(RandomizedRunner.java:845)
	at com.carrotsearch.randomizedtesting.RandomizedRunner$3.evaluate(RandomizedRunner.java:747)
	at com.carrotsearch.randomizedtesting.RandomizedRunner$4.evaluate(RandomizedRunner.java:781)
	at com.carrotsearch.randomizedtesting.RandomizedRunner$5.evaluate(RandomizedRunner.java:792)
	at com.carrotsearch.randomizedtesting.rules.StatementAdapter.evaluate(StatementAdapter.java:36)
	at com.carrotsearch.randomizedtesting.rules.SystemPropertiesRestoreRule$1.evaluate(SystemPropertiesRestoreRule.java:53)
	at org.apache.lucene.util.AbstractBeforeAfterRule$1.evaluate(AbstractBeforeAfterRule.java:46)
	at com.carrotsearch.randomizedtesting.rules.StatementAdapter.evaluate(StatementAdapter.java:36)
	at org.apache.lucene.util.TestRuleStoreClassName$1.evaluate(TestRuleStoreClassName.java:42)
	at com.carrotsearch.randomizedtesting.rules.NoShadowingOrOverridesOnMethodsRule$1.evaluate(NoShadowingOrOverridesOnMethodsRule.java:39)
	at com.carrotsearch.randomizedtesting.rules.NoShadowingOrOverridesOnMethodsRule$1.evaluate(NoShadowingOrOverridesOnMethodsRule.java:39)
	at com.carrotsearch.randomizedtesting.rules.StatementAdapter.evaluate(StatementAdapter.java:36)
	at com.carrotsearch.randomizedtesting.rules.StatementAdapter.evaluate(StatementAdapter.java:36)
	at com.carrotsearch.randomizedtesting.rules.StatementAdapter.evaluate(StatementAdapter.java:36)
	at org.apache.lucene.util.TestRuleAssertionsRequired$1.evaluate(TestRuleAssertionsRequired.java:54)
	at org.apache.lucene.util.TestRuleMarkFailure$1.evaluate(TestRuleMarkFailure.java:48)
	at org.apache.lucene.util.TestRuleIgnoreAfterMaxFailures$1.evaluate(TestRuleIgnoreAfterMaxFailures.java:65)
	at org.apache.lucene.util.TestRuleIgnoreTestSuites$1.evaluate(TestRuleIgnoreTestSuites.java:55)
	at com.carrotsearch.randomizedtesting.rules.StatementAdapter.evaluate(StatementAdapter.java:36)
	at com.carrotsearch.randomizedtesting.ThreadLeakControl$StatementRunner.run(ThreadLeakControl.java:365)
	at java.lang.Thread.run(Thread.java:745)
Caused by: org.apache.solr.client.solrj.SolrServerException: IOException occured when talking to server at: http://127.0.0.1:38235/collection1
	at org.apache.solr.client.solrj.impl.HttpSolrClient.executeMethod(HttpSolrClient.java:570)
	at org.apache.solr.client.solrj.impl.HttpSolrClient.request(HttpSolrClient.java:233)
	at org.apache.solr.client.solrj.impl.HttpSolrClient.request(HttpSolrClient.java:225)
	at org.apache.solr.client.solrj.impl.LBHttpSolrClient.doRequest(LBHttpSolrClient.java:370)
	at org.apache.solr.client.solrj.impl.LBHttpSolrClient.request(LBHttpSolrClient.java:325)
	at org.apache.solr.client.solrj.impl.CloudSolrClient.directUpdate(CloudSolrClient.java:622)
	... 49 more
Caused by: org.apache.http.NoHttpResponseException: 127.0.0.1:38235 failed to respond
	at org.apache.http.impl.conn.DefaultHttpResponseParser.parseHead(DefaultHttpResponseParser.java:143)
	at org.apache.http.impl.conn.DefaultHttpResponseParser.parseHead(DefaultHttpResponseParser.java:57)
	at org.apache.http.impl.io.AbstractMessageParser.parse(AbstractMessageParser.java:261)
	at org.apache.http.impl.AbstractHttpClientConnection.receiveResponseHeader(AbstractHttpClientConnection.java:283)
	at org.apache.http.impl.conn.DefaultClientConnection.receiveResponseHeader(DefaultClientConnection.java:251)
	at org.apache.http.impl.conn.ManagedClientConnectionImpl.receiveResponseHeader(ManagedClientConnectionImpl.java:197)
	at org.apache.http.protocol.HttpRequestExecutor.doReceiveResponse(HttpRequestExecutor.java:272)
	at org.apache.http.protocol.HttpRequestExecutor.execute(HttpRequestExecutor.java:124)
	at org.apache.http.impl.client.DefaultRequestDirector.tryExecute(DefaultRequestDirector.java:685)
	at org.apache.http.impl.client.DefaultRequestDirector.execute(DefaultRequestDirector.java:487)
	at org.apache.http.impl.client.AbstractHttpClient.doExecute(AbstractHttpClient.java:882)
	at org.apache.http.impl.client.CloseableHttpClient.execute(CloseableHttpClient.java:82)
	at org.apache.http.impl.client.CloseableHttpClient.execute(CloseableHttpClient.java:107)
	at org.apache.http.impl.client.CloseableHttpClient.execute(CloseableHttpClient.java:55)
	at org.apache.solr.client.solrj.impl.HttpSolrClient.executeMethod(HttpSolrClient.java:462)
	... 54 more


FAILED:  org.apache.solr.cloud.ReplicationFactorTest.test

Error Message:
org.apache.solr.client.solrj.SolrServerException: IOException occured when talking to server at: http://127.0.0.1:20826/repfacttest_c8n_1x3_shard1_replica1

Stack Trace:
org.apache.solr.client.solrj.SolrServerException: org.apache.solr.client.solrj.SolrServerException: IOException occured when talking to server at: http://127.0.0.1:20826/repfacttest_c8n_1x3_shard1_replica1
	at __randomizedtesting.SeedInfo.seed([25E72E934121CB2B:ADB31149EFDDA6D3]:0)
	at org.apache.solr.client.solrj.impl.CloudSolrClient.directUpdate(CloudSolrClient.java:625)
	at org.apache.solr.client.solrj.impl.CloudSolrClient.sendRequest(CloudSolrClient.java:948)
	at org.apache.solr.client.solrj.impl.CloudSolrClient.requestWithRetryOnStaleState(CloudSolrClient.java:839)
	at org.apache.solr.client.solrj.impl.CloudSolrClient.request(CloudSolrClient.java:782)
	at org.apache.solr.client.solrj.SolrClient.request(SolrClient.java:1220)
	at org.apache.solr.cloud.ReplicationFactorTest.sendDoc(ReplicationFactorTest.java:308)
	at org.apache.solr.cloud.ReplicationFactorTest.testRf3(ReplicationFactorTest.java:234)
	at org.apache.solr.cloud.ReplicationFactorTest.test(ReplicationFactorTest.java:113)
	at sun.reflect.NativeMethodAccessorImpl.invoke0(Native Method)
	at sun.reflect.NativeMethodAccessorImpl.invoke(NativeMethodAccessorImpl.java:57)
	at sun.reflect.DelegatingMethodAccessorImpl.invoke(DelegatingMethodAccessorImpl.java:43)
	at java.lang.reflect.Method.invoke(Method.java:606)
	at com.carrotsearch.randomizedtesting.RandomizedRunner.invoke(RandomizedRunner.java:1627)
	at com.carrotsearch.randomizedtesting.RandomizedRunner$6.evaluate(RandomizedRunner.java:836)
	at com.carrotsearch.randomizedtesting.RandomizedRunner$7.evaluate(RandomizedRunner.java:872)
	at com.carrotsearch.randomizedtesting.RandomizedRunner$8.evaluate(RandomizedRunner.java:886)
	at org.apache.solr.BaseDistributedSearchTestCase$ShardsRepeatRule$ShardsFixedStatement.callStatement(BaseDistributedSearchTestCase.java:960)
	at org.apache.solr.BaseDistributedSearchTestCase$ShardsRepeatRule$ShardsStatement.evaluate(BaseDistributedSearchTestCase.java:935)
	at com.carrotsearch.randomizedtesting.rules.SystemPropertiesRestoreRule$1.evaluate(SystemPropertiesRestoreRule.java:53)
	at org.apache.lucene.util.TestRuleSetupTeardownChained$1.evaluate(TestRuleSetupTeardownChained.java:50)
	at org.apache.lucene.util.AbstractBeforeAfterRule$1.evaluate(AbstractBeforeAfterRule.java:46)
	at org.apache.lucene.util.TestRuleThreadAndTestName$1.evaluate(TestRuleThreadAndTestName.java:49)
	at org.apache.lucene.util.TestRuleIgnoreAfterMaxFailures$1.evaluate(TestRuleIgnoreAfterMaxFailures.java:65)
	at org.apache.lucene.util.TestRuleMarkFailure$1.evaluate(TestRuleMarkFailure.java:48)
	at com.carrotsearch.randomizedtesting.rules.StatementAdapter.evaluate(StatementAdapter.java:36)
	at com.carrotsearch.randomizedtesting.ThreadLeakControl$StatementRunner.run(ThreadLeakControl.java:365)
	at com.carrotsearch.randomizedtesting.ThreadLeakControl.forkTimeoutingTask(ThreadLeakControl.java:798)
	at com.carrotsearch.randomizedtesting.ThreadLeakControl$3.evaluate(ThreadLeakControl.java:458)
	at com.carrotsearch.randomizedtesting.RandomizedRunner.runSingleTest(RandomizedRunner.java:845)
	at com.carrotsearch.randomizedtesting.RandomizedRunner$3.evaluate(RandomizedRunner.java:747)
	at com.carrotsearch.randomizedtesting.RandomizedRunner$4.evaluate(RandomizedRunner.java:781)
	at com.carrotsearch.randomizedtesting.RandomizedRunner$5.evaluate(RandomizedRunner.java:792)
	at com.carrotsearch.randomizedtesting.rules.StatementAdapter.evaluate(StatementAdapter.java:36)
	at com.carrotsearch.randomizedtesting.rules.SystemPropertiesRestoreRule$1.evaluate(SystemPropertiesRestoreRule.java:53)
	at org.apache.lucene.util.AbstractBeforeAfterRule$1.evaluate(AbstractBeforeAfterRule.java:46)
	at com.carrotsearch.randomizedtesting.rules.StatementAdapter.evaluate(StatementAdapter.java:36)
	at org.apache.lucene.util.TestRuleStoreClassName$1.evaluate(TestRuleStoreClassName.java:42)
	at com.carrotsearch.randomizedtesting.rules.NoShadowingOrOverridesOnMethodsRule$1.evaluate(NoShadowingOrOverridesOnMethodsRule.java:39)
	at com.carrotsearch.randomizedtesting.rules.NoShadowingOrOverridesOnMethodsRule$1.evaluate(NoShadowingOrOverridesOnMethodsRule.java:39)
	at com.carrotsearch.randomizedtesting.rules.StatementAdapter.evaluate(StatementAdapter.java:36)
	at com.carrotsearch.randomizedtesting.rules.StatementAdapter.evaluate(StatementAdapter.java:36)
	at com.carrotsearch.randomizedtesting.rules.StatementAdapter.evaluate(StatementAdapter.java:36)
	at org.apache.lucene.util.TestRuleAssertionsRequired$1.evaluate(TestRuleAssertionsRequired.java:54)
	at org.apache.lucene.util.TestRuleMarkFailure$1.evaluate(TestRuleMarkFailure.java:48)
	at org.apache.lucene.util.TestRuleIgnoreAfterMaxFailures$1.evaluate(TestRuleIgnoreAfterMaxFailures.java:65)
	at org.apache.lucene.util.TestRuleIgnoreTestSuites$1.evaluate(TestRuleIgnoreTestSuites.java:55)
	at com.carrotsearch.randomizedtesting.rules.StatementAdapter.evaluate(StatementAdapter.java:36)
	at com.carrotsearch.randomizedtesting.ThreadLeakControl$StatementRunner.run(ThreadLeakControl.java:365)
	at java.lang.Thread.run(Thread.java:745)
Caused by: org.apache.solr.client.solrj.SolrServerException: IOException occured when talking to server at: http://127.0.0.1:20826/repfacttest_c8n_1x3_shard1_replica1
	at org.apache.solr.client.solrj.impl.HttpSolrClient.executeMethod(HttpSolrClient.java:570)
	at org.apache.solr.client.solrj.impl.HttpSolrClient.request(HttpSolrClient.java:233)
	at org.apache.solr.client.solrj.impl.HttpSolrClient.request(HttpSolrClient.java:225)
	at org.apache.solr.client.solrj.impl.LBHttpSolrClient.doRequest(LBHttpSolrClient.java:370)
	at org.apache.solr.client.solrj.impl.LBHttpSolrClient.request(LBHttpSolrClient.java:325)
	at org.apache.solr.client.solrj.impl.CloudSolrClient.directUpdate(CloudSolrClient.java:622)
	... 48 more
Caused by: org.apache.http.NoHttpResponseException: 127.0.0.1:20826 failed to respond
	at org.apache.http.impl.conn.DefaultHttpResponseParser.parseHead(DefaultHttpResponseParser.java:143)
	at org.apache.http.impl.conn.DefaultHttpResponseParser.parseHead(DefaultHttpResponseParser.java:57)
	at org.apache.http.impl.io.AbstractMessageParser.parse(AbstractMessageParser.java:261)
	at org.apache.http.impl.AbstractHttpClientConnection.receiveResponseHeader(AbstractHttpClientConnection.java:283)
	at org.apache.http.impl.conn.DefaultClientConnection.receiveResponseHeader(DefaultClientConnection.java:251)
	at org.apache.http.impl.conn.ManagedClientConnectionImpl.receiveResponseHeader(ManagedClientConnectionImpl.java:197)
	at org.apache.http.protocol.HttpRequestExecutor.doReceiveResponse(HttpRequestExecutor.java:272)
	at org.apache.http.protocol.HttpRequestExecutor.execute(HttpRequestExecutor.java:124)
	at org.apache.http.impl.client.DefaultRequestDirector.tryExecute(DefaultRequestDirector.java:685)
	at org.apache.http.impl.client.DefaultRequestDirector.execute(DefaultRequestDirector.java:487)
	at org.apache.http.impl.client.AbstractHttpClient.doExecute(AbstractHttpClient.java:882)
	at org.apache.http.impl.client.CloseableHttpClient.execute(CloseableHttpClient.java:82)
	at org.apache.http.impl.client.CloseableHttpClient.execute(CloseableHttpClient.java:107)
	at org.apache.http.impl.client.CloseableHttpClient.execute(CloseableHttpClient.java:55)
	at org.apache.solr.client.solrj.impl.HttpSolrClient.executeMethod(HttpSolrClient.java:462)
	... 53 more




Build Log:
[...truncated 9549 lines...]
   [junit4] Suite: org.apache.solr.cloud.LeaderInitiatedRecoveryOnCommitTest
   [junit4]   2> Creating dataDir: /usr/home/jenkins/jenkins-slave/workspace/Lucene-Solr-Tests-5.x-Java7/solr/build/solr-core/test/J1/temp/solr.cloud.LeaderInitiatedRecoveryOnCommitTest 25E72E934121CB2B-001/init-core-data-001
   [junit4]   2> 380058 T1111 oas.BaseDistributedSearchTestCase.initHostContext Setting hostContext system property: /pd/l
   [junit4]   2> 380066 T1111 oasc.ZkTestServer.run STARTING ZK TEST SERVER
   [junit4]   1> client port:0.0.0.0/0.0.0.0:0
   [junit4]   2> 380066 T1112 oasc.ZkTestServer$ZKServerMain.runFromConfig Starting server
   [junit4]   2> 380166 T1111 oasc.ZkTestServer.run start zk server on port:22062
   [junit4]   2> 380167 T1111 oascc.SolrZkClient.createZkCredentialsToAddAutomatically Using default ZkCredentialsProvider
   [junit4]   2> 380168 T1111 oascc.ConnectionManager.waitForConnected Waiting for client to connect to ZooKeeper
   [junit4]   2> 380195 T1119 oascc.ConnectionManager.process Watcher org.apache.solr.common.cloud.ConnectionManager@2f3ded81 name:ZooKeeperConnection Watcher:127.0.0.1:22062 got event WatchedEvent state:SyncConnected type:None path:null path:null type:None
   [junit4]   2> 380196 T1111 oascc.ConnectionManager.waitForConnected Client is connected to ZooKeeper
   [junit4]   2> 380196 T1111 oascc.SolrZkClient.createZkACLProvider Using default ZkACLProvider
   [junit4]   2> 380196 T1111 oascc.SolrZkClient.makePath makePath: /solr
   [junit4]   2> 380199 T1111 oascc.SolrZkClient.createZkCredentialsToAddAutomatically Using default ZkCredentialsProvider
   [junit4]   2> 380200 T1111 oascc.ConnectionManager.waitForConnected Waiting for client to connect to ZooKeeper
   [junit4]   2> 380201 T1122 oascc.ConnectionManager.process Watcher org.apache.solr.common.cloud.ConnectionManager@7337503e name:ZooKeeperConnection Watcher:127.0.0.1:22062/solr got event WatchedEvent state:SyncConnected type:None path:null path:null type:None
   [junit4]   2> 380201 T1111 oascc.ConnectionManager.waitForConnected Client is connected to ZooKeeper
   [junit4]   2> 380202 T1111 oascc.SolrZkClient.createZkACLProvider Using default ZkACLProvider
   [junit4]   2> 380202 T1111 oascc.SolrZkClient.makePath makePath: /collections/collection1
   [junit4]   2> 380205 T1111 oascc.SolrZkClient.makePath makePath: /collections/collection1/shards
   [junit4]   2> 380206 T1111 oascc.SolrZkClient.makePath makePath: /collections/control_collection
   [junit4]   2> 380207 T1111 oascc.SolrZkClient.makePath makePath: /collections/control_collection/shards
   [junit4]   2> 380209 T1111 oasc.AbstractZkTestCase.putConfig put /usr/home/jenkins/jenkins-slave/workspace/Lucene-Solr-Tests-5.x-Java7/solr/core/src/test-files/solr/collection1/conf/solrconfig-tlog.xml to /configs/conf1/solrconfig.xml
   [junit4]   2> 380210 T1111 oascc.SolrZkClient.makePath makePath: /configs/conf1/solrconfig.xml
   [junit4]   2> 380212 T1111 oasc.AbstractZkTestCase.putConfig put /usr/home/jenkins/jenkins-slave/workspace/Lucene-Solr-Tests-5.x-Java7/solr/core/src/test-files/solr/collection1/conf/schema.xml to /configs/conf1/schema.xml
   [junit4]   2> 380213 T1111 oascc.SolrZkClient.makePath makePath: /configs/conf1/schema.xml
   [junit4]   2> 380215 T1111 oasc.AbstractZkTestCase.putConfig put /usr/home/jenkins/jenkins-slave/workspace/Lucene-Solr-Tests-5.x-Java7/solr/core/src/test-files/solr/collection1/conf/solrconfig.snippet.randomindexconfig.xml to /configs/conf1/solrconfig.snippet.randomindexconfig.xml
   [junit4]   2> 380216 T1111 oascc.SolrZkClient.makePath makePath: /configs/conf1/solrconfig.snippet.randomindexconfig.xml
   [junit4]   2> 380218 T1111 oasc.AbstractZkTestCase.putConfig put /usr/home/jenkins/jenkins-slave/workspace/Lucene-Solr-Tests-5.x-Java7/solr/core/src/test-files/solr/collection1/conf/stopwords.txt to /configs/conf1/stopwords.txt
   [junit4]   2> 380218 T1111 oascc.SolrZkClient.makePath makePath: /configs/conf1/stopwords.txt
   [junit4]   2> 380220 T1111 oasc.AbstractZkTestCase.putConfig put /usr/home/jenkins/jenkins-slave/workspace/Lucene-Solr-Tests-5.x-Java7/solr/core/src/test-files/solr/collection1/conf/protwords.txt to /configs/conf1/protwords.txt
   [junit4]   2> 380221 T1111 oascc.SolrZkClient.makePath makePath: /configs/conf1/protwords.txt
   [junit4]   2> 380222 T1111 oasc.AbstractZkTestCase.putConfig put /usr/home/jenkins/jenkins-slave/workspace/Lucene-Solr-Tests-5.x-Java7/solr/core/src/test-files/solr/collection1/conf/currency.xml to /configs/conf1/currency.xml
   [junit4]   2> 380223 T1111 oascc.SolrZkClient.makePath makePath: /configs/conf1/currency.xml
   [junit4]   2> 380224 T1111 oasc.AbstractZkTestCase.putConfig put /usr/home/jenkins/jenkins-slave/workspace/Lucene-Solr-Tests-5.x-Java7/solr/core/src/test-files/solr/collection1/conf/enumsConfig.xml to /configs/conf1/enumsConfig.xml
   [junit4]   2> 380225 T1111 oascc.SolrZkClient.makePath makePath: /configs/conf1/enumsConfig.xml
   [junit4]   2> 380227 T1111 oasc.AbstractZkTestCase.putConfig put /usr/home/jenkins/jenkins-slave/workspace/Lucene-Solr-Tests-5.x-Java7/solr/core/src/test-files/solr/collection1/conf/open-exchange-rates.json to /configs/conf1/open-exchange-rates.json
   [junit4]   2> 380227 T1111 oascc.SolrZkClient.makePath makePath: /configs/conf1/open-exchange-rates.json
   [junit4]   2> 380229 T1111 oasc.AbstractZkTestCase.putConfig put /usr/home/jenkins/jenkins-slave/workspace/Lucene-Solr-Tests-5.x-Java7/solr/core/src/test-files/solr/collection1/conf/mapping-ISOLatin1Accent.txt to /configs/conf1/mapping-ISOLatin1Accent.txt
   [junit4]   2> 380230 T1111 oascc.SolrZkClient.makePath makePath: /configs/conf1/mapping-ISOLatin1Accent.txt
   [junit4]   2> 380231 T1111 oasc.AbstractZkTestCase.putConfig put /usr/home/jenkins/jenkins-slave/workspace/Lucene-Solr-Tests-5.x-Java7/solr/core/src/test-files/solr/collection1/conf/old_synonyms.txt to /configs/conf1/old_synonyms.txt
   [junit4]   2> 380232 T1111 oascc.SolrZkClient.makePath makePath: /configs/conf1/old_synonyms.txt
   [junit4]   2> 380234 T1111 oasc.AbstractZkTestCase.putConfig put /usr/home/jenkins/jenkins-slave/workspace/Lucene-Solr-Tests-5.x-Java7/solr/core/src/test-files/solr/collection1/conf/synonyms.txt to /configs/conf1/synonyms.txt
   [junit4]   2> 380234 T1111 oascc.SolrZkClient.makePath makePath: /configs/conf1/synonyms.txt
   [junit4]   2> 381843 T1111 oas.SolrTestCaseJ4.writeCoreProperties Writing core.properties file to /usr/home/jenkins/jenkins-slave/workspace/Lucene-Solr-Tests-5.x-Java7/solr/build/solr-core/test/J1/temp/solr.cloud.LeaderInitiatedRecoveryOnCommitTest 25E72E934121CB2B-001/control-001/cores/collection1
   [junit4]   2> 381848 T1111 oejs.Server.doStart jetty-8.1.10.v20130312
   [junit4]   2> 381852 T1111 oejs.AbstractConnector.doStart Started SocketConnector@127.0.0.1:22069
   [junit4]   2> 381853 T1111 oascse.JettySolrRunner$1.lifeCycleStarted Jetty properties: {coreRootDirectory=/usr/home/jenkins/jenkins-slave/workspace/Lucene-Solr-Tests-5.x-Java7/solr/build/solr-core/test/J1/temp/solr.cloud.LeaderInitiatedRecoveryOnCommitTest 25E72E934121CB2B-001/control-001/cores, hostContext=/pd/l, hostPort=22068, solr.data.dir=/usr/home/jenkins/jenkins-slave/workspace/Lucene-Solr-Tests-5.x-Java7/solr/build/solr-core/test/J1/temp/solr.cloud.LeaderInitiatedRecoveryOnCommitTest 25E72E934121CB2B-001/tempDir-001/control/data}
   [junit4]   2> 381853 T1111 oass.SolrDispatchFilter.init SolrDispatchFilter.init()sun.misc.Launcher$AppClassLoader@57bd06bf
   [junit4]   2> 381854 T1111 oasc.SolrResourceLoader.<init> new SolrResourceLoader for directory: '/usr/home/jenkins/jenkins-slave/workspace/Lucene-Solr-Tests-5.x-Java7/solr/build/solr-core/test/J1/temp/solr.cloud.LeaderInitiatedRecoveryOnCommitTest 25E72E934121CB2B-001/control-001/'
   [junit4]   2> 382072 T1111 oasc.SolrXmlConfig.fromFile Loading container configuration from /usr/home/jenkins/jenkins-slave/workspace/Lucene-Solr-Tests-5.x-Java7/solr/build/solr-core/test/J1/temp/solr.cloud.LeaderInitiatedRecoveryOnCommitTest 25E72E934121CB2B-001/control-001/solr.xml
   [junit4]   2> 382126 T1111 oasc.CorePropertiesLocator.<init> Config-defined core root directory: /usr/home/jenkins/jenkins-slave/workspace/Lucene-Solr-Tests-5.x-Java7/solr/build/solr-core/test/J1/temp/solr.cloud.LeaderInitiatedRecoveryOnCommitTest 25E72E934121CB2B-001/control-001/cores
   [junit4]   2> 382126 T1111 oasc.CoreContainer.<init> New CoreContainer 1645308729
   [junit4]   2> 382127 T1111 oasc.CoreContainer.load Loading cores into CoreContainer [instanceDir=/usr/home/jenkins/jenkins-slave/workspace/Lucene-Solr-Tests-5.x-Java7/solr/build/solr-core/test/J1/temp/solr.cloud.LeaderInitiatedRecoveryOnCommitTest 25E72E934121CB2B-001/control-001/]
   [junit4]   2> 382127 T1111 oasc.CoreContainer.load loading shared library: /usr/home/jenkins/jenkins-slave/workspace/Lucene-Solr-Tests-5.x-Java7/solr/build/solr-core/test/J1/temp/solr.cloud.LeaderInitiatedRecoveryOnCommitTest 25E72E934121CB2B-001/control-001/lib
   [junit4]   2> 382128 T1111 oasc.SolrResourceLoader.addToClassLoader WARN Can't find (or read) directory to add to classloader: lib (resolved as: /usr/home/jenkins/jenkins-slave/workspace/Lucene-Solr-Tests-5.x-Java7/solr/build/solr-core/test/J1/temp/solr.cloud.LeaderInitiatedRecoveryOnCommitTest 25E72E934121CB2B-001/control-001/lib).
   [junit4]   2> 382137 T1111 oashc.HttpShardHandlerFactory.getParameter Setting socketTimeout to: 90000
   [junit4]   2> 382137 T1111 oashc.HttpShardHandlerFactory.getParameter Setting urlScheme to: 
   [junit4]   2> 382137 T1111 oashc.HttpShardHandlerFactory.getParameter Setting connTimeout to: 15000
   [junit4]   2> 382137 T1111 oashc.HttpShardHandlerFactory.getParameter Setting maxConnectionsPerHost to: 20
   [junit4]   2> 382138 T1111 oashc.HttpShardHandlerFactory.getParameter Setting maxConnections to: 10000
   [junit4]   2> 382138 T1111 oashc.HttpShardHandlerFactory.getParameter Setting corePoolSize to: 0
   [junit4]   2> 382138 T1111 oashc.HttpShardHandlerFactory.getParameter Setting maximumPoolSize to: 2147483647
   [junit4]   2> 382138 T1111 oashc.HttpShardHandlerFactory.getParameter Setting maxThreadIdleTime to: 5
   [junit4]   2> 382138 T1111 oashc.HttpShardHandlerFactory.getParameter Setting sizeOfQueue to: -1
   [junit4]   2> 382139 T1111 oashc.HttpShardHandlerFactory.getParameter Setting fairnessPolicy to: false
   [junit4]   2> 382139 T1111 oashc.HttpShardHandlerFactory.getParameter Setting useRetries to: false
   [junit4]   2> 382154 T1111 oasu.UpdateShardHandler.<init> Creating UpdateShardHandler HTTP client with params: socketTimeout=340000&connTimeout=45000&retry=true
   [junit4]   2> 382154 T1111 oasl.LogWatcher.createWatcher SLF4J impl is org.slf4j.impl.Log4jLoggerFactory
   [junit4]   2> 382155 T1111 oasl.LogWatcher.newRegisteredLogWatcher Registering Log Listener [Log4j (org.slf4j.impl.Log4jLoggerFactory)]
   [junit4]   2> 382155 T1111 oasc.CoreContainer.load Node Name: 127.0.0.1
   [junit4]   2> 382155 T1111 oasc.ZkContainer.initZooKeeper Zookeeper client=127.0.0.1:22062/solr
   [junit4]   2> 382155 T1111 oasc.ZkController.checkChrootPath zkHost includes chroot
   [junit4]   2> 382155 T1111 oascc.SolrZkClient.createZkCredentialsToAddAutomatically Using default ZkCredentialsProvider
   [junit4]   2> 382156 T1111 oascc.ConnectionManager.waitForConnected Waiting for client to connect to ZooKeeper
   [junit4]   2> 382158 T1134 oascc.ConnectionManager.process Watcher org.apache.solr.common.cloud.ConnectionManager@62e48bd5 name:ZooKeeperConnection Watcher:127.0.0.1:22062 got event WatchedEvent state:SyncConnected type:None path:null path:null type:None
   [junit4]   2> 382159 T1111 oascc.ConnectionManager.waitForConnected Client is connected to ZooKeeper
   [junit4]   2> 382160 T1111 oascc.SolrZkClient.createZkACLProvider Using default ZkACLProvider
   [junit4]   2> 382162 T1111 oascc.ConnectionManager.waitForConnected Waiting for client to connect to ZooKeeper
   [junit4]   2> 382164 T1137 oascc.ConnectionManager.process Watcher org.apache.solr.common.cloud.ConnectionManager@3f1d425d name:ZooKeeperConnection Watcher:127.0.0.1:22062/solr got event WatchedEvent state:SyncConnected type:None path:null path:null type:None
   [junit4]   2> 382164 T1111 oascc.ConnectionManager.waitForConnected Client is connected to ZooKeeper
   [junit4]   2> 382166 T1111 oascc.SolrZkClient.makePath makePath: /overseer/queue
   [junit4]   2> 382168 T1111 oascc.SolrZkClient.makePath makePath: /overseer/collection-queue-work
   [junit4]   2> 382170 T1111 oascc.SolrZkClient.makePath makePath: /overseer/collection-map-running
   [junit4]   2> 382173 T1111 oascc.SolrZkClient.makePath makePath: /overseer/collection-map-completed
   [junit4]   2> 382175 T1111 oascc.SolrZkClient.makePath makePath: /overseer/collection-map-failure
   [junit4]   2> 382177 T1111 oascc.SolrZkClient.makePath makePath: /live_nodes
   [junit4]   2> 382179 T1111 oascc.SolrZkClient.makePath makePath: /aliases.json
   [junit4]   2> 382180 T1111 oascc.SolrZkClient.makePath makePath: /clusterstate.json
   [junit4]   2> 382181 T1111 oasc.ZkController.createEphemeralLiveNode Register node as live in ZooKeeper:/live_nodes/127.0.0.1:22068_pd%2Fl
   [junit4]   2> 382182 T1111 oascc.SolrZkClient.makePath makePath: /live_nodes/127.0.0.1:22068_pd%2Fl
   [junit4]   2> 382184 T1111 oascc.SolrZkClient.makePath makePath: /overseer_elect
   [junit4]   2> 382185 T1111 oascc.SolrZkClient.makePath makePath: /overseer_elect/election
   [junit4]   2> 382187 T1111 oasc.Overseer.close Overseer (id=null) closing
   [junit4]   2> 382188 T1111 oasc.OverseerElectionContext.runLeaderProcess I am going to be the leader 127.0.0.1:22068_pd%2Fl
   [junit4]   2> 382189 T1111 oascc.SolrZkClient.makePath makePath: /overseer_elect/leader
   [junit4]   2> 382190 T1111 oasc.Overseer.start Overseer (id=93599020707741699-127.0.0.1:22068_pd%2Fl-n_0000000000) starting
   [junit4]   2> 382192 T1111 oascc.SolrZkClient.makePath makePath: /overseer/queue-work
   [junit4]   2> 382198 T1111 oasc.OverseerAutoReplicaFailoverThread.<init> Starting OverseerAutoReplicaFailoverThread autoReplicaFailoverWorkLoopDelay=10000 autoReplicaFailoverWaitAfterExpiration=30000 autoReplicaFailoverBadNodeExpiration=60000
   [junit4]   2> 382198 T1139 oasc.OverseerCollectionProcessor.run Process current queue of collection creations
   [junit4]   2> 382198 T1111 oascc.ZkStateReader.createClusterStateWatchersAndUpdate Updating cluster state from ZooKeeper... 
   [junit4]   2> 382199 T1138 oasc.Overseer$ClusterStateUpdater.run Starting to work on the main queue
   [junit4]   2> 382203 T1111 oasc.CorePropertiesLocator.discover Looking for core definitions underneath /usr/home/jenkins/jenkins-slave/workspace/Lucene-Solr-Tests-5.x-Java7/solr/build/solr-core/test/J1/temp/solr.cloud.LeaderInitiatedRecoveryOnCommitTest 25E72E934121CB2B-001/control-001/cores
   [junit4]   2> 382206 T1111 oasc.CoreDescriptor.<init> CORE DESCRIPTOR: {config=solrconfig.xml, absoluteInstDir=/usr/home/jenkins/jenkins-slave/workspace/Lucene-Solr-Tests-5.x-Java7/solr/build/solr-core/test/J1/temp/solr.cloud.LeaderInitiatedRecoveryOnCommitTest 25E72E934121CB2B-001/control-001/cores/collection1/, dataDir=data/, loadOnStartup=true, shard=, collection=control_collection, instanceDir=/usr/home/jenkins/jenkins-slave/workspace/Lucene-Solr-Tests-5.x-Java7/solr/build/solr-core/test/J1/temp/solr.cloud.LeaderInitiatedRecoveryOnCommitTest 25E72E934121CB2B-001/control-001/cores/collection1, transient=false, schema=schema.xml, coreNodeName=, name=collection1}
   [junit4]   2> 382206 T1111 oasc.CorePropertiesLocator.discoverUnder Found core collection1 in /usr/home/jenkins/jenkins-slave/workspace/Lucene-Solr-Tests-5.x-Java7/solr/build/solr-core/test/J1/temp/solr.cloud.LeaderInitiatedRecoveryOnCommitTest 25E72E934121CB2B-001/control-001/cores/collection1/
   [junit4]   2> 382206 T1111 oasc.CorePropertiesLocator.discover Found 1 core definitions
   [junit4]   2> 382208 T1141 C:control_collection c:collection1 oasc.ZkController.publish publishing core=collection1 state=down collection=control_collection
   [junit4]   2> 382208 T1141 C:control_collection c:collection1 oasc.ZkController.publish numShards not found on descriptor - reading it from system property
   [junit4]   2> 382209 T1137 oasc.DistributedQueue$LatchWatcher.process NodeChildrenChanged fired on path /overseer/queue state SyncConnected
   [junit4]   2> 382209 T1141 C:control_collection c:collection1 oasc.ZkController.waitForCoreNodeName look for our core node name
   [junit4]   2> 382210 T1138 oasc.Overseer$ClusterStateUpdater.run processMessage: queueSize: 1, message = {
   [junit4]   2> 	  "state":"down",
   [junit4]   2> 	  "operation":"state",
   [junit4]   2> 	  "collection":"control_collection",
   [junit4]   2> 	  "base_url":"http://127.0.0.1:22068/pd/l",
   [junit4]   2> 	  "roles":null,
   [junit4]   2> 	  "core":"collection1",
   [junit4]   2> 	  "shard":null,
   [junit4]   2> 	  "node_name":"127.0.0.1:22068_pd%2Fl",
   [junit4]   2> 	  "numShards":"1"} current state version: 0
   [junit4]   2> 382211 T1138 oasco.ReplicaMutator.updateState Update state numShards=1 message={
   [junit4]   2> 	  "state":"down",
   [junit4]   2> 	  "operation":"state",
   [junit4]   2> 	  "collection":"control_collection",
   [junit4]   2> 	  "base_url":"http://127.0.0.1:22068/pd/l",
   [junit4]   2> 	  "roles":null,
   [junit4]   2> 	  "core":"collection1",
   [junit4]   2> 	  "shard":null,
   [junit4]   2> 	  "node_name":"127.0.0.1:22068_pd%2Fl",
   [junit4]   2> 	  "numShards":"1"}
   [junit4]   2> 382211 T1138 oasco.ClusterStateMutator.createCollection building a new cName: control_collection
   [junit4]   2> 382211 T1138 oasco.ReplicaMutator.updateState Assigning new node to shard shard=shard1
   [junit4]   2> 382212 T1137 oascc.ZkStateReader$2.process A cluster state change: WatchedEvent state:SyncConnected type:NodeDataChanged path:/clusterstate.json, has occurred - updating... (live nodes size: 1)
   [junit4]   2> 383210 T1141 C:control_collection c:collection1 oasc.ZkController.waitForShardId waiting to find shard id in clusterstate for collection1
   [junit4]   2> 383211 T1141 C:control_collection c:collection1 oasc.ZkController.createCollectionZkNode Check for collection zkNode:control_collection
   [junit4]   2> 383211 T1141 C:control_collection c:collection1 oasc.ZkController.createCollectionZkNode Collection zkNode exists
   [junit4]   2> 383212 T1141 C:control_collection c:collection1 oascc.ZkStateReader.readConfigName Load collection config from:/collections/control_collection
   [junit4]   2> 383212 T1141 C:control_collection c:collection1 oascc.ZkStateReader.readConfigName path=/collections/control_collection configName=conf1 specified config exists in ZooKeeper
   [junit4]   2> 383212 T1141 C:control_collection c:collection1 oasc.SolrResourceLoader.<init> new SolrResourceLoader for directory: '/usr/home/jenkins/jenkins-slave/workspace/Lucene-Solr-Tests-5.x-Java7/solr/build/solr-core/test/J1/temp/solr.cloud.LeaderInitiatedRecoveryOnCommitTest 25E72E934121CB2B-001/control-001/cores/collection1/'
   [junit4]   2> 383241 T1141 C:control_collection c:collection1 oasc.ZkController.watchZKConfDir watch zkdir /configs/conf1
   [junit4]   2> 383243 T1141 C:control_collection c:collection1 oasc.Config.<init> loaded config solrconfig.xml with version 0 
   [junit4]   2> 383251 T1141 C:control_collection c:collection1 oasc.SolrConfig.refreshRequestParams current version of requestparams : -1
   [junit4]   2> 383266 T1141 C:control_collection c:collection1 oasc.SolrConfig.<init> Using Lucene MatchVersion: 5.2.0
   [junit4]   2> 383311 T1141 C:control_collection c:collection1 oasc.SolrConfig.<init> Loaded SolrConfig: solrconfig.xml
   [junit4]   2> 383312 T1141 C:control_collection c:collection1 oass.IndexSchema.readSchema Reading Solr Schema from /configs/conf1/schema.xml
   [junit4]   2> 383326 T1141 C:control_collection c:collection1 oass.IndexSchema.readSchema [collection1] Schema name=test
   [junit4]   2> 383729 T1141 C:control_collection c:collection1 oass.OpenExchangeRatesOrgProvider.init Initialized with rates=open-exchange-rates.json, refreshInterval=1440.
   [junit4]   2> 383746 T1141 C:control_collection c:collection1 oass.IndexSchema.readSchema default search field in schema is text
   [junit4]   2> 383757 T1141 C:control_collection c:collection1 oass.IndexSchema.readSchema unique key field: id
   [junit4]   2> 383773 T1141 C:control_collection c:collection1 oass.FileExchangeRateProvider.reload Reloading exchange rates from file currency.xml
   [junit4]   2> 383782 T1141 C:control_collection c:collection1 oass.FileExchangeRateProvider.reload Reloading exchange rates from file currency.xml
   [junit4]   2> 383786 T1141 C:control_collection c:collection1 oass.OpenExchangeRatesOrgProvider.reload Reloading exchange rates from open-exchange-rates.json
   [junit4]   2> 383787 T1141 C:control_collection c:collection1 oass.OpenExchangeRatesOrgProvider$OpenExchangeRates.<init> WARN Unknown key IMPORTANT NOTE
   [junit4]   2> 383787 T1141 C:control_collection c:collection1 oass.OpenExchangeRatesOrgProvider$OpenExchangeRates.<init> WARN Expected key, got STRING
   [junit4]   2> 383787 T1141 C:control_collection c:collection1 oass.OpenExchangeRatesOrgProvider.reload Reloading exchange rates from open-exchange-rates.json
   [junit4]   2> 383788 T1141 C:control_collection c:collection1 oass.OpenExchangeRatesOrgProvider$OpenExchangeRates.<init> WARN Unknown key IMPORTANT NOTE
   [junit4]   2> 383788 T1141 C:control_collection c:collection1 oass.OpenExchangeRatesOrgProvider$OpenExchangeRates.<init> WARN Expected key, got STRING
   [junit4]   2> 383788 T1141 C:control_collection c:collection1 oasc.CoreContainer.create Creating SolrCore 'collection1' using configuration from collection control_collection
   [junit4]   2> 383789 T1141 C:control_collection c:collection1 oasc.SolrCore.initDirectoryFactory org.apache.solr.core.MockDirectoryFactory
   [junit4]   2> 383789 T1141 C:control_collection c:collection1 oasc.SolrCore.<init> [collection1] Opening new SolrCore at /usr/home/jenkins/jenkins-slave/workspace/Lucene-Solr-Tests-5.x-Java7/solr/build/solr-core/test/J1/temp/solr.cloud.LeaderInitiatedRecoveryOnCommitTest 25E72E934121CB2B-001/control-001/cores/collection1/, dataDir=/usr/home/jenkins/jenkins-slave/workspace/Lucene-Solr-Tests-5.x-Java7/solr/build/solr-core/test/J1/temp/solr.cloud.LeaderInitiatedRecoveryOnCommitTest 25E72E934121CB2B-001/control-001/cores/collection1/data/
   [junit4]   2> 383789 T1141 C:control_collection c:collection1 oasc.JmxMonitoredMap.<init> JMX monitoring is enabled. Adding Solr mbeans to JMX Server: com.sun.jmx.mbeanserver.JmxMBeanServer@6ad957a7
   [junit4]   2> 383790 T1141 C:control_collection c:collection1 oasc.CachingDirectoryFactory.get return new directory for /usr/home/jenkins/jenkins-slave/workspace/Lucene-Solr-Tests-5.x-Java7/solr/build/solr-core/test/J1/temp/solr.cloud.LeaderInitiatedRecoveryOnCommitTest 25E72E934121CB2B-001/control-001/cores/collection1/data
   [junit4]   2> 383791 T1141 C:control_collection c:collection1 oasc.SolrCore.getNewIndexDir New index directory detected: old=null new=/usr/home/jenkins/jenkins-slave/workspace/Lucene-Solr-Tests-5.x-Java7/solr/build/solr-core/test/J1/temp/solr.cloud.LeaderInitiatedRecoveryOnCommitTest 25E72E934121CB2B-001/control-001/cores/collection1/data/index/
   [junit4]   2> 383791 T1141 C:control_collection c:collection1 oasc.SolrCore.initIndex WARN [collection1] Solr index directory '/usr/home/jenkins/jenkins-slave/workspace/Lucene-Solr-Tests-5.x-Java7/solr/build/solr-core/test/J1/temp/solr.cloud.LeaderInitiatedRecoveryOnCommitTest 25E72E934121CB2B-001/control-001/cores/collection1/data/index' doesn't exist. Creating new index...
   [junit4]   2> 383791 T1141 C:control_collection c:collection1 oasc.CachingDirectoryFactory.get return new directory for /usr/home/jenkins/jenkins-slave/workspace/Lucene-Solr-Tests-5.x-Java7/solr/build/solr-core/test/J1/temp/solr.cloud.LeaderInitiatedRecoveryOnCommitTest 25E72E934121CB2B-001/control-001/cores/collection1/data/index
   [junit4]   2> 383792 T1141 C:control_collection c:collection1 oasu.RandomMergePolicy.<init> RandomMergePolicy wrapping class org.apache.lucene.index.LogByteSizeMergePolicy: [LogByteSizeMergePolicy: minMergeSize=1677721, mergeFactor=33, maxMergeSize=2147483648, maxMergeSizeForForcedMerge=9223372036854775807, calibrateSizeByDeletes=false, maxMergeDocs=2147483647, maxCFSSegmentSizeMB=8.796093022207999E12, noCFSRatio=1.0]
   [junit4]   2> 383793 T1141 C:control_collection c:collection1 oasc.SolrDeletionPolicy.onCommit SolrDeletionPolicy.onCommit: commits: num=1
   [junit4]   2> 		commit{dir=MockDirectoryWrapper(RAMDirectory@5f7ee311 lockFactory=org.apache.lucene.store.SingleInstanceLockFactory@36da212),segFN=segments_1,generation=1}
   [junit4]   2> 383793 T1141 C:control_collection c:collection1 oasc.SolrDeletionPolicy.updateCommits newest commit generation = 1
   [junit4]   2> 383798 T1141 C:control_collection c:collection1 oasup.UpdateRequestProcessorChain.init creating updateRequestProcessorChain "nodistrib"
   [junit4]   2> 383799 T1141 C:control_collection c:collection1 oasup.UpdateRequestProcessorChain.init creating updateRequestProcessorChain "dedupe"
   [junit4]   2> 383799 T1141 C:control_collection c:collection1 oasup.UpdateRequestProcessorChain.init inserting DistributedUpdateProcessorFactory into updateRequestProcessorChain "dedupe"
   [junit4]   2> 383799 T1141 C:control_collection c:collection1 oasup.UpdateRequestProcessorChain.init creating updateRequestProcessorChain "stored_sig"
   [junit4]   2> 383800 T1141 C:control_collection c:collection1 oasup.UpdateRequestProcessorChain.init inserting DistributedUpdateProcessorFactory into updateRequestProcessorChain "stored_sig"
   [junit4]   2> 383800 T1141 C:control_collection c:collection1 oasup.UpdateRequestProcessorChain.init creating updateRequestProcessorChain "distrib-dup-test-chain-explicit"
   [junit4]   2> 383800 T1141 C:control_collection c:collection1 oasup.UpdateRequestProcessorChain.init creating updateRequestProcessorChain "distrib-dup-test-chain-implicit"
   [junit4]   2> 383801 T1141 C:control_collection c:collection1 oasup.UpdateRequestProcessorChain.init inserting DistributedUpdateProcessorFactory into updateRequestProcessorChain "distrib-dup-test-chain-implicit"
   [junit4]   2> 383801 T1141 C:control_collection c:collection1 oasc.SolrCore.loadUpdateProcessorChains no updateRequestProcessorChain defined as default, creating implicit default
   [junit4]   2> 383817 T1141 C:control_collection c:collection1 oashl.XMLLoader.init xsltCacheLifetimeSeconds=60
   [junit4]   2> 383823 T1141 C:control_collection c:collection1 oashl.XMLLoader.init xsltCacheLifetimeSeconds=60
   [junit4]   2> 383825 T1141 C:control_collection c:collection1 oashl.XMLLoader.init xsltCacheLifetimeSeconds=60
   [junit4]   2> 383826 T1141 C:control_collection c:collection1 oashl.XMLLoader.init xsltCacheLifetimeSeconds=60
   [junit4]   2> 383830 T1141 C:control_collection c:collection1 oasc.RequestHandlers.initHandlersFromConfig Registered paths: /update,/admin/logging,standard,/replication,/update/json,/admin/system,/admin/threads,/schema,/admin/segments,/admin/plugins,/update/csv,/admin/mbeans,/admin/properties,/get,/config,/update/json/docs,/admin/ping,/admin/luke,/admin/file
   [junit4]   2> 383842 T1141 C:control_collection c:collection1 oasc.SolrCore.initStatsCache Using default statsCache cache: org.apache.solr.search.stats.LocalStatsCache
   [junit4]   2> 383844 T1141 C:control_collection c:collection1 oasu.UpdateHandler.<init> Using UpdateLog implementation: org.apache.solr.update.UpdateLog
   [junit4]   2> 383844 T1141 C:control_collection c:collection1 oasu.UpdateLog.init Initializing UpdateLog: dataDir= defaultSyncLevel=FLUSH numRecordsToKeep=100 maxNumLogsToKeep=10
   [junit4]   2> 383846 T1141 C:control_collection c:collection1 oasu.CommitTracker.<init> Hard AutoCommit: disabled
   [junit4]   2> 383846 T1141 C:control_collection c:collection1 oasu.CommitTracker.<init> Soft AutoCommit: disabled
   [junit4]   2> 383846 T1141 C:control_collection c:collection1 oasu.RandomMergePolicy.<init> RandomMergePolicy wrapping class org.apache.lucene.index.TieredMergePolicy: [TieredMergePolicy: maxMergeAtOnce=16, maxMergeAtOnceExplicit=25, maxMergedSegmentMB=75.1943359375, floorSegmentMB=1.021484375, forceMergeDeletesPctAllowed=10.720232696799917, segmentsPerTier=23.0, maxCFSSegmentSizeMB=8.796093022207999E12, noCFSRatio=0.8897883915405346
   [junit4]   2> 383847 T1141 C:control_collection c:collection1 oasc.SolrDeletionPolicy.onInit SolrDeletionPolicy.onInit: commits: num=1
   [junit4]   2> 		commit{dir=MockDirectoryWrapper(RAMDirectory@5f7ee311 lockFactory=org.apache.lucene.store.SingleInstanceLockFactory@36da212),segFN=segments_1,generation=1}
   [junit4]   2> 383847 T1141 C:control_collection c:collection1 oasc.SolrDeletionPolicy.updateCommits newest commit generation = 1
   [junit4]   2> 383848 T1141 C:control_collection c:collection1 oass.SolrIndexSearcher.<init> Opening Searcher@632703e[collection1] main
   [junit4]   2> 383848 T1141 C:control_collection c:collection1 oascc.ZkStateReader.readConfigName Load collection config from:/collections/control_collection
   [junit4]   2> 383849 T1141 C:control_collection c:collection1 oascc.ZkStateReader.readConfigName path=/collections/control_collection configName=conf1 specified config exists in ZooKeeper
   [junit4]   2> 383849 T1141 C:control_collection c:collection1 oasr.ManagedResourceStorage.newStorageIO Setting up ZooKeeper-based storage for the RestManager with znodeBase: /configs/conf1
   [junit4]   2> 383849 T1141 C:control_collection c:collection1 oasr.ManagedResourceStorage$ZooKeeperStorageIO.configure Configured ZooKeeperStorageIO with znodeBase: /configs/conf1
   [junit4]   2> 383850 T1141 C:control_collection c:collection1 oasr.RestManager.init Initializing RestManager with initArgs: {}
   [junit4]   2> 383850 T1141 C:control_collection c:collection1 oasr.ManagedResourceStorage.load Reading _rest_managed.json using ZooKeeperStorageIO:path=/configs/conf1
   [junit4]   2> 383850 T1141 C:control_collection c:collection1 oasr.ManagedResourceStorage$ZooKeeperStorageIO.openInputStream No data found for znode /configs/conf1/_rest_managed.json
   [junit4]   2> 383851 T1141 C:control_collection c:collection1 oasr.ManagedResourceStorage.load Loaded null at path _rest_managed.json using ZooKeeperStorageIO:path=/configs/conf1
   [junit4]   2> 383851 T1141 C:control_collection c:collection1 oasr.RestManager.init Initializing 0 registered ManagedResources
   [junit4]   2> 383851 T1141 C:control_collection c:collection1 oash.ReplicationHandler.inform Commits will be reserved for  10000
   [junit4]   2> 383852 T1141 C:control_collection c:collection1 oasc.CoreContainer.registerCore registering core: collection1
   [junit4]   2> 383852 T1142 C:control_collection c:collection1 oasc.SolrCore.registerSearcher [collection1] Registered new searcher Searcher@632703e[collection1] main{ExitableDirectoryReader(UninvertingDirectoryReader())}
   [junit4]   2> 383853 T1145 C:control_collection S:shard1 oasc.ZkController.register Register replica - core:collection1 address:http://127.0.0.1:22068/pd/l collection:control_collection shard:shard1
   [junit4]   2> 383853 T1111 oass.SolrDispatchFilter.init user.dir=/usr/home/jenkins/jenkins-slave/workspace/Lucene-Solr-Tests-5.x-Java7/solr/build/solr-core/test/J1
   [junit4]   2> 383854 T1111 oass.SolrDispatchFilter.init SolrDispatchFilter.init() done
   [junit4]   2> 383854 T1145 C:control_collection S:shard1 oascc.SolrZkClient.makePath makePath: /collections/control_collection/leader_elect/shard1/election
   [junit4]   2> 383857 T1111 oascc.SolrZkClient.createZkCredentialsToAddAutomatically Using default ZkCredentialsProvider
   [junit4]   2> 383858 T1145 C:control_collection S:shard1 oasc.ShardLeaderElectionContext.runLeaderProcess Running the leader process for shard shard1
   [junit4]   2> 383858 T1111 oascc.ConnectionManager.waitForConnected Waiting for client to connect to ZooKeeper
   [junit4]   2> 383859 T1137 oasc.DistributedQueue$LatchWatcher.process NodeChildrenChanged fired on path /overseer/queue state SyncConnected
   [junit4]   2> 383860 T1145 C:control_collection S:shard1 oasc.ShardLeaderElectionContext.waitForReplicasToComeUp Enough replicas found to continue.
   [junit4]   2> 383860 T1149 oascc.ConnectionManager.process Watcher org.apache.solr.common.cloud.ConnectionManager@298a5b60 name:ZooKeeperConnection Watcher:127.0.0.1:22062/solr got event WatchedEvent state:SyncConnected type:None path:null path:null type:None
   [junit4]   2> 383860 T1145 C:control_collection S:shard1 oasc.ShardLeaderElectionContext.runLeaderProcess I may be the new leader - try and sync
   [junit4]   2> 383860 T1138 oasc.Overseer$ClusterStateUpdater.run processMessage: queueSize: 1, message = {
   [junit4]   2> 	  "operation":"leader",
   [junit4]   2> 	  "shard":"shard1",
   [junit4]   2> 	  "collection":"control_collection"} current state version: 1
   [junit4]   2> ASYNC  NEW_CORE C274 name=collection1 org.apache.solr.core.SolrCore@293a7fdb url=http://127.0.0.1:22068/pd/l/collection1 node=127.0.0.1:22068_pd%2Fl C274_STATE=coll:control_collection core:collection1 props:{state=down, base_url=http://127.0.0.1:22068/pd/l, core=collection1, node_name=127.0.0.1:22068_pd%2Fl}
   [junit4]   2> 383860 T1145 C:control_collection S:shard1 C274 P22068 oasc.SyncStrategy.sync Sync replicas to http://127.0.0.1:22068/pd/l/collection1/
   [junit4]   2> 383860 T1111 oascc.ConnectionManager.waitForConnected Client is connected to ZooKeeper
   [junit4]   2> 383861 T1145 C:control_collection S:shard1 C274 P22068 oasc.SyncStrategy.syncReplicas Sync Success - now sync replicas to me
   [junit4]   2> 383861 T1145 C:control_collection S:shard1 C274 P22068 oasc.SyncStrategy.syncToMe http://127.0.0.1:22068/pd/l/collection1/ has no replicas
   [junit4]   2> 383861 T1111 oascc.SolrZkClient.createZkACLProvider Using default ZkACLProvider
   [junit4]   2> 383861 T1145 C:control_collection S:shard1 oasc.ShardLeaderElectionContext.runLeaderProcess I am the new leader: http://127.0.0.1:22068/pd/l/collection1/ shard1
   [junit4]   2> 383862 T1137 oascc.ZkStateReader$2.process A cluster state change: WatchedEvent state:SyncConnected type:NodeDataChanged path:/clusterstate.json, has occurred - updating... (live nodes size: 1)
   [junit4]   2> 383861 T1111 oascc.ZkStateReader.createClusterStateWatchersAndUpdate Updating cluster state from ZooKeeper... 
   [junit4]   2> 383862 T1145 C:control_collection S:shard1 oascc.SolrZkClient.makePath makePath: /collections/control_collection/leaders/shard1
   [junit4]   2> 383865 T1111 oasc.ChaosMonkey.monkeyLog monkey: init - expire sessions:false cause connection loss:false
   [junit4]   2> 383866 T1137 oasc.DistributedQueue$LatchWatcher.process NodeChildrenChanged fired on path /overseer/queue state SyncConnected
   [junit4]   2> 383866 T1138 oasc.Overseer$ClusterStateUpdater.run processMessage: queueSize: 1, message = {
   [junit4]   2> 	  "operation":"leader",
   [junit4]   2> 	  "shard":"shard1",
   [junit4]   2> 	  "collection":"control_collection",
   [junit4]   2> 	  "base_url":"http://127.0.0.1:22068/pd/l",
   [junit4]   2> 	  "core":"collection1",
   [junit4]   2> 	  "state":"active"} current state version: 2
   [junit4]   2> 383969 T1137 oascc.ZkStateReader$2.process A cluster state change: WatchedEvent state:SyncConnected type:NodeDataChanged path:/clusterstate.json, has occurred - updating... (live nodes size: 1)
   [junit4]   2> 383969 T1149 oascc.ZkStateReader$2.process A cluster state change: WatchedEvent state:SyncConnected type:NodeDataChanged path:/clusterstate.json, has occurred - updating... (live nodes size: 1)
   [junit4]   2> 384018 T1145 C:control_collection S:shard1 oasc.ZkController.register We are http://127.0.0.1:22068/pd/l/collection1/ and leader is http://127.0.0.1:22068/pd/l/collection1/
   [junit4]   2> 384019 T1145 C:control_collection S:shard1 oasc.ZkController.register No LogReplay needed for core=collection1 baseURL=http://127.0.0.1:22068/pd/l
   [junit4]   2> 384019 T1145 C:control_collection S:shard1 oasc.ZkController.checkRecovery I am the leader, no recovery necessary
   [junit4]   2> 384019 T1145 C:control_collection S:shard1 c:collection1 oasc.ZkController.publish publishing core=collection1 state=active collection=control_collection
   [junit4]   2> 384019 T1145 C:control_collection S:shard1 c:collection1 oasc.ZkController.publish numShards not found on descriptor - reading it from system property
   [junit4]   2> 384021 T1137 oasc.DistributedQueue$LatchWatcher.process NodeChildrenChanged fired on path /overseer/queue state SyncConnected
   [junit4]   2> 384022 T1138 oasc.Overseer$ClusterStateUpdater.run processMessage: queueSize: 1, message = {
   [junit4]   2> 	  "state":"active",
   [junit4]   2> 	  "operation":"state",
   [junit4]   2> 	  "collection":"control_collection",
   [junit4]   2> 	  "base_url":"http://127.0.0.1:22068/pd/l",
   [junit4]   2> 	  "core_node_name":"core_node1",
   [junit4]   2> 	  "roles":null,
   [junit4]   2> 	  "core":"collection1",
   [junit4]   2> 	  "shard":"shard1",
   [junit4]   2> 	  "node_name":"127.0.0.1:22068_pd%2Fl",
   [junit4]   2> 	  "numShards":"1"} current state version: 3
   [junit4]   2> 384022 T1138 oasco.ReplicaMutator.updateState Update state numShards=1 message={
   [junit4]   2> 	  "state":"active",
   [junit4]   2> 	  "operation":"state",
   [junit4]   2> 	  "collection":"control_collection",
   [junit4]   2> 	  "base_url":"http://127.0.0.1:22068/pd/l",
   [junit4]   2> 	  "core_node_name":"core_node1",
   [junit4]   2> 	  "roles":null,
   [junit4]   2> 	  "core":"collection1",
   [junit4]   2> 	  "shard":"shard1",
   [junit4]   2> 	  "node_name":"127.0.0.1:22068_pd%2Fl",
   [junit4]   2> 	  "numShards":"1"}
   [junit4]   2> 384125 T1137 oascc.ZkStateReader$2.process A cluster state change: WatchedEvent state:SyncConnected type:NodeDataChanged path:/clusterstate.json, has occurred - updating... (live nodes size: 1)
   [junit4]   2> 384125 T1149 oascc.ZkStateReader$2.process A cluster state change: WatchedEvent state:SyncConnected type:NodeDataChanged path:/clusterstate.json, has occurred - updating... (live nodes size: 1)
   [junit4]   2> 385499 T1111 oas.SolrTestCaseJ4.writeCoreProperties Writing core.properties file to /usr/home/jenkins/jenkins-slave/workspace/Lucene-Solr-Tests-5.x-Java7/solr/build/solr-core/test/J1/temp/solr.cloud.LeaderInitiatedRecoveryOnCommitTest 25E72E934121CB2B-001/shard-1-001/cores/collection1
   [junit4]   2> 385504 T1111 oasc.AbstractFullDistribZkTestBase.createJettys create jetty 1 in directory /usr/home/jenkins/jenkins-slave/workspace/Lucene-Solr-Tests-5.x-Java7/solr/build/solr-core/test/J1/temp/solr.cloud.LeaderInitiatedRecoveryOnCommitTest 25E72E934121CB2B-001/shard-1-001
   [junit4]   2> 385505 T1111 oejs.Server.doStart jetty-8.1.10.v20130312
   [junit4]   2> 385509 T1111 oejs.AbstractConnector.doStart Started SocketConnector@127.0.0.1:22087
   [junit4]   2> 385510 T1111 oascse.JettySolrRunner$1.lifeCycleStarted Jetty properties: {hostPort=22086, coreRootDirectory=/usr/home/jenkins/jenkins-slave/workspace/Lucene-Solr-Tests-5.x-Java7/solr/build/solr-core/test/J1/temp/solr.cloud.LeaderInitiatedRecoveryOnCommitTest 25E72E934121CB2B-001/shard-1-001/cores, solrconfig=solrconfig.xml, hostContext=/pd/l, solr.data.dir=/usr/home/jenkins/jenkins-slave/workspace/Lucene-Solr-Tests-5.x-Java7/solr/build/solr-core/test/J1/temp/solr.cloud.LeaderInitiatedRecoveryOnCommitTest 25E72E934121CB2B-001/tempDir-001/jetty1}
   [junit4]   2> 385510 T1111 oass.SolrDispatchFilter.init SolrDispatchFilter.init()sun.misc.Launcher$AppClassLoader@57bd06bf
   [junit4]   2> 385511 T1111 oasc.SolrResourceLoader.<init> new SolrResourceLoader for directory: '/usr/home/jenkins/jenkins-slave/workspace/Lucene-Solr-Tests-5.x-Java7/solr/build/solr-core/test/J1/temp/solr.cloud.LeaderInitiatedRecoveryOnCommitTest 25E72E934121CB2B-001/shard-1-001/'
   [junit4]   2> 385557 T1111 oasc.SolrXmlConfig.fromFile Loading container configuration from /usr/home/jenkins/jenkins-slave/workspace/Lucene-Solr-Tests-5.x-Java7/solr/build/solr-core/test/J1/temp/solr.cloud.LeaderInitiatedRecoveryOnCommitTest 25E72E934121CB2B-001/shard-1-001/solr.xml
   [junit4]   2> 385618 T1111 oasc.CorePropertiesLocator.<init> Config-defined core root directory: /usr/home/jenkins/jenkins-slave/workspace/Lucene-Solr-Tests-5.x-Java7/solr/build/solr-core/test/J1/temp/solr.cloud.LeaderInitiatedRecoveryOnCommitTest 25E72E934121CB2B-001/shard-1-001/cores
   [junit4]   2> 385619 T1111 oasc.CoreContainer.<init> New CoreContainer 1755072217
   [junit4]   2> 385619 T1111 oasc.CoreContainer.load Loading cores into CoreContainer [instanceDir=/usr/home/jenkins/jenkins-slave/workspace/Lucene-Solr-Tests-5.x-Java7/solr/build/solr-core/test/J1/temp/solr.cloud.LeaderInitiatedRecoveryOnCommitTest 25E72E934121CB2B-001/shard-1-001/]
   [junit4]   2> 385619 T1111 oasc.CoreContainer.load loading shared library: /usr/home/jenkins/jenkins-slave/workspace/Lucene-Solr-Tests-5.x-Java7/solr/build/solr-core/test/J1/temp/solr.cloud.LeaderInitiatedRecoveryOnCommitTest 25E72E934121CB2B-001/shard-1-001/lib
   [junit4]   2> 385620 T1111 oasc.SolrResourceLoader.addToClassLoader WARN Can't find (or read) directory to add to classloader: lib (resolved as: /usr/home/jenkins/jenkins-slave/workspace/Lucene-Solr-Tests-5.x-Java7/solr/build/solr-core/test/J1/temp/solr.cloud.LeaderInitiatedRecoveryOnCommitTest 25E72E934121CB2B-001/shard-1-001/lib).
   [junit4]   2> 385639 T1111 oashc.HttpShardHandlerFactory.getParameter Setting socketTimeout to: 90000
   [junit4]   2> 385639 T1111 oashc.HttpShardHandlerFactory.getParameter Setting urlScheme to: 
   [junit4]   2> 385639 T1111 oashc.HttpShardHandlerFactory.getParameter Setting connTimeout to: 15000
   [junit4]   2> 385640 T1111 oashc.HttpShardHandlerFactory.getParameter Setting maxConnectionsPerHost to: 20
   [junit4]   2> 385640 T1111 oashc.HttpShardHandlerFactory.getParameter Setting maxConnections to: 10000
   [junit4]   2> 385641 T1111 oashc.HttpShardHandlerFactory.getParameter Setting corePoolSize to: 0
   [junit4]   2> 385641 T1111 oashc.HttpShardHandlerFactory.getParameter Setting maximumPoolSize to: 2147483647
   [junit4]   2> 385642 T1111 oashc.HttpShardHandlerFactory.getParameter Setting maxThreadIdleTime to: 5
   [junit4]   2> 385642 T1111 oashc.HttpShardHandlerFactory.getParameter Setting sizeOfQueue to: -1
   [junit4]   2> 385642 T1111 oashc.HttpShardHandlerFactory.getParameter Setting fairnessPolicy to: false
   [junit4]   2> 385643 T1111 oashc.HttpShardHandlerFactory.getParameter Setting useRetries to: false
   [junit4]   2> 385650 T1111 oasu.UpdateShardHandler.<init> Creating UpdateShardHandler HTTP client with params: socketTimeout=340000&connTimeout=45000&retry=true
   [junit4]   2> 385651 T1111 oasl.LogWatcher.createWatcher SLF4J impl is org.slf4j.impl.Log4jLoggerFactory
   [junit4]   2> 385651 T1111 oasl.LogWatcher.newRegisteredLogWatcher Registering Log Listener [Log4j (org.slf4j.impl.Log4jLoggerFactory)]
   [junit4]   2> 385652 T1111 oasc.CoreContainer.load Node Name: 127.0.0.1
   [junit4]   2> 385652 T1111 oasc.ZkContainer.initZooKeeper Zookeeper client=127.0.0.1:22062/solr
   [junit4]   2> 385652 T1111 oasc.ZkController.checkChrootPath zkHost includes chroot
   [junit4]   2> 385653 T1111 oascc.SolrZkClient.createZkCredentialsToAddAutomatically Using default ZkCredentialsProvider
   [junit4]   2> 385654 T1111 oascc.ConnectionManager.waitForConnected Waiting for client to connect to ZooKeeper
   [junit4]   2> 385655 T1161 oascc.ConnectionManager.process Watcher org.apache.solr.common.cloud.ConnectionManager@78134d4c name:ZooKeeperConnection Watcher:127.0.0.1:22062 got event WatchedEvent state:SyncConnected type:None path:null path:null type:None
   [junit4]   2> 385656 T1111 oascc.ConnectionManager.waitForConnected Client is connected to ZooKeeper
   [junit4]   2> 385657 T1111 oascc.SolrZkClient.createZkACLProvider Using default ZkACLProvider
   [junit4]   2> 385660 T1111 oascc.ConnectionManager.waitForConnected Waiting for client to connect to ZooKeeper
   [junit4]   2> 385662 T1164 oascc.ConnectionManager.process Watcher org.apache.solr.common.cloud.ConnectionManager@2f6887b3 name:ZooKeeperConnection Watcher:127.0.0.1:22062/solr got event WatchedEvent state:SyncConnected type:None path:null path:null type:None
   [junit4]   2> 385662 T1111 oascc.ConnectionManager.waitForConnected Client is connected to ZooKeeper
   [junit4]   2> 385667 T1111 oascc.ZkStateReader.createClusterStateWatchersAndUpdate Updating cluster state from ZooKeeper... 
   [junit4]   2> 386671 T1111 oasc.ZkController.createEphemeralLiveNode Register node as live in ZooKeeper:/live_nodes/127.0.0.1:22086_pd%2Fl
   [junit4]   2> 386672 T1111 oascc.SolrZkClient.makePath makePath: /live_nodes/127.0.0.1:22086_pd%2Fl
   [junit4]   2> 386675 T1111 oasc.Overseer.close Overseer (id=null) closing
   [junit4]   2> 386677 T1111 oasc.CorePropertiesLocator.discover Looking for core definitions underneath /usr/home/jenkins/jenkins-slave/workspace/Lucene-Solr-Tests-5.x-Java7/solr/build/solr-core/test/J1/temp/solr.cloud.LeaderInitiatedRecoveryOnCommitTest 25E72E934121CB2B-001/shard-1-001/cores
   [junit4]   2> 386681 T1111 oasc.CoreDescriptor.<init> CORE DESCRIPTOR: {loadOnStartup=true, coreNodeName=, name=collection1, instanceDir=/usr/home/jenkins/jenkins-slave/workspace/Lucene-Solr-Tests-5.x-Java7/solr/build/solr-core/test/J1/temp/solr.cloud.LeaderInitiatedRecoveryOnCommitTest 25E72E934121CB2B-001/shard-1-001/cores/collection1, absoluteInstDir=/usr/home/jenkins/jenkins-slave/workspace/Lucene-Solr-Tests-5.x-Java7/solr/build/solr-core/test/J1/temp/solr.cloud.LeaderInitiatedRecoveryOnCommitTest 25E72E934121CB2B-001/shard-1-001/cores/collection1/, transient=false, shard=, dataDir=data/, collection=collection1, config=solrconfig.xml, schema=schema.xml}
   [junit4]   2> 386681 T1111 oasc.CorePropertiesLocator.discoverUnder Found core collection1 in /usr/home/jenkins/jenkins-slave/workspace/Lucene-Solr-Tests-5.x-Java7/solr/build/solr-core/test/J1/temp/solr.cloud.LeaderInitiatedRecoveryOnCommitTest 25E72E934121CB2B-001/shard-1-001/cores/collection1/
   [junit4]   2> 386682 T1111 oasc.CorePropertiesLocator.discover Found 1 core definitions
   [junit4]   2> 386683 T1165 C:collection1 c:collection1 oasc.ZkController.publish publishing core=collection1 state=down collection=collection1
   [junit4]   2> 386684 T1165 C:collection1 c:collection1 oasc.ZkController.publish numShards not found on descriptor - reading it from system property
   [junit4]   2> 386685 T1165 C:collection1 c:collection1 oasc.ZkController.waitForCoreNodeName look for our core node name
   [junit4]   2> 386685 T1137 oasc.DistributedQueue$LatchWatcher.process NodeChildrenChanged fired on path /overseer/queue state SyncConnected
   [junit4]   2> 386686 T1138 oasc.Overseer$ClusterStateUpdater.run processMessage: queueSize: 1, message = {
   [junit4]   2> 	  "state":"down",
   [junit4]   2> 	  "operation":"state",
   [junit4]   2> 	  "collection":"collection1",
   [junit4]   2> 	  "base_url":"http://127.0.0.1:22086/pd/l",
   [junit4]   2> 	  "roles":null,
   [junit4]   2> 	  "core":"collection1",
   [junit4]   2> 	  "shard":null,
   [junit4]   2> 	  "node_name":"127.0.0.1:22086_pd%2Fl",
   [junit4]   2> 	  "numShards":"1"} current state version: 4
   [junit4]   2> 386686 T1138 oasco.ReplicaMutator.updateState Update state numShards=1 message={
   [junit4]   2> 	  "state":"down",
   [junit4]   2> 	  "operation":"state",
   [junit4]   2> 	  "collection":"collection1",
   [junit4]   2> 	  "base_url":"http://127.0.0.1:22086/pd/l",
   [junit4]   2> 	  "roles":null,
   [junit4]   2> 	  "core":"collection1",
   [junit4]   2> 	  "shard":null,
   [junit4]   2> 	  "node_name":"127.0.0.1:22086_pd%2Fl",
   [junit4]   2> 	  "numShards":"1"}
   [junit4]   2> 386686 T1138 oasco.ClusterStateMutator.createCollection building a new cName: collection1
   [junit4]   2> 386687 T1138 oasco.ReplicaMutator.updateState Assigning new node to shard shard=shard1
   [junit4]   2> 386688 T1164 oascc.ZkStateReader$2.process A cluster state change: WatchedEvent state:SyncConnected type:NodeDataChanged path:/clusterstate.json, has occurred - updating... (live nodes size: 2)
   [junit4]   2> 386688 T1149 oascc.ZkStateReader$2.process A cluster state change: WatchedEvent state:SyncConnected type:NodeDataChanged path:/clusterstate.json, has occurred - updating... (live nodes size: 2)
   [junit4]   2> 386688 T1137 oascc.ZkStateReader$2.process A cluster state change: WatchedEvent state:SyncConnected type:NodeDataChanged path:/clusterstate.json, has occurred - updating... (live nodes size: 2)
   [junit4]   2> 387685 T1165 C:collection1 c:collection1 oasc.ZkController.waitForShardId waiting to find shard id in clusterstate for collection1
   [junit4]   2> 387686 T1165 C:collection1 c:collection1 oasc.ZkController.createCollectionZkNode Check for collection zkNode:collection1
   [junit4]   2> 387686 T1165 C:collection1 c:collection1 oasc.ZkController.createCollectionZkNode Collection zkNode exists
   [junit4]   2> 387687 T1165 C:collection1 c:collection1 oascc.ZkStateReader.readConfigName Load collection config from:/collections/collection1
   [junit4]   2> 387687 T1165 C:collection1 c:collection1 oascc.ZkStateReader.readConfigName path=/collections/collection1 configName=conf1 specified config exists in ZooKeeper
   [junit4]   2> 387688 T1165 C:collection1 c:collection1 oasc.SolrResourceLoader.<init> new SolrResourceLoader for directory: '/usr/home/jenkins/jenkins-slave/workspace/Lucene-Solr-Tests-5.x-Java7/solr/build/solr-core/test/J1/temp/solr.cloud.LeaderInitiatedRecoveryOnCommitTest 25E72E934121CB2B-001/shard-1-001/cores/collection1/'
   [junit4]   2> 387705 T1165 C:collection1 c:collection1 oasc.ZkController.watchZKConfDir watch zkdir /configs/conf1
   [junit4]   2> 387707 T1165 C:collection1 c:collection1 oasc.Config.<init> loaded config solrconfig.xml with version 0 
   [junit4]   2> 387719 T1165 C:collection1 c:collection1 oasc.SolrConfig.refreshRequestParams current version of requestparams : -1
   [junit4]   2> 387745 T1165 C:collection1 c:collection1 oasc.SolrConfig.<init> Using Lucene MatchVersion: 5.2.0
   [junit4]   2> 387798 T1165 C:collection1 c:collection1 oasc.SolrConfig.<init> Loaded SolrConfig: solrconfig.xml
   [junit4]   2> 387799 T1165 C:collection1 c:collection1 oass.IndexSchema.readSchema Reading Solr Schema from /configs/conf1/schema.xml
   [junit4]   2> 387819 T1165 C:collection1 c:collection1 oass.IndexSchema.readSchema [collection1] Schema name=test
   [junit4]   2> 388122 T1165 C:collection1 c:collection1 oass.OpenExchangeRatesOrgProvider.init Initialized with rates=open-exchange-rates.json, refreshInterval=1440.
   [junit4]   2> 388140 T1165 C:collection1 c:collection1 oass.IndexSchema.readSchema default search field in schema is text
   [junit4]   2> 388142 T1165 C:collection1 c:collection1 oass.IndexSchema.readSchema unique key field: id
   [junit4]   2> 388151 T1165 C:collection1 c:collection1 oass.FileExchangeRateProvider.reload Reloading exchange rates from file currency.xml
   [junit4]   2> 388154 T1165 C:collection1 c:collection1 oass.FileExchangeRateProvider.reload Reloading exchange rates from file currency.xml
   [junit4]   2> 388157 T1165 C:collection1 c:collection1 oass.OpenExchangeRatesOrgProvider.reload Reloading exchange rates from open-exchange-rates.json
   [junit4]   2> 388158 T1165 C:collection1 c:collection1 oass.OpenExchangeRatesOrgProvider$OpenExchangeRates.<init> WARN Unknown key IMPORTANT NOTE
   [junit4]   2> 388158 T1165 C:collection1 c:collection1 oass.OpenExchangeRatesOrgProvider$OpenExchangeRates.<init> WARN Expected key, got STRING
   [junit4]   2> 388158 T1165 C:collection1 c:collection1 oass.OpenExchangeRatesOrgProvider.reload Reloading exchange rates from open-exchange-rates.json
   [junit4]   2> 388159 T1165 C:collection1 c:collection1 oass.OpenExchangeRatesOrgProvider$OpenExchangeRates.<init> WARN Unknown key IMPORTANT NOTE
   [junit4]   2> 388159 T1165 C:collection1 c:collection1 oass.OpenExchangeRatesOrgProvider$OpenExchangeRates.<init> WARN Expected key, got STRING
   [junit4]   2> 388159 T1165 C:collection1 c:collection1 oasc.CoreContainer.create Creating SolrCore 'collection1' using configuration from collection collection1
   [junit4]   2> 388159 T1165 C:collection1 c:collection1 oasc.SolrCore.initDirectoryFactory org.apache.solr.core.MockDirectoryFactory
   [junit4]   2> 388159 T1165 C:collection1 c:collection1 oasc.SolrCore.<init> [collection1] Opening new SolrCore at /usr/home/jenkins/jenkins-slave/workspace/Lucene-Solr-Tests-5.x-Java7/solr/build/solr-core/test/J1/temp/solr.cloud.LeaderInitiatedRecoveryOnCommitTest 25E72E934121CB2B-001/shard-1-001/cores/collection1/, dataDir=/usr/home/jenkins/jenkins-slave/workspace/Lucene-Solr-Tests-5.x-Java7/solr/build/solr-core/test/J1/temp/solr.cloud.LeaderInitiatedRecoveryOnCommitTest 25E72E934121CB2B-001/shard-1-001/cores/collection1/data/
   [junit4]   2> 388160 T1165 C:collection1 c:collection1 oasc.JmxMonitoredMap.<init> JMX monitoring is enabled. Adding Solr mbeans to JMX Server: com.sun.jmx.mbeanserver.JmxMBeanServer@6ad957a7
   [junit4]   2> 388160 T1165 C:collection1 c:collection1 oasc.CachingDirectoryFactory.get return new directory for /usr/home/jenkins/jenkins-slave/workspace/Lucene-Solr-Tests-5.x-Java7/solr/build/solr-core/test/J1/temp/solr.cloud.LeaderInitiatedRecoveryOnCommitTest 25E72E934121CB2B-001/shard-1-001/cores/collection1/data
   [junit4]   2> 388161 T1165 C:collection1 c:collection1 oasc.SolrCore.getNewIndexDir New index directory detected: old=null new=/usr/home/jenkins/jenkins-slave/workspace/Lucene-Solr-Tests-5.x-Java7/solr/build/solr-core/test/J1/temp/solr.cloud.LeaderInitiatedRecoveryOnCommitTest 25E72E934121CB2B-001/shard-1-001/cores/collection1/data/index/
   [junit4]   2> 388161 T1165 C:collection1 c:collection1 oasc.SolrCore.initIndex WARN [collection1] Solr index directory '/usr/home/jenkins/jenkins-slave/workspace/Lucene-Solr-Tests-5.x-Java7/solr/build/solr-core/test/J1/temp/solr.cloud.LeaderInitiatedRecoveryOnCommitTest 25E72E934121CB2B-001/shard-1-001/cores/collection1/data/index' doesn't exist. Creating new index...
   [junit4]   2> 388161 T1165 C:collection1 c:collection1 oasc.CachingDirectoryFactory.get return new directory for /usr/home/jenkins/jenkins-slave/workspace/Lucene-Solr-Tests-5.x-Java7/solr/build/solr-core/test/J1/temp/solr.cloud.LeaderInitiatedRecoveryOnCommitTest 25E72E934121CB2B-001/shard-1-001/cores/collection1/data/index
   [junit4]   2> 388161 T1165 C:collection1 c:collection1 oasu.RandomMergePolicy.<init> RandomMergePolicy wrapping class org.apache.lucene.index.LogByteSizeMergePolicy: [LogByteSizeMergePolicy: minMergeSize=1677721, mergeFactor=33, maxMergeSize=2147483648, maxMergeSizeForForcedMerge=9223372036854775807, calibrateSizeByDeletes=false, maxMergeDocs=2147483647, maxCFSSegmentSizeMB=8.796093022207999E12, noCFSRatio=1.0]
   [junit4]   2> 388162 T1165 C:collection1 c:collection1 oasc.SolrDeletionPolicy.onCommit SolrDeletionPolicy.onCommit: commits: num=1
   [junit4]   2> 		commit{dir=MockDirectoryWrapper(RAMDirectory@542169c0 lockFactory=org.apache.lucene.store.SingleInstanceLockFactory@5da5e766),segFN=segments_1,generation=1}
   [junit4]   2> 388162 T1165 C:collection1 c:collection1 oasc.SolrDeletionPolicy.updateCommits newest commit generation = 1
   [junit4]   2> 388167 T1165 C:collection1 c:collection1 oasup.UpdateRequestProcessorChain.init cr

[...truncated too long message...]

934121CB2B-001/tempDir-001/shard2/cores/collection1/data;done=false>>]
   [junit4]   2> 2195371 T6981 oasc.CachingDirectoryFactory.close Closing directory: /usr/home/jenkins/jenkins-slave/workspace/Lucene-Solr-Tests-5.x-Java7/solr/build/solr-core/test/J3/temp/solr.handler.component.DistributedMLTComponentTest 25E72E934121CB2B-001/tempDir-001/shard2/cores/collection1/data
   [junit4]   2> 2195372 T6981 oasc.CachingDirectoryFactory.closeCacheValue looking to close /usr/home/jenkins/jenkins-slave/workspace/Lucene-Solr-Tests-5.x-Java7/solr/build/solr-core/test/J3/temp/solr.handler.component.DistributedMLTComponentTest 25E72E934121CB2B-001/tempDir-001/shard2/cores/collection1/data/index [CachedDir<<refCount=0;path=/usr/home/jenkins/jenkins-slave/workspace/Lucene-Solr-Tests-5.x-Java7/solr/build/solr-core/test/J3/temp/solr.handler.component.DistributedMLTComponentTest 25E72E934121CB2B-001/tempDir-001/shard2/cores/collection1/data/index;done=false>>]
   [junit4]   2> 2195372 T6981 oasc.CachingDirectoryFactory.close Closing directory: /usr/home/jenkins/jenkins-slave/workspace/Lucene-Solr-Tests-5.x-Java7/solr/build/solr-core/test/J3/temp/solr.handler.component.DistributedMLTComponentTest 25E72E934121CB2B-001/tempDir-001/shard2/cores/collection1/data/index
   [junit4]   2> 2195373 T6981 oejsh.ContextHandler.doStop stopped o.e.j.s.ServletContextHandler{/,null}
   [junit4]   2> NOTE: reproduce with: ant test  -Dtestcase=DistributedMLTComponentTest -Dtests.method=test -Dtests.seed=25E72E934121CB2B -Dtests.multiplier=2 -Dtests.slow=true -Dtests.locale=sr_CS -Dtests.timezone=Etc/GMT+1 -Dtests.asserts=true -Dtests.file.encoding=US-ASCII
   [junit4] ERROR    102s J3 | DistributedMLTComponentTest.test <<<
   [junit4]    > Throwable #1: org.apache.solr.client.solrj.SolrServerException: Timeout occured while waiting response from server at: http://127.0.0.1:37002//collection1
   [junit4]    > 	at __randomizedtesting.SeedInfo.seed([25E72E934121CB2B:ADB31149EFDDA6D3]:0)
   [junit4]    > 	at org.apache.solr.client.solrj.impl.HttpSolrClient.executeMethod(HttpSolrClient.java:566)
   [junit4]    > 	at org.apache.solr.client.solrj.impl.HttpSolrClient.request(HttpSolrClient.java:233)
   [junit4]    > 	at org.apache.solr.client.solrj.impl.HttpSolrClient.request(HttpSolrClient.java:225)
   [junit4]    > 	at org.apache.solr.client.solrj.SolrRequest.process(SolrRequest.java:135)
   [junit4]    > 	at org.apache.solr.client.solrj.SolrClient.query(SolrClient.java:943)
   [junit4]    > 	at org.apache.solr.client.solrj.SolrClient.query(SolrClient.java:958)
   [junit4]    > 	at org.apache.solr.BaseDistributedSearchTestCase.queryServer(BaseDistributedSearchTestCase.java:558)
   [junit4]    > 	at org.apache.solr.BaseDistributedSearchTestCase.query(BaseDistributedSearchTestCase.java:606)
   [junit4]    > 	at org.apache.solr.BaseDistributedSearchTestCase.query(BaseDistributedSearchTestCase.java:588)
   [junit4]    > 	at org.apache.solr.BaseDistributedSearchTestCase.query(BaseDistributedSearchTestCase.java:567)
   [junit4]    > 	at org.apache.solr.handler.component.DistributedMLTComponentTest.test(DistributedMLTComponentTest.java:126)
   [junit4]    > 	at org.apache.solr.BaseDistributedSearchTestCase$ShardsRepeatRule$ShardsFixedStatement.callStatement(BaseDistributedSearchTestCase.java:960)
   [junit4]    > 	at org.apache.solr.BaseDistributedSearchTestCase$ShardsRepeatRule$ShardsStatement.evaluate(BaseDistributedSearchTestCase.java:935)
   [junit4]    > 	at java.lang.Thread.run(Thread.java:745)
   [junit4]    > Caused by: java.net.SocketTimeoutException: Read timed out
   [junit4]    > 	at java.net.SocketInputStream.socketRead0(Native Method)
   [junit4]    > 	at java.net.SocketInputStream.read(SocketInputStream.java:152)
   [junit4]    > 	at java.net.SocketInputStream.read(SocketInputStream.java:122)
   [junit4]    > 	at org.apache.http.impl.io.AbstractSessionInputBuffer.fillBuffer(AbstractSessionInputBuffer.java:160)
   [junit4]    > 	at org.apache.http.impl.io.SocketInputBuffer.fillBuffer(SocketInputBuffer.java:84)
   [junit4]    > 	at org.apache.http.impl.io.AbstractSessionInputBuffer.readLine(AbstractSessionInputBuffer.java:273)
   [junit4]    > 	at org.apache.http.impl.conn.DefaultHttpResponseParser.parseHead(DefaultHttpResponseParser.java:140)
   [junit4]    > 	at org.apache.http.impl.conn.DefaultHttpResponseParser.parseHead(DefaultHttpResponseParser.java:57)
   [junit4]    > 	at org.apache.http.impl.io.AbstractMessageParser.parse(AbstractMessageParser.java:261)
   [junit4]    > 	at org.apache.http.impl.AbstractHttpClientConnection.receiveResponseHeader(AbstractHttpClientConnection.java:283)
   [junit4]    > 	at org.apache.http.impl.conn.DefaultClientConnection.receiveResponseHeader(DefaultClientConnection.java:251)
   [junit4]    > 	at org.apache.http.impl.conn.ManagedClientConnectionImpl.receiveResponseHeader(ManagedClientConnectionImpl.java:197)
   [junit4]    > 	at org.apache.http.protocol.HttpRequestExecutor.doReceiveResponse(HttpRequestExecutor.java:272)
   [junit4]    > 	at org.apache.http.protocol.HttpRequestExecutor.execute(HttpRequestExecutor.java:124)
   [junit4]    > 	at org.apache.http.impl.client.DefaultRequestDirector.tryExecute(DefaultRequestDirector.java:685)
   [junit4]    > 	at org.apache.http.impl.client.DefaultRequestDirector.execute(DefaultRequestDirector.java:487)
   [junit4]    > 	at org.apache.http.impl.client.AbstractHttpClient.doExecute(AbstractHttpClient.java:882)
   [junit4]    > 	at org.apache.http.impl.client.CloseableHttpClient.execute(CloseableHttpClient.java:82)
   [junit4]    > 	at org.apache.http.impl.client.CloseableHttpClient.execute(CloseableHttpClient.java:107)
   [junit4]    > 	at org.apache.http.impl.client.CloseableHttpClient.execute(CloseableHttpClient.java:55)
   [junit4]    > 	at org.apache.solr.client.solrj.impl.HttpSolrClient.executeMethod(HttpSolrClient.java:462)
   [junit4]    > 	... 51 more
   [junit4]   2> 2195581 T6981 oas.SolrTestCaseJ4.deleteCore ###deleteCore
   [junit4]   2> NOTE: leaving temporary files on disk at: /usr/home/jenkins/jenkins-slave/workspace/Lucene-Solr-Tests-5.x-Java7/solr/build/solr-core/test/J3/temp/solr.handler.component.DistributedMLTComponentTest 25E72E934121CB2B-001
   [junit4]   2> NOTE: test params are: codec=CheapBastard, sim=RandomSimilarityProvider(queryNorm=false,coord=no): {}, locale=sr_CS, timezone=Etc/GMT+1
   [junit4]   2> NOTE: FreeBSD 9.1-RELEASE-p3 amd64/Oracle Corporation 1.7.0_65 (64-bit)/cpus=16,threads=1,free=229360800,total=411566080
   [junit4]   2> NOTE: All tests run in this JVM: [EchoParamsTest, RequestHandlersTest, TestIndexingPerformance, ShowFileRequestHandlerTest, BasicFunctionalityTest, StatsComponentTest, IndexSchemaRuntimeFieldTest, TestSort, CoreMergeIndexesAdminHandlerTest, TestCloudInspectUtil, PrimUtilsTest, TestSearchPerf, TestSolrDeletionPolicy2, LeaderElectionIntegrationTest, BadIndexSchemaTest, AtomicUpdatesTest, TestManagedSchemaDynamicFieldResource, TestRealTimeGet, TestReversedWildcardFilterFactory, TestExtendedDismaxParser, BasicDistributedZkTest, TestHdfsUpdateLog, TestSerializedLuceneMatchVersion, BasicDistributedZk2Test, TestCloudManagedSchema, TestSolrJ, TestQuerySenderNoQuery, TestStressVersions, SimpleCollectionCreateDeleteTest, TestLRUStatsCache, HdfsDirectoryFactoryTest, DistributedTermsComponentTest, WordBreakSolrSpellCheckerTest, TestFoldingMultitermQuery, DistributedSpellCheckComponentTest, TestBlendedInfixSuggestions, TestIndexSearcher, DocValuesMissingTest, AsyncMigrateRouteKeyTest, TestManagedSynonymFilterFactory, QueryEqualityTest, CollectionsAPIAsyncDistributedZkTest, TestManagedSchema, JSONWriterTest, TestDocumentBuilder, ChangedSchemaMergeTest, TimeZoneUtilsTest, MergeStrategyTest, HighlighterTest, TestRemoteStreaming, DateMathParserTest, TestEmbeddedSolrServerConstructors, SolrInfoMBeanTest, TestHashPartitioner, CloudExitableDirectoryReaderTest, TestLuceneMatchVersion, CollectionsAPIDistributedZkTest, TestCloudManagedSchemaConcurrent, TestCloudSchemaless, UnloadDistributedZkTest, TestBlobHandler, MigrateRouteKeyTest, DistribJoinFromCollectionTest, ChaosMonkeySafeLeaderTest, TestDistribDocBasedVersion, DistributedFacetPivotLargeTest, TestDistributedMissingSort, DistributedFacetPivotWhiteBoxTest, DistributedMLTComponentTest]
   [junit4] Completed on J3 in 102.46s, 1 test, 1 error <<< FAILURES!

[...truncated 525 lines...]
BUILD FAILED
/usr/home/jenkins/jenkins-slave/workspace/Lucene-Solr-Tests-5.x-Java7/build.xml:529: The following error occurred while executing this line:
/usr/home/jenkins/jenkins-slave/workspace/Lucene-Solr-Tests-5.x-Java7/build.xml:477: The following error occurred while executing this line:
/usr/home/jenkins/jenkins-slave/workspace/Lucene-Solr-Tests-5.x-Java7/build.xml:61: The following error occurred while executing this line:
/usr/home/jenkins/jenkins-slave/workspace/Lucene-Solr-Tests-5.x-Java7/extra-targets.xml:39: The following error occurred while executing this line:
/usr/home/jenkins/jenkins-slave/workspace/Lucene-Solr-Tests-5.x-Java7/solr/build.xml:191: The following error occurred while executing this line:
/usr/home/jenkins/jenkins-slave/workspace/Lucene-Solr-Tests-5.x-Java7/solr/common-build.xml:509: The following error occurred while executing this line:
/usr/home/jenkins/jenkins-slave/workspace/Lucene-Solr-Tests-5.x-Java7/lucene/common-build.xml:1370: The following error occurred while executing this line:
/usr/home/jenkins/jenkins-slave/workspace/Lucene-Solr-Tests-5.x-Java7/lucene/common-build.xml:976: There were test failures: 478 suites, 1902 tests, 4 errors, 1 failure, 61 ignored (21 assumptions)

Total time: 58 minutes 17 seconds
Build step 'Invoke Ant' marked build as failure
Archiving artifacts
Sending artifact delta relative to Lucene-Solr-Tests-5.x-Java7 #2431
Archived 5 artifacts
Archive block size is 32768
Received 0 blocks and 226560664 bytes
Compression is 0.0%
Took 46 sec
Recording test results
Email was triggered for: Failure
Sending email for trigger: Failure



Mime
View raw message