lucene-dev mailing list archives

Site index · List index
Message view « Date » · « Thread »
Top « Date » · « Thread »
From Apache Jenkins Server <jenk...@builds.apache.org>
Subject [JENKINS] Lucene-Solr-Tests-5.x-Java7 - Build # 2907 - Still Failing
Date Tue, 07 Apr 2015 22:33:27 GMT
Build: https://builds.apache.org/job/Lucene-Solr-Tests-5.x-Java7/2907/

1 tests failed.
FAILED:  org.apache.solr.cloud.ReplicationFactorTest.test

Error Message:
java.net.SocketTimeoutException: Read timed out

Stack Trace:
org.apache.solr.client.solrj.SolrServerException: java.net.SocketTimeoutException: Read timed out
	at org.apache.solr.client.solrj.impl.CloudSolrClient.requestWithRetryOnStaleState(CloudSolrClient.java:929)
	at org.apache.solr.client.solrj.impl.CloudSolrClient.request(CloudSolrClient.java:782)
	at org.apache.solr.client.solrj.SolrClient.request(SolrClient.java:1220)
	at org.apache.solr.cloud.AbstractFullDistribZkTestBase.sendDocsWithRetry(AbstractFullDistribZkTestBase.java:774)
	at org.apache.solr.cloud.ReplicationFactorTest.testRf3(ReplicationFactorTest.java:277)
	at org.apache.solr.cloud.ReplicationFactorTest.test(ReplicationFactorTest.java:113)
	at sun.reflect.NativeMethodAccessorImpl.invoke0(Native Method)
	at sun.reflect.NativeMethodAccessorImpl.invoke(NativeMethodAccessorImpl.java:57)
	at sun.reflect.DelegatingMethodAccessorImpl.invoke(DelegatingMethodAccessorImpl.java:43)
	at java.lang.reflect.Method.invoke(Method.java:606)
	at com.carrotsearch.randomizedtesting.RandomizedRunner.invoke(RandomizedRunner.java:1627)
	at com.carrotsearch.randomizedtesting.RandomizedRunner$6.evaluate(RandomizedRunner.java:836)
	at com.carrotsearch.randomizedtesting.RandomizedRunner$7.evaluate(RandomizedRunner.java:872)
	at com.carrotsearch.randomizedtesting.RandomizedRunner$8.evaluate(RandomizedRunner.java:886)
	at org.apache.solr.BaseDistributedSearchTestCase$ShardsRepeatRule$ShardsFixedStatement.callStatement(BaseDistributedSearchTestCase.java:960)
	at org.apache.solr.BaseDistributedSearchTestCase$ShardsRepeatRule$ShardsStatement.evaluate(BaseDistributedSearchTestCase.java:935)
	at com.carrotsearch.randomizedtesting.rules.SystemPropertiesRestoreRule$1.evaluate(SystemPropertiesRestoreRule.java:53)
	at org.apache.lucene.util.TestRuleSetupTeardownChained$1.evaluate(TestRuleSetupTeardownChained.java:50)
	at org.apache.lucene.util.AbstractBeforeAfterRule$1.evaluate(AbstractBeforeAfterRule.java:46)
	at org.apache.lucene.util.TestRuleThreadAndTestName$1.evaluate(TestRuleThreadAndTestName.java:49)
	at org.apache.lucene.util.TestRuleIgnoreAfterMaxFailures$1.evaluate(TestRuleIgnoreAfterMaxFailures.java:65)
	at org.apache.lucene.util.TestRuleMarkFailure$1.evaluate(TestRuleMarkFailure.java:48)
	at com.carrotsearch.randomizedtesting.rules.StatementAdapter.evaluate(StatementAdapter.java:36)
	at com.carrotsearch.randomizedtesting.ThreadLeakControl$StatementRunner.run(ThreadLeakControl.java:365)
	at com.carrotsearch.randomizedtesting.ThreadLeakControl.forkTimeoutingTask(ThreadLeakControl.java:798)
	at com.carrotsearch.randomizedtesting.ThreadLeakControl$3.evaluate(ThreadLeakControl.java:458)
	at com.carrotsearch.randomizedtesting.RandomizedRunner.runSingleTest(RandomizedRunner.java:845)
	at com.carrotsearch.randomizedtesting.RandomizedRunner$3.evaluate(RandomizedRunner.java:747)
	at com.carrotsearch.randomizedtesting.RandomizedRunner$4.evaluate(RandomizedRunner.java:781)
	at com.carrotsearch.randomizedtesting.RandomizedRunner$5.evaluate(RandomizedRunner.java:792)
	at com.carrotsearch.randomizedtesting.rules.StatementAdapter.evaluate(StatementAdapter.java:36)
	at com.carrotsearch.randomizedtesting.rules.SystemPropertiesRestoreRule$1.evaluate(SystemPropertiesRestoreRule.java:53)
	at org.apache.lucene.util.AbstractBeforeAfterRule$1.evaluate(AbstractBeforeAfterRule.java:46)
	at com.carrotsearch.randomizedtesting.rules.StatementAdapter.evaluate(StatementAdapter.java:36)
	at org.apache.lucene.util.TestRuleStoreClassName$1.evaluate(TestRuleStoreClassName.java:42)
	at com.carrotsearch.randomizedtesting.rules.NoShadowingOrOverridesOnMethodsRule$1.evaluate(NoShadowingOrOverridesOnMethodsRule.java:39)
	at com.carrotsearch.randomizedtesting.rules.NoShadowingOrOverridesOnMethodsRule$1.evaluate(NoShadowingOrOverridesOnMethodsRule.java:39)
	at com.carrotsearch.randomizedtesting.rules.StatementAdapter.evaluate(StatementAdapter.java:36)
	at com.carrotsearch.randomizedtesting.rules.StatementAdapter.evaluate(StatementAdapter.java:36)
	at com.carrotsearch.randomizedtesting.rules.StatementAdapter.evaluate(StatementAdapter.java:36)
	at org.apache.lucene.util.TestRuleAssertionsRequired$1.evaluate(TestRuleAssertionsRequired.java:54)
	at org.apache.lucene.util.TestRuleMarkFailure$1.evaluate(TestRuleMarkFailure.java:48)
	at org.apache.lucene.util.TestRuleIgnoreAfterMaxFailures$1.evaluate(TestRuleIgnoreAfterMaxFailures.java:65)
	at org.apache.lucene.util.TestRuleIgnoreTestSuites$1.evaluate(TestRuleIgnoreTestSuites.java:55)
	at com.carrotsearch.randomizedtesting.rules.StatementAdapter.evaluate(StatementAdapter.java:36)
	at com.carrotsearch.randomizedtesting.ThreadLeakControl$StatementRunner.run(ThreadLeakControl.java:365)
	at java.lang.Thread.run(Thread.java:745)
Caused by: java.net.SocketTimeoutException: Read timed out
	at java.net.SocketInputStream.socketRead0(Native Method)
	at java.net.SocketInputStream.read(SocketInputStream.java:152)
	at java.net.SocketInputStream.read(SocketInputStream.java:122)
	at org.apache.http.impl.io.AbstractSessionInputBuffer.fillBuffer(AbstractSessionInputBuffer.java:160)
	at org.apache.http.impl.io.SocketInputBuffer.fillBuffer(SocketInputBuffer.java:84)
	at org.apache.http.impl.io.AbstractSessionInputBuffer.readLine(AbstractSessionInputBuffer.java:273)
	at org.apache.http.impl.conn.DefaultHttpResponseParser.parseHead(DefaultHttpResponseParser.java:140)
	at org.apache.http.impl.conn.DefaultHttpResponseParser.parseHead(DefaultHttpResponseParser.java:57)
	at org.apache.http.impl.io.AbstractMessageParser.parse(AbstractMessageParser.java:261)
	at org.apache.http.impl.AbstractHttpClientConnection.receiveResponseHeader(AbstractHttpClientConnection.java:283)
	at org.apache.http.impl.conn.DefaultClientConnection.receiveResponseHeader(DefaultClientConnection.java:251)
	at org.apache.http.impl.conn.ManagedClientConnectionImpl.receiveResponseHeader(ManagedClientConnectionImpl.java:197)
	at org.apache.http.protocol.HttpRequestExecutor.doReceiveResponse(HttpRequestExecutor.java:272)
	at org.apache.http.protocol.HttpRequestExecutor.execute(HttpRequestExecutor.java:124)
	at org.apache.http.impl.client.DefaultRequestDirector.tryExecute(DefaultRequestDirector.java:685)
	at org.apache.http.impl.client.DefaultRequestDirector.execute(DefaultRequestDirector.java:487)
	at org.apache.http.impl.client.AbstractHttpClient.doExecute(AbstractHttpClient.java:882)
	at org.apache.http.impl.client.CloseableHttpClient.execute(CloseableHttpClient.java:82)
	at org.apache.http.impl.client.CloseableHttpClient.execute(CloseableHttpClient.java:107)
	at org.apache.http.impl.client.CloseableHttpClient.execute(CloseableHttpClient.java:55)
	at org.apache.solr.client.solrj.impl.HttpSolrClient.executeMethod(HttpSolrClient.java:462)
	at org.apache.solr.client.solrj.impl.HttpSolrClient.request(HttpSolrClient.java:233)
	at org.apache.solr.client.solrj.impl.HttpSolrClient.request(HttpSolrClient.java:225)
	at org.apache.solr.client.solrj.impl.LBHttpSolrClient.doRequest(LBHttpSolrClient.java:370)
	at org.apache.solr.client.solrj.impl.LBHttpSolrClient.request(LBHttpSolrClient.java:325)
	at org.apache.solr.client.solrj.impl.CloudSolrClient$2.call(CloudSolrClient.java:596)
	at org.apache.solr.client.solrj.impl.CloudSolrClient$2.call(CloudSolrClient.java:593)
	at java.util.concurrent.FutureTask.run(FutureTask.java:262)
	at java.util.concurrent.ThreadPoolExecutor.runWorker(ThreadPoolExecutor.java:1145)
	at java.util.concurrent.ThreadPoolExecutor$Worker.run(ThreadPoolExecutor.java:615)
	... 1 more




Build Log:
[...truncated 9900 lines...]
   [junit4] Suite: org.apache.solr.cloud.ReplicationFactorTest
   [junit4]   2> Creating dataDir: /usr/home/jenkins/jenkins-slave/workspace/Lucene-Solr-Tests-5.x-Java7/solr/build/solr-core/test/J3/temp/solr.cloud.ReplicationFactorTest 457F35F1A3900CAB-001/init-core-data-001
   [junit4]   2> 440254 T1875 oas.BaseDistributedSearchTestCase.initHostContext Setting hostContext system property: /
   [junit4]   2> 440258 T1875 oasc.ZkTestServer.run STARTING ZK TEST SERVER
   [junit4]   1> client port:0.0.0.0/0.0.0.0:0
   [junit4]   2> 440258 T1876 oasc.ZkTestServer$ZKServerMain.runFromConfig Starting server
   [junit4]   2> 440358 T1875 oasc.ZkTestServer.run start zk server on port:14242
   [junit4]   2> 440359 T1875 oascc.SolrZkClient.createZkCredentialsToAddAutomatically Using default ZkCredentialsProvider
   [junit4]   2> 440360 T1875 oascc.ConnectionManager.waitForConnected Waiting for client to connect to ZooKeeper
   [junit4]   2> 440362 T1883 oascc.ConnectionManager.process Watcher org.apache.solr.common.cloud.ConnectionManager@29b8b880 name:ZooKeeperConnection Watcher:127.0.0.1:14242 got event WatchedEvent state:SyncConnected type:None path:null path:null type:None
   [junit4]   2> 440363 T1875 oascc.ConnectionManager.waitForConnected Client is connected to ZooKeeper
   [junit4]   2> 440363 T1875 oascc.SolrZkClient.createZkACLProvider Using default ZkACLProvider
   [junit4]   2> 440363 T1875 oascc.SolrZkClient.makePath makePath: /solr
   [junit4]   2> 440365 T1875 oascc.SolrZkClient.createZkCredentialsToAddAutomatically Using default ZkCredentialsProvider
   [junit4]   2> 440366 T1875 oascc.ConnectionManager.waitForConnected Waiting for client to connect to ZooKeeper
   [junit4]   2> 440367 T1886 oascc.ConnectionManager.process Watcher org.apache.solr.common.cloud.ConnectionManager@3bb633cd name:ZooKeeperConnection Watcher:127.0.0.1:14242/solr got event WatchedEvent state:SyncConnected type:None path:null path:null type:None
   [junit4]   2> 440367 T1875 oascc.ConnectionManager.waitForConnected Client is connected to ZooKeeper
   [junit4]   2> 440367 T1875 oascc.SolrZkClient.createZkACLProvider Using default ZkACLProvider
   [junit4]   2> 440367 T1875 oascc.SolrZkClient.makePath makePath: /collections/collection1
   [junit4]   2> 440368 T1875 oascc.SolrZkClient.makePath makePath: /collections/collection1/shards
   [junit4]   2> 440369 T1875 oascc.SolrZkClient.makePath makePath: /collections/control_collection
   [junit4]   2> 440370 T1875 oascc.SolrZkClient.makePath makePath: /collections/control_collection/shards
   [junit4]   2> 440372 T1875 oasc.AbstractZkTestCase.putConfig put /usr/home/jenkins/jenkins-slave/workspace/Lucene-Solr-Tests-5.x-Java7/solr/core/src/test-files/solr/collection1/conf/solrconfig-tlog.xml to /configs/conf1/solrconfig.xml
   [junit4]   2> 440372 T1875 oascc.SolrZkClient.makePath makePath: /configs/conf1/solrconfig.xml
   [junit4]   2> 440374 T1875 oasc.AbstractZkTestCase.putConfig put /usr/home/jenkins/jenkins-slave/workspace/Lucene-Solr-Tests-5.x-Java7/solr/core/src/test-files/solr/collection1/conf/schema.xml to /configs/conf1/schema.xml
   [junit4]   2> 440374 T1875 oascc.SolrZkClient.makePath makePath: /configs/conf1/schema.xml
   [junit4]   2> 440475 T1875 oasc.AbstractZkTestCase.putConfig put /usr/home/jenkins/jenkins-slave/workspace/Lucene-Solr-Tests-5.x-Java7/solr/core/src/test-files/solr/collection1/conf/solrconfig.snippet.randomindexconfig.xml to /configs/conf1/solrconfig.snippet.randomindexconfig.xml
   [junit4]   2> 440476 T1875 oascc.SolrZkClient.makePath makePath: /configs/conf1/solrconfig.snippet.randomindexconfig.xml
   [junit4]   2> 440477 T1875 oasc.AbstractZkTestCase.putConfig put /usr/home/jenkins/jenkins-slave/workspace/Lucene-Solr-Tests-5.x-Java7/solr/core/src/test-files/solr/collection1/conf/stopwords.txt to /configs/conf1/stopwords.txt
   [junit4]   2> 440477 T1875 oascc.SolrZkClient.makePath makePath: /configs/conf1/stopwords.txt
   [junit4]   2> 440479 T1875 oasc.AbstractZkTestCase.putConfig put /usr/home/jenkins/jenkins-slave/workspace/Lucene-Solr-Tests-5.x-Java7/solr/core/src/test-files/solr/collection1/conf/protwords.txt to /configs/conf1/protwords.txt
   [junit4]   2> 440479 T1875 oascc.SolrZkClient.makePath makePath: /configs/conf1/protwords.txt
   [junit4]   2> 440480 T1875 oasc.AbstractZkTestCase.putConfig put /usr/home/jenkins/jenkins-slave/workspace/Lucene-Solr-Tests-5.x-Java7/solr/core/src/test-files/solr/collection1/conf/currency.xml to /configs/conf1/currency.xml
   [junit4]   2> 440481 T1875 oascc.SolrZkClient.makePath makePath: /configs/conf1/currency.xml
   [junit4]   2> 440482 T1875 oasc.AbstractZkTestCase.putConfig put /usr/home/jenkins/jenkins-slave/workspace/Lucene-Solr-Tests-5.x-Java7/solr/core/src/test-files/solr/collection1/conf/enumsConfig.xml to /configs/conf1/enumsConfig.xml
   [junit4]   2> 440482 T1875 oascc.SolrZkClient.makePath makePath: /configs/conf1/enumsConfig.xml
   [junit4]   2> 440483 T1875 oasc.AbstractZkTestCase.putConfig put /usr/home/jenkins/jenkins-slave/workspace/Lucene-Solr-Tests-5.x-Java7/solr/core/src/test-files/solr/collection1/conf/open-exchange-rates.json to /configs/conf1/open-exchange-rates.json
   [junit4]   2> 440484 T1875 oascc.SolrZkClient.makePath makePath: /configs/conf1/open-exchange-rates.json
   [junit4]   2> 440485 T1875 oasc.AbstractZkTestCase.putConfig put /usr/home/jenkins/jenkins-slave/workspace/Lucene-Solr-Tests-5.x-Java7/solr/core/src/test-files/solr/collection1/conf/mapping-ISOLatin1Accent.txt to /configs/conf1/mapping-ISOLatin1Accent.txt
   [junit4]   2> 440485 T1875 oascc.SolrZkClient.makePath makePath: /configs/conf1/mapping-ISOLatin1Accent.txt
   [junit4]   2> 440486 T1875 oasc.AbstractZkTestCase.putConfig put /usr/home/jenkins/jenkins-slave/workspace/Lucene-Solr-Tests-5.x-Java7/solr/core/src/test-files/solr/collection1/conf/old_synonyms.txt to /configs/conf1/old_synonyms.txt
   [junit4]   2> 440487 T1875 oascc.SolrZkClient.makePath makePath: /configs/conf1/old_synonyms.txt
   [junit4]   2> 440488 T1875 oasc.AbstractZkTestCase.putConfig put /usr/home/jenkins/jenkins-slave/workspace/Lucene-Solr-Tests-5.x-Java7/solr/core/src/test-files/solr/collection1/conf/synonyms.txt to /configs/conf1/synonyms.txt
   [junit4]   2> 440488 T1875 oascc.SolrZkClient.makePath makePath: /configs/conf1/synonyms.txt
   [junit4]   2> 441510 T1875 oas.SolrTestCaseJ4.writeCoreProperties Writing core.properties file to /usr/home/jenkins/jenkins-slave/workspace/Lucene-Solr-Tests-5.x-Java7/solr/build/solr-core/test/J3/temp/solr.cloud.ReplicationFactorTest 457F35F1A3900CAB-001/control-001/cores/collection1
   [junit4]   2> 441513 T1875 oejs.Server.doStart jetty-8.1.10.v20130312
   [junit4]   2> 441517 T1875 oejs.AbstractConnector.doStart Started SocketConnector@127.0.0.1:14246
   [junit4]   2> 441517 T1875 oascse.JettySolrRunner$1.lifeCycleStarted Jetty properties: {hostPort=14245, hostContext=/, solr.data.dir=/usr/home/jenkins/jenkins-slave/workspace/Lucene-Solr-Tests-5.x-Java7/solr/build/solr-core/test/J3/temp/solr.cloud.ReplicationFactorTest 457F35F1A3900CAB-001/tempDir-001/control/data, coreRootDirectory=/usr/home/jenkins/jenkins-slave/workspace/Lucene-Solr-Tests-5.x-Java7/solr/build/solr-core/test/J3/temp/solr.cloud.ReplicationFactorTest 457F35F1A3900CAB-001/control-001/cores}
   [junit4]   2> 441518 T1875 oass.SolrDispatchFilter.init SolrDispatchFilter.init()sun.misc.Launcher$AppClassLoader@57bd06bf
   [junit4]   2> 441518 T1875 oasc.SolrResourceLoader.<init> new SolrResourceLoader for directory: '/usr/home/jenkins/jenkins-slave/workspace/Lucene-Solr-Tests-5.x-Java7/solr/build/solr-core/test/J3/temp/solr.cloud.ReplicationFactorTest 457F35F1A3900CAB-001/control-001/'
   [junit4]   2> 441547 T1875 oasc.SolrXmlConfig.fromFile Loading container configuration from /usr/home/jenkins/jenkins-slave/workspace/Lucene-Solr-Tests-5.x-Java7/solr/build/solr-core/test/J3/temp/solr.cloud.ReplicationFactorTest 457F35F1A3900CAB-001/control-001/solr.xml
   [junit4]   2> 441599 T1875 oasc.CorePropertiesLocator.<init> Config-defined core root directory: /usr/home/jenkins/jenkins-slave/workspace/Lucene-Solr-Tests-5.x-Java7/solr/build/solr-core/test/J3/temp/solr.cloud.ReplicationFactorTest 457F35F1A3900CAB-001/control-001/cores
   [junit4]   2> 441600 T1875 oasc.CoreContainer.<init> New CoreContainer 1380014511
   [junit4]   2> 441600 T1875 oasc.CoreContainer.load Loading cores into CoreContainer [instanceDir=/usr/home/jenkins/jenkins-slave/workspace/Lucene-Solr-Tests-5.x-Java7/solr/build/solr-core/test/J3/temp/solr.cloud.ReplicationFactorTest 457F35F1A3900CAB-001/control-001/]
   [junit4]   2> 441601 T1875 oasc.CoreContainer.load loading shared library: /usr/home/jenkins/jenkins-slave/workspace/Lucene-Solr-Tests-5.x-Java7/solr/build/solr-core/test/J3/temp/solr.cloud.ReplicationFactorTest 457F35F1A3900CAB-001/control-001/lib
   [junit4]   2> 441602 T1875 oasc.SolrResourceLoader.addToClassLoader WARN Can't find (or read) directory to add to classloader: lib (resolved as: /usr/home/jenkins/jenkins-slave/workspace/Lucene-Solr-Tests-5.x-Java7/solr/build/solr-core/test/J3/temp/solr.cloud.ReplicationFactorTest 457F35F1A3900CAB-001/control-001/lib).
   [junit4]   2> 441611 T1875 oashc.HttpShardHandlerFactory.getParameter Setting socketTimeout to: 90000
   [junit4]   2> 441611 T1875 oashc.HttpShardHandlerFactory.getParameter Setting urlScheme to: 
   [junit4]   2> 441612 T1875 oashc.HttpShardHandlerFactory.getParameter Setting connTimeout to: 15000
   [junit4]   2> 441612 T1875 oashc.HttpShardHandlerFactory.getParameter Setting maxConnectionsPerHost to: 20
   [junit4]   2> 441612 T1875 oashc.HttpShardHandlerFactory.getParameter Setting maxConnections to: 10000
   [junit4]   2> 441612 T1875 oashc.HttpShardHandlerFactory.getParameter Setting corePoolSize to: 0
   [junit4]   2> 441612 T1875 oashc.HttpShardHandlerFactory.getParameter Setting maximumPoolSize to: 2147483647
   [junit4]   2> 441613 T1875 oashc.HttpShardHandlerFactory.getParameter Setting maxThreadIdleTime to: 5
   [junit4]   2> 441613 T1875 oashc.HttpShardHandlerFactory.getParameter Setting sizeOfQueue to: -1
   [junit4]   2> 441613 T1875 oashc.HttpShardHandlerFactory.getParameter Setting fairnessPolicy to: false
   [junit4]   2> 441613 T1875 oashc.HttpShardHandlerFactory.getParameter Setting useRetries to: false
   [junit4]   2> 441618 T1875 oasu.UpdateShardHandler.<init> Creating UpdateShardHandler HTTP client with params: socketTimeout=340000&connTimeout=45000&retry=true
   [junit4]   2> 441619 T1875 oasl.LogWatcher.createWatcher SLF4J impl is org.slf4j.impl.Log4jLoggerFactory
   [junit4]   2> 441619 T1875 oasl.LogWatcher.newRegisteredLogWatcher Registering Log Listener [Log4j (org.slf4j.impl.Log4jLoggerFactory)]
   [junit4]   2> 441619 T1875 oasc.CoreContainer.load Node Name: 127.0.0.1
   [junit4]   2> 441619 T1875 oasc.ZkContainer.initZooKeeper Zookeeper client=127.0.0.1:14242/solr
   [junit4]   2> 441619 T1875 oasc.ZkController.checkChrootPath zkHost includes chroot
   [junit4]   2> 441620 T1875 oascc.SolrZkClient.createZkCredentialsToAddAutomatically Using default ZkCredentialsProvider
   [junit4]   2> 441620 T1875 oascc.ConnectionManager.waitForConnected Waiting for client to connect to ZooKeeper
   [junit4]   2> 441622 T1898 oascc.ConnectionManager.process Watcher org.apache.solr.common.cloud.ConnectionManager@994d153 name:ZooKeeperConnection Watcher:127.0.0.1:14242 got event WatchedEvent state:SyncConnected type:None path:null path:null type:None
   [junit4]   2> 441623 T1875 oascc.ConnectionManager.waitForConnected Client is connected to ZooKeeper
   [junit4]   2> 441623 T1875 oascc.SolrZkClient.createZkACLProvider Using default ZkACLProvider
   [junit4]   2> 441624 T1875 oascc.ConnectionManager.waitForConnected Waiting for client to connect to ZooKeeper
   [junit4]   2> 441625 T1901 oascc.ConnectionManager.process Watcher org.apache.solr.common.cloud.ConnectionManager@5fcb98d6 name:ZooKeeperConnection Watcher:127.0.0.1:14242/solr got event WatchedEvent state:SyncConnected type:None path:null path:null type:None
   [junit4]   2> 441626 T1875 oascc.ConnectionManager.waitForConnected Client is connected to ZooKeeper
   [junit4]   2> 441627 T1875 oascc.SolrZkClient.makePath makePath: /overseer/queue
   [junit4]   2> 441628 T1875 oascc.SolrZkClient.makePath makePath: /overseer/collection-queue-work
   [junit4]   2> 441629 T1875 oascc.SolrZkClient.makePath makePath: /overseer/collection-map-running
   [junit4]   2> 441631 T1875 oascc.SolrZkClient.makePath makePath: /overseer/collection-map-completed
   [junit4]   2> 441632 T1875 oascc.SolrZkClient.makePath makePath: /overseer/collection-map-failure
   [junit4]   2> 441633 T1875 oascc.SolrZkClient.makePath makePath: /live_nodes
   [junit4]   2> 441634 T1875 oascc.SolrZkClient.makePath makePath: /aliases.json
   [junit4]   2> 441635 T1875 oascc.SolrZkClient.makePath makePath: /clusterstate.json
   [junit4]   2> 441636 T1875 oasc.ZkController.createEphemeralLiveNode Register node as live in ZooKeeper:/live_nodes/127.0.0.1:14245_
   [junit4]   2> 441636 T1875 oascc.SolrZkClient.makePath makePath: /live_nodes/127.0.0.1:14245_
   [junit4]   2> 441637 T1875 oascc.SolrZkClient.makePath makePath: /overseer_elect
   [junit4]   2> 441638 T1875 oascc.SolrZkClient.makePath makePath: /overseer_elect/election
   [junit4]   2> 441639 T1875 oasc.Overseer.close Overseer (id=null) closing
   [junit4]   2> 441640 T1875 oasc.OverseerElectionContext.runLeaderProcess I am going to be the leader 127.0.0.1:14245_
   [junit4]   2> 441640 T1875 oascc.SolrZkClient.makePath makePath: /overseer_elect/leader
   [junit4]   2> 441641 T1875 oasc.Overseer.start Overseer (id=93614406352961539-127.0.0.1:14245_-n_0000000000) starting
   [junit4]   2> 441642 T1875 oascc.SolrZkClient.makePath makePath: /overseer/queue-work
   [junit4]   2> 441646 T1875 oasc.OverseerAutoReplicaFailoverThread.<init> Starting OverseerAutoReplicaFailoverThread autoReplicaFailoverWorkLoopDelay=10000 autoReplicaFailoverWaitAfterExpiration=30000 autoReplicaFailoverBadNodeExpiration=60000
   [junit4]   2> 441647 T1903 oasc.OverseerCollectionProcessor.run Process current queue of collection creations
   [junit4]   2> 441647 T1902 oasc.Overseer$ClusterStateUpdater.run Starting to work on the main queue
   [junit4]   2> 441647 T1875 oascc.ZkStateReader.createClusterStateWatchersAndUpdate Updating cluster state from ZooKeeper... 
   [junit4]   2> 441650 T1875 oasc.CorePropertiesLocator.discover Looking for core definitions underneath /usr/home/jenkins/jenkins-slave/workspace/Lucene-Solr-Tests-5.x-Java7/solr/build/solr-core/test/J3/temp/solr.cloud.ReplicationFactorTest 457F35F1A3900CAB-001/control-001/cores
   [junit4]   2> 441651 T1875 oasc.CoreDescriptor.<init> CORE DESCRIPTOR: {shard=, instanceDir=/usr/home/jenkins/jenkins-slave/workspace/Lucene-Solr-Tests-5.x-Java7/solr/build/solr-core/test/J3/temp/solr.cloud.ReplicationFactorTest 457F35F1A3900CAB-001/control-001/cores/collection1, loadOnStartup=true, dataDir=data/, transient=false, coreNodeName=, schema=schema.xml, config=solrconfig.xml, collection=control_collection, name=collection1, absoluteInstDir=/usr/home/jenkins/jenkins-slave/workspace/Lucene-Solr-Tests-5.x-Java7/solr/build/solr-core/test/J3/temp/solr.cloud.ReplicationFactorTest 457F35F1A3900CAB-001/control-001/cores/collection1/}
   [junit4]   2> 441652 T1875 oasc.CorePropertiesLocator.discoverUnder Found core collection1 in /usr/home/jenkins/jenkins-slave/workspace/Lucene-Solr-Tests-5.x-Java7/solr/build/solr-core/test/J3/temp/solr.cloud.ReplicationFactorTest 457F35F1A3900CAB-001/control-001/cores/collection1/
   [junit4]   2> 441652 T1875 oasc.CorePropertiesLocator.discover Found 1 core definitions
   [junit4]   2> 441653 T1905 C:control_collection c:collection1 oasc.ZkController.publish publishing core=collection1 state=down collection=control_collection
   [junit4]   2> 441653 T1905 C:control_collection c:collection1 oasc.ZkController.publish numShards not found on descriptor - reading it from system property
   [junit4]   2> 441653 T1905 C:control_collection c:collection1 oasc.ZkController.waitForCoreNodeName look for our core node name
   [junit4]   2> 441653 T1901 oasc.DistributedQueue$LatchWatcher.process NodeChildrenChanged fired on path /overseer/queue state SyncConnected
   [junit4]   2> 441654 T1902 oasc.Overseer$ClusterStateUpdater.run processMessage: queueSize: 1, message = {
   [junit4]   2> 	  "roles":null,
   [junit4]   2> 	  "state":"down",
   [junit4]   2> 	  "base_url":"http://127.0.0.1:14245",
   [junit4]   2> 	  "numShards":"1",
   [junit4]   2> 	  "core":"collection1",
   [junit4]   2> 	  "operation":"state",
   [junit4]   2> 	  "collection":"control_collection",
   [junit4]   2> 	  "node_name":"127.0.0.1:14245_",
   [junit4]   2> 	  "shard":null} current state version: 0
   [junit4]   2> 441655 T1902 oasco.ReplicaMutator.updateState Update state numShards=1 message={
   [junit4]   2> 	  "roles":null,
   [junit4]   2> 	  "state":"down",
   [junit4]   2> 	  "base_url":"http://127.0.0.1:14245",
   [junit4]   2> 	  "numShards":"1",
   [junit4]   2> 	  "core":"collection1",
   [junit4]   2> 	  "operation":"state",
   [junit4]   2> 	  "collection":"control_collection",
   [junit4]   2> 	  "node_name":"127.0.0.1:14245_",
   [junit4]   2> 	  "shard":null}
   [junit4]   2> 441655 T1902 oasco.ClusterStateMutator.createCollection building a new cName: control_collection
   [junit4]   2> 441655 T1902 oasco.ReplicaMutator.updateState Assigning new node to shard shard=shard1
   [junit4]   2> 441656 T1901 oascc.ZkStateReader$2.process A cluster state change: WatchedEvent state:SyncConnected type:NodeDataChanged path:/clusterstate.json, has occurred - updating... (live nodes size: 1)
   [junit4]   2> 442654 T1905 C:control_collection c:collection1 oasc.ZkController.waitForShardId waiting to find shard id in clusterstate for collection1
   [junit4]   2> 442655 T1905 C:control_collection c:collection1 oasc.ZkController.createCollectionZkNode Check for collection zkNode:control_collection
   [junit4]   2> 442655 T1905 C:control_collection c:collection1 oasc.ZkController.createCollectionZkNode Collection zkNode exists
   [junit4]   2> 442656 T1905 C:control_collection c:collection1 oascc.ZkStateReader.readConfigName Load collection config from:/collections/control_collection
   [junit4]   2> 442656 T1905 C:control_collection c:collection1 oascc.ZkStateReader.readConfigName path=/collections/control_collection configName=conf1 specified config exists in ZooKeeper
   [junit4]   2> 442656 T1905 C:control_collection c:collection1 oasc.SolrResourceLoader.<init> new SolrResourceLoader for directory: '/usr/home/jenkins/jenkins-slave/workspace/Lucene-Solr-Tests-5.x-Java7/solr/build/solr-core/test/J3/temp/solr.cloud.ReplicationFactorTest 457F35F1A3900CAB-001/control-001/cores/collection1/'
   [junit4]   2> 442674 T1905 C:control_collection c:collection1 oasc.ZkController.watchZKConfDir watch zkdir /configs/conf1
   [junit4]   2> 442676 T1905 C:control_collection c:collection1 oasc.Config.<init> loaded config solrconfig.xml with version 0 
   [junit4]   2> 442686 T1905 C:control_collection c:collection1 oasc.SolrConfig.refreshRequestParams current version of requestparams : -1
   [junit4]   2> 442709 T1905 C:control_collection c:collection1 oasc.SolrConfig.<init> Using Lucene MatchVersion: 5.2.0
   [junit4]   2> 442761 T1905 C:control_collection c:collection1 oasc.SolrConfig.<init> Loaded SolrConfig: solrconfig.xml
   [junit4]   2> 442862 T1905 C:control_collection c:collection1 oass.IndexSchema.readSchema Reading Solr Schema from /configs/conf1/schema.xml
   [junit4]   2> 442873 T1905 C:control_collection c:collection1 oass.IndexSchema.readSchema [collection1] Schema name=test
   [junit4]   2> 443284 T1905 C:control_collection c:collection1 oass.OpenExchangeRatesOrgProvider.init Initialized with rates=open-exchange-rates.json, refreshInterval=1440.
   [junit4]   2> 443301 T1905 C:control_collection c:collection1 oass.IndexSchema.readSchema default search field in schema is text
   [junit4]   2> 443304 T1905 C:control_collection c:collection1 oass.IndexSchema.readSchema unique key field: id
   [junit4]   2> 443314 T1905 C:control_collection c:collection1 oass.FileExchangeRateProvider.reload Reloading exchange rates from file currency.xml
   [junit4]   2> 443318 T1905 C:control_collection c:collection1 oass.FileExchangeRateProvider.reload Reloading exchange rates from file currency.xml
   [junit4]   2> 443322 T1905 C:control_collection c:collection1 oass.OpenExchangeRatesOrgProvider.reload Reloading exchange rates from open-exchange-rates.json
   [junit4]   2> 443323 T1905 C:control_collection c:collection1 oass.OpenExchangeRatesOrgProvider$OpenExchangeRates.<init> WARN Unknown key IMPORTANT NOTE
   [junit4]   2> 443323 T1905 C:control_collection c:collection1 oass.OpenExchangeRatesOrgProvider$OpenExchangeRates.<init> WARN Expected key, got STRING
   [junit4]   2> 443323 T1905 C:control_collection c:collection1 oass.OpenExchangeRatesOrgProvider.reload Reloading exchange rates from open-exchange-rates.json
   [junit4]   2> 443324 T1905 C:control_collection c:collection1 oass.OpenExchangeRatesOrgProvider$OpenExchangeRates.<init> WARN Unknown key IMPORTANT NOTE
   [junit4]   2> 443324 T1905 C:control_collection c:collection1 oass.OpenExchangeRatesOrgProvider$OpenExchangeRates.<init> WARN Expected key, got STRING
   [junit4]   2> 443325 T1905 C:control_collection c:collection1 oasc.CoreContainer.create Creating SolrCore 'collection1' using configuration from collection control_collection
   [junit4]   2> 443325 T1905 C:control_collection c:collection1 oasc.SolrCore.initDirectoryFactory org.apache.solr.core.MockDirectoryFactory
   [junit4]   2> 443325 T1905 C:control_collection c:collection1 oasc.SolrCore.<init> [collection1] Opening new SolrCore at /usr/home/jenkins/jenkins-slave/workspace/Lucene-Solr-Tests-5.x-Java7/solr/build/solr-core/test/J3/temp/solr.cloud.ReplicationFactorTest 457F35F1A3900CAB-001/control-001/cores/collection1/, dataDir=/usr/home/jenkins/jenkins-slave/workspace/Lucene-Solr-Tests-5.x-Java7/solr/build/solr-core/test/J3/temp/solr.cloud.ReplicationFactorTest 457F35F1A3900CAB-001/control-001/cores/collection1/data/
   [junit4]   2> 443326 T1905 C:control_collection c:collection1 oasc.JmxMonitoredMap.<init> JMX monitoring is enabled. Adding Solr mbeans to JMX Server: com.sun.jmx.mbeanserver.JmxMBeanServer@42d7ecc1
   [junit4]   2> 443326 T1905 C:control_collection c:collection1 oasc.CachingDirectoryFactory.get return new directory for /usr/home/jenkins/jenkins-slave/workspace/Lucene-Solr-Tests-5.x-Java7/solr/build/solr-core/test/J3/temp/solr.cloud.ReplicationFactorTest 457F35F1A3900CAB-001/control-001/cores/collection1/data
   [junit4]   2> 443327 T1905 C:control_collection c:collection1 oasc.SolrCore.getNewIndexDir New index directory detected: old=null new=/usr/home/jenkins/jenkins-slave/workspace/Lucene-Solr-Tests-5.x-Java7/solr/build/solr-core/test/J3/temp/solr.cloud.ReplicationFactorTest 457F35F1A3900CAB-001/control-001/cores/collection1/data/index/
   [junit4]   2> 443327 T1905 C:control_collection c:collection1 oasc.SolrCore.initIndex WARN [collection1] Solr index directory '/usr/home/jenkins/jenkins-slave/workspace/Lucene-Solr-Tests-5.x-Java7/solr/build/solr-core/test/J3/temp/solr.cloud.ReplicationFactorTest 457F35F1A3900CAB-001/control-001/cores/collection1/data/index' doesn't exist. Creating new index...
   [junit4]   2> 443327 T1905 C:control_collection c:collection1 oasc.CachingDirectoryFactory.get return new directory for /usr/home/jenkins/jenkins-slave/workspace/Lucene-Solr-Tests-5.x-Java7/solr/build/solr-core/test/J3/temp/solr.cloud.ReplicationFactorTest 457F35F1A3900CAB-001/control-001/cores/collection1/data/index
   [junit4]   2> 443328 T1905 C:control_collection c:collection1 oasu.RandomMergePolicy.<init> RandomMergePolicy wrapping class org.apache.lucene.index.LogDocMergePolicy: [LogDocMergePolicy: minMergeSize=1000, mergeFactor=42, maxMergeSize=9223372036854775807, maxMergeSizeForForcedMerge=9223372036854775807, calibrateSizeByDeletes=true, maxMergeDocs=2147483647, maxCFSSegmentSizeMB=8.796093022207999E12, noCFSRatio=0.6542973963737145]
   [junit4]   2> 443329 T1905 C:control_collection c:collection1 oasc.SolrDeletionPolicy.onCommit SolrDeletionPolicy.onCommit: commits: num=1
   [junit4]   2> 		commit{dir=MockDirectoryWrapper(RAMDirectory@45455d46 lockFactory=org.apache.lucene.store.SingleInstanceLockFactory@4ceec231),segFN=segments_1,generation=1}
   [junit4]   2> 443329 T1905 C:control_collection c:collection1 oasc.SolrDeletionPolicy.updateCommits newest commit generation = 1
   [junit4]   2> 443334 T1905 C:control_collection c:collection1 oasup.UpdateRequestProcessorChain.init creating updateRequestProcessorChain "nodistrib"
   [junit4]   2> 443335 T1905 C:control_collection c:collection1 oasup.UpdateRequestProcessorChain.init creating updateRequestProcessorChain "dedupe"
   [junit4]   2> 443335 T1905 C:control_collection c:collection1 oasup.UpdateRequestProcessorChain.init inserting DistributedUpdateProcessorFactory into updateRequestProcessorChain "dedupe"
   [junit4]   2> 443335 T1905 C:control_collection c:collection1 oasup.UpdateRequestProcessorChain.init creating updateRequestProcessorChain "stored_sig"
   [junit4]   2> 443336 T1905 C:control_collection c:collection1 oasup.UpdateRequestProcessorChain.init inserting DistributedUpdateProcessorFactory into updateRequestProcessorChain "stored_sig"
   [junit4]   2> 443336 T1905 C:control_collection c:collection1 oasup.UpdateRequestProcessorChain.init creating updateRequestProcessorChain "distrib-dup-test-chain-explicit"
   [junit4]   2> 443336 T1905 C:control_collection c:collection1 oasup.UpdateRequestProcessorChain.init creating updateRequestProcessorChain "distrib-dup-test-chain-implicit"
   [junit4]   2> 443337 T1905 C:control_collection c:collection1 oasup.UpdateRequestProcessorChain.init inserting DistributedUpdateProcessorFactory into updateRequestProcessorChain "distrib-dup-test-chain-implicit"
   [junit4]   2> 443337 T1905 C:control_collection c:collection1 oasc.SolrCore.loadUpdateProcessorChains no updateRequestProcessorChain defined as default, creating implicit default
   [junit4]   2> 443357 T1905 C:control_collection c:collection1 oashl.XMLLoader.init xsltCacheLifetimeSeconds=60
   [junit4]   2> 443360 T1905 C:control_collection c:collection1 oashl.XMLLoader.init xsltCacheLifetimeSeconds=60
   [junit4]   2> 443362 T1905 C:control_collection c:collection1 oashl.XMLLoader.init xsltCacheLifetimeSeconds=60
   [junit4]   2> 443364 T1905 C:control_collection c:collection1 oashl.XMLLoader.init xsltCacheLifetimeSeconds=60
   [junit4]   2> 443369 T1905 C:control_collection c:collection1 oasc.RequestHandlers.initHandlersFromConfig Registered paths: /admin/file,/admin/ping,/admin/luke,/admin/threads,/admin/properties,/admin/segments,/get,/admin/mbeans,/schema,/update/json/docs,/config,/update/csv,/admin/logging,/admin/plugins,/update,/update/json,/replication,/admin/system,standard
   [junit4]   2> 443371 T1905 C:control_collection c:collection1 oasc.SolrCore.initStatsCache Using default statsCache cache: org.apache.solr.search.stats.LocalStatsCache
   [junit4]   2> 443373 T1905 C:control_collection c:collection1 oasu.UpdateHandler.<init> Using UpdateLog implementation: org.apache.solr.update.UpdateLog
   [junit4]   2> 443373 T1905 C:control_collection c:collection1 oasu.UpdateLog.init Initializing UpdateLog: dataDir= defaultSyncLevel=FLUSH numRecordsToKeep=100 maxNumLogsToKeep=10
   [junit4]   2> 443374 T1905 C:control_collection c:collection1 oasu.CommitTracker.<init> Hard AutoCommit: disabled
   [junit4]   2> 443375 T1905 C:control_collection c:collection1 oasu.CommitTracker.<init> Soft AutoCommit: disabled
   [junit4]   2> 443375 T1905 C:control_collection c:collection1 oasu.RandomMergePolicy.<init> RandomMergePolicy wrapping class org.apache.lucene.index.TieredMergePolicy: [TieredMergePolicy: maxMergeAtOnce=39, maxMergeAtOnceExplicit=37, maxMergedSegmentMB=57.2275390625, floorSegmentMB=0.2529296875, forceMergeDeletesPctAllowed=20.90666064053401, segmentsPerTier=22.0, maxCFSSegmentSizeMB=8.796093022207999E12, noCFSRatio=1.0
   [junit4]   2> 443376 T1905 C:control_collection c:collection1 oasc.SolrDeletionPolicy.onInit SolrDeletionPolicy.onInit: commits: num=1
   [junit4]   2> 		commit{dir=MockDirectoryWrapper(RAMDirectory@45455d46 lockFactory=org.apache.lucene.store.SingleInstanceLockFactory@4ceec231),segFN=segments_1,generation=1}
   [junit4]   2> 443376 T1905 C:control_collection c:collection1 oasc.SolrDeletionPolicy.updateCommits newest commit generation = 1
   [junit4]   2> 443377 T1905 C:control_collection c:collection1 oass.SolrIndexSearcher.<init> Opening Searcher@73d0e76e[collection1] main
   [junit4]   2> 443377 T1905 C:control_collection c:collection1 oascc.ZkStateReader.readConfigName Load collection config from:/collections/control_collection
   [junit4]   2> 443377 T1905 C:control_collection c:collection1 oascc.ZkStateReader.readConfigName path=/collections/control_collection configName=conf1 specified config exists in ZooKeeper
   [junit4]   2> 443378 T1905 C:control_collection c:collection1 oasr.ManagedResourceStorage.newStorageIO Setting up ZooKeeper-based storage for the RestManager with znodeBase: /configs/conf1
   [junit4]   2> 443378 T1905 C:control_collection c:collection1 oasr.ManagedResourceStorage$ZooKeeperStorageIO.configure Configured ZooKeeperStorageIO with znodeBase: /configs/conf1
   [junit4]   2> 443378 T1905 C:control_collection c:collection1 oasr.RestManager.init Initializing RestManager with initArgs: {}
   [junit4]   2> 443378 T1905 C:control_collection c:collection1 oasr.ManagedResourceStorage.load Reading _rest_managed.json using ZooKeeperStorageIO:path=/configs/conf1
   [junit4]   2> 443379 T1905 C:control_collection c:collection1 oasr.ManagedResourceStorage$ZooKeeperStorageIO.openInputStream No data found for znode /configs/conf1/_rest_managed.json
   [junit4]   2> 443379 T1905 C:control_collection c:collection1 oasr.ManagedResourceStorage.load Loaded null at path _rest_managed.json using ZooKeeperStorageIO:path=/configs/conf1
   [junit4]   2> 443379 T1905 C:control_collection c:collection1 oasr.RestManager.init Initializing 0 registered ManagedResources
   [junit4]   2> 443380 T1905 C:control_collection c:collection1 oash.ReplicationHandler.inform Commits will be reserved for  10000
   [junit4]   2> 443380 T1905 C:control_collection c:collection1 oasc.CoreContainer.registerCore registering core: collection1
   [junit4]   2> 443381 T1906 C:control_collection c:collection1 oasc.SolrCore.registerSearcher [collection1] Registered new searcher Searcher@73d0e76e[collection1] main{ExitableDirectoryReader(UninvertingDirectoryReader())}
   [junit4]   2> 443381 T1909 C:control_collection S:shard1 oasc.ZkController.register Register replica - core:collection1 address:http://127.0.0.1:14245 collection:control_collection shard:shard1
   [junit4]   2> 443381 T1875 oass.SolrDispatchFilter.init user.dir=/usr/home/jenkins/jenkins-slave/workspace/Lucene-Solr-Tests-5.x-Java7/solr/build/solr-core/test/J3
   [junit4]   2> 443382 T1875 oass.SolrDispatchFilter.init SolrDispatchFilter.init() done
   [junit4]   2> 443382 T1909 C:control_collection S:shard1 oascc.SolrZkClient.makePath makePath: /collections/control_collection/leader_elect/shard1/election
   [junit4]   2> 443385 T1909 C:control_collection S:shard1 oasc.ShardLeaderElectionContext.runLeaderProcess Running the leader process for shard shard1
   [junit4]   2> 443386 T1901 oasc.DistributedQueue$LatchWatcher.process NodeChildrenChanged fired on path /overseer/queue state SyncConnected
   [junit4]   2> 443386 T1909 C:control_collection S:shard1 oasc.ShardLeaderElectionContext.waitForReplicasToComeUp Enough replicas found to continue.
   [junit4]   2> 443386 T1909 C:control_collection S:shard1 oasc.ShardLeaderElectionContext.runLeaderProcess I may be the new leader - try and sync
   [junit4]   2> 443386 T1875 oascc.SolrZkClient.createZkCredentialsToAddAutomatically Using default ZkCredentialsProvider
   [junit4]   2> 443386 T1902 oasc.Overseer$ClusterStateUpdater.run processMessage: queueSize: 1, message = {
   [junit4]   2> 	  "operation":"leader",
   [junit4]   2> 	  "shard":"shard1",
   [junit4]   2> 	  "collection":"control_collection"} current state version: 1
   [junit4]   2> ASYNC  NEW_CORE C206 name=collection1 org.apache.solr.core.SolrCore@1ab3596b url=http://127.0.0.1:14245/collection1 node=127.0.0.1:14245_ C206_STATE=coll:control_collection core:collection1 props:{state=down, base_url=http://127.0.0.1:14245, core=collection1, node_name=127.0.0.1:14245_}
   [junit4]   2> 443386 T1909 C:control_collection S:shard1 C206 P14245 oasc.SyncStrategy.sync Sync replicas to http://127.0.0.1:14245/collection1/
   [junit4]   2> 443387 T1875 oascc.ConnectionManager.waitForConnected Waiting for client to connect to ZooKeeper
   [junit4]   2> 443387 T1909 C:control_collection S:shard1 C206 P14245 oasc.SyncStrategy.syncReplicas Sync Success - now sync replicas to me
   [junit4]   2> 443388 T1909 C:control_collection S:shard1 C206 P14245 oasc.SyncStrategy.syncToMe http://127.0.0.1:14245/collection1/ has no replicas
   [junit4]   2> 443388 T1901 oascc.ZkStateReader$2.process A cluster state change: WatchedEvent state:SyncConnected type:NodeDataChanged path:/clusterstate.json, has occurred - updating... (live nodes size: 1)
   [junit4]   2> 443388 T1909 C:control_collection S:shard1 oasc.ShardLeaderElectionContext.runLeaderProcess I am the new leader: http://127.0.0.1:14245/collection1/ shard1
   [junit4]   2> 443388 T1909 C:control_collection S:shard1 oascc.SolrZkClient.makePath makePath: /collections/control_collection/leaders/shard1
   [junit4]   2> 443389 T1913 oascc.ConnectionManager.process Watcher org.apache.solr.common.cloud.ConnectionManager@7f02e185 name:ZooKeeperConnection Watcher:127.0.0.1:14242/solr got event WatchedEvent state:SyncConnected type:None path:null path:null type:None
   [junit4]   2> 443389 T1875 oascc.ConnectionManager.waitForConnected Client is connected to ZooKeeper
   [junit4]   2> 443389 T1875 oascc.SolrZkClient.createZkACLProvider Using default ZkACLProvider
   [junit4]   2> 443390 T1875 oascc.ZkStateReader.createClusterStateWatchersAndUpdate Updating cluster state from ZooKeeper... 
   [junit4]   2> 443391 T1901 oasc.DistributedQueue$LatchWatcher.process NodeChildrenChanged fired on path /overseer/queue state SyncConnected
   [junit4]   2> 443392 T1902 oasc.Overseer$ClusterStateUpdater.run processMessage: queueSize: 1, message = {
   [junit4]   2> 	  "operation":"leader",
   [junit4]   2> 	  "shard":"shard1",
   [junit4]   2> 	  "collection":"control_collection",
   [junit4]   2> 	  "base_url":"http://127.0.0.1:14245",
   [junit4]   2> 	  "core":"collection1",
   [junit4]   2> 	  "state":"active"} current state version: 2
   [junit4]   2> 443392 T1875 oasc.ChaosMonkey.monkeyLog monkey: init - expire sessions:false cause connection loss:false
   [junit4]   2> 443494 T1913 oascc.ZkStateReader$2.process A cluster state change: WatchedEvent state:SyncConnected type:NodeDataChanged path:/clusterstate.json, has occurred - updating... (live nodes size: 1)
   [junit4]   2> 443494 T1901 oascc.ZkStateReader$2.process A cluster state change: WatchedEvent state:SyncConnected type:NodeDataChanged path:/clusterstate.json, has occurred - updating... (live nodes size: 1)
   [junit4]   2> 443544 T1909 C:control_collection S:shard1 oasc.ZkController.register We are http://127.0.0.1:14245/collection1/ and leader is http://127.0.0.1:14245/collection1/
   [junit4]   2> 443545 T1909 C:control_collection S:shard1 oasc.ZkController.register No LogReplay needed for core=collection1 baseURL=http://127.0.0.1:14245
   [junit4]   2> 443545 T1909 C:control_collection S:shard1 oasc.ZkController.checkRecovery I am the leader, no recovery necessary
   [junit4]   2> 443545 T1909 C:control_collection S:shard1 c:collection1 oasc.ZkController.publish publishing core=collection1 state=active collection=control_collection
   [junit4]   2> 443545 T1909 C:control_collection S:shard1 c:collection1 oasc.ZkController.publish numShards not found on descriptor - reading it from system property
   [junit4]   2> 443546 T1901 oasc.DistributedQueue$LatchWatcher.process NodeChildrenChanged fired on path /overseer/queue state SyncConnected
   [junit4]   2> 443546 T1902 oasc.Overseer$ClusterStateUpdater.run processMessage: queueSize: 1, message = {
   [junit4]   2> 	  "roles":null,
   [junit4]   2> 	  "state":"active",
   [junit4]   2> 	  "base_url":"http://127.0.0.1:14245",
   [junit4]   2> 	  "numShards":"3",
   [junit4]   2> 	  "core":"collection1",
   [junit4]   2> 	  "operation":"state",
   [junit4]   2> 	  "core_node_name":"core_node1",
   [junit4]   2> 	  "collection":"control_collection",
   [junit4]   2> 	  "node_name":"127.0.0.1:14245_",
   [junit4]   2> 	  "shard":"shard1"} current state version: 3
   [junit4]   2> 443547 T1902 oasco.ReplicaMutator.updateState Update state numShards=3 message={
   [junit4]   2> 	  "roles":null,
   [junit4]   2> 	  "state":"active",
   [junit4]   2> 	  "base_url":"http://127.0.0.1:14245",
   [junit4]   2> 	  "numShards":"3",
   [junit4]   2> 	  "core":"collection1",
   [junit4]   2> 	  "operation":"state",
   [junit4]   2> 	  "core_node_name":"core_node1",
   [junit4]   2> 	  "collection":"control_collection",
   [junit4]   2> 	  "node_name":"127.0.0.1:14245_",
   [junit4]   2> 	  "shard":"shard1"}
   [junit4]   2> 443650 T1901 oascc.ZkStateReader$2.process A cluster state change: WatchedEvent state:SyncConnected type:NodeDataChanged path:/clusterstate.json, has occurred - updating... (live nodes size: 1)
   [junit4]   2> 443650 T1913 oascc.ZkStateReader$2.process A cluster state change: WatchedEvent state:SyncConnected type:NodeDataChanged path:/clusterstate.json, has occurred - updating... (live nodes size: 1)
   [junit4]   2> 444808 T1875 oas.SolrTestCaseJ4.writeCoreProperties Writing core.properties file to /usr/home/jenkins/jenkins-slave/workspace/Lucene-Solr-Tests-5.x-Java7/solr/build/solr-core/test/J3/temp/solr.cloud.ReplicationFactorTest 457F35F1A3900CAB-001/shard-1-001/cores/collection1
   [junit4]   2> 444811 T1875 oasc.AbstractFullDistribZkTestBase.createJettys create jetty 1 in directory /usr/home/jenkins/jenkins-slave/workspace/Lucene-Solr-Tests-5.x-Java7/solr/build/solr-core/test/J3/temp/solr.cloud.ReplicationFactorTest 457F35F1A3900CAB-001/shard-1-001
   [junit4]   2> 444812 T1875 oejs.Server.doStart jetty-8.1.10.v20130312
   [junit4]   2> 444815 T1875 oejs.AbstractConnector.doStart Started SocketConnector@127.0.0.1:14251
   [junit4]   2> 444815 T1875 oascse.JettySolrRunner$1.lifeCycleStarted Jetty properties: {coreRootDirectory=/usr/home/jenkins/jenkins-slave/workspace/Lucene-Solr-Tests-5.x-Java7/solr/build/solr-core/test/J3/temp/solr.cloud.ReplicationFactorTest 457F35F1A3900CAB-001/shard-1-001/cores, hostContext=/, solr.data.dir=/usr/home/jenkins/jenkins-slave/workspace/Lucene-Solr-Tests-5.x-Java7/solr/build/solr-core/test/J3/temp/solr.cloud.ReplicationFactorTest 457F35F1A3900CAB-001/tempDir-001/jetty1, solrconfig=solrconfig.xml, hostPort=14250}
   [junit4]   2> 444816 T1875 oass.SolrDispatchFilter.init SolrDispatchFilter.init()sun.misc.Launcher$AppClassLoader@57bd06bf
   [junit4]   2> 444816 T1875 oasc.SolrResourceLoader.<init> new SolrResourceLoader for directory: '/usr/home/jenkins/jenkins-slave/workspace/Lucene-Solr-Tests-5.x-Java7/solr/build/solr-core/test/J3/temp/solr.cloud.ReplicationFactorTest 457F35F1A3900CAB-001/shard-1-001/'
   [junit4]   2> 444856 T1875 oasc.SolrXmlConfig.fromFile Loading container configuration from /usr/home/jenkins/jenkins-slave/workspace/Lucene-Solr-Tests-5.x-Java7/solr/build/solr-core/test/J3/temp/solr.cloud.ReplicationFactorTest 457F35F1A3900CAB-001/shard-1-001/solr.xml
   [junit4]   2> 444896 T1875 oasc.CorePropertiesLocator.<init> Config-defined core root directory: /usr/home/jenkins/jenkins-slave/workspace/Lucene-Solr-Tests-5.x-Java7/solr/build/solr-core/test/J3/temp/solr.cloud.ReplicationFactorTest 457F35F1A3900CAB-001/shard-1-001/cores
   [junit4]   2> 444896 T1875 oasc.CoreContainer.<init> New CoreContainer 1555043384
   [junit4]   2> 444897 T1875 oasc.CoreContainer.load Loading cores into CoreContainer [instanceDir=/usr/home/jenkins/jenkins-slave/workspace/Lucene-Solr-Tests-5.x-Java7/solr/build/solr-core/test/J3/temp/solr.cloud.ReplicationFactorTest 457F35F1A3900CAB-001/shard-1-001/]
   [junit4]   2> 444897 T1875 oasc.CoreContainer.load loading shared library: /usr/home/jenkins/jenkins-slave/workspace/Lucene-Solr-Tests-5.x-Java7/solr/build/solr-core/test/J3/temp/solr.cloud.ReplicationFactorTest 457F35F1A3900CAB-001/shard-1-001/lib
   [junit4]   2> 444897 T1875 oasc.SolrResourceLoader.addToClassLoader WARN Can't find (or read) directory to add to classloader: lib (resolved as: /usr/home/jenkins/jenkins-slave/workspace/Lucene-Solr-Tests-5.x-Java7/solr/build/solr-core/test/J3/temp/solr.cloud.ReplicationFactorTest 457F35F1A3900CAB-001/shard-1-001/lib).
   [junit4]   2> 444906 T1875 oashc.HttpShardHandlerFactory.getParameter Setting socketTimeout to: 90000
   [junit4]   2> 444907 T1875 oashc.HttpShardHandlerFactory.getParameter Setting urlScheme to: 
   [junit4]   2> 444907 T1875 oashc.HttpShardHandlerFactory.getParameter Setting connTimeout to: 15000
   [junit4]   2> 444907 T1875 oashc.HttpShardHandlerFactory.getParameter Setting maxConnectionsPerHost to: 20
   [junit4]   2> 444907 T1875 oashc.HttpShardHandlerFactory.getParameter Setting maxConnections to: 10000
   [junit4]   2> 444908 T1875 oashc.HttpShardHandlerFactory.getParameter Setting corePoolSize to: 0
   [junit4]   2> 444908 T1875 oashc.HttpShardHandlerFactory.getParameter Setting maximumPoolSize to: 2147483647
   [junit4]   2> 444908 T1875 oashc.HttpShardHandlerFactory.getParameter Setting maxThreadIdleTime to: 5
   [junit4]   2> 444908 T1875 oashc.HttpShardHandlerFactory.getParameter Setting sizeOfQueue to: -1
   [junit4]   2> 444908 T1875 oashc.HttpShardHandlerFactory.getParameter Setting fairnessPolicy to: false
   [junit4]   2> 444909 T1875 oashc.HttpShardHandlerFactory.getParameter Setting useRetries to: false
   [junit4]   2> 444914 T1875 oasu.UpdateShardHandler.<init> Creating UpdateShardHandler HTTP client with params: socketTimeout=340000&connTimeout=45000&retry=true
   [junit4]   2> 444915 T1875 oasl.LogWatcher.createWatcher SLF4J impl is org.slf4j.impl.Log4jLoggerFactory
   [junit4]   2> 444915 T1875 oasl.LogWatcher.newRegisteredLogWatcher Registering Log Listener [Log4j (org.slf4j.impl.Log4jLoggerFactory)]
   [junit4]   2> 444915 T1875 oasc.CoreContainer.load Node Name: 127.0.0.1
   [junit4]   2> 444915 T1875 oasc.ZkContainer.initZooKeeper Zookeeper client=127.0.0.1:14242/solr
   [junit4]   2> 444916 T1875 oasc.ZkController.checkChrootPath zkHost includes chroot
   [junit4]   2> 444916 T1875 oascc.SolrZkClient.createZkCredentialsToAddAutomatically Using default ZkCredentialsProvider
   [junit4]   2> 444917 T1875 oascc.ConnectionManager.waitForConnected Waiting for client to connect to ZooKeeper
   [junit4]   2> 444918 T1925 oascc.ConnectionManager.process Watcher org.apache.solr.common.cloud.ConnectionManager@3fa3586c name:ZooKeeperConnection Watcher:127.0.0.1:14242 got event WatchedEvent state:SyncConnected type:None path:null path:null type:None
   [junit4]   2> 444919 T1875 oascc.ConnectionManager.waitForConnected Client is connected to ZooKeeper
   [junit4]   2> 444920 T1875 oascc.SolrZkClient.createZkACLProvider Using default ZkACLProvider
   [junit4]   2> 444921 T1875 oascc.ConnectionManager.waitForConnected Waiting for client to connect to ZooKeeper
   [junit4]   2> 444922 T1928 oascc.ConnectionManager.process Watcher org.apache.solr.common.cloud.ConnectionManager@128b39c7 name:ZooKeeperConnection Watcher:127.0.0.1:14242/solr got event WatchedEvent state:SyncConnected type:None path:null path:null type:None
   [junit4]   2> 444922 T1875 oascc.ConnectionManager.waitForConnected Client is connected to ZooKeeper
   [junit4]   2> 444925 T1875 oascc.ZkStateReader.createClusterStateWatchersAndUpdate Updating cluster state from ZooKeeper... 
   [junit4]   2> 445928 T1875 oasc.ZkController.createEphemeralLiveNode Register node as live in ZooKeeper:/live_nodes/127.0.0.1:14250_
   [junit4]   2> 445929 T1875 oascc.SolrZkClient.makePath makePath: /live_nodes/127.0.0.1:14250_
   [junit4]   2> 445932 T1875 oasc.Overseer.close Overseer (id=null) closing
   [junit4]   2> 445934 T1875 oasc.CorePropertiesLocator.discover Looking for core definitions underneath /usr/home/jenkins/jenkins-slave/workspace/Lucene-Solr-Tests-5.x-Java7/solr/build/solr-core/test/J3/temp/solr.cloud.ReplicationFactorTest 457F35F1A3900CAB-001/shard-1-001/cores
   [junit4]   2> 445935 T1875 oasc.CoreDescriptor.<init> CORE DESCRIPTOR: {transient=false, shard=, coreNodeName=, absoluteInstDir=/usr/home/jenkins/jenkins-slave/workspace/Lucene-Solr-Tests-5.x-Java7/solr/build/solr-core/test/J3/temp/solr.cloud.ReplicationFactorTest 457F35F1A3900CAB-001/shard-1-001/cores/collection1/, config=solrconfig.xml, dataDir=data/, collection=collection1, loadOnStartup=true, instanceDir=/usr/home/jenkins/jenkins-slave/workspace/Lucene-Solr-Tests-5.x-Java7/solr/build/solr-core/test/J3/temp/solr.cloud.ReplicationFactorTest 457F35F1A3900CAB-001/shard-1-001/cores/collection1, name=collection1, schema=schema.xml}
   [junit4]   2> 445936 T1875 oasc.CorePropertiesLocator.discoverUnder Found core collection1 in /usr/home/jenkins/jenkins-slave/workspace/Lucene-Solr-Tests-5.x-Java7/solr/build/solr-core/test/J3/temp/solr.cloud.ReplicationFactorTest 457F35F1A3900CAB-001/shard-1-001/cores/collection1/
   [junit4]   2> 445936 T1875 oasc.CorePropertiesLocator.discover Found 1 core definitions
   [junit4]   2> 445937 T1929 C:collection1 c:collection1 oasc.ZkController.publish publishing core=collection1 state=down collection=collection1
   [junit4]   2> 445937 T1929 C:collection1 c:collection1 oasc.ZkController.publish numShards not found on descriptor - reading it from system property
   [junit4]   2> 445937 T1929 C:collection1 c:collection1 oasc.ZkController.waitForCoreNodeName look for our core node name
   [junit4]   2> 445937 T1901 oasc.DistributedQueue$LatchWatcher.process NodeChildrenChanged fired on path /overseer/queue state SyncConnected
   [junit4]   2> 445938 T1902 oasc.Overseer$ClusterStateUpdater.run processMessage: queueSize: 1, message = {
   [junit4]   2> 	  "roles":null,
   [junit4]   2> 	  "state":"down",
   [junit4]   2> 	  "base_url":"http://127.0.0.1:14250",
   [junit4]   2> 	  "numShards":"3",
   [junit4]   2> 	  "core":"collection1",
   [junit4]   2> 	  "operation":"state",
   [junit4]   2> 	  "collection":"collection1",
   [junit4]   2> 	  "node_name":"127.0.0.1:14250_",
   [junit4]   2> 	  "shard":null} current state version: 4
   [junit4]   2> 445938 T1902 oasco.ReplicaMutator.updateState Update state numShards=3 message={
   [junit4]   2> 	  "roles":null,
   [junit4]   2> 	  "state":"down",
   [junit4]   2> 	  "base_url":"http://127.0.0.1:14250",
   [junit4]   2> 	  "numShards":"3",
   [junit4]   2> 	  "core":"collection1",
   [junit4]   2> 	  "operation":"state",
   [junit4]   2> 	  "collection":"collection1",
   [junit4]   2> 	  "node_name":"127.0.0.1:14250_",
   [junit4]   2> 	  "shard":null}
   [junit4]   2> 445939 T1902 oasco.ClusterStateMutator.createCollection building a new cName: collection1
   [junit4]   2> 445939 T1902 oasco.ReplicaMutator.updateState Assigning new node to shard shard=shard3
   [junit4]   2> 445940 T1901 oascc.ZkStateReader$2.process A cluster state change: WatchedEvent state:SyncConnected type:NodeDataChanged path:/clusterstate.json, has occurred - updating... (live nodes size: 2)
   [junit4]   2> 445940 T1928 oascc.ZkStateReader$2.process A cluster state change: WatchedEvent state:SyncConnected type:NodeDataChanged path:/clusterstate.json, has occurred - updating... (live nodes size: 2)
   [junit4]   2> 445940 T1913 oascc.ZkStateReader$2.process A cluster state change: WatchedEvent state:SyncConnected type:NodeDataChanged path:/clusterstate.json, has occurred - updating... (live nodes size: 2)
   [junit4]   2> 446938 T1929 C:collection1 c:collection1 oasc.ZkController.waitForShardId waiting to find shard id in clusterstate for collection1
   [junit4]   2> 446939 T1929 C:collection1 c:collection1 oasc.ZkController.createCollectionZkNode Check for collection zkNode:collection1
   [junit4]   2> 446939 T1929 C:collection1 c:collection1 oasc.ZkController.createCollectionZkNode Collection zkNode exists
   [junit4]   2> 446939 T1929 C:collection1 c:collection1 oascc.ZkStateReader.readConfigName Load collection config from:/collections/collection1
   [junit4]   2> 446940 T1929 C:collection1 c:collection1 oascc.ZkStateReader.readConfigName path=/collections/collection1 configName=conf1 specified config exists in ZooKeeper
   [junit4]   2> 446940 T1929 C:collection1 c:collection1 oasc.SolrResourceLoader.<init> new SolrResourceLoader for directory: '/usr/home/jenkins/jenkins-slave/workspace/Lucene-Solr-Tests-5.x-Java7/solr/build/solr-core/test/J3/temp/solr.cloud.ReplicationFactorTest 457F35F1A3900CAB-001/shard-1-001/cores/collection1/'
   [junit4]   2> 446954 T1929 C:collection1 c:collection1 oasc.ZkController.watchZKConfDir watch zkdir /configs/conf1
   [junit4]   2> 446956 T1929 C:collection1 c:collection1 oasc.Config.<init> loaded config solrconfig.xml with version 0 
   [junit4]   2> 446965 T1929 C:collection1 c:collection1 oasc.SolrConfig.refreshRequestParams current version of requestparams : -1
   [junit4]   2> 446982 T1929 C:collection1 c:collection1 oasc.SolrConfig.<init> Using Lucene MatchVersion: 5.2.0
   [junit4]   2> 447020 T1929 C:collection1 c:collection1 oasc.SolrConfig.<init> Loaded SolrConfig: solrconfig.xml
   [junit4]   2> 447121 T1929 C:collection1 c:collection1 oass.IndexSchema.readSchema Reading Solr Schema from /configs/conf1/schema.xml
   [junit4]   2> 447129 T1929 C:collection1 c:collection1 oass.IndexSchema.readSchema [collection1] Schema name=test
   [junit4]   2> 447470 T1929 C:collection1 c:collection1 oass.OpenExchangeRatesOrgProvider.init Initialized with rates=open-exchange-rates.json, refreshInterval=1440.
   [junit4]   2> 447482 T1929 C:collection1 c:collection1 oass.IndexSchema.readSchema default search field in schema is text
   [junit4]   2> 447484 T1929 C:collection1 c:collection1 oass.IndexSchema.readSchema unique key field: id
   [junit4]   2> 447492 T1929 C:collection1 c:collection1 oass.FileExchangeRateProvider.reload Reloading exchange rates from file currency.xml
   [junit4]   2> 447495 T1929 C:collection1 c:collection1 oass.FileExchangeRateProvider.reload Reloading exchange rates from file currency.xml
   [junit4]   2> 447498 T1929 C:collection1 c:collection1 oass.OpenExchangeRatesOrgProvider.reload Reloading exchange rates from open-exchange-rates.json
   [junit4]   2> 447498 T1929 C:collection1 c:collection1 oass.OpenExchangeRatesOrgProvider$OpenExchangeRates.<init> WARN Unknown key IMPORTANT NOTE
   [junit4]   2> 447498 T1929 C:collection1 c:collection1 oass.OpenExchangeRatesOrgProvider$OpenExchangeRates.<init> WARN Expected key, got STRING
   [junit4]   2> 447498 T1929 C:collection1 c:collection1 oass.OpenExchangeRatesOrgProvider.reload Reloading exchange rates from open-exchange-rates.json
   [junit4]   2> 447499 T1929 C:collection1 c:collection1 oass.OpenExchangeRatesOrgProvider$OpenExchangeRates.<init> WARN Unknown key IMPORTANT NOTE
   [junit4]   2> 447499 T1929 C:collection1 c:collection1 oass.OpenExchangeRatesOrgProvider$OpenExchangeRates.<init> WARN Expected key, got STRING
   [junit4]   2> 447499 T1929 C:collection1 c:collection1 oasc.CoreContainer.create Creating SolrCore 'collection1' using configuration from collection collection1
   [junit4]   2> 447499 T1929 C:collection1 c:collection1 oasc.SolrCore.initDirectoryFactory org.apache.solr.core.MockDirectoryFactory
   [junit4]   2> 447500 T1929 C:collection1 c:collection1 oasc.SolrCore.<init> [collection1] Opening new SolrCore at /usr/home/jenkins/jenkins-slave/workspace/Lucene-Solr-Tests-5.x-Java7/solr/build/solr-core/test/J3/temp/solr.cloud.ReplicationFactorTest 457F35F1A3900CAB-001/shard-1-001/cores/collection1/, dataDir=/usr/home/jenkins/jenkins-slave/workspace/Lucene-Solr-Tests-5.x-Java7/solr/build/solr-core/test/J3/temp/solr.cloud.ReplicationFactorTest 457F35F1A3900CAB-001/shard-1-001/cores/collection1/data/
   [junit4]   2> 447500 T1929 C:collection1 c:collection1 oasc.JmxMonitoredMap.<init> JMX monitoring is enabled. Adding Solr mbeans to JMX Server: com.sun.jmx.mbeanserver.JmxMBeanServer@42d7ecc1
   [junit4]   2> 447501 T1929 C:collection1 c:collection1 oasc.CachingDirectoryFactory.get return new directory for /usr/home/jenkins/jenkins-slave/workspace/Lucene-Solr-Tests-5.x-Java7/solr/build/solr-core/test/J3/temp/solr.cloud.ReplicationFactorTest 457F35F1A3900CAB-001/shard-1-001/cores/collection1/data
   [junit4]   2> 447501 T1929 C:collection1 c:collection1 oasc.SolrCore.getNewIndexDir New index directory detected: old=null new=/usr/home/jenkins/jenkins-slave/workspace/Lucene-Solr-Tests-5.x-Java7/solr/build/solr-core/test/J3/temp/solr.cloud.ReplicationFactorTest 457F35F1A3900CAB-001/shard-1-001/cores/collection1/data/index/
   [junit4]   2> 447501 T1929 C:collection1 c:collection1 oasc.SolrCore.initIndex WARN [collection1] Solr index directory '/usr/home/jenkins/jenkins-slave/workspace/Lucene-Solr-Tests-5.x-Java7/solr/build/solr-core/test/J3/temp/solr.cloud.ReplicationFactorTest 457F35F1A3900CAB-001/shard-1-001/cores/collection1/data/index' doesn't exist. Creating new index...
   [junit4]   2> 447501 T1929 C:collection1 c:collection1 oasc.CachingDirectoryFactory.get return new directory for /usr/home/jenkins/jenkins-slave/workspace/Lucene-Solr-Tests-5.x-Java7/solr/build/solr-core/test/J3/temp/solr.cloud.ReplicationFactorTest 457F35F1A3900CAB-001/shard-1-001/cores/collection1/data/index
   [junit4]   2> 447501 T1929 C:collection1 c:collection1 oasu.RandomMergePolicy.<init> RandomMergePolicy wrapping class org.apache.lucene.index.LogDocMergePolicy: [LogDocMergePolicy: minMergeSize=1000, mergeFactor=42, maxMergeSize=9223372036854775807, maxMergeSizeForForcedMerge=9223372036854775807, calibrateSizeByDeletes=true, maxMergeDocs=2147483647, maxCFSSegmentSizeMB=8.796093022207999E12, noCFSRatio=0.6542973963737145]
   [junit4]   2> 447502 T1929 C:collection1 c:collection1 oasc.SolrDeletionPolicy.onCommit SolrDeletionPolicy.onCommit: commits: num=1
   [junit4]   2> 		commit{dir=MockDirectoryWrapper(RAMDirectory@a1b712e lockFactory=org.apache.lucene.store.SingleInstanceLockFactory@fa38831),segFN=segments_1,generation=1}
   [junit4]   2> 447502 T1929 C:collection1 c:collection1 oasc.SolrDeletionPolicy.updateCommits newest commit generation = 1
   [junit4]   2> 447507 T1929 C:collection1 c:collection1 oasup.UpdateRequestProcessorChain.init creating updateRequestProcessorChain "nodistrib"
   [junit4]   2> 447507 T1929 C:collection1 c:collection1 oasup.UpdateRequestProcessorChain.init creating updateRequestProcessorChain "dedupe"
   [junit4]   2> 447507 T1929 C:collection1 c:collection1 oasup.UpdateRequestProcessorChain.init inserting DistributedUpdateProcessorFactory into updateRequestProcessorChain "dedupe"
   [junit4]   2> 447508 T1929 C:collection1 c:collection1 oasup.UpdateRequestProcessorChain.init creating updateRequestProcessorChain "stored_sig"
   [junit4]   2> 447508 T1929 C:collection1 c:collection1 oasup.UpdateRequestProcessorChain.init inserting DistributedUpdateProcessorFactory into updateRequestProcessorChain "stored_sig"
   [junit4]   2> 447508 T1929 C:collection1 c:collection1 oasup.UpdateRequestProcessorChain.init creating updateRequestProcessorChain "distrib-dup-test-chain-explicit"
   [junit4]   2> 447508 T1929 C:collection1 c:collection1 oasup.UpdateRequestProcessorChain.init creating updateRequestProcessorChain "distrib-dup-test-chain-implicit"
   [junit4]   2> 447509 T1929 C:collection1 c:collection1 oasup.UpdateRequestProcessorChain.init inserting DistributedUpdateProcessorFactory into updateRequestProcessorChain "distrib-dup-test-chain-implicit"
   [junit4]   2> 447509 T1929 C:collection1 c:collection1 oasc.SolrCore.loadUpdateProcessorChains no updateRequestProcessorChain defined as default, creating implicit default
   [junit4]   2> 447523 T1929 C:collection1 c:collection1 oashl.XMLLoader.init xsltCacheLifetimeSeconds=60
   [junit4]   2> 447524 T1929 C:collection1 c:collection1 oashl.XMLLoader.init xsltCacheLifetimeSeconds=60
   [junit4]   2> 447526 T1929 C:collection1 c:collection1 oashl.XMLLoader.init xsltCacheLifetimeSeconds=60
   [junit4]   2> 447528 T1929 C:collection1 c:collection1 oashl.XMLLoader.init xsltCacheLifetimeSeconds=60
   [junit4]   2> 447533 T1929 C:collection1 c:collection1 oasc.RequestHandlers.initHandlersFromConfig Registered paths: /admin/file,/admin/ping,/admin/luke,/admin/threads,/admin/properties,/admin/segments,/get,/admin/mbeans,/schema,/update/json/docs,/config,/update/csv,/admin/logging,/admin/plugins,/update,/update/json,/replication,/admin/system,standard
   [junit4]   2> 447535 T1929 C:collection1 c:collection1 oasc.SolrCore.initStatsCache Using default statsCache cache: org.apache.solr.search.stats.LocalStatsCache
   [junit4]   2> 447536 T1929 C:collection1 c:collection1 oasu.UpdateHandler.<init> Using UpdateLog implementation: org.apache.solr.update.UpdateLog
   [junit4]   2> 447536 T1929 C:collection1 c:collection1 oasu.UpdateLog.init Initializing UpdateLog: dataDir= defaultSyncLevel=FLUSH numRecordsToKeep=100 maxNumLogsToKeep=10
   [junit4]   2> 447537 T1929 C:collection1 c:collection1 oasu.CommitTracker.<init> Hard AutoCommit: disabled
   [junit4]   2> 447537 T1929 C:collection1 c:collection1 oasu.CommitTracker.<init> Soft AutoCommit: disabled
   [junit4]   2> 447539 T1929 C:collection1 c:collection1 oasu.RandomMergePolicy.<init> RandomMergePolicy wrapping class org.apache.lucene.index.TieredMergePolicy: [TieredMergePolicy: maxMergeAtOnce=39, maxMergeAtOnceExplicit=37, maxMergedSegmentMB=57.2275390625, floorSegmentMB=0.2529296875, forceMergeDeletesPctAllowed=20.90666064053401, segmentsPerTier=22.0, maxCFSSegmentSizeMB=8.796093022207999E12, noCFSRatio=1.0
   [junit4]   2> 447539 T1929 C:collection1 c:collection1 oasc.SolrDeletionPolicy.onInit SolrDeletionPolicy.onInit: commits: num=1
   [junit4]   2> 		commit{dir=MockDirectoryWrapper(RAMDirectory@a1b712e lockFactory=org.apache.lucene.store.SingleInstanceLockFactory@fa38831),segFN=segments_1,generation=1}
   [junit4]   2> 447539 T1929 C:collection1 c:collection1 oasc.SolrDeletionPolicy.updateCommits newest commit generation = 1
   [junit4]   2> 447540 T1929 C:collection1 c:collection1 oass.SolrIndexSearcher.<init> Opening Searcher@57b843f7[collection1] main
   [junit4]   2> 447540 T1929 C:collection1 c:collection1 oascc.ZkStateReader.readConfigName Load collection config from:/collections/collection1
   [junit4]   2> 447540 T1929 C:collection1 c:collection1 oascc.ZkStateReader.readConfigName path=/collections/collection1 configName=conf1 specified config exists in ZooKeeper
   [junit4]   2> 447541 T1929 C:collection1 c:collection1 oasr.ManagedResourceStorage.newStorageIO Setting up ZooKeeper-based storage for the RestManager with znodeBase: /configs/conf1
   [junit4]   2> 447541 T1929 C:collection1 c:collection1 oasr.ManagedResourceStorage$ZooKeeperStorageIO.configure Configured ZooKeeperStorageIO with znodeBase: /configs/conf1
   [junit4]   2> 447541 T1929 C:collection1 c:collection1 oasr.RestManager.init Initializing RestManager with initArgs: {}
   [junit4]   2> 447541 T1929 C:collection1 c:collection1 oasr.ManagedResourceStorage.load Reading _rest_managed.json using ZooKeeperStorageIO:path=/configs/conf1
   [junit4]   2> 447542 T1929 C:collection1 c:collection1 oasr.ManagedResourceStorage$ZooKeeperStorageIO.openInputStream No data found for znode /configs/conf1/_rest_managed.json
   [junit4]   2> 447542 T1929 C:collection1 c:collection1 oasr.ManagedResourceStorage.load Loaded null at path _rest_managed.json using ZooKeeperStorageIO:path=/configs/conf1
   [junit4]   2> 447542 T1929 C:collection1 c:collection1 oasr.RestManager.init Initializing 0 registered ManagedResources
   [junit4]   2> 447542 T1929 C:collection1 c:collection1 oash.ReplicationHandler.inform Commits will be reserved for  10000
   [junit4]   2> 447543 T1930 C:collection1 c:collection1 oasc.SolrCore.registerSearcher [collection1] Registered new searcher Searcher@57b843f7[collection1] main{ExitableDirectoryReader(UninvertingDirectoryReader())}
   [junit4]   2> 447543 T1929 C:collection1 c:collection1 oasc.CoreContainer.registerCore registering core: collection1
   [junit4]   2> 447544 T1933 C:collection1 S:shard3 oasc.ZkController.register Register replica - core:collection1 address:http://127.0.0.1:14250 collection:collection1 shard:shard3
   [junit4]   2> 447544 T1875 oass.SolrDispatchFilter.init user.dir=/usr/home/jenkins/jenkins-slave/workspace/Lucene-Solr-Tests-5.x-Java7/solr/build/solr-core/test/J3
   [junit4]   2> 447544 T1875 oass.SolrDispatchFilter.init SolrDispatchFilter.init() done
   [junit4]   2> 447545 T1933 C:collection1 S:shard3 oascc.SolrZkClient.makePath makePath: /collections/collection1/leader_elect/shard3/election
   [junit4]   2> 447548 T1933 C:collection1 S:shard3 oasc.ShardLeaderElectionContext.runLeaderProcess Running the leader process for shard shard3
   [junit4]   2> 447549 T1901 oasc.DistributedQueue$LatchWatcher.process NodeChildrenChanged fired on path /overseer/queue state SyncConnected
   [junit4]   2> 447549 T1933 C:collection1 S:shard3 oasc.ShardLeaderElectionContext.waitForReplicasToComeUp Enough replicas found to continue.
   [junit4]   2> 447549 T1933 C:collection1 S:shard3 oasc.ShardLeaderElectionContext.runLeaderProcess I may be the new leader - try and sync
   [junit4]   2> ASYNC  NEW_CORE C207 name=collection1 org.apache.solr.core.SolrCore@ab3b34e url=http://127.0.0.1:14250/collection1 node=127.0.0.1:14250_ C207_STATE=coll:collection1 core:collection1 props:{state=down, base_url=http://127.0.0.1:14250, core=collection1, node_name=127.0.0.1:14250_}
   [junit4]   2> 447549 T1933 C:collection1 S:shard3 C207 P14250 oasc.SyncStrategy.sync Sync replicas to http://127.0.0.1:14250/collection1/
   [junit4]   2> 447549 T1902 oasc.Overseer$ClusterStateUpdater.run processMessage: queueSize: 1, message = {
   [junit4]   2> 	  "operation":"leader",
   [junit4]   2> 	  "shard":"shard3",
   [junit4]   2> 	  "collection":"collection1"} current state version: 5
   [junit4]   2> 447549 T1933 C:collection1 S:shard3 C207 P14250 oasc.SyncStrategy.syncReplicas Sync Success - now sync replicas to me
   [junit4]   2> 447549 T1933 C:collection1 S:shard3 C207 P14250 oasc.SyncStrategy.syncToMe http://127.0.0.1:14250/collection1/ has no replicas
   [junit4]   2> 447550 T1933 C:collection1 S:shard3 oasc.ShardLeaderElectionContext.runLeaderProcess I am the new leader: http://127.0.0.1:14250/collection1/ shard3
   [junit4]   2> 447550 T1933 C:collection1 S:shard3 oascc.SolrZkClient.makePath makePath: /collections/collection1/leaders/shard3
   [junit4]   2> 447550 T1901 oascc.ZkStateReader$2.process A cluster state change: WatchedEvent state:SyncConnected type:NodeDataChanged path:/clusterstate.json, has occurred - updating... (live nodes size: 2)
   [junit4]   2> 447550 T1928 oascc.ZkStateReader$2.process A cluster state change: WatchedEvent state:SyncConnected type:NodeDataChanged path:/clusterstate.json, has occurred - updating... (live nodes size: 2)
   [junit4]   2> 447550 T1913 oascc.ZkStateReader$2.process A cluster state change: WatchedEvent state:SyncConnected type:NodeDataChanged path:/clusterstate.json, has occurred - updating... (live nodes size: 2)
   [junit4]   2> 447553 T1901 oasc.DistributedQueue$LatchWatcher.process NodeChildrenChanged fired on path /overseer/queue state SyncConnected
   [junit4]   2> 447553 T1902 oasc.Overseer$ClusterStateUpdater.run processMessage: queueSize: 1, message = {
   [junit4]   2> 	  "operation":"leader",
   [junit4]   2> 	  "shard":"shard3",
   [junit4]   2> 	  "collection":"collection1",
   [junit4]   2> 	  "base_url":"http://127.0.0.1:14250",
   [junit4]   2> 	  "core":"collection1",
   [junit4]   2> 	  "state":"active"} current state version: 6
   [junit4]   2> 447655 T1901 oascc.ZkStateReader$2.process A cluster state change: WatchedEvent state:SyncConnected type:NodeDataChanged path:/clusterstate.json, has occurred - updating... (live nodes size: 2)
   [junit4]   2> 447655 T1913 oascc.ZkStateReader$2.process A cluster state change: WatchedEvent state:SyncConnected type:NodeDataChanged path:/clusterstate.json, has occurred - updating... (live nodes size: 2)
   [junit4]   2> 447655 T1928 oascc.ZkStateReader$2.process A cluster state change: WatchedEvent state:SyncConnected type:NodeDataChanged path:/clusterstate.json, has occurred - updating... (live nodes size: 2)
   [junit4]   2> 447705 T1933 C:collection1 S:shard3 oasc.ZkController.register We are http://127.0.0.1:14250/collection1/ and leader is http://127.0.0.1:14250/collection1/
   [junit4]   2> 447706 T1933 C:collection1 S:shard3 oasc.ZkController.register No LogReplay needed for core=collection1 baseURL=http://127.0.0.1:14250
   [junit4]   2> 447706 T1933 C:collection1 S:shard3 oasc.ZkController.checkRecovery I am the leader, no recovery necessary
   [junit4]   2> 447706 T1933 C:collection1 S:shard3 c:collection1 oasc.ZkController.publish publishing core=collection1 state=active collection=collection1
   [junit4]   2> 447706 T1933 C:collection1 S:shard3 c:collection1 oasc.ZkController.publish numShards not found on descriptor - reading it from system property
   [junit4]   2> 447707 T1901 oasc.DistributedQueue$LatchWatcher.process NodeChildrenChanged fired on path /overseer/queue state SyncConnected
   [junit4]   2> 447708 T1902 oasc.Overseer$ClusterStateUpdater.run processMessage: queueSize: 1, message = {
   [junit4]   2> 	  "roles":null,
   [junit4]   2> 	  "state":"active",
   [junit4]   2> 	  "base_url":"http://127.0.0.1:14250",
   [junit4]   2> 	  "numShards":"3",
   [junit4]   2> 	  "core":"collection1",
   [junit4]   2> 	  "operation":"state",
   [junit4]   2> 	  "core_node_name":"core_node1",
   [junit4]   2> 	  "collection":"collection1",
   [junit4]   2> 	  "node_name":"127.0.0.1:14250_",
   [junit4]   2> 	  "shard":"shard3"} current state version: 7
   [junit4]   2> 447709 T1902 oasco.ReplicaMutator.updateState Update state numShards=3 message={
   [junit4]   2> 	  "roles":null,
   [junit4]   2> 	  "state":"active",
   [junit4]   2> 	  "base_url":"http://127.0.0.1:14250",
   [junit4]   2> 	  "numShards":"3",
   [junit4]   2> 	  "core":"collection1",
   [junit4]   2> 	  "operation":"state",
   [junit4]   2> 	  "core_node_name":"core_node1",
   [junit4]   2> 	  "collection":"collection1",
   [junit4]   2> 	  "node_name":"127.0.0.1:14250_",
   [junit4]   2> 	  "shard":"shard3"}
   [junit4]   2> 447811 T1928 oascc.ZkStateReader$2.process A cluster state change: WatchedEvent state:SyncConnected type:NodeDataChanged path:/clusterstate.json, has occurred - updating... (live nodes size: 2)
   [junit4]   2> 447811 T1901 oascc.ZkStateReader$2.process A cluster state change: WatchedEvent state:SyncConnected type:NodeDataChanged path:/clusterstate.json, has occurred - updating... (live nodes size: 2)
   [junit4]   2> 447811 T1913 oascc.ZkStateReader$2.process A cluster state change: WatchedEvent state:SyncConnected type:NodeDataChanged path:/clusterstate.json, has occurred - updating... (live nodes size: 2)
   [junit4]   2> 448664 T1875 oas.SolrTestCaseJ4.writeCoreProperties Writing core.properties file to /usr/home/jenkins/jenkins-slave/workspace/Lucene-Solr-Tests-5.x-Java7/solr/build/solr-core/test/J3/temp/solr.cloud.ReplicationFactorTest 457F35F1A3900CAB-001/shard-2-001/cores/collection1
   [junit4]   2> 448666 T1875 oasc.AbstractFullDistribZkTestBase.createJettys create jetty 2 in directory /usr/home/jenkins/jenkins-slave/workspace/Lucene-Solr-Tests-5.x-Java7/solr/build/solr-core/test/J3/temp/solr.cloud.ReplicationFactorTest 457F35F1A3900CAB-001/shard-2-001
   [junit4]   2> 448668 T1875 oejs.Server.doStart jetty-8.1.10.v20130312
   [junit4]   2> 448670 T1875 oejs.AbstractConnector.doStart Started SocketConnector@127.0.0.1:14256
   [junit4]   2> 448670 T1875 oascse.JettySolrRunner$1.lifeCycleStarted Jetty properties: {hostContext=/, hostPort=14255, solrconfig=solrconfig.xml, coreRootDirectory=/usr/home/jenkins/jenkins-slave/workspace/Lucene-Solr-Tests-5.x-Java7/solr/build/solr-core/test/J3/temp/solr.cloud.ReplicationFactorTest 457F35F1A3900CAB-001/shard-2-001/cores, solr.data.dir=/usr/home/jenkins/jenkins-slave/workspace/Lucene-Solr-Tests-5.x-Java7/solr/build/solr-core/test/J3/temp/solr.cloud.ReplicationFactorTest 457F35F1A3900CAB-001/tempDir-001/jetty2}
   [junit4]   2> 448671 T1875 oass.SolrDispatchFilter.init SolrDispatchFilter.init()sun.misc.Launcher$AppClassLoader@57bd06bf
   [junit4]   2> 448671 T1875 oasc.SolrResourceLoader.<init> new SolrResourceLoader for directory: '/usr/home/jenkins/jenkins-slave/workspace/Lucene-Solr-Tests-5.x-Java7/solr/build/solr-core/test/J3/temp/solr.cloud.ReplicationFactorTest 457F35F1A3900CAB-001/shard-2-001/'
   [junit4]   2> 448720 T1875 oasc.SolrXmlConfig.fromFile Loading container configuration from /usr/home/jenkins/jenkins-slave/workspace/Lucene-Solr-Tests-5.x-Java7/solr/build/solr-core/test/J3/temp/solr.cloud.ReplicationFactorTest 457F35F1A3900CAB-001/shard-2-001/solr.xml
   [junit4]   2> 448781 T1875 oasc.CorePropertiesLocator.<init> Config-defined core root directory: /usr/home/jenkins/jenkins-slave/workspace/Lucene-Solr-Tests-5.x-Java7/solr/build/solr-core/test/J3/temp/solr.cloud.ReplicationFactorTest 457F35F1A3900CAB-001/shard-2-001/cores
   [junit4]   2> 448781 T1875 oasc.CoreContainer.<init> New CoreContainer 2041762435
   [junit4]   2> 448782 T1875 oasc.CoreContainer.load Loading cores into CoreContainer [instanceDir=/usr/home/jenkins/jenkins-slave/workspace/Lucene-Solr-Tests-5.x-Java7/solr/build/solr-core/test/J3/temp/solr.cloud.ReplicationFactorTest 457F35F1A3900CAB-001/shard-2-001/]
   [junit4]   2> 448782 T1875 oasc.CoreContainer.load loading shared library: /usr/home/jenkins/jenkins-slave/workspace/Lucene-Solr-Tests-5.x-Java7/solr/build/solr-core/test/J3/temp/solr.cloud.ReplicationFactorTest 457F35F1A3900CAB-001/shard-2-001/lib
   [junit4]   2> 448783 T1875 oasc.SolrResourceLoader.addToClassLoader WARN Can't find (or read) directory to add to classloader: lib (resolved as: /usr/home/jenkins/jenkins-slave/workspace/Lucene-Solr-Tests-5.x-Java7/solr/build/solr-core/test/J3/temp/solr.cloud.ReplicationFactorTest 457F35F1A3900CAB-001/shard-2-001/lib).
   [junit4]   2> 448797 T1875 oashc.HttpShardHandlerFactory.getParameter Setting socketTimeout to: 90000
   [junit4]   2> 448797 T1875 oashc.HttpShardHandlerFactory.getParameter Setting urlScheme to: 
   [junit4]   2> 448798 T1875 oashc.HttpShardHandlerFactory.getParameter Setting connTimeout to: 15000
   [junit4]   2> 448798 T1875 oashc.HttpShardHandlerFactory.getParameter Setting maxConnectionsPerHost to: 20
   [junit4]   2> 448798 T1875 oashc.HttpShardHandlerFactory.getParameter Setting maxConnections to: 10000
   [junit4]   2> 448799 T1875 oashc.HttpShardHandlerFactory.getParameter Setting corePoolSize to: 0
   [junit4]   2> 448799 T1875 oashc.HttpShardHandlerFactory.getParameter Setting maximumPoolSize to: 2147483647
   [junit4]   2> 448799 T1875 oashc.HttpShardHandlerFactory.getParameter Setting maxThreadIdleTime to: 5
   [junit4]   2> 448800 T1875 oashc.HttpShardHandlerFactory.getParameter Setting sizeOfQueue to: -1
   [junit4]   2> 448800 T1875 oashc.HttpShardHandlerFactory.getParameter Setting fairnessPolicy to: false
   [junit4]   2> 448800 T1875 oashc.HttpShardHandlerFactory.getParameter Setting useRetries to: false
   [junit4]   2> 448807 T1875 oasu.UpdateShardHandler.<init> Creating UpdateShardHandler HTTP client with params: socketTimeout=340000&connTimeout=45000&retry=true
   [junit4]   2> 448808 T1875 oasl.LogWatcher.createWatcher SLF4J impl is org.slf4j.impl.Log4jLoggerFactory
   [junit4]   2> 448809 T1875 oasl.LogWatcher.newRegisteredLogWatcher Registering Log Listener [Log4j (org.slf4j.impl.Log4jLoggerFactory)]
   [junit4]   2> 448809 T1875 oasc.CoreContainer.load Node Name: 127.0.0.1
   [junit4]   2> 448809 T1875 oasc.ZkContainer.initZooKeeper Zookeeper client=127.0.0.1:14242/solr
   [junit4]   2> 448810 T1875 oasc.ZkController.checkChrootPath zkHost includes chroot
   [junit4]   2> 448810 T1875 oascc.SolrZkClient.createZkCredentialsToAddAutomatically Using default ZkCredentialsProvider
   [junit4]   2> 448811 T1875 oascc.ConnectionManager.waitForConnected Waiting for client to connect to ZooKeeper
   [junit4]   2> 448813 T1946 oascc.ConnectionManager.process Watcher org.apache.solr.common.cloud.ConnectionManager@657aa9f6 name:ZooKeeperConnection Watcher:127.0.0.1:14242 got event WatchedEvent state:SyncConnected type:None path:null path:null type:None
   [junit4]   2> 448814 T1875 oascc.ConnectionManager.waitForConnected Client is connected to ZooKeeper
   [junit4]   2> 448814 T1875 oascc.SolrZkClient.createZkACLProvider Using default ZkACLProvider
   [junit4]   2> 448816 T1875 oascc.ConnectionManager.waitForConnected Waiting for client to connect to ZooKeeper
   [junit4]   2> 448817 T1949 oascc.ConnectionManager.process Watcher org.apache.solr.common.cloud.ConnectionManager@14f9a04e name:ZooKeeperConnection Watcher:127.0.0.1:14242/solr got event WatchedEvent state:SyncConnected type:None path:null path:null type:None
   [junit4]   2> 448818 T1875 oascc.ConnectionManager.waitForConnected Client is connected to ZooKeeper
   [junit4]   2> 448822 T1875 oascc.ZkStateReader.createClusterStateWatchersAndUpdate Updating cluster state from ZooKeeper... 
   [junit4]   2> 449825 T1875 oasc.ZkController.createEphemeralLiveNode Register node as live in ZooKeeper:/live_nodes/127.0.0.1:14255_
   [junit4]   2> 449826 T1875 oascc.SolrZkClient.makePath makePath: /live_nodes/127.0.0.1:14255_
   [junit4]   2> 449829 T1875 oasc.Overseer.close Overseer (id=null) closing
   [junit4]   2> 449831 T1875 oasc.CorePropertiesLocator.discover Looking for core definitions underneath /usr/home/jenkins/jenkins-slave/workspace/Lucene-Solr-Tests-5.x-Java7/solr/build/solr-core/test/J3/temp/solr.cloud.ReplicationFactorTest 457F35F1A3900CAB-001/shard-2-001/cores
   [junit4]   2> 449832 T1875 oasc.CoreDescriptor.<init> CORE DESCRIPTOR: {coreNodeName=, shard=, schema=schema.xml, dataDir=data/, instanceDir=/usr/home/jenkins/jenkins-slave/workspace/Lucene-Solr-Tests-5.x-Java7/solr/build/solr-core/test/J3/temp/solr.cloud.ReplicationFactorTest 457F35F1A3900CAB-001/shard-2-001/cores/collection1, name=collection1, collection=collection1, config=solrconfig.xml, loadOnStartup=true, transient=false, absoluteInstDir=/usr/home/jenkins/jenkins-slave/workspace/Lucene-Solr-Tests-5.x-Java7/solr/build/solr-core/test/J3/temp/solr.cloud.ReplicationFactorTest 457F35F1A3900CAB-001/shard-2-001/cores/collection1/}
   [junit4]   2> 449833 T1875 oasc.CorePropertiesLocator.discoverUnder Found core collection1 in /usr/home/jenkins/jenkins-slave/workspace/Lucene-Solr-Tests-5.x-Java7/solr/build/solr-core/test/J3/temp/solr.cloud.ReplicationFactorTest 457F35F1A3900CAB-001/shard-2-001/cores/collection1/
   [junit4]   2> 449833 T1875 oasc.CorePropertiesLocator.discover Found 1 core definitions
   [junit4]   2> 449834 T1950 C:collection1 c:collection1 oasc.ZkController.publish publishing core=collection1 state=down collection=collection1
   [junit4]   2> 449834 T1950 C:collection1 c:collection1 oasc.ZkController.publish numShards not found on descriptor - reading it from system property
   [junit4]   2> 449834 T1950 C:collection1 c:collection1 oasc.ZkController.waitForCoreNodeName look for our core node name
   [junit4]   2> 449834 T1901 oasc.DistributedQueue$LatchWatcher.process NodeChildrenChanged fired on path /overseer/queue state SyncConnected
   [junit4]   2> 449835 T1902 oasc.Overseer$ClusterStateUpdater.run processMessage: queueSize: 1, message = {
   [junit4]   2> 	  "roles":null,
   [junit4]   2> 	  "state":"down",
   [junit4]   2> 	  "base_url":"http://127.0.0.1:14255",
   [junit4]   2> 	  "numShards":"3",
   [junit4]   2> 	  "core":"collection1",
   [junit4]   2> 	  "operation":"state",
   [junit4]   2> 	  "collection":"collection1",
   [junit4]   2> 	  "node_name":"127.0.0.1:14255_",
   [junit4]   2> 	  "shard":null} current state version: 8
   [junit4]   2> 449836 T1902 oasco.ReplicaMutator.updateState Update state numShards=3 message={
   [junit4]   2> 	  "roles":null,
   [junit4]   2> 	  "state":"down",
   [junit4]   2> 	  "base_url":"http://127.0.0.1:14255",
   [junit4]   2> 	  "numShards":"3",
   [junit4]   2> 	  "core":"collection1",
   [junit4]   2> 	  "operation":"state",
   [junit4]   2> 	  "collection":"collection1",
   [junit4]   2> 	  "node_name":"127.0.0.1:14255_",
   [junit4]   2> 	  "shard":null}
   [junit4]   2> 449836 T1902 oasco.ReplicaMutator.updateState Collection already exists with numShards=3
   [junit4]   2> 449836 T1902 oasco.ReplicaMutator.updateState Assigning new node to shard shard=shard2
   [junit4]   2> 449837 T1949 oascc.ZkStateReader$2.process A cluster state change: WatchedEvent state:SyncConnected type:NodeDataChanged path:/clusterstate.json, has occurred - updating... (live nodes size: 3)
   [junit4]   2> 449837 T1913 oascc.ZkStateReader$2.process A cluster state change: WatchedEvent state:SyncConnected type:NodeDataChanged path:/clusterstate.json, has occurred - updating... (live nodes size: 3)
   [junit4]   2> 449837 T1901 oascc.ZkStateReader$2.process A cluster state change: WatchedEvent state:SyncConnected type:NodeDataChanged path:/clusterstate.json, has occurred - updating... (live nodes size: 3)
   [junit4]   2> 449837 T1928 oascc.ZkStateReader$2.process A cluster state change: WatchedEvent state:SyncConnected type:NodeDataChanged path:/clusterstate.json, has occurred - updating... (live nodes size: 3)
   [junit4]   2> 450835 T1950 C:collection1 c:collection1 oasc.ZkController.waitForShardId waiting to find shard id in clusterstate for collection1
   [junit4]   2> 450836 T1950 C:collection1 c:collection1 oasc.ZkController.createCollectionZkNode Check for collection zkNode:collection1
   [junit4]   2> 450836 T1950 C:collection1 c:collection1 oasc.ZkController.createCollectionZkNode Collection zkNode exists
   [junit4]   2> 450837 T1950 C:collection1 c:collection1 oascc.ZkStateReader.readConfigName Load collection config from:/collections/collection1
   [junit4]   2> 450837 T1950 C:collection1 c:collection1 oascc.ZkStateReader.readConfigName path=/collections/collection1 configName=conf1 specified config exists in ZooKeeper
   [junit4]   2> 450837 T1950 C:collection1 c:collection1 oasc.SolrResourceLoader.<init> new SolrResourceLoader for directory: '/usr/home/jenkins/jenkins-slave/workspace/Lucene-Solr-Tests-5.x-Java7/solr/build/solr-core/test/J3/temp/solr.cloud.ReplicationFactorTest 457F35F1A3900CAB-001/shard-2-001/cores/collection1/'
   [junit4]   2> 450855 T1950 C:collection1 c:collection1 oasc.ZkController.watchZKConfDir watch zkdir /configs/conf1
   [junit4]   2> 450857 T1950 C:collection1 c:collection1 oasc.Config.<init> loaded config solrconfig.xml with version 0 
   [junit4]   2> 450868 T1950 C:collection1 c:collection1 oasc.SolrConfig.refreshRequestParams current version of requestparams : -1
   [junit4]   2> 450891 T1950 C:collection1 c:collection1 oasc.SolrConfig.<init> Using Lucene MatchVersion: 5.2.0
   [junit4]   2> 450941 T1950 C:collection1 c:collection1 oasc.SolrConfig.<init> Loaded SolrConfig: solrconfig.xml
   [junit4]   2> 451042 T1950 C:collection1 c:collection1 oass.IndexSchema.readSchema Reading Solr Schema from /configs/conf1/schema.xml
   [junit4]   2> 451053 T1950 C:collection1 c:collection1 oass.IndexSchema.readSchema [collection1] Schema name=test
   [junit4]   2> 451470 T1950 C:collection1 c:collection1 oass.OpenExchangeRatesOrgProvider.init Initialized with rates=open-exchange-rates.json, refreshInterval=1440.
   [junit4]   2> 451486 T1950 C:collection1 c:collection1 oass.IndexSchema.readSchema default search field in schema is text
   [junit4]   2> 451489 T1950 C:collection1 c:collection1 oass.IndexSchema.readSchema unique key field: id
   [junit4]   2> 451499 T1950 C:collection1 c:collection1 oass.FileExchangeRateProvider.reload Reloading exchange rates from file currency.xml
   [junit4]   2> 451504 T1950 C:collection1 c:collection1 oass.FileExchangeRateProvider.reload Reloading exchange rates from file currency.xml
   [junit4]   2> 451508 T1950 C:collection1 c:collection1 oass.OpenExchangeRatesOrgProvider.reload Reloading exchange rates from open-exchange-rates.json
   [junit4]   2> 451509 T1950 C:collection1 c:collection1 oass.OpenExchangeRatesOrgProvider$OpenExchangeRates.<init> WARN Unknown key IMPORTANT NOTE
   [junit4]   2> 451510 T1950 C:collection1 c:collection1 oass.OpenExchangeRatesOrgProvider$OpenExchangeRates.<init> WARN Expected key, got STRING
   [junit4]   2> 451510 T1950 C:collection1 c:collection1 oass.OpenExchangeRatesOrgProvider.reload Reloading exchange rates from open-exchange-rates.json
   [junit4]   2> 451511 T1950 C:collection1 c:collection1 oass.OpenExchangeRatesOrgProvider$OpenExchangeRates.<init> WARN Unknown key IMPORTANT NOTE
   [junit4]   2> 451511 T1950 C:collection1 c:collection1 oass.OpenExchangeRatesOrgProvider$OpenExchangeRates.<init> WARN Expected key, got STRING
   [junit4]   2> 451511 T1950 C:collection1 c:collection1 oasc.CoreContainer.create Creating SolrCore 'collection1' using configuration from collection collection1
   [junit4]   2> 451512 T1950 C:collection1 c:collection1 oasc.SolrCore.initDirectoryFactory org.apache.solr.core.MockDirectoryFactory
   [junit4]   2> 451512 T1950 C:collection1 c:collection1 oasc.SolrCore.<init> [collection1] Opening new SolrCore at /usr/home/jenkins/jenkins-slave/worksp

[...truncated too long message...]

ent.ThreadPoolExecutor@bc189bc[Shutting down, pool size = 5, active threads = 5, queued tasks = 0, completed tasks = 48]
   [junit4]    > 	at __randomizedtesting.SeedInfo.seed([457F35F1A3900CAB]:0)
   [junit4]    > 	at java.util.concurrent.ThreadPoolExecutor$AbortPolicy.rejectedExecution(ThreadPoolExecutor.java:2048)
   [junit4]    > 	at java.util.concurrent.ThreadPoolExecutor.reject(ThreadPoolExecutor.java:821)
   [junit4]    > 	at java.util.concurrent.ThreadPoolExecutor.execute(ThreadPoolExecutor.java:1372)
   [junit4]    > 	at org.apache.solr.client.solrj.impl.ConcurrentUpdateSolrClient$Runner.run(ConcurrentUpdateSolrClient.java:278)
   [junit4]    > 	at java.util.concurrent.ThreadPoolExecutor.runWorker(ThreadPoolExecutor.java:1145)
   [junit4]    > 	at java.util.concurrent.ThreadPoolExecutor$Worker.run(ThreadPoolExecutor.java:615)
   [junit4]    > 	at java.lang.Thread.run(Thread.java:745)Throwable #4: com.carrotsearch.randomizedtesting.UncaughtExceptionError: Captured an uncaught exception in thread: Thread[id=2070, name=updateExecutor-278-thread-5, state=RUNNABLE, group=TGRP-ReplicationFactorTest]
   [junit4]    > Caused by: java.util.concurrent.RejectedExecutionException: Task org.apache.solr.client.solrj.impl.ConcurrentUpdateSolrClient$Runner@350152a3 rejected from java.util.concurrent.ThreadPoolExecutor@bc189bc[Shutting down, pool size = 4, active threads = 4, queued tasks = 0, completed tasks = 49]
   [junit4]    > 	at __randomizedtesting.SeedInfo.seed([457F35F1A3900CAB]:0)
   [junit4]    > 	at java.util.concurrent.ThreadPoolExecutor$AbortPolicy.rejectedExecution(ThreadPoolExecutor.java:2048)
   [junit4]    > 	at java.util.concurrent.ThreadPoolExecutor.reject(ThreadPoolExecutor.java:821)
   [junit4]    > 	at java.util.concurrent.ThreadPoolExecutor.execute(ThreadPoolExecutor.java:1372)
   [junit4]    > 	at org.apache.solr.client.solrj.impl.ConcurrentUpdateSolrClient$Runner.run(ConcurrentUpdateSolrClient.java:278)
   [junit4]    > 	at java.util.concurrent.ThreadPoolExecutor.runWorker(ThreadPoolExecutor.java:1145)
   [junit4]    > 	at java.util.concurrent.ThreadPoolExecutor$Worker.run(ThreadPoolExecutor.java:615)
   [junit4]    > 	at java.lang.Thread.run(Thread.java:745)Throwable #5: com.carrotsearch.randomizedtesting.UncaughtExceptionError: Captured an uncaught exception in thread: Thread[id=2073, name=updateExecutor-278-thread-6, state=RUNNABLE, group=TGRP-ReplicationFactorTest]
   [junit4]    > Caused by: java.util.concurrent.RejectedExecutionException: Task org.apache.solr.client.solrj.impl.ConcurrentUpdateSolrClient$Runner@162ec62c rejected from java.util.concurrent.ThreadPoolExecutor@bc189bc[Shutting down, pool size = 3, active threads = 3, queued tasks = 0, completed tasks = 50]
   [junit4]    > 	at __randomizedtesting.SeedInfo.seed([457F35F1A3900CAB]:0)
   [junit4]    > 	at java.util.concurrent.ThreadPoolExecutor$AbortPolicy.rejectedExecution(ThreadPoolExecutor.java:2048)
   [junit4]    > 	at java.util.concurrent.ThreadPoolExecutor.reject(ThreadPoolExecutor.java:821)
   [junit4]    > 	at java.util.concurrent.ThreadPoolExecutor.execute(ThreadPoolExecutor.java:1372)
   [junit4]    > 	at org.apache.solr.client.solrj.impl.ConcurrentUpdateSolrClient$Runner.run(ConcurrentUpdateSolrClient.java:278)
   [junit4]    > 	at java.util.concurrent.ThreadPoolExecutor.runWorker(ThreadPoolExecutor.java:1145)
   [junit4]    > 	at java.util.concurrent.ThreadPoolExecutor$Worker.run(ThreadPoolExecutor.java:615)
   [junit4]    > 	at java.lang.Thread.run(Thread.java:745)Throwable #6: com.carrotsearch.randomizedtesting.UncaughtExceptionError: Captured an uncaught exception in thread: Thread[id=2076, name=updateExecutor-278-thread-7, state=RUNNABLE, group=TGRP-ReplicationFactorTest]
   [junit4]    > Caused by: java.util.concurrent.RejectedExecutionException: Task org.apache.solr.client.solrj.impl.ConcurrentUpdateSolrClient$Runner@743f2543 rejected from java.util.concurrent.ThreadPoolExecutor@bc189bc[Shutting down, pool size = 2, active threads = 2, queued tasks = 0, completed tasks = 51]
   [junit4]    > 	at __randomizedtesting.SeedInfo.seed([457F35F1A3900CAB]:0)
   [junit4]    > 	at java.util.concurrent.ThreadPoolExecutor$AbortPolicy.rejectedExecution(ThreadPoolExecutor.java:2048)
   [junit4]    > 	at java.util.concurrent.ThreadPoolExecutor.reject(ThreadPoolExecutor.java:821)
   [junit4]    > 	at java.util.concurrent.ThreadPoolExecutor.execute(ThreadPoolExecutor.java:1372)
   [junit4]    > 	at org.apache.solr.client.solrj.impl.ConcurrentUpdateSolrClient$Runner.run(ConcurrentUpdateSolrClient.java:278)
   [junit4]    > 	at java.util.concurrent.ThreadPoolExecutor.runWorker(ThreadPoolExecutor.java:1145)
   [junit4]    > 	at java.util.concurrent.ThreadPoolExecutor$Worker.run(ThreadPoolExecutor.java:615)
   [junit4]    > 	at java.lang.Thread.run(Thread.java:745)Throwable #7: com.carrotsearch.randomizedtesting.UncaughtExceptionError: Captured an uncaught exception in thread: Thread[id=2079, name=updateExecutor-278-thread-8, state=RUNNABLE, group=TGRP-ReplicationFactorTest]
   [junit4]    > Caused by: java.util.concurrent.RejectedExecutionException: Task org.apache.solr.client.solrj.impl.ConcurrentUpdateSolrClient$Runner@43cb4a37 rejected from java.util.concurrent.ThreadPoolExecutor@bc189bc[Shutting down, pool size = 1, active threads = 1, queued tasks = 0, completed tasks = 52]
   [junit4]    > 	at __randomizedtesting.SeedInfo.seed([457F35F1A3900CAB]:0)
   [junit4]    > 	at java.util.concurrent.ThreadPoolExecutor$AbortPolicy.rejectedExecution(ThreadPoolExecutor.java:2048)
   [junit4]    > 	at java.util.concurrent.ThreadPoolExecutor.reject(ThreadPoolExecutor.java:821)
   [junit4]    > 	at java.util.concurrent.ThreadPoolExecutor.execute(ThreadPoolExecutor.java:1372)
   [junit4]    > 	at org.apache.solr.client.solrj.impl.ConcurrentUpdateSolrClient$Runner.run(ConcurrentUpdateSolrClient.java:278)
   [junit4]    > 	at java.util.concurrent.ThreadPoolExecutor.runWorker(ThreadPoolExecutor.java:1145)
   [junit4]    > 	at java.util.concurrent.ThreadPoolExecutor$Worker.run(ThreadPoolExecutor.java:615)
   [junit4]    > 	at java.lang.Thread.run(Thread.java:745)
   [junit4]   2> 1012391 T1875 C:control_collection S:shard1 c:collection1 oas.SolrTestCaseJ4.deleteCore ###deleteCore
   [junit4]   2> NOTE: leaving temporary files on disk at: /usr/home/jenkins/jenkins-slave/workspace/Lucene-Solr-Tests-5.x-Java7/solr/build/solr-core/test/J3/temp/solr.cloud.ReplicationFactorTest 457F35F1A3900CAB-001
   [junit4]   2> 572143 T1874 ccr.ThreadLeakControl.checkThreadLeaks WARNING Will linger awaiting termination of 1 leaked thread(s).
   [junit4]   2> NOTE: test params are: codec=Asserting(Lucene50): {multiDefault=BlockTreeOrds(blocksize=128), a_t=PostingsFormat(name=Memory doPackFST= false), text=FST50, range_facet_l=PostingsFormat(name=Memory doPackFST= false), intDefault=PostingsFormat(name=Memory doPackFST= false), timestamp=PostingsFormat(name=Memory doPackFST= false), _version_=PostingsFormat(name=Memory doPackFST= false), id=PostingsFormat(name=LuceneVarGapFixedInterval)}, docValues:{timestamp=DocValuesFormat(name=SimpleText)}, sim=RandomSimilarityProvider(queryNorm=true,coord=yes): {}, locale=en_IE, timezone=America/Kentucky/Monticello
   [junit4]   2> NOTE: FreeBSD 9.1-RELEASE-p3 amd64/Oracle Corporation 1.7.0_65 (64-bit)/cpus=16,threads=1,free=171993136,total=303038464
   [junit4]   2> NOTE: All tests run in this JVM: [TestCoreContainer, ChaosMonkeySafeLeaderTest, TestLMDirichletSimilarityFactory, TestSimpleTrackingShardHandler, AnalysisErrorHandlingTest, OpenExchangeRatesOrgProviderTest, TestSystemIdResolver, LeaderElectionTest, TestExactStatsCache, HighlighterMaxOffsetTest, SolrRequestParserTest, HdfsBasicDistributedZk2Test, CurrencyFieldXmlFileTest, TestMiniSolrCloudCluster, RAMDirectoryFactoryTest, TestCollectionAPI, PrimUtilsTest, HdfsCollectionsAPIDistributedZkTest, TestPostingsSolrHighlighter, TestSerializedLuceneMatchVersion, TestFieldTypeCollectionResource, TestJmxIntegration, TestPseudoReturnFields, TestSolrCoreProperties, TestImplicitCoreProperties, XsltUpdateRequestHandlerTest, CSVRequestHandlerTest, TestSolrJ, DateMathParserTest, TestTrie, TestRemoteStreaming, DistanceUnitsTest, TestEmbeddedSolrServerConstructors, CustomCollectionTest, ReplicationFactorTest]
   [junit4] Completed on J3 in 572.42s, 1 test, 1 error <<< FAILURES!

[...truncated 868 lines...]
BUILD FAILED
/usr/home/jenkins/jenkins-slave/workspace/Lucene-Solr-Tests-5.x-Java7/build.xml:529: The following error occurred while executing this line:
/usr/home/jenkins/jenkins-slave/workspace/Lucene-Solr-Tests-5.x-Java7/build.xml:477: The following error occurred while executing this line:
/usr/home/jenkins/jenkins-slave/workspace/Lucene-Solr-Tests-5.x-Java7/build.xml:61: The following error occurred while executing this line:
/usr/home/jenkins/jenkins-slave/workspace/Lucene-Solr-Tests-5.x-Java7/extra-targets.xml:39: The following error occurred while executing this line:
/usr/home/jenkins/jenkins-slave/workspace/Lucene-Solr-Tests-5.x-Java7/solr/build.xml:191: The following error occurred while executing this line:
/usr/home/jenkins/jenkins-slave/workspace/Lucene-Solr-Tests-5.x-Java7/solr/common-build.xml:509: The following error occurred while executing this line:
/usr/home/jenkins/jenkins-slave/workspace/Lucene-Solr-Tests-5.x-Java7/lucene/common-build.xml:1370: The following error occurred while executing this line:
/usr/home/jenkins/jenkins-slave/workspace/Lucene-Solr-Tests-5.x-Java7/lucene/common-build.xml:976: There were test failures: 480 suites, 1905 tests, 1 error, 61 ignored (21 assumptions)

Total time: 60 minutes 12 seconds
Build step 'Invoke Ant' marked build as failure
Archiving artifacts
Sending artifact delta relative to Lucene-Solr-Tests-5.x-Java7 #2431
Archived 5 artifacts
Archive block size is 32768
Received 0 blocks and 204630843 bytes
Compression is 0.0%
Took 36 sec
Recording test results
Email was triggered for: Failure
Sending email for trigger: Failure



Mime
View raw message