lucene-dev mailing list archives

Site index · List index
Message view « Date » · « Thread »
Top « Date » · « Thread »
From Policeman Jenkins Server <jenk...@thetaphi.de>
Subject [JENKINS] Lucene-Solr-trunk-Windows (64bit/jdk1.8.0_40) - Build # 4625 - Failure!
Date Wed, 01 Apr 2015 19:38:38 GMT
Build: http://jenkins.thetaphi.de/job/Lucene-Solr-trunk-Windows/4625/
Java: 64bit/jdk1.8.0_40 -XX:+UseCompressedOops -XX:+UseG1GC

2 tests failed.
FAILED:  junit.framework.TestSuite.org.apache.solr.core.TestSolrConfigHandler

Error Message:
Could not remove the following files (in the order of attempts):    C:\Users\JenkinsSlave\workspace\Lucene-Solr-trunk-Windows\solr\build\solr-core\test\J1\temp\solr.core.TestSolrConfigHandler 6DE66C602ACF2E07-001\tempDir-010\collection1\conf\configoverlay.json: java.nio.file.FileSystemException: C:\Users\JenkinsSlave\workspace\Lucene-Solr-trunk-Windows\solr\build\solr-core\test\J1\temp\solr.core.TestSolrConfigHandler 6DE66C602ACF2E07-001\tempDir-010\collection1\conf\configoverlay.json: The process cannot access the file because it is being used by another process.     C:\Users\JenkinsSlave\workspace\Lucene-Solr-trunk-Windows\solr\build\solr-core\test\J1\temp\solr.core.TestSolrConfigHandler 6DE66C602ACF2E07-001\tempDir-010\collection1\conf: java.nio.file.DirectoryNotEmptyException: C:\Users\JenkinsSlave\workspace\Lucene-Solr-trunk-Windows\solr\build\solr-core\test\J1\temp\solr.core.TestSolrConfigHandler 6DE66C602ACF2E07-001\tempDir-010\collection1\conf    C:\Users\JenkinsSlave\workspace\Lucene-Solr-trunk-Windows\solr\build\solr-core\test\J1\temp\solr.core.TestSolrConfigHandler 6DE66C602ACF2E07-001\tempDir-010\collection1: java.nio.file.DirectoryNotEmptyException: C:\Users\JenkinsSlave\workspace\Lucene-Solr-trunk-Windows\solr\build\solr-core\test\J1\temp\solr.core.TestSolrConfigHandler 6DE66C602ACF2E07-001\tempDir-010\collection1    C:\Users\JenkinsSlave\workspace\Lucene-Solr-trunk-Windows\solr\build\solr-core\test\J1\temp\solr.core.TestSolrConfigHandler 6DE66C602ACF2E07-001\tempDir-010: java.nio.file.DirectoryNotEmptyException: C:\Users\JenkinsSlave\workspace\Lucene-Solr-trunk-Windows\solr\build\solr-core\test\J1\temp\solr.core.TestSolrConfigHandler 6DE66C602ACF2E07-001\tempDir-010    C:\Users\JenkinsSlave\workspace\Lucene-Solr-trunk-Windows\solr\build\solr-core\test\J1\temp\solr.core.TestSolrConfigHandler 6DE66C602ACF2E07-001\tempDir-010: java.nio.file.DirectoryNotEmptyException: C:\Users\JenkinsSlave\workspace\Lucene-Solr-trunk-Windows\solr\build\solr-core\test\J1\temp\solr.core.TestSolrConfigHandler 6DE66C602ACF2E07-001\tempDir-010    C:\Users\JenkinsSlave\workspace\Lucene-Solr-trunk-Windows\solr\build\solr-core\test\J1\temp\solr.core.TestSolrConfigHandler 6DE66C602ACF2E07-001: java.nio.file.DirectoryNotEmptyException: C:\Users\JenkinsSlave\workspace\Lucene-Solr-trunk-Windows\solr\build\solr-core\test\J1\temp\solr.core.TestSolrConfigHandler 6DE66C602ACF2E07-001 

Stack Trace:
java.io.IOException: Could not remove the following files (in the order of attempts):
   C:\Users\JenkinsSlave\workspace\Lucene-Solr-trunk-Windows\solr\build\solr-core\test\J1\temp\solr.core.TestSolrConfigHandler 6DE66C602ACF2E07-001\tempDir-010\collection1\conf\configoverlay.json: java.nio.file.FileSystemException: C:\Users\JenkinsSlave\workspace\Lucene-Solr-trunk-Windows\solr\build\solr-core\test\J1\temp\solr.core.TestSolrConfigHandler 6DE66C602ACF2E07-001\tempDir-010\collection1\conf\configoverlay.json: The process cannot access the file because it is being used by another process.

   C:\Users\JenkinsSlave\workspace\Lucene-Solr-trunk-Windows\solr\build\solr-core\test\J1\temp\solr.core.TestSolrConfigHandler 6DE66C602ACF2E07-001\tempDir-010\collection1\conf: java.nio.file.DirectoryNotEmptyException: C:\Users\JenkinsSlave\workspace\Lucene-Solr-trunk-Windows\solr\build\solr-core\test\J1\temp\solr.core.TestSolrConfigHandler 6DE66C602ACF2E07-001\tempDir-010\collection1\conf
   C:\Users\JenkinsSlave\workspace\Lucene-Solr-trunk-Windows\solr\build\solr-core\test\J1\temp\solr.core.TestSolrConfigHandler 6DE66C602ACF2E07-001\tempDir-010\collection1: java.nio.file.DirectoryNotEmptyException: C:\Users\JenkinsSlave\workspace\Lucene-Solr-trunk-Windows\solr\build\solr-core\test\J1\temp\solr.core.TestSolrConfigHandler 6DE66C602ACF2E07-001\tempDir-010\collection1
   C:\Users\JenkinsSlave\workspace\Lucene-Solr-trunk-Windows\solr\build\solr-core\test\J1\temp\solr.core.TestSolrConfigHandler 6DE66C602ACF2E07-001\tempDir-010: java.nio.file.DirectoryNotEmptyException: C:\Users\JenkinsSlave\workspace\Lucene-Solr-trunk-Windows\solr\build\solr-core\test\J1\temp\solr.core.TestSolrConfigHandler 6DE66C602ACF2E07-001\tempDir-010
   C:\Users\JenkinsSlave\workspace\Lucene-Solr-trunk-Windows\solr\build\solr-core\test\J1\temp\solr.core.TestSolrConfigHandler 6DE66C602ACF2E07-001\tempDir-010: java.nio.file.DirectoryNotEmptyException: C:\Users\JenkinsSlave\workspace\Lucene-Solr-trunk-Windows\solr\build\solr-core\test\J1\temp\solr.core.TestSolrConfigHandler 6DE66C602ACF2E07-001\tempDir-010
   C:\Users\JenkinsSlave\workspace\Lucene-Solr-trunk-Windows\solr\build\solr-core\test\J1\temp\solr.core.TestSolrConfigHandler 6DE66C602ACF2E07-001: java.nio.file.DirectoryNotEmptyException: C:\Users\JenkinsSlave\workspace\Lucene-Solr-trunk-Windows\solr\build\solr-core\test\J1\temp\solr.core.TestSolrConfigHandler 6DE66C602ACF2E07-001

	at __randomizedtesting.SeedInfo.seed([6DE66C602ACF2E07]:0)
	at org.apache.lucene.util.IOUtils.rm(IOUtils.java:286)
	at org.apache.lucene.util.TestRuleTemporaryFilesCleanup.afterAlways(TestRuleTemporaryFilesCleanup.java:200)
	at com.carrotsearch.randomizedtesting.rules.TestRuleAdapter$1.afterAlways(TestRuleAdapter.java:31)
	at com.carrotsearch.randomizedtesting.rules.StatementAdapter.evaluate(StatementAdapter.java:43)
	at com.carrotsearch.randomizedtesting.rules.StatementAdapter.evaluate(StatementAdapter.java:36)
	at org.apache.lucene.util.TestRuleAssertionsRequired$1.evaluate(TestRuleAssertionsRequired.java:54)
	at org.apache.lucene.util.TestRuleMarkFailure$1.evaluate(TestRuleMarkFailure.java:48)
	at org.apache.lucene.util.TestRuleIgnoreAfterMaxFailures$1.evaluate(TestRuleIgnoreAfterMaxFailures.java:65)
	at org.apache.lucene.util.TestRuleIgnoreTestSuites$1.evaluate(TestRuleIgnoreTestSuites.java:55)
	at com.carrotsearch.randomizedtesting.rules.StatementAdapter.evaluate(StatementAdapter.java:36)
	at com.carrotsearch.randomizedtesting.ThreadLeakControl$StatementRunner.run(ThreadLeakControl.java:365)
	at java.lang.Thread.run(Thread.java:745)


FAILED:  org.apache.solr.update.HardAutoCommitTest.testCommitWithin

Error Message:
Exception during query

Stack Trace:
java.lang.RuntimeException: Exception during query
	at __randomizedtesting.SeedInfo.seed([6DE66C602ACF2E07:D7340318A9E1C012]:0)
	at org.apache.solr.SolrTestCaseJ4.assertQ(SolrTestCaseJ4.java:794)
	at org.apache.solr.update.HardAutoCommitTest.testCommitWithin(HardAutoCommitTest.java:100)
	at sun.reflect.NativeMethodAccessorImpl.invoke0(Native Method)
	at sun.reflect.NativeMethodAccessorImpl.invoke(NativeMethodAccessorImpl.java:62)
	at sun.reflect.DelegatingMethodAccessorImpl.invoke(DelegatingMethodAccessorImpl.java:43)
	at java.lang.reflect.Method.invoke(Method.java:497)
	at com.carrotsearch.randomizedtesting.RandomizedRunner.invoke(RandomizedRunner.java:1627)
	at com.carrotsearch.randomizedtesting.RandomizedRunner$6.evaluate(RandomizedRunner.java:836)
	at com.carrotsearch.randomizedtesting.RandomizedRunner$7.evaluate(RandomizedRunner.java:872)
	at com.carrotsearch.randomizedtesting.RandomizedRunner$8.evaluate(RandomizedRunner.java:886)
	at com.carrotsearch.randomizedtesting.rules.SystemPropertiesRestoreRule$1.evaluate(SystemPropertiesRestoreRule.java:53)
	at org.apache.lucene.util.TestRuleSetupTeardownChained$1.evaluate(TestRuleSetupTeardownChained.java:50)
	at org.apache.lucene.util.AbstractBeforeAfterRule$1.evaluate(AbstractBeforeAfterRule.java:46)
	at org.apache.lucene.util.TestRuleThreadAndTestName$1.evaluate(TestRuleThreadAndTestName.java:49)
	at org.apache.lucene.util.TestRuleIgnoreAfterMaxFailures$1.evaluate(TestRuleIgnoreAfterMaxFailures.java:65)
	at org.apache.lucene.util.TestRuleMarkFailure$1.evaluate(TestRuleMarkFailure.java:48)
	at com.carrotsearch.randomizedtesting.rules.StatementAdapter.evaluate(StatementAdapter.java:36)
	at com.carrotsearch.randomizedtesting.ThreadLeakControl$StatementRunner.run(ThreadLeakControl.java:365)
	at com.carrotsearch.randomizedtesting.ThreadLeakControl.forkTimeoutingTask(ThreadLeakControl.java:798)
	at com.carrotsearch.randomizedtesting.ThreadLeakControl$3.evaluate(ThreadLeakControl.java:458)
	at com.carrotsearch.randomizedtesting.RandomizedRunner.runSingleTest(RandomizedRunner.java:845)
	at com.carrotsearch.randomizedtesting.RandomizedRunner$3.evaluate(RandomizedRunner.java:747)
	at com.carrotsearch.randomizedtesting.RandomizedRunner$4.evaluate(RandomizedRunner.java:781)
	at com.carrotsearch.randomizedtesting.RandomizedRunner$5.evaluate(RandomizedRunner.java:792)
	at com.carrotsearch.randomizedtesting.rules.StatementAdapter.evaluate(StatementAdapter.java:36)
	at com.carrotsearch.randomizedtesting.rules.SystemPropertiesRestoreRule$1.evaluate(SystemPropertiesRestoreRule.java:53)
	at org.apache.lucene.util.AbstractBeforeAfterRule$1.evaluate(AbstractBeforeAfterRule.java:46)
	at com.carrotsearch.randomizedtesting.rules.StatementAdapter.evaluate(StatementAdapter.java:36)
	at org.apache.lucene.util.TestRuleStoreClassName$1.evaluate(TestRuleStoreClassName.java:42)
	at com.carrotsearch.randomizedtesting.rules.NoShadowingOrOverridesOnMethodsRule$1.evaluate(NoShadowingOrOverridesOnMethodsRule.java:39)
	at com.carrotsearch.randomizedtesting.rules.NoShadowingOrOverridesOnMethodsRule$1.evaluate(NoShadowingOrOverridesOnMethodsRule.java:39)
	at com.carrotsearch.randomizedtesting.rules.StatementAdapter.evaluate(StatementAdapter.java:36)
	at com.carrotsearch.randomizedtesting.rules.StatementAdapter.evaluate(StatementAdapter.java:36)
	at com.carrotsearch.randomizedtesting.rules.StatementAdapter.evaluate(StatementAdapter.java:36)
	at org.apache.lucene.util.TestRuleAssertionsRequired$1.evaluate(TestRuleAssertionsRequired.java:54)
	at org.apache.lucene.util.TestRuleMarkFailure$1.evaluate(TestRuleMarkFailure.java:48)
	at org.apache.lucene.util.TestRuleIgnoreAfterMaxFailures$1.evaluate(TestRuleIgnoreAfterMaxFailures.java:65)
	at org.apache.lucene.util.TestRuleIgnoreTestSuites$1.evaluate(TestRuleIgnoreTestSuites.java:55)
	at com.carrotsearch.randomizedtesting.rules.StatementAdapter.evaluate(StatementAdapter.java:36)
	at com.carrotsearch.randomizedtesting.ThreadLeakControl$StatementRunner.run(ThreadLeakControl.java:365)
	at java.lang.Thread.run(Thread.java:745)
Caused by: java.lang.RuntimeException: REQUEST FAILED: xpath=//result[@numFound=1]
	xml response was: <?xml version="1.0" encoding="UTF-8"?>
<response>
<lst name="responseHeader"><int name="status">0</int><int name="QTime">0</int></lst><result name="response" numFound="0" start="0"></result>
</response>

	request was:q=id:529&qt=standard&start=0&rows=20&version=2.2
	at org.apache.solr.SolrTestCaseJ4.assertQ(SolrTestCaseJ4.java:787)
	... 40 more




Build Log:
[...truncated 9371 lines...]
   [junit4] Suite: org.apache.solr.update.HardAutoCommitTest
   [junit4]   2> Creating dataDir: C:\Users\JenkinsSlave\workspace\Lucene-Solr-trunk-Windows\solr\build\solr-core\test\J0\temp\solr.update.HardAutoCommitTest 6DE66C602ACF2E07-001\init-core-data-001
   [junit4]   2> 327383 T1351 oas.SolrTestCaseJ4.buildSSLConfig Randomized ssl (false) and clientAuth (true)
   [junit4]   2> 327384 T1351 oas.SolrTestCaseJ4.initCore ####initCore
   [junit4]   2> 327384 T1351 oasc.SolrResourceLoader.<init> new SolrResourceLoader for directory: 'C:\Users\JenkinsSlave\workspace\Lucene-Solr-trunk-Windows\solr\core\src\test-files\solr\collection1\'
   [junit4]   2> 327386 T1351 oasc.SolrResourceLoader.replaceClassLoader Adding 'file:/C:/Users/JenkinsSlave/workspace/Lucene-Solr-trunk-Windows/solr/core/src/test-files/solr/collection1/lib/classes/' to classloader
   [junit4]   2> 327386 T1351 oasc.SolrResourceLoader.replaceClassLoader Adding 'file:/C:/Users/JenkinsSlave/workspace/Lucene-Solr-trunk-Windows/solr/core/src/test-files/solr/collection1/lib/README' to classloader
   [junit4]   2> 327428 T1351 oasc.SolrConfig.refreshRequestParams current version of requestparams : -1
   [junit4]   2> 327436 T1351 oasc.SolrConfig.<init> Using Lucene MatchVersion: 6.0.0
   [junit4]   2> 327451 T1351 oasc.SolrConfig.<init> Loaded SolrConfig: solrconfig.xml
   [junit4]   2> 327451 T1351 oass.IndexSchema.readSchema Reading Solr Schema from C:\Users\JenkinsSlave\workspace\Lucene-Solr-trunk-Windows\solr\core\src\test-files\solr\collection1\conf\schema.xml
   [junit4]   2> 327456 T1351 oass.IndexSchema.readSchema [null] Schema name=test
   [junit4]   2> 327541 T1351 oass.OpenExchangeRatesOrgProvider.init Initialized with rates=open-exchange-rates.json, refreshInterval=1440.
   [junit4]   2> 327548 T1351 oass.IndexSchema.readSchema default search field in schema is text
   [junit4]   2> 327549 T1351 oass.IndexSchema.readSchema unique key field: id
   [junit4]   2> 327555 T1351 oass.FileExchangeRateProvider.reload Reloading exchange rates from file currency.xml
   [junit4]   2> 327557 T1351 oass.FileExchangeRateProvider.reload Reloading exchange rates from file currency.xml
   [junit4]   2> 327559 T1351 oass.OpenExchangeRatesOrgProvider.reload Reloading exchange rates from open-exchange-rates.json
   [junit4]   2> 327559 T1351 oass.OpenExchangeRatesOrgProvider$OpenExchangeRates.<init> WARN Unknown key IMPORTANT NOTE
   [junit4]   2> 327560 T1351 oass.OpenExchangeRatesOrgProvider$OpenExchangeRates.<init> WARN Expected key, got STRING
   [junit4]   2> 327560 T1351 oass.OpenExchangeRatesOrgProvider.reload Reloading exchange rates from open-exchange-rates.json
   [junit4]   2> 327560 T1351 oass.OpenExchangeRatesOrgProvider$OpenExchangeRates.<init> WARN Unknown key IMPORTANT NOTE
   [junit4]   2> 327560 T1351 oass.OpenExchangeRatesOrgProvider$OpenExchangeRates.<init> WARN Expected key, got STRING
   [junit4]   2> 327560 T1351 oasc.SolrResourceLoader.locateSolrHome JNDI not configured for solr (NoInitialContextEx)
   [junit4]   2> 327561 T1351 oasc.SolrResourceLoader.locateSolrHome using system property solr.solr.home: C:\Users\JenkinsSlave\workspace\Lucene-Solr-trunk-Windows\solr\core\src\test-files\solr
   [junit4]   2> 327561 T1351 oasc.SolrResourceLoader.<init> new SolrResourceLoader for directory: 'C:\Users\JenkinsSlave\workspace\Lucene-Solr-trunk-Windows\solr\core\src\test-files\solr\'
   [junit4]   2> 327575 T1351 oasc.CoreContainer.<init> New CoreContainer 366835628
   [junit4]   2> 327575 T1351 oasc.CoreContainer.load Loading cores into CoreContainer [instanceDir=C:\Users\JenkinsSlave\workspace\Lucene-Solr-trunk-Windows\solr\core\src\test-files\solr\]
   [junit4]   2> 327575 T1351 oasc.CoreContainer.load loading shared library: C:\Users\JenkinsSlave\workspace\Lucene-Solr-trunk-Windows\solr\core\src\test-files\solr\lib
   [junit4]   2> 327576 T1351 oasc.SolrResourceLoader.addToClassLoader WARN Can't find (or read) directory to add to classloader: lib (resolved as: C:\Users\JenkinsSlave\workspace\Lucene-Solr-trunk-Windows\solr\core\src\test-files\solr\lib).
   [junit4]   2> 327584 T1351 oashc.HttpShardHandlerFactory.getParameter Setting socketTimeout to: 600000
   [junit4]   2> 327584 T1351 oashc.HttpShardHandlerFactory.getParameter Setting urlScheme to: null
   [junit4]   2> 327584 T1351 oashc.HttpShardHandlerFactory.getParameter Setting connTimeout to: 60000
   [junit4]   2> 327585 T1351 oashc.HttpShardHandlerFactory.getParameter Setting maxConnectionsPerHost to: 20
   [junit4]   2> 327585 T1351 oashc.HttpShardHandlerFactory.getParameter Setting maxConnections to: 10000
   [junit4]   2> 327585 T1351 oashc.HttpShardHandlerFactory.getParameter Setting corePoolSize to: 0
   [junit4]   2> 327585 T1351 oashc.HttpShardHandlerFactory.getParameter Setting maximumPoolSize to: 2147483647
   [junit4]   2> 327585 T1351 oashc.HttpShardHandlerFactory.getParameter Setting maxThreadIdleTime to: 5
   [junit4]   2> 327585 T1351 oashc.HttpShardHandlerFactory.getParameter Setting sizeOfQueue to: -1
   [junit4]   2> 327585 T1351 oashc.HttpShardHandlerFactory.getParameter Setting fairnessPolicy to: false
   [junit4]   2> 327585 T1351 oashc.HttpShardHandlerFactory.getParameter Setting useRetries to: false
   [junit4]   2> 327586 T1351 oasu.UpdateShardHandler.<init> Creating UpdateShardHandler HTTP client with params: socketTimeout=30000&connTimeout=30000&retry=true
   [junit4]   2> 327586 T1351 oasl.LogWatcher.createWatcher SLF4J impl is org.slf4j.impl.Log4jLoggerFactory
   [junit4]   2> 327586 T1351 oasl.LogWatcher.newRegisteredLogWatcher Registering Log Listener [Log4j (org.slf4j.impl.Log4jLoggerFactory)]
   [junit4]   2> 327586 T1351 oasc.CoreContainer.load Node Name: testNode
   [junit4]   2> 327587 T1351 oasc.CoreDescriptor.<init> CORE DESCRIPTOR: {name=collection1, config=solrconfig.xml, transient=false, schema=schema.xml, loadOnStartup=true, instanceDir=collection1, collection=collection1, absoluteInstDir=C:\Users\JenkinsSlave\workspace\Lucene-Solr-trunk-Windows\solr\core\src\test-files\solr\collection1\, dataDir=C:\Users\JenkinsSlave\workspace\Lucene-Solr-trunk-Windows\solr\build\solr-core\test\J0\temp\solr.update.HardAutoCommitTest 6DE66C602ACF2E07-001\init-core-data-001, shard=shard1}
   [junit4]   2> 327588 T1352 oasc.SolrResourceLoader.<init> new SolrResourceLoader for directory: 'C:\Users\JenkinsSlave\workspace\Lucene-Solr-trunk-Windows\solr\core\src\test-files\solr\collection1\'
   [junit4]   2> 327599 T1352 oasc.SolrResourceLoader.replaceClassLoader Adding 'file:/C:/Users/JenkinsSlave/workspace/Lucene-Solr-trunk-Windows/solr/core/src/test-files/solr/collection1/lib/classes/' to classloader
   [junit4]   2> 327600 T1352 oasc.SolrResourceLoader.replaceClassLoader Adding 'file:/C:/Users/JenkinsSlave/workspace/Lucene-Solr-trunk-Windows/solr/core/src/test-files/solr/collection1/lib/README' to classloader
   [junit4]   2> 327618 T1352 oasc.SolrConfig.refreshRequestParams current version of requestparams : -1
   [junit4]   2> 327625 T1352 oasc.SolrConfig.<init> Using Lucene MatchVersion: 6.0.0
   [junit4]   2> 327641 T1352 oasc.SolrConfig.<init> Loaded SolrConfig: solrconfig.xml
   [junit4]   2> 327641 T1352 oass.IndexSchema.readSchema Reading Solr Schema from C:\Users\JenkinsSlave\workspace\Lucene-Solr-trunk-Windows\solr\core\src\test-files\solr\collection1\conf\schema.xml
   [junit4]   2> 327645 T1352 oass.IndexSchema.readSchema [collection1] Schema name=test
   [junit4]   2> 327704 T1352 oass.OpenExchangeRatesOrgProvider.init Initialized with rates=open-exchange-rates.json, refreshInterval=1440.
   [junit4]   2> 327708 T1352 oass.IndexSchema.readSchema default search field in schema is text
   [junit4]   2> 327710 T1352 oass.IndexSchema.readSchema unique key field: id
   [junit4]   2> 327718 T1352 oass.FileExchangeRateProvider.reload Reloading exchange rates from file currency.xml
   [junit4]   2> 327720 T1352 oass.FileExchangeRateProvider.reload Reloading exchange rates from file currency.xml
   [junit4]   2> 327721 T1352 oass.OpenExchangeRatesOrgProvider.reload Reloading exchange rates from open-exchange-rates.json
   [junit4]   2> 327722 T1352 oass.OpenExchangeRatesOrgProvider$OpenExchangeRates.<init> WARN Unknown key IMPORTANT NOTE
   [junit4]   2> 327722 T1352 oass.OpenExchangeRatesOrgProvider$OpenExchangeRates.<init> WARN Expected key, got STRING
   [junit4]   2> 327722 T1352 oass.OpenExchangeRatesOrgProvider.reload Reloading exchange rates from open-exchange-rates.json
   [junit4]   2> 327722 T1352 oass.OpenExchangeRatesOrgProvider$OpenExchangeRates.<init> WARN Unknown key IMPORTANT NOTE
   [junit4]   2> 327722 T1352 oass.OpenExchangeRatesOrgProvider$OpenExchangeRates.<init> WARN Expected key, got STRING
   [junit4]   2> 327724 T1352 oasc.CoreContainer.create Creating SolrCore 'collection1' using configuration from instancedir C:\Users\JenkinsSlave\workspace\Lucene-Solr-trunk-Windows\solr\core\src\test-files\solr\collection1\
   [junit4]   2> 327724 T1352 c:collection1 oasc.SolrCore.initDirectoryFactory org.apache.solr.core.MockDirectoryFactory
   [junit4]   2> 327724 T1352 c:collection1 oasc.SolrCore.<init> [collection1] Opening new SolrCore at C:\Users\JenkinsSlave\workspace\Lucene-Solr-trunk-Windows\solr\core\src\test-files\solr\collection1\, dataDir=C:\Users\JenkinsSlave\workspace\Lucene-Solr-trunk-Windows\solr\build\solr-core\test\J0\temp\solr.update.HardAutoCommitTest 6DE66C602ACF2E07-001\init-core-data-001\
   [junit4]   2> 327724 T1352 c:collection1 oasc.JmxMonitoredMap.<init> JMX monitoring is enabled. Adding Solr mbeans to JMX Server: com.sun.jmx.mbeanserver.JmxMBeanServer@624096ac
   [junit4]   2> 327724 T1352 c:collection1 oasc.CachingDirectoryFactory.get return new directory for C:\Users\JenkinsSlave\workspace\Lucene-Solr-trunk-Windows\solr\build\solr-core\test\J0\temp\solr.update.HardAutoCommitTest 6DE66C602ACF2E07-001\init-core-data-001\
   [junit4]   2> 327725 T1352 c:collection1 oasc.SolrCore.getNewIndexDir New index directory detected: old=null new=C:\Users\JenkinsSlave\workspace\Lucene-Solr-trunk-Windows\solr\build\solr-core\test\J0\temp\solr.update.HardAutoCommitTest 6DE66C602ACF2E07-001\init-core-data-001\index/
   [junit4]   2> 327725 T1352 c:collection1 oasc.SolrCore.initIndex WARN [collection1] Solr index directory 'C:\Users\JenkinsSlave\workspace\Lucene-Solr-trunk-Windows\solr\build\solr-core\test\J0\temp\solr.update.HardAutoCommitTest 6DE66C602ACF2E07-001\init-core-data-001\index' doesn't exist. Creating new index...
   [junit4]   2> 327725 T1352 c:collection1 oasc.CachingDirectoryFactory.get return new directory for C:\Users\JenkinsSlave\workspace\Lucene-Solr-trunk-Windows\solr\build\solr-core\test\J0\temp\solr.update.HardAutoCommitTest 6DE66C602ACF2E07-001\init-core-data-001\index
   [junit4]   2> 327725 T1352 c:collection1 oasu.RandomMergePolicy.<init> RandomMergePolicy wrapping class org.apache.lucene.index.TieredMergePolicy: [TieredMergePolicy: maxMergeAtOnce=17, maxMergeAtOnceExplicit=39, maxMergedSegmentMB=61.9609375, floorSegmentMB=0.3525390625, forceMergeDeletesPctAllowed=6.699692461334661, segmentsPerTier=27.0, maxCFSSegmentSizeMB=8.796093022207999E12, noCFSRatio=1.0
   [junit4]   2> 327732 T1352 c:collection1 oasc.SolrDeletionPolicy.onCommit SolrDeletionPolicy.onCommit: commits: num=1
   [junit4]   2> 		commit{dir=MockDirectoryWrapper(RAMDirectory@716a1905 lockFactory=org.apache.lucene.store.SingleInstanceLockFactory@673f05a9),segFN=segments_1,generation=1}
   [junit4]   2> 327732 T1352 c:collection1 oasc.SolrDeletionPolicy.updateCommits newest commit generation = 1
   [junit4]   2> 327735 T1352 c:collection1 oasup.UpdateRequestProcessorChain.init creating updateRequestProcessorChain "dedupe"
   [junit4]   2> 327736 T1352 c:collection1 oasup.UpdateRequestProcessorChain.init inserting DistributedUpdateProcessorFactory into updateRequestProcessorChain "dedupe"
   [junit4]   2> 327736 T1352 c:collection1 oasup.UpdateRequestProcessorChain.init creating updateRequestProcessorChain "dedupe-allfields"
   [junit4]   2> 327736 T1352 c:collection1 oasup.UpdateRequestProcessorChain.init inserting DistributedUpdateProcessorFactory into updateRequestProcessorChain "dedupe-allfields"
   [junit4]   2> 327736 T1352 c:collection1 oasup.UpdateRequestProcessorChain.init creating updateRequestProcessorChain "stored_sig"
   [junit4]   2> 327736 T1352 c:collection1 oasup.UpdateRequestProcessorChain.init inserting DistributedUpdateProcessorFactory into updateRequestProcessorChain "stored_sig"
   [junit4]   2> 327736 T1352 c:collection1 oasup.UpdateRequestProcessorChain.init creating updateRequestProcessorChain "uniq-fields"
   [junit4]   2> 327736 T1352 c:collection1 oasup.UpdateRequestProcessorChain.init inserting DistributedUpdateProcessorFactory into updateRequestProcessorChain "uniq-fields"
   [junit4]   2> 327736 T1352 c:collection1 oasup.UpdateRequestProcessorChain.init creating updateRequestProcessorChain "distrib-dup-test-chain-explicit"
   [junit4]   2> 327737 T1352 c:collection1 oasup.UpdateRequestProcessorChain.init creating updateRequestProcessorChain "distrib-dup-test-chain-implicit"
   [junit4]   2> 327737 T1352 c:collection1 oasup.UpdateRequestProcessorChain.init inserting DistributedUpdateProcessorFactory into updateRequestProcessorChain "distrib-dup-test-chain-implicit"
   [junit4]   2> 327737 T1352 c:collection1 oasc.SolrCore.loadUpdateProcessorChains no updateRequestProcessorChain defined as default, creating implicit default
   [junit4]   2> 327742 T1352 c:collection1 oashl.XMLLoader.init xsltCacheLifetimeSeconds=60
   [junit4]   2> 327743 T1352 c:collection1 oashl.XMLLoader.init xsltCacheLifetimeSeconds=60
   [junit4]   2> 327744 T1352 c:collection1 oashl.XMLLoader.init xsltCacheLifetimeSeconds=60
   [junit4]   2> 327745 T1352 c:collection1 oashl.XMLLoader.init xsltCacheLifetimeSeconds=60
   [junit4]   2> 327750 T1352 c:collection1 oasc.PluginBag.createPlugin requestHandler : 'lazy' created with startup=lazy 
   [junit4]   2> 327786 T1352 c:collection1 oasc.RequestHandlers.initHandlersFromConfig Registered paths: /admin/mbeans,standard,spellCheckCompRH,lazy,/update/json/docs,/admin/luke,spellCheckWithWordbreak_Direct,tvrh,/get,/admin/properties,/update/json,mltrh,/admin/threads,/search-facet-def,/update/csv,/search-facet-invariants,/admin/segments,spellCheckCompRH1,/mlt,/admin/system,/replication,dismax,defaults,/config,/schema,/admin/plugins,/admin/logging,spellCheckWithWordbreak,mock,/admin/ping,/update,/admin/file,/terms,spellCheckCompRH_Direct,/debug/dump
   [junit4]   2> 327787 T1352 c:collection1 oasc.SolrCore.initDeprecatedSupport WARN solrconfig.xml uses deprecated <admin/gettableFiles>, Please update your config to use the ShowFileRequestHandler.
   [junit4]   2> 327787 T1352 c:collection1 oasc.SolrCore.initStatsCache Using default statsCache cache: org.apache.solr.search.stats.LocalStatsCache
   [junit4]   2> 327788 T1352 c:collection1 oasu.UpdateHandler.<init> Using UpdateLog implementation: org.apache.solr.update.UpdateLog
   [junit4]   2> 327789 T1352 c:collection1 oasu.UpdateLog.init Initializing UpdateLog: dataDir= defaultSyncLevel=FLUSH numRecordsToKeep=100 maxNumLogsToKeep=10
   [junit4]   2> 327789 T1352 c:collection1 oasu.CommitTracker.<init> Hard AutoCommit: disabled
   [junit4]   2> 327789 T1352 c:collection1 oasu.CommitTracker.<init> Soft AutoCommit: disabled
   [junit4]   2> 327790 T1352 c:collection1 oasu.RandomMergePolicy.<init> RandomMergePolicy wrapping class org.apache.lucene.index.TieredMergePolicy: [TieredMergePolicy: maxMergeAtOnce=2, maxMergeAtOnceExplicit=6, maxMergedSegmentMB=82.1455078125, floorSegmentMB=1.0439453125, forceMergeDeletesPctAllowed=28.16582759636699, segmentsPerTier=32.0, maxCFSSegmentSizeMB=8.796093022207999E12, noCFSRatio=1.0
   [junit4]   2> 327790 T1352 c:collection1 oasc.SolrDeletionPolicy.onInit SolrDeletionPolicy.onInit: commits: num=1
   [junit4]   2> 		commit{dir=MockDirectoryWrapper(RAMDirectory@716a1905 lockFactory=org.apache.lucene.store.SingleInstanceLockFactory@673f05a9),segFN=segments_1,generation=1}
   [junit4]   2> 327790 T1352 c:collection1 oasc.SolrDeletionPolicy.updateCommits newest commit generation = 1
   [junit4]   2> 327790 T1352 c:collection1 oass.SolrIndexSearcher.<init> Opening Searcher@79905de8[collection1] main
   [junit4]   2> 327791 T1352 c:collection1 oasr.RestManager.init Initializing RestManager with initArgs: {storageIO=org.apache.solr.rest.ManagedResourceStorage$InMemoryStorageIO}
   [junit4]   2> 327791 T1352 c:collection1 oasr.ManagedResourceStorage.load Reading _rest_managed.json using InMemoryStorage
   [junit4]   2> 327791 T1352 c:collection1 oasr.RestManager.init Initializing 0 registered ManagedResources
   [junit4]   2> 327791 T1352 c:collection1 oashc.SpellCheckComponent.inform Initializing spell checkers
   [junit4]   2> 327799 T1352 c:collection1 oass.DirectSolrSpellChecker.init init: {name=direct,classname=DirectSolrSpellChecker,field=lowerfilt,minQueryLength=3}
   [junit4]   2> 327865 T1352 c:collection1 oash.ReplicationHandler.inform Commits will be reserved for  10000
   [junit4]   2> 327866 T1352 c:collection1 oasc.CoreContainer.registerCore registering core: collection1
   [junit4]   2> 327867 T1351 oas.SolrTestCaseJ4.initCore ####initCore end
   [junit4]   2> 327872 T1353 c:collection1 oashc.SpellCheckComponent$SpellCheckerListener.newSearcher Loading spell index for spellchecker: default
   [junit4]   2> 327873 T1353 c:collection1 oashc.SpellCheckComponent$SpellCheckerListener.newSearcher Loading spell index for spellchecker: direct
   [junit4]   2> 327873 T1353 c:collection1 oashc.SpellCheckComponent$SpellCheckerListener.newSearcher Loading spell index for spellchecker: wordbreak
   [junit4]   2> 327873 T1353 c:collection1 oashc.SpellCheckComponent$SpellCheckerListener.newSearcher Loading spell index for spellchecker: multipleFields
   [junit4]   2> 327873 T1353 c:collection1 oashc.SpellCheckComponent$SpellCheckerListener.newSearcher Loading spell index for spellchecker: jarowinkler
   [junit4]   2> 327874 T1353 c:collection1 oashc.SpellCheckComponent$SpellCheckerListener.newSearcher Loading spell index for spellchecker: external
   [junit4]   2> 327875 T1353 c:collection1 oashc.SpellCheckComponent$SpellCheckerListener.newSearcher Loading spell index for spellchecker: freq
   [junit4]   2> 327875 T1353 c:collection1 oashc.SpellCheckComponent$SpellCheckerListener.newSearcher Loading spell index for spellchecker: fqcn
   [junit4]   2> 327876 T1353 c:collection1 oashc.SpellCheckComponent$SpellCheckerListener.newSearcher Loading spell index for spellchecker: perDict
   [junit4]   2> 327876 T1353 c:collection1 oasc.SolrCore.registerSearcher [collection1] Registered new searcher Searcher@79905de8[collection1] main{ExitableDirectoryReader(UninvertingDirectoryReader())}
   [junit4]   2> 327877 T1351 oas.SolrTestCaseJ4.setUp ###Starting testCommitWithin
   [junit4]   2> ASYNC  NEW_CORE C332 name=collection1 org.apache.solr.core.SolrCore@5247a341
   [junit4]   2> 327885 T1351 C332 oasup.LogUpdateProcessor.finish [collection1] webapp=null path=null params={} {deleteByQuery=*:* (-1497277836743933952)} 0 8
   [junit4]   2> 327887 T1351 oasc.SolrResourceLoader.<init> new SolrResourceLoader for directory: 'C:\Users\JenkinsSlave\workspace\Lucene-Solr-trunk-Windows\solr\core\src\test-files\solr\collection1\'
   [junit4]   2> 327887 T1351 oasc.SolrResourceLoader.replaceClassLoader Adding 'file:/C:/Users/JenkinsSlave/workspace/Lucene-Solr-trunk-Windows/solr/core/src/test-files/solr/collection1/lib/classes/' to classloader
   [junit4]   2> 327888 T1351 oasc.SolrResourceLoader.replaceClassLoader Adding 'file:/C:/Users/JenkinsSlave/workspace/Lucene-Solr-trunk-Windows/solr/core/src/test-files/solr/collection1/lib/README' to classloader
   [junit4]   2> 327906 T1351 oasc.SolrConfig.refreshRequestParams current version of requestparams : -1
   [junit4]   2> 327913 T1351 oasc.SolrConfig.<init> Using Lucene MatchVersion: 6.0.0
   [junit4]   2> 327928 T1351 oasc.SolrConfig.<init> Loaded SolrConfig: solrconfig.xml
   [junit4]   2> 327929 T1351 oass.IndexSchema.readSchema Reading Solr Schema from C:\Users\JenkinsSlave\workspace\Lucene-Solr-trunk-Windows\solr\core\src\test-files\solr\collection1\conf\schema.xml
   [junit4]   2> 327933 T1351 oass.IndexSchema.readSchema [collection1] Schema name=test
   [junit4]   2> 328007 T1351 oass.OpenExchangeRatesOrgProvider.init Initialized with rates=open-exchange-rates.json, refreshInterval=1440.
   [junit4]   2> 328012 T1351 oass.IndexSchema.readSchema default search field in schema is text
   [junit4]   2> 328014 T1351 oass.IndexSchema.readSchema unique key field: id
   [junit4]   2> 328019 T1351 oass.FileExchangeRateProvider.reload Reloading exchange rates from file currency.xml
   [junit4]   2> 328021 T1351 oass.FileExchangeRateProvider.reload Reloading exchange rates from file currency.xml
   [junit4]   2> 328022 T1351 oass.OpenExchangeRatesOrgProvider.reload Reloading exchange rates from open-exchange-rates.json
   [junit4]   2> 328023 T1351 oass.OpenExchangeRatesOrgProvider$OpenExchangeRates.<init> WARN Unknown key IMPORTANT NOTE
   [junit4]   2> 328025 T1351 oass.OpenExchangeRatesOrgProvider$OpenExchangeRates.<init> WARN Expected key, got STRING
   [junit4]   2> 328026 T1351 oass.OpenExchangeRatesOrgProvider.reload Reloading exchange rates from open-exchange-rates.json
   [junit4]   2> 328026 T1351 oass.OpenExchangeRatesOrgProvider$OpenExchangeRates.<init> WARN Unknown key IMPORTANT NOTE
   [junit4]   2> 328026 T1351 oass.OpenExchangeRatesOrgProvider$OpenExchangeRates.<init> WARN Expected key, got STRING
   [junit4]   2> 328026 T1351 oasc.CoreContainer.reload Reloading SolrCore 'collection1' using configuration from instancedir C:\Users\JenkinsSlave\workspace\Lucene-Solr-trunk-Windows\solr\core\src\test-files\solr\collection1\
   [junit4]   2> 328028 T1351 c:collection1 oasc.SolrCore.<init> [collection1] Opening new SolrCore at C:\Users\JenkinsSlave\workspace\Lucene-Solr-trunk-Windows\solr\core\src\test-files\solr\collection1\, dataDir=C:\Users\JenkinsSlave\workspace\Lucene-Solr-trunk-Windows\solr\build\solr-core\test\J0\temp\solr.update.HardAutoCommitTest 6DE66C602ACF2E07-001\init-core-data-001\
   [junit4]   2> 328028 T1351 c:collection1 oasc.JmxMonitoredMap.<init> JMX monitoring is enabled. Adding Solr mbeans to JMX Server: com.sun.jmx.mbeanserver.JmxMBeanServer@624096ac
   [junit4]   2> 328028 T1351 c:collection1 oasc.SolrCore.getNewIndexDir New index directory detected: old=null new=C:\Users\JenkinsSlave\workspace\Lucene-Solr-trunk-Windows\solr\build\solr-core\test\J0\temp\solr.update.HardAutoCommitTest 6DE66C602ACF2E07-001\init-core-data-001\index/
   [junit4]   2> 328032 T1351 c:collection1 oasup.UpdateRequestProcessorChain.init creating updateRequestProcessorChain "dedupe"
   [junit4]   2> 328033 T1351 c:collection1 oasup.UpdateRequestProcessorChain.init inserting DistributedUpdateProcessorFactory into updateRequestProcessorChain "dedupe"
   [junit4]   2> 328033 T1351 c:collection1 oasup.UpdateRequestProcessorChain.init creating updateRequestProcessorChain "dedupe-allfields"
   [junit4]   2> 328033 T1351 c:collection1 oasup.UpdateRequestProcessorChain.init inserting DistributedUpdateProcessorFactory into updateRequestProcessorChain "dedupe-allfields"
   [junit4]   2> 328033 T1351 c:collection1 oasup.UpdateRequestProcessorChain.init creating updateRequestProcessorChain "stored_sig"
   [junit4]   2> 328033 T1351 c:collection1 oasup.UpdateRequestProcessorChain.init inserting DistributedUpdateProcessorFactory into updateRequestProcessorChain "stored_sig"
   [junit4]   2> 328033 T1351 c:collection1 oasup.UpdateRequestProcessorChain.init creating updateRequestProcessorChain "uniq-fields"
   [junit4]   2> 328034 T1351 c:collection1 oasup.UpdateRequestProcessorChain.init inserting DistributedUpdateProcessorFactory into updateRequestProcessorChain "uniq-fields"
   [junit4]   2> 328034 T1351 c:collection1 oasup.UpdateRequestProcessorChain.init creating updateRequestProcessorChain "distrib-dup-test-chain-explicit"
   [junit4]   2> 328034 T1351 c:collection1 oasup.UpdateRequestProcessorChain.init creating updateRequestProcessorChain "distrib-dup-test-chain-implicit"
   [junit4]   2> 328034 T1351 c:collection1 oasup.UpdateRequestProcessorChain.init inserting DistributedUpdateProcessorFactory into updateRequestProcessorChain "distrib-dup-test-chain-implicit"
   [junit4]   2> 328035 T1351 c:collection1 oasc.SolrCore.loadUpdateProcessorChains no updateRequestProcessorChain defined as default, creating implicit default
   [junit4]   2> 328036 T1351 c:collection1 oashl.XMLLoader.init xsltCacheLifetimeSeconds=60
   [junit4]   2> 328037 T1351 c:collection1 oashl.XMLLoader.init xsltCacheLifetimeSeconds=60
   [junit4]   2> 328038 T1351 c:collection1 oashl.XMLLoader.init xsltCacheLifetimeSeconds=60
   [junit4]   2> 328039 T1351 c:collection1 oashl.XMLLoader.init xsltCacheLifetimeSeconds=60
   [junit4]   2> 328047 T1351 c:collection1 oasc.PluginBag.createPlugin requestHandler : 'lazy' created with startup=lazy 
   [junit4]   2> 328049 T1351 c:collection1 oasc.RequestHandlers.initHandlersFromConfig Registered paths: /admin/mbeans,standard,spellCheckCompRH,lazy,/update/json/docs,/admin/luke,spellCheckWithWordbreak_Direct,tvrh,/get,/admin/properties,/update/json,mltrh,/admin/threads,/search-facet-def,/update/csv,/search-facet-invariants,/admin/segments,spellCheckCompRH1,/mlt,/admin/system,/replication,dismax,defaults,/config,/schema,/admin/plugins,/admin/logging,spellCheckWithWordbreak,mock,/admin/ping,/update,/admin/file,/terms,spellCheckCompRH_Direct,/debug/dump
   [junit4]   2> 328049 T1351 c:collection1 oasc.SolrCore.initDeprecatedSupport WARN solrconfig.xml uses deprecated <admin/gettableFiles>, Please update your config to use the ShowFileRequestHandler.
   [junit4]   2> 328050 T1351 c:collection1 oasc.SolrCore.initStatsCache Using default statsCache cache: org.apache.solr.search.stats.LocalStatsCache
   [junit4]   2> 328053 T1351 c:collection1 oasu.CommitTracker.<init> Hard AutoCommit: disabled
   [junit4]   2> 328053 T1351 c:collection1 oasu.CommitTracker.<init> Soft AutoCommit: disabled
   [junit4]   2> 328054 T1351 c:collection1 oass.SolrIndexSearcher.<init> Opening Searcher@6f751c68[collection1] main
   [junit4]   2> 328054 T1351 c:collection1 oasr.RestManager.init Initializing RestManager with initArgs: {storageIO=org.apache.solr.rest.ManagedResourceStorage$InMemoryStorageIO}
   [junit4]   2> 328054 T1351 c:collection1 oasr.ManagedResourceStorage.load Reading _rest_managed.json using InMemoryStorage
   [junit4]   2> 328054 T1351 c:collection1 oasr.RestManager.init Initializing 0 registered ManagedResources
   [junit4]   2> 328055 T1351 c:collection1 oashc.SpellCheckComponent.inform Initializing spell checkers
   [junit4]   2> 328057 T1351 c:collection1 oass.DirectSolrSpellChecker.init init: {name=direct,classname=DirectSolrSpellChecker,field=lowerfilt,minQueryLength=3}
   [junit4]   2> 328062 T1351 c:collection1 oash.ReplicationHandler.inform Commits will be reserved for  10000
   [junit4]   2> 328066 T1351 c:collection1 oasu.DefaultSolrCoreState.newIndexWriter Creating new IndexWriter...
   [junit4]   2> 328066 T1351 c:collection1 oasu.DefaultSolrCoreState.newIndexWriter Waiting until IndexWriter is unused... core=collection1
   [junit4]   2> 328066 T1351 c:collection1 oasu.DefaultSolrCoreState.newIndexWriter Closing old IndexWriter... core=collection1
   [junit4]   2> 328072 T1355 c:collection1 oashc.SpellCheckComponent$SpellCheckerListener.newSearcher Loading spell index for spellchecker: default
   [junit4]   2> 328072 T1355 c:collection1 oashc.SpellCheckComponent$SpellCheckerListener.newSearcher Loading spell index for spellchecker: direct
   [junit4]   2> 328073 T1355 c:collection1 oashc.SpellCheckComponent$SpellCheckerListener.newSearcher Loading spell index for spellchecker: wordbreak
   [junit4]   2> 328073 T1355 c:collection1 oashc.SpellCheckComponent$SpellCheckerListener.newSearcher Loading spell index for spellchecker: multipleFields
   [junit4]   2> 328073 T1355 c:collection1 oashc.SpellCheckComponent$SpellCheckerListener.newSearcher Loading spell index for spellchecker: jarowinkler
   [junit4]   2> 328074 T1355 c:collection1 oashc.SpellCheckComponent$SpellCheckerListener.newSearcher Loading spell index for spellchecker: external
   [junit4]   2> 328074 T1355 c:collection1 oashc.SpellCheckComponent$SpellCheckerListener.newSearcher Loading spell index for spellchecker: freq
   [junit4]   2> 328074 T1355 c:collection1 oashc.SpellCheckComponent$SpellCheckerListener.newSearcher Loading spell index for spellchecker: fqcn
   [junit4]   2> 328075 T1355 c:collection1 oashc.SpellCheckComponent$SpellCheckerListener.newSearcher Loading spell index for spellchecker: perDict
   [junit4]   2> 328075 T1355 c:collection1 oasc.SolrCore.registerSearcher [collection1] Registered new searcher Searcher@6f751c68[collection1] main{ExitableDirectoryReader(UninvertingDirectoryReader())}
   [junit4]   2> 328077 T1351 c:collection1 oasu.RandomMergePolicy.<init> RandomMergePolicy wrapping class org.apache.lucene.index.TieredMergePolicy: [TieredMergePolicy: maxMergeAtOnce=44, maxMergeAtOnceExplicit=19, maxMergedSegmentMB=63.140625, floorSegmentMB=1.9072265625, forceMergeDeletesPctAllowed=28.126166380012904, segmentsPerTier=35.0, maxCFSSegmentSizeMB=8.796093022207999E12, noCFSRatio=0.2564418809441915
   [junit4]   2> 328079 T1351 c:collection1 oasc.SolrDeletionPolicy.onInit SolrDeletionPolicy.onInit: commits: num=1
   [junit4]   2> 		commit{dir=MockDirectoryWrapper(RAMDirectory@716a1905 lockFactory=org.apache.lucene.store.SingleInstanceLockFactory@673f05a9),segFN=segments_1,generation=1}
   [junit4]   2> 328080 T1351 c:collection1 oasc.SolrDeletionPolicy.updateCommits newest commit generation = 1
   [junit4]   2> 328080 T1351 c:collection1 oasu.DefaultSolrCoreState.newIndexWriter New IndexWriter is ready to be used.
   [junit4]   2> 328081 T1351 c:collection1 oass.SolrIndexSearcher.<init> Opening Searcher@705aa3d5[collection1] main
   [junit4]   2> 328081 T1351 c:collection1 oasc.CoreContainer.registerCore replacing core: collection1
   [junit4]   2> 328081 T1351 c:collection1 oasc.SolrCore.close [collection1]  CLOSING SolrCore org.apache.solr.core.SolrCore@5247a341
   [junit4]   2> 328081 T1351 c:collection1 oasu.DirectUpdateHandler2.close closing DirectUpdateHandler2{commits=0,autocommits=0,soft autocommits=0,optimizes=0,rollbacks=0,expungeDeletes=0,docsPending=0,adds=0,deletesById=0,deletesByQuery=1,errors=0,cumulative_adds=0,cumulative_deletesById=0,cumulative_deletesByQuery=1,cumulative_errors=0,transaction_logs_total_size=0,transaction_logs_total_number=0}
   [junit4]   2> 328082 T1351 c:collection1 oasc.SolrCore.closeSearcher [collection1] Closing main searcher on request.
   [junit4]   2> 328099 T1355 c:collection1 oasc.SolrCore.registerSearcher [collection1] Registered new searcher Searcher@705aa3d5[collection1] main{ExitableDirectoryReader(UninvertingDirectoryReader())}
   [junit4]   2> 328101 T1351 c:collection1 oasup.LogUpdateProcessor.finish [collection1] {add=[529 (1497277836974620672)]} 0 6
   [junit4]   2> ASYNC  NEW_CORE C333 name=collection1 org.apache.solr.core.SolrCore@699c47b5
   [junit4]   2> 328102 T1351 c:collection1 C333 oasc.SolrCore.execute [collection1] webapp=null path=null params={q=id:529&qt=standard&start=0&rows=20&version=2.2} hits=0 status=0 QTime=0 
   [junit4]   2> 328103 T1351 c:collection1 oasup.LogUpdateProcessor.finish [collection1] {add=[530 (1497277836979863552)]} 0 8
   [junit4]   2> 328103 T1351 c:collection1 C333 oasc.SolrCore.execute [collection1] webapp=null path=null params={q=id:530&qt=standard&start=0&rows=20&version=2.2} hits=0 status=0 QTime=0 
   [junit4]   2> 328104 T1351 c:collection1 oasup.LogUpdateProcessor.finish [collection1] {delete=[529 (-1497277836980912128)]} 0 9
   [junit4]   2> 328104 T1351 c:collection1 C333 oasc.SolrCore.execute [collection1] webapp=null path=null params={q=id:529&qt=standard&start=0&rows=20&version=2.2} hits=0 status=0 QTime=0 
   [junit4]   2> 328105 T1351 c:collection1 oas.SolrTestCaseJ4.assertQ ERROR REQUEST FAILED: xpath=//result[@numFound=1]
   [junit4]   2> 		xml response was: <?xml version="1.0" encoding="UTF-8"?>
   [junit4]   2> 	<response>
   [junit4]   2> 	<lst name="responseHeader"><int name="status">0</int><int name="QTime">0</int></lst><result name="response" numFound="0" start="0"></result>
   [junit4]   2> 	</response>
   [junit4]   2> 	
   [junit4]   2> 		request was:q=id:529&qt=standard&start=0&rows=20&version=2.2
   [junit4]   2> 328105 T1351 c:collection1 oasc.SolrException.log ERROR REQUEST FAILED: q=id:529&qt=standard&start=0&rows=20&version=2.2:java.lang.RuntimeException: REQUEST FAILED: xpath=//result[@numFound=1]
   [junit4]   2> 		xml response was: <?xml version="1.0" encoding="UTF-8"?>
   [junit4]   2> 	<response>
   [junit4]   2> 	<lst name="responseHeader"><int name="status">0</int><int name="QTime">0</int></lst><result name="response" numFound="0" start="0"></result>
   [junit4]   2> 	</response>
   [junit4]   2> 	
   [junit4]   2> 		request was:q=id:529&qt=standard&start=0&rows=20&version=2.2
   [junit4]   2> 		at org.apache.solr.SolrTestCaseJ4.assertQ(SolrTestCaseJ4.java:787)
   [junit4]   2> 		at org.apache.solr.update.HardAutoCommitTest.testCommitWithin(HardAutoCommitTest.java:100)
   [junit4]   2> 		at sun.reflect.NativeMethodAccessorImpl.invoke0(Native Method)
   [junit4]   2> 		at sun.reflect.NativeMethodAccessorImpl.invoke(NativeMethodAccessorImpl.java:62)
   [junit4]   2> 		at sun.reflect.DelegatingMethodAccessorImpl.invoke(DelegatingMethodAccessorImpl.java:43)
   [junit4]   2> 		at java.lang.reflect.Method.invoke(Method.java:497)
   [junit4]   2> 		at com.carrotsearch.randomizedtesting.RandomizedRunner.invoke(RandomizedRunner.java:1627)
   [junit4]   2> 		at com.carrotsearch.randomizedtesting.RandomizedRunner$6.evaluate(RandomizedRunner.java:836)
   [junit4]   2> 		at com.carrotsearch.randomizedtesting.RandomizedRunner$7.evaluate(RandomizedRunner.java:872)
   [junit4]   2> 		at com.carrotsearch.randomizedtesting.RandomizedRunner$8.evaluate(RandomizedRunner.java:886)
   [junit4]   2> 		at com.carrotsearch.randomizedtesting.rules.SystemPropertiesRestoreRule$1.evaluate(SystemPropertiesRestoreRule.java:53)
   [junit4]   2> 		at org.apache.lucene.util.TestRuleSetupTeardownChained$1.evaluate(TestRuleSetupTeardownChained.java:50)
   [junit4]   2> 		at org.apache.lucene.util.AbstractBeforeAfterRule$1.evaluate(AbstractBeforeAfterRule.java:46)
   [junit4]   2> 		at org.apache.lucene.util.TestRuleThreadAndTestName$1.evaluate(TestRuleThreadAndTestName.java:49)
   [junit4]   2> 		at org.apache.lucene.util.TestRuleIgnoreAfterMaxFailures$1.evaluate(TestRuleIgnoreAfterMaxFailures.java:65)
   [junit4]   2> 		at org.apache.lucene.util.TestRuleMarkFailure$1.evaluate(TestRuleMarkFailure.java:48)
   [junit4]   2> 		at com.carrotsearch.randomizedtesting.rules.StatementAdapter.evaluate(StatementAdapter.java:36)
   [junit4]   2> 		at com.carrotsearch.randomizedtesting.ThreadLeakControl$StatementRunner.run(ThreadLeakControl.java:365)
   [junit4]   2> 		at com.carrotsearch.randomizedtesting.ThreadLeakControl.forkTimeoutingTask(ThreadLeakControl.java:798)
   [junit4]   2> 		at com.carrotsearch.randomizedtesting.ThreadLeakControl$3.evaluate(ThreadLeakControl.java:458)
   [junit4]   2> 		at com.carrotsearch.randomizedtesting.RandomizedRunner.runSingleTest(RandomizedRunner.java:845)
   [junit4]   2> 		at com.carrotsearch.randomizedtesting.RandomizedRunner$3.evaluate(RandomizedRunner.java:747)
   [junit4]   2> 		at com.carrotsearch.randomizedtesting.RandomizedRunner$4.evaluate(RandomizedRunner.java:781)
   [junit4]   2> 		at com.carrotsearch.randomizedtesting.RandomizedRunner$5.evaluate(RandomizedRunner.java:792)
   [junit4]   2> 		at com.carrotsearch.randomizedtesting.rules.StatementAdapter.evaluate(StatementAdapter.java:36)
   [junit4]   2> 		at com.carrotsearch.randomizedtesting.rules.SystemPropertiesRestoreRule$1.evaluate(SystemPropertiesRestoreRule.java:53)
   [junit4]   2> 		at org.apache.lucene.util.AbstractBeforeAfterRule$1.evaluate(AbstractBeforeAfterRule.java:46)
   [junit4]   2> 		at com.carrotsearch.randomizedtesting.rules.StatementAdapter.evaluate(StatementAdapter.java:36)
   [junit4]   2> 		at org.apache.lucene.util.TestRuleStoreClassName$1.evaluate(TestRuleStoreClassName.java:42)
   [junit4]   2> 		at com.carrotsearch.randomizedtesting.rules.NoShadowingOrOverridesOnMethodsRule$1.evaluate(NoShadowingOrOverridesOnMethodsRule.java:39)
   [junit4]   2> 		at com.carrotsearch.randomizedtesting.rules.NoShadowingOrOverridesOnMethodsRule$1.evaluate(NoShadowingOrOverridesOnMethodsRule.java:39)
   [junit4]   2> 		at com.carrotsearch.randomizedtesting.rules.StatementAdapter.evaluate(StatementAdapter.java:36)
   [junit4]   2> 		at com.carrotsearch.randomizedtesting.rules.StatementAdapter.evaluate(StatementAdapter.java:36)
   [junit4]   2> 		at com.carrotsearch.randomizedtesting.rules.StatementAdapter.evaluate(StatementAdapter.java:36)
   [junit4]   2> 		at org.apache.lucene.util.TestRuleAssertionsRequired$1.evaluate(TestRuleAssertionsRequired.java:54)
   [junit4]   2> 		at org.apache.lucene.util.TestRuleMarkFailure$1.evaluate(TestRuleMarkFailure.java:48)
   [junit4]   2> 		at org.apache.lucene.util.TestRuleIgnoreAfterMaxFailures$1.evaluate(TestRuleIgnoreAfterMaxFailures.java:65)
   [junit4]   2> 		at org.apache.lucene.util.TestRuleIgnoreTestSuites$1.evaluate(TestRuleIgnoreTestSuites.java:55)
   [junit4]   2> 		at com.carrotsearch.randomizedtesting.rules.StatementAdapter.evaluate(StatementAdapter.java:36)
   [junit4]   2> 		at com.carrotsearch.randomizedtesting.ThreadLeakControl$StatementRunner.run(ThreadLeakControl.java:365)
   [junit4]   2> 		at java.lang.Thread.run(Thread.java:745)
   [junit4]   2> 	
   [junit4]   2> 328107 T1351 c:collection1 oas.SolrTestCaseJ4.tearDown ###Ending testCommitWithin
   [junit4]   2> NOTE: reproduce with: ant test  -Dtestcase=HardAutoCommitTest -Dtests.method=testCommitWithin -Dtests.seed=6DE66C602ACF2E07 -Dtests.slow=true -Dtests.locale=nl -Dtests.timezone=Indian/Antananarivo -Dtests.asserts=true -Dtests.file.encoding=Cp1252
   [junit4] ERROR   0.26s J0 | HardAutoCommitTest.testCommitWithin <<<
   [junit4]    > Throwable #1: java.lang.RuntimeException: Exception during query
   [junit4]    > 	at __randomizedtesting.SeedInfo.seed([6DE66C602ACF2E07:D7340318A9E1C012]:0)
   [junit4]    > 	at org.apache.solr.SolrTestCaseJ4.assertQ(SolrTestCaseJ4.java:794)
   [junit4]    > 	at org.apache.solr.update.HardAutoCommitTest.testCommitWithin(HardAutoCommitTest.java:100)
   [junit4]    > 	at java.lang.Thread.run(Thread.java:745)
   [junit4]    > Caused by: java.lang.RuntimeException: REQUEST FAILED: xpath=//result[@numFound=1]
   [junit4]    > 	xml response was: <?xml version="1.0" encoding="UTF-8"?>
   [junit4]    > <response>
   [junit4]    > <lst name="responseHeader"><int name="status">0</int><int name="QTime">0</int></lst><result name="response" numFound="0" start="0"></result>
   [junit4]    > </response>
   [junit4]    > 	request was:q=id:529&qt=standard&start=0&rows=20&version=2.2
   [junit4]    > 	at org.apache.solr.SolrTestCaseJ4.assertQ(SolrTestCaseJ4.java:787)
   [junit4]    > 	... 40 more
   [junit4]   2> 328132 T1351 c:collection1 oas.SolrTestCaseJ4.deleteCore ###deleteCore
   [junit4]   2> 328132 T1351 c:collection1 oasc.CoreContainer.shutdown Shutting down CoreContainer instance=366835628
   [junit4]   2> 328134 T1351 c:collection1 oasc.SolrCore.close [collection1]  CLOSING SolrCore org.apache.solr.core.SolrCore@699c47b5
   [junit4]   2> 328134 T1351 c:collection1 oasu.DirectUpdateHandler2.close closing DirectUpdateHandler2{commits=0,autocommits=0,soft autocommits=0,optimizes=0,rollbacks=0,expungeDeletes=0,docsPending=2,adds=2,deletesById=1,deletesByQuery=0,errors=0,cumulative_adds=2,cumulative_deletesById=1,cumulative_deletesByQuery=0,cumulative_errors=0,transaction_logs_total_size=0,transaction_logs_total_number=0}
   [junit4]   2> 328134 T1351 c:collection1 oasu.SolrCoreState.decrefSolrCoreState Closing SolrCoreState
   [junit4]   2> 328134 T1351 c:collection1 oasu.DefaultSolrCoreState.closeIndexWriter SolrCoreState ref count has reached 0 - closing IndexWriter
   [junit4]   2> 328135 T1351 c:collection1 oasu.DefaultSolrCoreState.closeIndexWriter closing IndexWriter with IndexWriterCloser
   [junit4]   2> 328135 T1351 c:collection1 C333 oasu.DirectUpdateHandler2.closeWriter Committing on IndexWriter close.
   [junit4]   2> 328137 T1351 c:collection1 C333 oasc.SolrDeletionPolicy.onCommit SolrDeletionPolicy.onCommit: commits: num=2
   [junit4]   2> 		commit{dir=MockDirectoryWrapper(RAMDirectory@716a1905 lockFactory=org.apache.lucene.store.SingleInstanceLockFactory@673f05a9),segFN=segments_1,generation=1}
   [junit4]   2> 		commit{dir=MockDirectoryWrapper(RAMDirectory@716a1905 lockFactory=org.apache.lucene.store.SingleInstanceLockFactory@673f05a9),segFN=segments_2,generation=2}
   [junit4]   2> 328137 T1351 c:collection1 C333 oasc.SolrDeletionPolicy.updateCommits newest commit generation = 2
   [junit4]   2> 328139 T1351 c:collection1 oasc.SolrCore.closeSearcher [collection1] Closing main searcher on request.
   [junit4]   2> 328156 T1351 c:collection1 oasc.CachingDirectoryFactory.close Closing MockDirectoryFactory - 2 directories currently being tracked
   [junit4]   2> 328156 T1351 c:collection1 oasc.CachingDirectoryFactory.closeCacheValue looking to close C:\Users\JenkinsSlave\workspace\Lucene-Solr-trunk-Windows\solr\build\solr-core\test\J0\temp\solr.update.HardAutoCommitTest 6DE66C602ACF2E07-001\init-core-data-001\index [CachedDir<<refCount=0;path=C:\Users\JenkinsSlave\workspace\Lucene-Solr-trunk-Windows\solr\build\solr-core\test\J0\temp\solr.update.HardAutoCommitTest 6DE66C602ACF2E07-001\init-core-data-001\index;done=false>>]
   [junit4]   2> 328156 T1351 c:collection1 oasc.CachingDirectoryFactory.close Closing directory: C:\Users\JenkinsSlave\workspace\Lucene-Solr-trunk-Windows\solr\build\solr-core\test\J0\temp\solr.update.HardAutoCommitTest 6DE66C602ACF2E07-001\init-core-data-001\index
   [junit4]   2> 328157 T1351 c:collection1 oasc.CachingDirectoryFactory.closeCacheValue looking to close C:\Users\JenkinsSlave\workspace\Lucene-Solr-trunk-Windows\solr\build\solr-core\test\J0\temp\solr.update.HardAutoCommitTest 6DE66C602ACF2E07-001\init-core-data-001\ [CachedDir<<refCount=0;path=C:\Users\JenkinsSlave\workspace\Lucene-Solr-trunk-Windows\solr\build\solr-core\test\J0\temp\solr.update.HardAutoCommitTest 6DE66C602ACF2E07-001\init-core-data-001\;done=false>>]
   [junit4]   2> 328157 T1351 c:collection1 oasc.CachingDirectoryFactory.close Closing directory: C:\Users\JenkinsSlave\workspace\Lucene-Solr-trunk-Windows\solr\build\solr-core\test\J0\temp\solr.update.HardAutoCommitTest 6DE66C602ACF2E07-001\init-core-data-001\
   [junit4]   2> NOTE: leaving temporary files on disk at: C:\Users\JenkinsSlave\workspace\Lucene-Solr-trunk-Windows\solr\build\solr-core\test\J0\temp\solr.update.HardAutoCommitTest 6DE66C602ACF2E07-001
   [junit4]   2> NOTE: test params are: codec=Asserting(Lucene50): {_version_=PostingsFormat(name=Direct), field_t=PostingsFormat(name=LuceneVarGapFixedInterval), multiDefault=PostingsFormat(name=MockRandom), subject=PostingsFormat(name=MockRandom), intDefault=PostingsFormat(name=Direct), id=PostingsFormat(name=LuceneVarGapFixedInterval), text=PostingsFormat(name=Memory doPackFST= false), range_facet_l=PostingsFormat(name=MockRandom), timestamp=PostingsFormat(name=MockRandom)}, docValues:{timestamp=DocValuesFormat(name=Memory)}, sim=DefaultSimilarity, locale=nl, timezone=Indian/Antananarivo
   [junit4]   2> NOTE: Windows 7 6.1 amd64/Oracle Corporation 1.8.0_40 (64-bit)/cpus=3,threads=1,free=176368800,total=458227712
   [junit4]   2> NOTE: All tests run in this JVM: [TestRecoveryHdfs, JSONWriterTest, BasicDistributedZkTest, AtomicUpdatesTest, TestMaxScoreQueryParser, TestBM25SimilarityFactory, SolrInfoMBeanTest, TestRandomDVFaceting, RecoveryZkTest, TestRestManager, CoreAdminRequestStatusTest, TestIndexingPerformance, SuggesterTest, TestLRUCache, ZkCLITest, TestStressVersions, ShowFileRequestHandlerTest, TestRequestStatusCollectionAPI, AddSchemaFieldsUpdateProcessorFactoryTest, TestAddFieldRealTimeGet, DistanceUnitsTest, TestQueryUtils, TestRawResponseWriter, MigrateRouteKeyTest, HardAutoCommitTest]
   [junit4] Completed on J0 in 0.84s, 1 test, 1 error <<< FAILURES!

[...truncated 1065 lines...]
   [junit4] Suite: org.apache.solr.core.TestSolrConfigHandler
   [junit4]   2> Creating dataDir: C:\Users\JenkinsSlave\workspace\Lucene-Solr-trunk-Windows\solr\build\solr-core\test\J1\temp\solr.core.TestSolrConfigHandler 6DE66C602ACF2E07-001\init-core-data-001
   [junit4]   2> 1739276 T11151 oas.SolrTestCaseJ4.buildSSLConfig Randomized ssl (false) and clientAuth (false)
   [junit4]   2> 1739278 T11151 oas.SolrTestCaseJ4.setUp ###Starting testReqHandlerAPIs
   [junit4]   2> 1739526 T11151 oas.SolrTestCaseJ4.initCore ####initCore
   [junit4]   2> 1739526 T11151 oas.SolrTestCaseJ4.initCore ####initCore end
   [junit4]   2> 1739527 T11151 oas.SolrTestCaseJ4.writeCoreProperties Writing core.properties file to C:\Users\JenkinsSlave\workspace\Lucene-Solr-trunk-Windows\solr\build\solr-core\test\J1\temp\solr.core.TestSolrConfigHandler 6DE66C602ACF2E07-001\tempDir-003\cores\core
   [junit4]   2> 1739530 T11151 oejs.Server.doStart jetty-9.2.9.v20150224
   [junit4]   2> 1739532 T11151 oejsh.ContextHandler.doStart Started o.e.j.s.ServletContextHandler@1c37d432{/solr,null,AVAILABLE}
   [junit4]   2> 1739533 T11151 oejs.AbstractConnector.doStart Started ServerConnector@13080890{HTTP/1.1}{127.0.0.1:63317}
   [junit4]   2> 1739534 T11151 oejs.Server.doStart Started @1741464ms
   [junit4]   2> 1739534 T11151 oascse.JettySolrRunner$1.lifeCycleStarted Jetty properties: {hostContext=/solr, hostPort=63317, configSetBaseDir=C:\Users\JenkinsSlave\workspace\Lucene-Solr-trunk-Windows\solr\build\solr-core\test\J1\temp\solr.core.TestSolrConfigHandler 6DE66C602ACF2E07-001\tempDir-001, coreRootDirectory=C:\Users\JenkinsSlave\workspace\Lucene-Solr-trunk-Windows\solr\build\solr-core\test\J1\temp\solr.core.TestSolrConfigHandler 6DE66C602ACF2E07-001\tempDir-003\cores}
   [junit4]   2> 1739535 T11151 oass.SolrDispatchFilter.init SolrDispatchFilter.init()sun.misc.Launcher$AppClassLoader@4e0e2f2a
   [junit4]   2> 1739535 T11151 oasc.SolrResourceLoader.<init> new SolrResourceLoader for directory: 'C:\Users\JenkinsSlave\workspace\Lucene-Solr-trunk-Windows\solr\build\solr-core\test\J1\temp\solr.core.TestSolrConfigHandler 6DE66C602ACF2E07-001\tempDir-001\'
   [junit4]   2> 1739556 T11151 oasc.SolrXmlConfig.fromFile Loading container configuration from C:\Users\JenkinsSlave\workspace\Lucene-Solr-trunk-Windows\solr\build\solr-core\test\J1\temp\solr.core.TestSolrConfigHandler 6DE66C602ACF2E07-001\tempDir-001\solr.xml
   [junit4]   2> 1739562 T11151 oasc.CorePropertiesLocator.<init> Config-defined core root directory: C:\Users\JenkinsSlave\workspace\Lucene-Solr-trunk-Windows\solr\build\solr-core\test\J1\temp\solr.core.TestSolrConfigHandler 6DE66C602ACF2E07-001\tempDir-003\cores
   [junit4]   2> 1739562 T11151 oasc.CoreContainer.<init> New CoreContainer 121518493
   [junit4]   2> 1739562 T11151 oasc.CoreContainer.load Loading cores into CoreContainer [instanceDir=C:\Users\JenkinsSlave\workspace\Lucene-Solr-trunk-Windows\solr\build\solr-core\test\J1\temp\solr.core.TestSolrConfigHandler 6DE66C602ACF2E07-001\tempDir-001\]
   [junit4]   2> 1739562 T11151 oasc.CoreContainer.load loading shared library: C:\Users\JenkinsSlave\workspace\Lucene-Solr-trunk-Windows\solr\build\solr-core\test\J1\temp\solr.core.TestSolrConfigHandler 6DE66C602ACF2E07-001\tempDir-001\lib
   [junit4]   2> 1739563 T11151 oasc.SolrResourceLoader.addToClassLoader WARN Can't find (or read) directory to add to classloader: lib (resolved as: C:\Users\JenkinsSlave\workspace\Lucene-Solr-trunk-Windows\solr\build\solr-core\test\J1\temp\solr.core.TestSolrConfigHandler 6DE66C602ACF2E07-001\tempDir-001\lib).
   [junit4]   2> 1739569 T11151 oashc.HttpShardHandlerFactory.getParameter Setting socketTimeout to: 90000
   [junit4]   2> 1739569 T11151 oashc.HttpShardHandlerFactory.getParameter Setting urlScheme to: 
   [junit4]   2> 1739569 T11151 oashc.HttpShardHandlerFactory.getParameter Setting connTimeout to: 15000
   [junit4]   2> 1739570 T11151 oashc.HttpShardHandlerFactory.getParameter Setting maxConnectionsPerHost to: 20
   [junit4]   2> 1739570 T11151 oashc.HttpShardHandlerFactory.getParameter Setting maxConnections to: 10000
   [junit4]   2> 1739570 T11151 oashc.HttpShardHandlerFactory.getParameter Setting corePoolSize to: 0
   [junit4]   2> 1739570 T11151 oashc.HttpShardHandlerFactory.getParameter Setting maximumPoolSize to: 2147483647
   [junit4]   2> 1739570 T11151 oashc.HttpShardHandlerFactory.getParameter Setting maxThreadIdleTime to: 5
   [junit4]   2> 1739570 T11151 oashc.HttpShardHandlerFactory.getParameter Setting sizeOfQueue to: -1
   [junit4]   2> 1739571 T11151 oashc.HttpShardHandlerFactory.getParameter Setting fairnessPolicy to: false
   [junit4]   2> 1739571 T11151 oashc.HttpShardHandlerFactory.getParameter Setting useRetries to: false
   [junit4]   2> 1739571 T11151 oasu.UpdateShardHandler.<init> Creating UpdateShardHandler HTTP client with params: socketTimeout=340000&connTimeout=45000&retry=true
   [junit4]   2> 1739571 T11151 oasl.LogWatcher.createWatcher SLF4J impl is org.slf4j.impl.Log4jLoggerFactory
   [junit4]   2> 1739572 T11151 oasl.LogWatcher.newRegisteredLogWatcher Registering Log Listener [Log4j (org.slf4j.impl.Log4jLoggerFactory)]
   [junit4]   2> 1739572 T11151 oasc.CoreContainer.load Node Name: 127.0.0.1
   [junit4]   2> 1739573 T11151 oasc.CorePropertiesLocator.discover Looking for core definitions underneath C:\Users\JenkinsSlave\workspace\Lucene-Solr-trunk-Windows\solr\build\solr-core\test\J1\temp\solr.core.TestSolrConfigHandler 6DE66C602ACF2E07-001\tempDir-003\cores
   [junit4]   2> 1739574 T11151 oasc.CoreDescriptor.<init> CORE DESCRIPTOR: {name=collection1, config=solrconfig-managed-schema.xml, transient=false, schema=schema-rest.xml, loadOnStartup=true, instanceDir=C:\Users\JenkinsSlave\workspace\Lucene-Solr-trunk-Windows\solr\build\solr-core\test\J1\temp\solr.core.TestSolrConfigHandler 6DE66C602ACF2E07-001\tempDir-003\cores\core, absoluteInstDir=C:\Users\JenkinsSlave\workspace\Lucene-Solr-trunk-Windows\solr\build\solr-core\test\J1\temp\solr.core.TestSolrConfigHandler 6DE66C602ACF2E07-001\tempDir-003\cores\core\, configSet=collection1, dataDir=data\}
   [junit4]   2> 1739575 T11151 oasc.CorePropertiesLocator.discoverUnder Found core collection1 in C:\Users\JenkinsSlave\workspace\Lucene-Solr-trunk-Windows\solr\build\solr-core\test\J1\temp\solr.core.TestSolrConfigHandler 6DE66C602ACF2E07-001\tempDir-003\cores\core\
   [junit4]   2> 1739575 T11151 oasc.CorePropertiesLocator.discover Found 1 core definitions
   [junit4]   2> 1739576 T11163 oasc.SolrResourceLoader.<init> new SolrResourceLoader for directory: 'C:\Users\JenkinsSlave\workspace\Lucene-Solr-trunk-Windows\solr\build\solr-core\test\J1\temp\solr.core.TestSolrConfigHandler 6DE66C602ACF2E07-001\tempDir-001\collection1\'
   [junit4]   2> 1739577 T11163 oasc.SolrResourceLoader.replaceClassLoader Adding 'file:/C:/Users/JenkinsSlave/workspace/Lucene-Solr-trunk-Windows/solr/build/solr-core/test/J1/temp/solr.core.TestSolrConfigHandler%206DE66C602ACF2E07-001/tempDir-001/collection1/lib/classes/' to classloader
   [junit4]   2> 1739577 T11163 oasc.SolrResourceLoader.replaceClassLoader Adding 'file:/C:/Users/JenkinsSlave/workspace/Lucene-Solr-trunk-Windows/solr/build/solr-core/test/J1/temp/solr.core.TestSolrConfigHandler%206DE66C602ACF2E07-001/tempDir-001/collection1/lib/README' to classloader
   [junit4]   2> 1739597 T11163 oasc.SolrConfig.refreshRequestParams current version of requestparams : -1
   [junit4]   2> 1739599 T11163 oasc.SolrConfig.<init> Using Lucene MatchVersion: 6.0.0
   [junit4]   2> 1739603 T11163 oasc.SolrConfig.<init> Loaded SolrConfig: solrconfig-managed-schema.xml
   [junit4]   2> 1739606 T11163 oass.ManagedIndexSchemaFactory.readSchemaLocally The schema is configured as managed, but managed schema resource managed-schema not found - loading non-managed schema schema-rest.xml instead
   [junit4]   2> 1739606 T11163 oass.IndexSchema.readSchema Reading Solr Schema from C:\Users\JenkinsSlave\workspace\Lucene-Solr-trunk-Windows\solr\build\solr-core\test\J1\temp\solr.core.TestSolrConfigHandler 6DE66C602ACF2E07-001\tempDir-001\collection1\conf\schema-rest.xml
   [junit4]   2> 1739610 T11163 oass.IndexSchema.readSchema [collection1] Schema name=test-rest
   [junit4]   2> 1739678 T11163 oass.IndexSchema.readSchema default search field in schema is text
   [junit4]   2> 1739679 T11163 oass.IndexSchema.readSchema query parser default operator is OR
   [junit4]   2> 1739679 T11163 oass.IndexSchema.readSchema unique key field: id
   [junit4]   2> 1739680 T11163 oass.IndexSchema.loadCopyFields WARN Field title is not multivalued and destination for multiple copyFields (3)
   [junit4]   2> 1739685 T11163 oasr.RestManager$Registry.registerManagedResource Registered ManagedResource impl org.apache.solr.rest.schema.analysis.ManagedWordSetResource for path /schema/analysis/stopwords/english
   [junit4]   2> 1739686 T11163 oasr.RestManager$Registry.registerManagedResource Registered ManagedResource impl org.apache.solr.rest.schema.analysis.ManagedSynonymFilterFactory$SynonymManager for path /schema/analysis/synonyms/english
   [junit4]   2> 1739687 T11163 oasr.RestManager$Registry.registerManagedResource Registered ManagedResource impl org.apache.solr.rest.schema.analysis.ManagedWordSetResource for path /schema/analysis/stopwords/german
   [junit4]   2> 1739687 T11163 oasr.RestManager$Registry.registerManagedResource Registered ManagedResource impl org.apache.solr.rest.schema.analysis.ManagedSynonymFilterFactory$SynonymManager for path /schema/analysis/synonyms/german
   [junit4]   2> 1739688 T11163 oass.ManagedIndexSchema.persistManagedSchema Upgraded to managed schema at C:\Users\JenkinsSlave\workspace\Lucene-Solr-trunk-Windows\solr\build\solr-core\test\J1\temp\solr.core.TestSolrConfigHandler 6DE66C602ACF2E07-001\tempDir-001\collection1\conf\managed-schema
   [junit4]   2> 1739695 T11163 oass.ManagedIndexSchemaFactory.upgradeToManagedSchema After upgrading to managed schema, renamed the non-managed schema C:\Users\JenkinsSlave\workspace\Lucene-Solr-trunk-Windows\solr\build\solr-core\test\J1\temp\solr.core.TestSolrConfigHandler 6DE66C602ACF2E07-001\tempDir-001\collection1\conf\schema-rest.xml to C:\Users\JenkinsSlave\workspace\Lucene-Solr-trunk-Windows\solr\build\solr-core\test\J1\temp\solr.core.TestSolrConfigHandler 6DE66C602ACF2E07-001\tempDir-001\collection1\conf\schema-rest.xml.bak
   [junit4]   2> 1739695 T11163 oasc.CoreContainer.create Creating SolrCore 'collection1' using configuration from configset C:\Users\JenkinsSlave\workspace\Lucene-Solr-trunk-Windows\solr\build\solr-core\test\J1\temp\solr.core.TestSolrConfigHandler 6DE66C602ACF2E07-001\tempDir-001\collection1
   [junit4]   2> 1739696 T11163 c:collection1 oasc.SolrCore.initDirectoryFactory solr.NRTCachingDirectoryFactory
   [junit4]   2> 1739696 T11163 c:collection1 oasc.SolrCore.<init> [collection1] Opening new SolrCore at C:\Users\JenkinsSlave\workspace\Lucene-Solr-trunk-Windows\solr\build\solr-core\test\J1\temp\solr.core.TestSolrConfigHandler 6DE66C602ACF2E07-001\tempDir-001\collection1\, dataDir=C:\Users\JenkinsSlave\workspace\Lucene-Solr-trunk-Windows\solr\build\solr-core\test\J1\temp\solr.core.TestSolrConfigHandler 6DE66C602ACF2E07-001\tempDir-003\cores\core\data\
   [junit4]   2> 1739696 T11163 c:collection1 oasc.SolrCore.<init> JMX monitoring not detected for core: collection1
   [junit4]   2> 1739697 T11163 c:collection1 oasc.CachingDirectoryFactory.get return new directory for C:\Users\JenkinsSlave\workspace\Lucene-Solr-trunk-Windows\solr\build\solr-core\test\J1\temp\solr.core.TestSolrConfigHandler 6DE66C602ACF2E07-001\tempDir-003\cores\core\data
   [junit4]   2> 1739698 T11163 c:collection1 oasc.SolrCore.getNewIndexDir New index directory detected: old=null new=C:\Users\JenkinsSlave\workspace\Lucene-Solr-trunk-Windows\solr\build\solr-core\test\J1\temp\solr.core.TestSolrConfigHandler 6DE66C602ACF2E07-001\tempDir-003\cores\core\data\index/
   [junit4]   2> 1739698 T11163 c:collection1 oasc.SolrCore.initIndex WARN [collection1] Solr index directory 'C:\Users\JenkinsSlave\workspace\Lucene-Solr-trunk-Windows\solr\build\solr-core\test\J1\temp\solr.core.TestSolrConfigHandler 6DE66C602ACF2E07-001\tempDir-003\cores\core\data\index' doesn't exist. Creating new index...
   [junit4]   2> 1739699 T11163 c:collection1 oasc.CachingDirectoryFactory.get return new directory for C:\Users\JenkinsSlave\workspace\Lucene-Solr-trunk-Windows\solr\build\solr-core\test\J1\temp\solr.core.TestSolrConfigHandler 6DE66C602ACF2E07-001\tempDir-003\cores\core\data\index
   [junit4]   2> 1739699 T11163 c:collection1 oasu.RandomMergePolicy.<init> RandomMergePolicy wrapping class org.apache.lucene.index.AlcoholicMergePolicy: [AlcoholicMergePolicy: minMergeSize=0, mergeFactor=10, maxMergeSize=147527572, maxMergeSizeForForcedMerge=9223372036854775807, calibrateSizeByDeletes=true, maxMergeDocs=2147483647, maxCFSSegmentSizeMB=8.796093022207999E12, noCFSRatio=0.1]
   [junit4]   2> 1739702 T11163 c:collection1 oasc.SolrDeletionPolicy.onCommit SolrDeletionPolicy.onCommit: commits: num=1
   [junit4]   2> 		commit{dir=NRTCachingDirectory(MMapDirectory@C:\Users\JenkinsSlave\workspace\Lucene-Solr-trunk-Windows\solr\build\solr-core\test\J1\temp\solr.core.TestSolrConfigHandler 6DE66C602ACF2E07-001\tempDir-003\cores\core\data\index lockFactory=org.apache.lucene.store.SingleInstanceLockFactory@4cdc52e0; maxCacheMB=48.0 maxMergeSizeMB=4.0),segFN=segments_1,generation=1}
   [junit4]   2> 1739702 T11163 c:collection1 oasc.SolrDeletionPolicy.updateCommits newest commit generation = 1
   [junit4]   2> 1739704 T11163 c:collection1 oasc.SolrCore.loadUpdateProcessorChains no updateRequestProcessorChain defined as default, creating implicit default
   [junit4]   2> 1739705 T11163 c:collection1 oasc.RequestHandlers.applyInitParams WARN INVALID paramSet a in requestHandler {type = requestHandler,name = /dump,class = DumpRequestHandler,args = {defaults={a=A,b=B}}}
   [junit4]   2> 1739709 T11163 c:collection1 oashl.XMLLoader.init xsltCacheLifetimeSeconds=60
   [junit4]   2> 1739711 T11163 c:collection1 oashl.XMLLoader.init xsltCacheLifetimeSeconds=60
   [junit4]   2> 1739712 T11163 c:collection1 oashl.XMLLoader.init xsltCacheLifetimeSeconds=60
   [junit4]   2> 1739712 T11163 c:collection1 oashl.XMLLoader.init xsltCacheLifetimeSeconds=60
   [junit4]   2> 1739714 T11163 c:collection1 oasc.RequestHandlers.initHandlersFromConfig Registered paths: /admin/mbeans,standard,/dump,/update/csv,/update/json/docs,/admin/luke,/admin/segments,/get,/admin/system,/replication,/admin/properties,/config,/schema,/admin/plugins,/admin/logging,/update/json,/admin/threads,/admin/ping,/update,/admin/file
   [junit4]   2> 1739714 T11163 c:collection1 oasc.SolrCore.initStatsCache Using default statsCache cache: org.apache.solr.search.stats.LocalStatsCache
   [junit4]   2> 1739715 T11163 c:collection1 oasu.CommitTracker.<init> Hard AutoCommit: disabled
   [junit4]   2> 1739715 T11163 c:collection1 oasu.CommitTracker.<init> Soft AutoCommit: disabled
   [junit4]   2> 1739715 T11163 c:collection1 oasu.RandomMergePolicy.<init> RandomMergePolicy wrapping class org.apache.lucene.index.TieredMergePolicy: [TieredMergePolicy: maxMergeAtOnce=38, maxMergeAtOnceExplicit=11, maxMergedSegmentMB=42.7333984375, floorSegmentMB=0.453125, forceMergeDeletesPctAllowed=0.7226188784166743, segmentsPerTier=45.0, maxCFSSegmentSizeMB=8.796093022207999E12, noCFSRatio=0.2978061428002666
   [junit4]   2> 1739716 T11163 c:collection1 oasc.SolrDeletionPolicy.onInit SolrDeletionPolicy.onInit: commits: num=1
   [junit4]   2> 		commit{dir=NRTCachingDirectory(MMapDirectory@C:\Users\JenkinsSlave\workspace\Lucene-Solr-trunk-Windows\solr\build\solr-core\test\J1\temp\solr.core.TestSolrConfigHandler 6DE66C602ACF2E07-001\tempDir-003\cores\core\data\index lockFactory=org.apache.lucene.store.SingleInstanceLockFactory@4cdc52e0; maxCacheMB=48.0 maxMergeSizeMB=4.0),segFN=segments_1,generation=1}
   [junit4]   2> 1739716 T11163 c:collection1 oasc.SolrDeletionPolicy.updateCommits newest commit generation = 1
   [junit4]   2> 1739716 T11163 c:collection1 oass.SolrIndexSearcher.<init> Opening Searcher@5734c0d4[collection1] main
   [junit4]   2> 1739717 T11163 c:collection1 oasr.ManagedResourceStorage$FileStorageIO.configure File-based storage initialized to use dir: C:\Users\JenkinsSlave\workspace\Lucene-Solr-trunk-Windows\solr\build\solr-core\test\J1\temp\solr.core.TestSolrConfigHandler 6DE66C602ACF2E07-001\tempDir-001\collection1\conf
   [junit4]   2> 1739717 T11163 c:collection1 oasr.RestManager.init Initializing RestManager with initArgs: {storageDir=C:\Users\JenkinsSlave\workspace\Lucene-Solr-trunk-Windows\solr\build\solr-core\test\J1\temp\solr.core.TestSolrConfigHandler 6DE66C602ACF2E07-001\tempDir-001\collection1\conf}
   [junit4]   2> 1739717 T11163 c:collection1 oasr.ManagedResourceStorage.load Reading _rest_managed.json using file:dir=C:\Users\JenkinsSlave\workspace\Lucene-Solr-trunk-Windows\solr\build\solr-core\test\J1\temp\solr.core.TestSolrConfigHandler 6DE66C602ACF2E07-001\tempDir-001\collection1\conf
   [junit4]   2> 1739718 T11163 c:collection1 oasr.RestManager.init Initializing 4 registered ManagedResources
   [junit4]   2> 1739718 T11163 c:collection1 oasr.ManagedResourceStorage.load Reading _schema_analysis_stopwords_english.json using file:dir=C:\Users\JenkinsSlave\workspace\Lucene-Solr-trunk-Windows\solr\build\solr-core\test\J1\temp\solr.core.TestSolrConfigHandler 6DE66C602ACF2E07-001\tempDir-001\collection1\conf
   [junit4]   2> 1739718 T11163 c:collection1 oasr.ManagedResource.reloadFromStorage WARN No stored data found for /schema/analysis/stopwords/english
   [junit4]   2> 1739719 T11163 c:collection1 oasr.ManagedResourceStorage$JsonStorage.store Saved JSON object to path _schema_analysis_stopwords_english.json using file:dir=C:\Users\JenkinsSlave\workspace\Lucene-Solr-trunk-Windows\solr\build\solr-core\test\J1\temp\solr.core.TestSolrConfigHandler 6DE66C602ACF2E07-001\tempDir-001\collection1\conf
   [junit4]   2> 1739719 T11163 c:collection1 oasrsa.ManagedWordSetResource.onManagedDataLoadedFromStorage Loaded 0 words for /schema/analysis/stopwords/english
   [junit4]   2> 1739719 T11163 c:collection1 oasr.ManagedResource.notifyObserversDuringInit Notified 1 observers of /schema/analysis/stopwords/english
   [junit4]   2> 1739719 T11163 c:collection1 oasr.ManagedResourceStorage.load Reading _schema_analysis_stopwords_german.json using file:dir=C:\Users\JenkinsSlave\workspace\Lucene-Solr-trunk-Windows\solr\build\solr-core\test\J1\temp\solr.core.TestSolrConfigHandler 6DE66C602ACF2E07-001\tempDir-001\collection1\conf
   [junit4]   2> 1739720 T11163 c:collection1 oasr.ManagedResource.reloadFromStorage WARN No stored data found for /schema/analysis/stopwords/german
   [junit4]   2> 1739721 T11163 c:collection1 oasr.ManagedResourceStorage$JsonStorage.store Saved JSON object to path _schema_analysis_stopwords_german.json using file:dir=C:\Users\JenkinsSlave\workspace\Lucene-Solr-trunk-Windows\solr\build\solr-core\test\J1\temp\solr.core.TestSolrConfigHandler 6DE66C602ACF2E07-001\tempDir-001\collection1\conf
   [junit4]   2> 1739721 T11163 c:collection1 oasrsa.ManagedWordSetResource.onManagedDataLoadedFromStorage Loaded 0 words for /schema/analysis/stopwords/german
   [junit4]   2> 1739721 T11163 c:collection1 oasr.ManagedResource.notifyObserversDuringInit Notified 1 observers of /schema/analysis/stopwords/german
   [junit4]   2> 1739721 T11163 c:collection1 oasr.ManagedResourceStorage.load Reading _schema_analysis_synonyms_english.json using file:dir=C:\Users\JenkinsSlave\workspace\Lucene-Solr-trunk-Windows\solr\build\solr-core\test\J1\temp\solr.core.TestSolrConfigHandler 6DE66C602ACF2E07-001\tempDir-001\collection1\conf
   [junit4]   2> 1739722 T11163 c:collection1 oasr.ManagedResource.reloadFromStorage WARN No stored data found for /schema/analysis/synonyms/english
   [junit4]   2> 1739722 T11163 c:collection1 oasrsa.ManagedSynonymFilterFactory$SynonymManager.onManagedDataLoadedFromStorage Loaded 0 synonym mappings for /schema/analysis/synonyms/english
   [junit4]   2> 1739722 T11163 c:collection1 oasr.ManagedResource.notifyObserversDuringInit Notified 1 observers of /schema/analysis/synonyms/english
   [junit4]   2> 1739722 T11163 c:collection1 oasr.ManagedResourceStorage.load Reading _schema_analysis_synonyms_german.json using file:dir=C:\Users\JenkinsSlave\workspace\Lucene-Solr-trunk-Windows\solr\build\solr-core\test\J1\temp\solr.core.TestSolrConfigHandler 6DE66C602ACF2E07-001\tempDir-001\collection1\conf
   [junit4]   2> 1739722 T11163 c:collection1 oasr.ManagedResource.reloadFromStorage WARN No stored data found for /schema/analysis/synonyms/german
   [junit4]   2> 1739722 T11163 c:collection1 oasrsa.ManagedSynonymFilterFactory$SynonymManager.onManagedDataLoadedFromStorage Loaded 0 synonym mappings for /schema/analysis/synonyms/german
   [junit4]   2> 1739722 T11163 c:collection1 oasr.ManagedResource.notifyObserversDuringInit Notified 1 observers of /schema/analysis/synonyms/german
   [junit4]   2> 1739722 T11163 c:collection1 oash.ReplicationHandler.inform Commits will be reserved for  10000
   [junit4]   2> 1739722 T11163 c:collection1 oasc.CoreContainer.registerCore registering core: collection1
   [junit4]   2> 1739722 T11164 c:collection1 oasc.SolrCore.registerSearcher [collection1] Registered new searcher Searcher@5734c0d4[collection1] main{ExitableDirectoryReader(UninvertingDirectoryReader())}
   [junit4]   2> 1739723 T11151 oass.SolrDispatchFilter.init user.dir=C:\Users\JenkinsSlave\workspace\Lucene-Solr-trunk-Windows\solr\build\solr-core\test\J1
   [junit4]   2> 1739723 T11151 oass.SolrDispatchFilter.init SolrDispatchFilter.init() done
   [junit4]   2> 1739723 T11151 oas.SolrJettyTestBase.createJetty Jetty Assigned Port#63317
   [junit4]   2> ASYNC  NEW_CORE C2264 name=collection1 org.apache.solr.core.SolrCore@5e6cbb48
   [junit4]   2> 1739729 T11155 c:collection1 C2264 oasc.SolrResourceLoader.persistConfLocally Written confile configoverlay.json
   [junit4]   2> 1739730 T11155 c:collection1 C2264 oasc.SolrResourceLoader.<init> new SolrResourceLoader for directory: 'C:\Users\JenkinsSlave\workspace\Lucene-Solr-trunk-Windows\solr\build\solr-core\test\J1\temp\solr.core.TestSolrConfigHandler 6DE66C602ACF2E07-001\tempDir-001\collection1\'
   [junit4]   2> 1739732 T11155 c:collection1 C2264 oasc.SolrResourceLoader.replaceClassLoader Adding 'file:/C:/Users/JenkinsSlave/workspace/Lucene-Solr-trunk-Windows/solr/build/solr-core/test/J1/temp/solr.core.TestSolrConfigHandler%206DE66C602ACF2E07-001/tempDir-001/collection1/lib/classes/' to classloader
   [junit4]   2> 1739733 T11155 c:collection1 C2264 oasc.SolrResourceLoader.replaceClassLoader Adding 'file:/C:/Users/JenkinsSlave/workspace/Lucene-Solr-trunk-Windows/solr/build/solr-core/test/J1/temp/solr.core.TestSolrConfigHandler%206DE66C602ACF2E07-001/tempDir-001/collection1/lib/README' to classloader
   [junit4]   2> 1739763 T11155 c:collection1 C2264 oasc.SolrConfig.refreshRequestParams current version of requestparams : -1
   [junit4]   2> 1739764 T11155 c:collection1 C2264 oasc.SolrConfig.<init> Using Lucene MatchVersion: 6.0.0
   [junit4]   2> ASYNC  NEW_CORE C2265 name=collection1 org.apache.solr.core.SolrCore@5e6cbb48
   [junit4]   2> 1739785 T11155 c:collection1 C2265 oasc.SolrConfig.<init> Loaded SolrConfig: solrconfig-managed-schema.xml
   [junit4]   2> 1739788 T11155 c:collection1 C2265 oass.IndexSchema.readSchema Reading Solr Schema from C:\Users\JenkinsSlave\workspace\Lucene-Solr-trunk-Windows\solr\build\solr-core\test\J1\temp\solr.core.TestSolrConfigHandler 6DE66C602ACF2E07-001\tempDir-001\collection1\conf\managed-schema
   [junit4]   2> 1739792 T11155 c:collection1 C2265 oass.IndexSchema.readSchema [collection1] Schema name=test-rest
   [junit4]   2> 1739852 T11155 c:collection1 C2265 oass.IndexSchema.readSchema default search field in schema is text
   [junit4]   2> 1739852 T11155 c:collection1 C2265 oass.IndexSchema.readSchema query parser default operator is OR
   [junit4]   2> 1739853 T11155 c:collection1 C2265 oass.IndexSchema.readSchema unique key field: id
   [junit4]   2> 1739853 T11155 c:collection1 C2265 oass.IndexSchema.loadCopyFields WARN Field title is not multivalued and destination for multiple copyFields (3)
   [junit4]   2> 1739855 T11155 c:collection1 C2265 oasr.RestManager$Registry.registerManagedResource Registered ManagedResource impl org.apache.solr.rest.schema.analysis.ManagedWordSetResource for path /schema/analysis/stopwords/german
   [junit4]   2> 1739855 T11155 c:collection1 C2265 oasr.RestManager$Registry.registerManagedResource Registered ManagedResource impl org.apache.solr.rest.schema.analysis.ManagedSynonymFilterFactory$SynonymManager for path /schema/analysis/synonyms/german
   [junit4]   2> 1739855 T11155 c:collection1 C2265 oasr.RestManager$Registry.registerManagedResource Registered ManagedResource impl org.apache.solr.rest.schema.analysis.ManagedWordSetResource for path /schema/analysis/stopwords/english
   [junit4]   2> 1739856 T11155 c:collection1 C2265 oasr.RestManager$Registry.registerManagedResource Registered ManagedResource impl org.apache.solr.rest.schema.analysis.ManagedSynonymFilterFactory$SynonymManager for path /schema/analysis/synonyms/english
   [junit4]   2> 1739862 T11155 c:collection1 C2265 oasc.CoreContainer.reload Reloading SolrCore 'collection1' using configuration from configset C:\Users\JenkinsSlave\workspace\Lucene-Solr-trunk-Windows\solr\build\solr-core\test\J1\temp\solr.core.TestSolrConfigHandler 6DE66C602ACF2E07-001\tempDir-001\collection1
   [junit4]   2> 1739863 T11155 c:collection1 C2265 oasc.SolrCore.<init> [collection1] Opening new SolrCore at C:\Users\JenkinsSlave\workspace\Lucene-Solr-trunk-Windows\solr\build\solr-core\test\J1\temp\solr.core.TestSolrConfigHandler 6DE66C602ACF2E07-001\tempDir-001\collection1\, dataDir=C:\Users\JenkinsSlave\workspace\Lucene-Solr-trunk-Windows\solr\build\solr-core\test\J1\temp\solr.core.TestSolrConfigHandler 6DE66C602ACF2E07-001\tempDir-003\cores\core\data\
   [junit4]   2> 1739863 T11155 c:collection1 C2265 oasc.SolrCore.<init> JMX monitoring not detected for core: collection1
   [junit4]   2> 1739863 T11155 c:collection1 C2265 oasc.SolrCore.getNewIndexDir New index directory detected: old=null new=C:\Users\JenkinsSlave\workspace\Lucene-Solr-trunk-Windows\solr\build\solr-core\test\J1\temp\solr.core.TestSolrConfigHandler 6DE66C602ACF2E07-001\tempDir-003\cores\core\data\index/
   [junit4]   2> 1739866 T11155 c:collection1 C2265 oasc.SolrCore.loadUpdateProcessorChains no updateRequestProcessorChain defined as default, creating implicit default
   [junit4]   2> 1739866 T11155 c:collection1 C2265 oasc.RequestHandlers.applyInitParams WARN INVALID paramSet a in requestHandler {type = requestHandler,name = /dump,class = DumpRequestHandler,args = {defaults={a=A,b=B}}}
   [junit4]   2> 1739867 T11155 c:collection1 C2265 oashl.XMLLoader.init xsltCacheLifetimeSeconds=60
   [junit4]   2> 1739869 T11155 c:collection1 C2265 oashl.XMLLoader.init xsltCacheLifetimeSeconds=60
   [junit4]   2> 1739870 T11155 c:collection1 C2265 oashl.XMLLoader.init xsltCacheLifetimeSeconds=60
   [junit4]   2> 1739870 T11155 c:collection1 C2265 oashl.XMLLoader.init xsltCacheLifetimeSeconds=60
   [junit4]   2> 1739872 T11155 c:collection1 C2265 oasc.PluginBag.createPlugin requestHandler : '/x' created with startup=lazy 
   [junit4]   2> 1739872 T11155 c:collection1 C2265 oasc.RequestHandlers.initHandlersFromConfig Registered paths: /admin/mbeans,standard,/dump,/update/csv,/x,/update/json/docs,/admin/luke,/admin/segments,/get,/admin/system,/replication,/admin/properties,/config,/schema,/admin/plugins,/admin/logging,/update/json,/admin/threads,/admin/ping,/update,/admin/file
   [junit4]   2> 1739873 T11155 c:collection1 C2265 oasc.SolrCore.initStatsCache Using default statsCache cache: org.apache.solr.search.stats.LocalStatsCache
   [junit4]   2> 1739874 T11155 c:collection1 C2265 oasu.CommitTracker.<init> Hard AutoCommit: disabled
   [junit4]   2> 1739874 T11155 c:collection1 C2265 oasu.CommitTracker.<init> Soft AutoCommit: disabled
   [junit4]   2> 1739874 T11155 c:collection1 C2265 oass.SolrIndexSearcher.<init> Opening Searcher@76c27d5c[collection1] main
   [junit4]   2> 1739875 T11155 c:collection1 C2265 oasr.ManagedResourceStorage$FileStorageIO.configure File-based storage initialized to use dir: C:\Users\JenkinsSlave\workspace\Lucene-Solr-trunk-Windows\solr\build\solr-core\test\J1\temp\solr.core.TestSolrConfigHandler 6DE66C602ACF2E07-001\tempDir-001\collection1\conf
   [junit4]   2> 1739875 T11155 c:collection1 C2265 oasr.RestManager.init Initializing RestManager with initArgs: {storageDir=C:\Users\JenkinsSlave\workspace\Lucene-Solr-trunk-Windows\solr\build\solr-core\test\J1\temp\solr.core.TestSolrConfigHandler 6DE66C602ACF2E07-001\tempDir-001\collection1\conf}
   [junit4]   2> 1739875 T11155 c:collection1 C2265 oasr.ManagedResourceStorage.load Reading _rest_managed.json using file:dir=C:\Users\JenkinsSlave\workspace\Lucene-Solr-trunk-Windows\solr\build\solr-core\test\J1\temp\solr.core.TestSolrConfigHandler 6DE66C602ACF2E07-001\tempDir-001\collection1\conf
   [junit4]   2> 1739876 T11155 c:collection1 C2265 oasr.RestManager.init Initializing 4 registered ManagedResources
   [junit4]   2> 1739876 T11155 c:collection1 C2265 oasr.ManagedResourceStorage.load Reading _schema_analysis_stopwords_english.json using file:dir=C:\Users\JenkinsSlave\workspace\Lucene-Solr-trunk-Windows\solr\build\solr-core\test\J1\temp\solr.core.TestSolrConfigHandler 6DE66C602ACF2E07-001\tempDir-001\collection1\conf
   [junit4]   2> 1739876 T11155 c:collection1 C2265 oasr.ManagedResourceStorage.load Loaded LinkedHashMap at path _schema_analysis_stopwords_english.json using file:dir=C:\Users\JenkinsSlave\workspace\Lucene-Solr-trunk-Windows\solr\build\solr-core\test\J1\temp\solr.core.TestSolrConfigHandler 6DE66C602ACF2E07-001\tempDir-001\collection1\conf
   [junit4]   2> 1739876 T11155 c:collection1 C2265 oasr.ManagedResource.processStoredData Loaded initArgs {ignoreCase=false} for /schema/analysis/stopwords/english
   [junit4]   2> 1739877 T11155 c:collection1 C2265 oasrsa.ManagedWordSetResource.onManagedDataLoadedFromStorage Loaded 0 words for /schema/analysis/stopwords/english
   [junit4]   2> 1739877 T11155 c:collection1 C2265 oasr.ManagedResource.notifyObserversDuringInit Notified 1 observers of /schema/analysis/stopwords/english
   [junit4]   2> 1739877 T11155 c:collection1 C2265 oasr.ManagedResourceStorage.load Reading _schema_analysis_stopwords_german.json using file:dir=C:\Users\JenkinsSlave\workspace\Lucene-Solr-trunk-Windows\solr\build\solr-core\test\J1\temp\solr.core.TestSolrConfigHandler 6DE66C602ACF2E07-001\tempDir-001\collection1\conf
   [junit4]   2> 1739877 T11155 c:collection1 C2265 oasr.ManagedResourceStorage.load Loaded LinkedHashMap at path _schema_analysis_stopwords_german.json using file:dir=C:\Users\JenkinsSlave\workspace\Lucene-Solr-trunk-Windows\solr\build\solr-core\test\J1\temp\solr.core.TestSolrConfigHandler 6DE66C602ACF2E07-001\tempDir-001\collection1\conf
   [junit4]   2> 1739878 T11155 c:collection1 C2265 oasr.ManagedResource.processStoredData Loaded initArgs {ignoreCase=false} for /schema/analysis/stopwords/german
   [junit4]   2> 1739878 T11155 c:collection1 C2265 oasrsa.ManagedWordSetResource.onManagedDataLoadedFromStorage Loaded 0 words for /schema/analysis/stopwords/german
   [junit4]   2> 1739878 T11155 c:collection1 C2265 oasr.ManagedResource.notifyObserversDuringInit Notified 1 observers of /schema/analysis/stopwords/german
   [junit4]   2> 1739878 T11155 c:collection1 C2265 oasr.ManagedResourceStorage.load Reading _schema_analysis_synonyms_english.json using file:dir=C:\Users\JenkinsSlave\workspace\Lucene-Solr-trunk-Windows\solr\build\solr-core\test\J1\temp\solr.core.TestSolrConfigHandler 6DE66C602ACF2E07-001\tempDir-001\collection1\conf
   [junit4]   2> 1739878 T11155 c:collection1 C2265 oasr.ManagedResource.reloadFromStorage WARN No stored data found for /schema/analysis/synonyms/english
   [junit4]   2> 1739879 T11155 c:collection1 C2265 oasrsa.ManagedSynonymFilterFactory$SynonymManager.onManagedDataLoadedFromStorage Loaded 0 synonym mappings for /schema/analysis/synonyms/english
   [junit4]   2> 1739879 T11155 c:collection1 C2265 oasr.ManagedResource.notifyObserversDuringInit Notified 1 observers of /schema/analysis/synonyms/english
   [junit4]   2> 1739879 T11155 c:collection1 C2265 oasr.ManagedResourceStorage.load Reading _schema_analysis_synonyms_german.json using file:dir=C:\Users\JenkinsSlave\workspace\Lucene-Solr-trunk-Windows\solr\build\solr-core\test\J1\temp\solr.core.TestSolrConfigHandler 6DE66C602ACF2E07-001\tempDir-001\collection1\conf
   [junit4]   2> 1739879 T11155 c:collection1 C2265 oasr.ManagedResource.reloadFromStorage WARN No stored data found for /schema/analysis/synonyms/german
   [junit4]   2> 1739879 T11155 c:collection1 C2265 oasrsa.ManagedSynonymFilterFactory$SynonymManager.onManagedDataLoadedFromStorage Loaded 0 synonym mappings for /schema/analysis/synonyms/german
   [junit4]   2> 1739880 T11155 c:collection1 C2265 oasr.ManagedResource.notifyObserversDuringInit Notified 1 observers of /schema/analysis/synonyms/german
   [junit4]   2> 1739880 T11155 c:collection1 C2265 oash.ReplicationHandler.inform Commits will be reserved for  10000
   [junit4]   2> 1739880 T11155 c:collection1 C2265 oasu.DefaultSolrCoreState.newIndexWriter Creating new IndexWriter...
   [junit4]   2> 1739880 T11155 c:collection1 C2265 oasu.DefaultSolrCoreState.newIndexWriter Waiting until IndexWriter is unused... core=collection1
   [junit4]   2> 1739880 T11155 c:collection1 C2265 oasu.DefaultSolrCoreState.newIndexWriter Closing old IndexWriter... core=collection1
   [junit4]   2> 1739880 T11167 c:collection1 oasc.SolrCore.registerSearcher [collection1] Registered new searcher Searcher@76c27d5c[collection1] main{ExitableDirectoryReader(UninvertingDirector

[...truncated too long message...]

jectReleaseTracker, MBeansHandlerTest, TestChildDocTransformer, FacetPivotSmallTest, TestRangeQuery, TestReplicationHandlerBackup, TestCloudSchemaless, TestSystemIdResolver, DistributedMLTComponentTest, CurrencyFieldXmlFileTest, InfoHandlerTest, RollingRestartTest, TestDocSet, ShardRoutingCustomTest, TestJsonRequest, StatsComponentTest, TestAnalyzeInfixSuggestions, SpatialFilterTest, SpellingQueryConverterTest, CustomCollectionTest, PreAnalyzedUpdateProcessorTest, HighlighterTest, TestExceedMaxTermLength, TestDFRSimilarityFactory, TestCodecSupport, SearchHandlerTest, SolrRequestParserTest, TestFieldTypeResource, SpellPossibilityIteratorTest, HdfsDirectoryTest, TestZkChroot, TestLuceneMatchVersion, TestLeaderElectionZkExpiry, RAMDirectoryFactoryTest, TestSolrDeletionPolicy1, FileBasedSpellCheckerTest, TestDistributedGrouping, BasicZkTest, DateMathParserTest, ExternalFileFieldSortTest, TestOverriddenPrefixQueryForCustomFieldType, TestInitQParser, TestManagedStopFilterFactory, TestReqParamsAPI, AddBlockUpdateTest, HdfsThreadLeakTest, LeaderElectionIntegrationTest, ResourceLoaderTest, SaslZkACLProviderTest, TestFastWriter, ResponseHeaderTest, OverseerCollectionProcessorTest, IgnoreCommitOptimizeUpdateProcessorFactoryTest, SimpleMLTQParserTest, HdfsChaosMonkeySafeLeaderTest, TestOrdValues, AsyncMigrateRouteKeyTest, TestSchemaNameResource, OpenCloseCoreStressTest, TestInitParams, TestConfigReload, TestClusterStateMutator, TestQuerySenderListener, DeleteShardTest, TestDynamicFieldCollectionResource, TestCollapseQParserPlugin, TestSolrDeletionPolicy2, TestMacros, DeleteInactiveReplicaTest, SolrIndexConfigTest, IndexSchemaTest, DateRangeFieldTest, UpdateParamsTest, TestCopyFieldCollectionResource, ExitableDirectoryReaderTest, DistributedQueueTest, SegmentsInfoRequestHandlerTest, TestRecovery, TestBulkSchemaAPI, SpatialRPTFieldTypeTest, ChangedSchemaMergeTest, TestCursorMarkWithoutUniqueKey, FullSolrCloudDistribCmdsTest, MinimalSchemaTest, TestSolrJ, TestHdfsUpdateLog, FieldMutatingUpdateProcessorTest, TriLevelCompositeIdRoutingTest, EchoParamsTest, DistribJoinFromCollectionTest, ParsingFieldUpdateProcessorsTest, DateFieldTest, CollectionsAPIAsyncDistributedZkTest, ConnectionManagerTest, TestCoreDiscovery, HdfsDirectoryFactoryTest, TestCloudPivotFacet, TestSolr4Spatial, CSVRequestHandlerTest, TestMiniSolrCloudClusterSSL, CurrencyFieldOpenExchangeTest, ShardSplitTest, NotRequiredUniqueKeyTest, TestDistributedMissingSort, MoreLikeThisHandlerTest, TestShardHandlerFactory, TestReRankQParserPlugin, RegexBoostProcessorTest, DisMaxRequestHandlerTest, DirectSolrSpellCheckerTest, HighlighterConfigTest, OpenExchangeRatesOrgProviderTest, TestSerializedLuceneMatchVersion, SimplePostToolTest, LoggingHandlerTest, ChaosMonkeySafeLeaderTest, BasicDistributedZk2Test, CollectionsAPIDistributedZkTest, ShardRoutingTest, TestRandomFaceting, ZkSolrClientTest, AutoCommitTest, DistributedSpellCheckComponentTest, TermVectorComponentDistributedTest, TestRealTimeGet, TestJoin, TestReload, DistributedTermsComponentTest, TestCoreContainer, SimpleFacetsTest, SpellCheckComponentTest, TestGroupingSearch, SolrCmdDistributorTest, QueryElevationComponentTest, PeerSyncTest, BadIndexSchemaTest, ConvertedLegacyTest, TestSort, TestFiltering, BasicFunctionalityTest, TestLazyCores, DirectUpdateHandlerTest, TestBadConfig, SoftAutoCommitTest, SolrIndexSplitterTest, AnalysisAfterCoreReloadTest, SignatureUpdateProcessorFactoryTest, TestExtendedDismaxParser, SpellCheckCollatorTest, SuggesterFSTTest, TestFoldingMultitermQuery, DocValuesTest, SuggesterTSTTest, TestStressLucene, TestTrie, SuggesterWFSTTest, PolyFieldTest, NoCacheHeaderTest, SchemaVersionSpecificBehaviorTest, TestUpdate, TestWordDelimiterFilterFactory, DirectUpdateHandlerOptimizeTest, StatelessScriptUpdateProcessorFactoryTest, DocValuesMultiTest, DebugComponentTest, IndexBasedSpellCheckerTest, LukeRequestHandlerTest, TestReversedWildcardFilterFactory, PrimitiveFieldTypeTest, TermsComponentTest, DocumentBuilderTest, TermVectorComponentTest, FastVectorHighlighterTest, TestJmxIntegration, TestCSVResponseWriter, TestAnalyzedSuggestions, BinaryUpdateRequestHandlerTest, TestPHPSerializedResponseWriter, TestLFUCache, AlternateDirectoryTest, TestQuerySenderNoQuery, TestStressRecovery, SampleTest, NumericFieldsTest, TestConfig, TestFuzzyAnalyzedSuggestions, DirectSolrConnectionTest, TestCharFilters, TestLMJelinekMercerSimilarityFactory, TestDefaultSimilarityFactory, TestFastOutputStream, PluginInfoTest, TestSuggestSpellingConverter, DOMUtilTest, TestUtils, TestDocumentBuilder, ZkNodePropsTest, SystemInfoHandlerTest, FileUtilsTest, TestRTGBase, CursorPagingTest, SolrTestCaseJ4Test, TestHighlightDedupGrouping, TestSimpleTrackingShardHandler, TestTolerantSearch, TestEmbeddedSolrServerConstructors, TestJettySolrRunner, AliasIntegrationTest, DeleteReplicaTest, DistribDocExpirationUpdateProcessorTest, LeaderInitiatedRecoveryOnCommitTest, MultiThreadedOCPTest, OverseerStatusTest, RemoteQueryErrorTest, TestCloudInspectUtil, TestCollectionAPI, TestRebalanceLeaders, VMParamsZkACLAndCredentialsProvidersTest, HdfsCollectionsAPIDistributedZkTest, HdfsRecoveryZkTest, HdfsUnloadDistributedZkTest, HdfsWriteToMultipleCollectionsTest, StressHdfsTest, CachingDirectoryFactoryTest, TestImplicitCoreProperties, TestInfoStreamLogging, TestReloadAndDeleteDocs, TestSolrConfigHandler]
   [junit4]   2> NOTE: reproduce with: ant test  -Dtestcase=TestSolrConfigHandler -Dtests.seed=6DE66C602ACF2E07 -Dtests.slow=true -Dtests.locale=lv -Dtests.timezone=Australia/Sydney -Dtests.asserts=true -Dtests.file.encoding=Cp1252
   [junit4] ERROR   0.00s J1 | TestSolrConfigHandler (suite) <<<
   [junit4]    > Throwable #1: java.io.IOException: Could not remove the following files (in the order of attempts):
   [junit4]    >    C:\Users\JenkinsSlave\workspace\Lucene-Solr-trunk-Windows\solr\build\solr-core\test\J1\temp\solr.core.TestSolrConfigHandler 6DE66C602ACF2E07-001\tempDir-010\collection1\conf\configoverlay.json: java.nio.file.FileSystemException: C:\Users\JenkinsSlave\workspace\Lucene-Solr-trunk-Windows\solr\build\solr-core\test\J1\temp\solr.core.TestSolrConfigHandler 6DE66C602ACF2E07-001\tempDir-010\collection1\conf\configoverlay.json: The process cannot access the file because it is being used by another process.
   [junit4]    >    C:\Users\JenkinsSlave\workspace\Lucene-Solr-trunk-Windows\solr\build\solr-core\test\J1\temp\solr.core.TestSolrConfigHandler 6DE66C602ACF2E07-001\tempDir-010\collection1\conf: java.nio.file.DirectoryNotEmptyException: C:\Users\JenkinsSlave\workspace\Lucene-Solr-trunk-Windows\solr\build\solr-core\test\J1\temp\solr.core.TestSolrConfigHandler 6DE66C602ACF2E07-001\tempDir-010\collection1\conf
   [junit4]    >    C:\Users\JenkinsSlave\workspace\Lucene-Solr-trunk-Windows\solr\build\solr-core\test\J1\temp\solr.core.TestSolrConfigHandler 6DE66C602ACF2E07-001\tempDir-010\collection1: java.nio.file.DirectoryNotEmptyException: C:\Users\JenkinsSlave\workspace\Lucene-Solr-trunk-Windows\solr\build\solr-core\test\J1\temp\solr.core.TestSolrConfigHandler 6DE66C602ACF2E07-001\tempDir-010\collection1
   [junit4]    >    C:\Users\JenkinsSlave\workspace\Lucene-Solr-trunk-Windows\solr\build\solr-core\test\J1\temp\solr.core.TestSolrConfigHandler 6DE66C602ACF2E07-001\tempDir-010: java.nio.file.DirectoryNotEmptyException: C:\Users\JenkinsSlave\workspace\Lucene-Solr-trunk-Windows\solr\build\solr-core\test\J1\temp\solr.core.TestSolrConfigHandler 6DE66C602ACF2E07-001\tempDir-010
   [junit4]    >    C:\Users\JenkinsSlave\workspace\Lucene-Solr-trunk-Windows\solr\build\solr-core\test\J1\temp\solr.core.TestSolrConfigHandler 6DE66C602ACF2E07-001\tempDir-010: java.nio.file.DirectoryNotEmptyException: C:\Users\JenkinsSlave\workspace\Lucene-Solr-trunk-Windows\solr\build\solr-core\test\J1\temp\solr.core.TestSolrConfigHandler 6DE66C602ACF2E07-001\tempDir-010
   [junit4]    >    C:\Users\JenkinsSlave\workspace\Lucene-Solr-trunk-Windows\solr\build\solr-core\test\J1\temp\solr.core.TestSolrConfigHandler 6DE66C602ACF2E07-001: java.nio.file.DirectoryNotEmptyException: C:\Users\JenkinsSlave\workspace\Lucene-Solr-trunk-Windows\solr\build\solr-core\test\J1\temp\solr.core.TestSolrConfigHandler 6DE66C602ACF2E07-001
   [junit4]    > 	at __randomizedtesting.SeedInfo.seed([6DE66C602ACF2E07]:0)
   [junit4]    > 	at org.apache.lucene.util.IOUtils.rm(IOUtils.java:286)
   [junit4]    > 	at java.lang.Thread.run(Thread.java:745)
   [junit4] Completed on J1 in 5.29s, 4 tests, 1 error <<< FAILURES!

[...truncated 202 lines...]
BUILD FAILED
C:\Users\JenkinsSlave\workspace\Lucene-Solr-trunk-Windows\build.xml:519: The following error occurred while executing this line:
C:\Users\JenkinsSlave\workspace\Lucene-Solr-trunk-Windows\build.xml:467: The following error occurred while executing this line:
C:\Users\JenkinsSlave\workspace\Lucene-Solr-trunk-Windows\build.xml:61: The following error occurred while executing this line:
C:\Users\JenkinsSlave\workspace\Lucene-Solr-trunk-Windows\extra-targets.xml:39: The following error occurred while executing this line:
C:\Users\JenkinsSlave\workspace\Lucene-Solr-trunk-Windows\solr\build.xml:191: The following error occurred while executing this line:
C:\Users\JenkinsSlave\workspace\Lucene-Solr-trunk-Windows\solr\common-build.xml:510: The following error occurred while executing this line:
C:\Users\JenkinsSlave\workspace\Lucene-Solr-trunk-Windows\lucene\common-build.xml:1351: The following error occurred while executing this line:
C:\Users\JenkinsSlave\workspace\Lucene-Solr-trunk-Windows\lucene\common-build.xml:958: There were test failures: 479 suites, 1901 tests, 1 suite-level error, 1 error, 57 ignored (29 assumptions)

Total time: 47 minutes 53 seconds
Build step 'Invoke Ant' marked build as failure
[description-setter] Description set: Java: 64bit/jdk1.8.0_40 -XX:+UseCompressedOops -XX:+UseG1GC
Archiving artifacts
Recording test results
Email was triggered for: Failure - Any
Sending email for trigger: Failure - Any



Mime
View raw message