lucene-dev mailing list archives

Site index · List index
Message view « Date » · « Thread »
Top « Date » · « Thread »
From bu...@elastic.co
Subject [CI] Lucene 5x Linux 64 Test Only - Build # 53666 - Failure!
Date Tue, 30 Jun 2015 08:33:11 GMT
<html><head><style>
BODY, TABLE, TD, TH, P {
  font-family:Verdana,Helvetica,sans serif;
  font-size:11px;
  color:black;
}
h1 { color:black; }
h2 { color:black; }
h3 { color:black; }
TD.bg1 { color:white; background-color:#0000C0; font-size:120% }
TD.bg2 { color:white; background-color:#4040FF; font-size:110% }
TD.bg3 { color:white; background-color:#8080FF; }
TD.test_passed { color:blue; }
TD.test_failed { color:red; }
TD.console { font-family:Courier New; }
</style>
</head><body>

<table>
  <tbody><tr><td colspan="2 align=" left"=""><img src="http://build-eu-00.elastic.co/static/e59dfe28/images/32x32/red.gif"
/>
  <b style="font-size: 200%;">BUILD FAILURE</b></td></tr>
  <tr><td><br /></td></tr>
  <tr><td>Build URL</td><td><a href="http://build-eu-00.elastic.co/job/lucene_linux_java8_64_test_only/53666/">http://build-eu-00.elastic.co/job/lucene_linux_java8_64_test_only/53666/</a></td></tr>
  <tr><td>Project:</td><td>lucene_linux_java8_64_test_only</td></tr>

  <tr><td>Randomization:</td>
<td>
JDKEA9,network,heap[1024m],-server +UseSerialGC +UseCompressedOops +AggressiveOpts,sec manager
on
</td></tr>

  <tr><td>Date of build:</td><td>Tue, 30 Jun 2015 10:30:40 +0200</td></tr>
  <tr><td>Build duration:</td><td>2 min 29 sec</td></tr>
</tbody></table>
<br />

<!-- CHANGE SET -->

	<table width="100%">
    <tbody><tr><td class="bg1" colspan="2"><b>CHANGES</b></td></tr>
	
        <tr><td colspan="2">No Changes</td></tr>

  </tbody></table>
<br />


<!-- ARTIFACTS -->

  <table width="100%">
    <tbody><tr><td class="bg1"><b>BUILD ARTIFACTS</b></td></tr>
    <tr>
      <td>
		
      	  <li>
      	    <a href="http://build-eu-00.elastic.co/job/lucene_linux_java8_64_test_only/53666/artifact/checkout/lucene/build/core/test/temp/junit4-J0-20150630_103101_128.events">checkout/lucene/build/core/test/temp/junit4-J0-20150630_103101_128.events</a>
      	  </li>
		
      	  <li>
      	    <a href="http://build-eu-00.elastic.co/job/lucene_linux_java8_64_test_only/53666/artifact/checkout/lucene/build/core/test/temp/junit4-J1-20150630_103101_128.events">checkout/lucene/build/core/test/temp/junit4-J1-20150630_103101_128.events</a>
      	  </li>
		
      	  <li>
      	    <a href="http://build-eu-00.elastic.co/job/lucene_linux_java8_64_test_only/53666/artifact/checkout/lucene/build/core/test/temp/junit4-J2-20150630_103101_128.events">checkout/lucene/build/core/test/temp/junit4-J2-20150630_103101_128.events</a>
      	  </li>
		
      	  <li>
      	    <a href="http://build-eu-00.elastic.co/job/lucene_linux_java8_64_test_only/53666/artifact/checkout/lucene/build/core/test/temp/junit4-J3-20150630_103101_128.events">checkout/lucene/build/core/test/temp/junit4-J3-20150630_103101_128.events</a>
      	  </li>
		
      	  <li>
      	    <a href="http://build-eu-00.elastic.co/job/lucene_linux_java8_64_test_only/53666/artifact/checkout/lucene/build/core/test/temp/junit4-J4-20150630_103101_128.events">checkout/lucene/build/core/test/temp/junit4-J4-20150630_103101_128.events</a>
      	  </li>
		
      	  <li>
      	    <a href="http://build-eu-00.elastic.co/job/lucene_linux_java8_64_test_only/53666/artifact/checkout/lucene/build/core/test/temp/junit4-J5-20150630_103101_128.events">checkout/lucene/build/core/test/temp/junit4-J5-20150630_103101_128.events</a>
      	  </li>
		
      	  <li>
      	    <a href="http://build-eu-00.elastic.co/job/lucene_linux_java8_64_test_only/53666/artifact/checkout/lucene/build/core/test/temp/junit4-J6-20150630_103101_128.events">checkout/lucene/build/core/test/temp/junit4-J6-20150630_103101_128.events</a>
      	  </li>
		
      	  <li>
      	    <a href="http://build-eu-00.elastic.co/job/lucene_linux_java8_64_test_only/53666/artifact/checkout/lucene/build/core/test/temp/junit4-J7-20150630_103101_128.events">checkout/lucene/build/core/test/temp/junit4-J7-20150630_103101_128.events</a>
      	  </li>

      </td>
    </tr>
  </tbody></table>
<br />  


<!-- MAVEN ARTIFACTS -->


<!-- JUnit TEMPLATE -->


  <table width="100%">
    <tbody><tr><td class="bg1" colspan="2"><b>FAILED JUNIT TESTS</b></td></tr>
    
           <tr><td class="bg2" colspan="2"> Name: org.apache.lucene.index Failed:
1 test(s), Passed: 787 test(s), Skipped: 23 test(s), Total: 811 test(s)</td></tr>
           
             <tr bgcolor="white"><td class="test_failed" colspan="2"><b><li>Failed:
org.apache.lucene.index.TestIndexWriterMerging.testForceMergeDeletes </li></b></td></tr>
           
  </tbody></table>
<br />

<!-- CONSOLE OUTPUT -->
<!-- % if(build.result==hudson.model.Result.FAILURE) { % -->
<table width="100%" cellpadding="0" cellspacing="0">
<tbody><tr><td class="bg1"><b>CONSOLE OUTPUT</b></td></tr>

	<tr><td class="console">[...truncated 1788 lines...]</td></tr>

	<tr><td class="console">   [junit4] Tests with failures:</td></tr>

	<tr><td class="console">   [junit4]   - org.apache.lucene.index.TestIndexWriterMerging.testForceMergeDeletes</td></tr>

	<tr><td class="console">   [junit4] </td></tr>

	<tr><td class="console">   [junit4] </td></tr>

	<tr><td class="console">   [junit4] JVM J0:     1.31 ..   122.99 =   121.69s</td></tr>

	<tr><td class="console">   [junit4] JVM J1:     1.11 ..   127.08 =   125.97s</td></tr>

	<tr><td class="console">   [junit4] JVM J2:     1.13 ..   123.78 =   122.65s</td></tr>

	<tr><td class="console">   [junit4] JVM J3:     1.11 ..   122.06 =   120.95s</td></tr>

	<tr><td class="console">   [junit4] JVM J4:     1.12 ..   123.38 =   122.26s</td></tr>

	<tr><td class="console">   [junit4] JVM J5:     1.12 ..   122.72 =   121.60s</td></tr>

	<tr><td class="console">   [junit4] JVM J6:     1.12 ..   122.63 =   121.51s</td></tr>

	<tr><td class="console">   [junit4] JVM J7:     1.31 ..   122.88 =   121.57s</td></tr>

	<tr><td class="console">   [junit4] Execution time total: 2 minutes 7 seconds</td></tr>

	<tr><td class="console">   [junit4] Tests summary: 402 suites, 3269 tests, 1
failure, 49 ignored (45 assumptions)</td></tr>

	<tr><td class="console"></td></tr>

	<tr><td class="console">BUILD FAILED</td></tr>

	<tr><td class="console">/home/jenkins/workspace/lucene_linux_java8_64_test_only/checkout/lucene/build.xml:50:
The following error occurred while executing this line:</td></tr>

	<tr><td class="console">/home/jenkins/workspace/lucene_linux_java8_64_test_only/checkout/lucene/common-build.xml:1444:
The following error occurred while executing this line:</td></tr>

	<tr><td class="console">/home/jenkins/workspace/lucene_linux_java8_64_test_only/checkout/lucene/common-build.xml:999:
There were test failures: 402 suites, 3269 tests, 1 failure, 49 ignored (45 assumptions)</td></tr>

	<tr><td class="console"></td></tr>

	<tr><td class="console">Total time: 2 minutes 15 seconds</td></tr>

	<tr><td class="console">Build step 'Invoke Ant' marked build as failure</td></tr>

	<tr><td class="console">Archiving artifacts</td></tr>

	<tr><td class="console">Recording test results</td></tr>

	<tr><td class="console">[description-setter] Description set: JDKEA9,network,heap[1024m],-server
+UseSerialGC +UseCompressedOops +AggressiveOpts,sec manager on</td></tr>

	<tr><td class="console">Email was triggered for: Failure - 1st</td></tr>

	<tr><td class="console">Trigger Failure - Any was overridden by another trigger
and will not send an email.</td></tr>

	<tr><td class="console">Trigger Failure - Still was overridden by another trigger
and will not send an email.</td></tr>

	<tr><td class="console">Sending email for trigger: Failure - 1st</td></tr>

</tbody></table>
<br />
<!-- % } % -->


</body></html>

Mime
View raw message