lucene-dev mailing list archives

Site index · List index
Message view « Date » · « Thread »
Top « Date » · « Thread »
From Apache Jenkins Server <jenk...@builds.apache.org>
Subject [JENKINS] Lucene-Solr-Tests-trunk-Java8 - Build # 120 - Failure
Date Sat, 27 Jun 2015 17:03:59 GMT
Build: https://builds.apache.org/job/Lucene-Solr-Tests-trunk-Java8/120/

1 tests failed.
REGRESSION:  org.apache.solr.cloud.BasicDistributedZkTest.test

Error Message:
commitWithin did not work on node: http://127.0.0.1:49954/collection1 expected:<68> but was:<67>

Stack Trace:
java.lang.AssertionError: commitWithin did not work on node: http://127.0.0.1:49954/collection1 expected:<68> but was:<67>
	at __randomizedtesting.SeedInfo.seed([5EA6D616EDDEBD5:8DBE52BBC021862D]:0)
	at org.junit.Assert.fail(Assert.java:93)
	at org.junit.Assert.failNotEquals(Assert.java:647)
	at org.junit.Assert.assertEquals(Assert.java:128)
	at org.junit.Assert.assertEquals(Assert.java:472)
	at org.apache.solr.cloud.BasicDistributedZkTest.test(BasicDistributedZkTest.java:332)
	at sun.reflect.NativeMethodAccessorImpl.invoke0(Native Method)
	at sun.reflect.NativeMethodAccessorImpl.invoke(NativeMethodAccessorImpl.java:62)
	at sun.reflect.DelegatingMethodAccessorImpl.invoke(DelegatingMethodAccessorImpl.java:43)
	at java.lang.reflect.Method.invoke(Method.java:483)
	at com.carrotsearch.randomizedtesting.RandomizedRunner.invoke(RandomizedRunner.java:1627)
	at com.carrotsearch.randomizedtesting.RandomizedRunner$6.evaluate(RandomizedRunner.java:836)
	at com.carrotsearch.randomizedtesting.RandomizedRunner$7.evaluate(RandomizedRunner.java:872)
	at com.carrotsearch.randomizedtesting.RandomizedRunner$8.evaluate(RandomizedRunner.java:886)
	at org.apache.solr.BaseDistributedSearchTestCase$ShardsRepeatRule$ShardsFixedStatement.callStatement(BaseDistributedSearchTestCase.java:960)
	at org.apache.solr.BaseDistributedSearchTestCase$ShardsRepeatRule$ShardsStatement.evaluate(BaseDistributedSearchTestCase.java:935)
	at com.carrotsearch.randomizedtesting.rules.SystemPropertiesRestoreRule$1.evaluate(SystemPropertiesRestoreRule.java:57)
	at org.apache.lucene.util.TestRuleSetupTeardownChained$1.evaluate(TestRuleSetupTeardownChained.java:50)
	at org.apache.lucene.util.AbstractBeforeAfterRule$1.evaluate(AbstractBeforeAfterRule.java:46)
	at org.apache.lucene.util.TestRuleThreadAndTestName$1.evaluate(TestRuleThreadAndTestName.java:49)
	at org.apache.lucene.util.TestRuleIgnoreAfterMaxFailures$1.evaluate(TestRuleIgnoreAfterMaxFailures.java:65)
	at org.apache.lucene.util.TestRuleMarkFailure$1.evaluate(TestRuleMarkFailure.java:48)
	at com.carrotsearch.randomizedtesting.rules.StatementAdapter.evaluate(StatementAdapter.java:36)
	at com.carrotsearch.randomizedtesting.ThreadLeakControl$StatementRunner.run(ThreadLeakControl.java:365)
	at com.carrotsearch.randomizedtesting.ThreadLeakControl.forkTimeoutingTask(ThreadLeakControl.java:798)
	at com.carrotsearch.randomizedtesting.ThreadLeakControl$3.evaluate(ThreadLeakControl.java:458)
	at com.carrotsearch.randomizedtesting.RandomizedRunner.runSingleTest(RandomizedRunner.java:845)
	at com.carrotsearch.randomizedtesting.RandomizedRunner$3.evaluate(RandomizedRunner.java:747)
	at com.carrotsearch.randomizedtesting.RandomizedRunner$4.evaluate(RandomizedRunner.java:781)
	at com.carrotsearch.randomizedtesting.RandomizedRunner$5.evaluate(RandomizedRunner.java:792)
	at com.carrotsearch.randomizedtesting.rules.StatementAdapter.evaluate(StatementAdapter.java:36)
	at com.carrotsearch.randomizedtesting.rules.SystemPropertiesRestoreRule$1.evaluate(SystemPropertiesRestoreRule.java:57)
	at org.apache.lucene.util.AbstractBeforeAfterRule$1.evaluate(AbstractBeforeAfterRule.java:46)
	at com.carrotsearch.randomizedtesting.rules.StatementAdapter.evaluate(StatementAdapter.java:36)
	at org.apache.lucene.util.TestRuleStoreClassName$1.evaluate(TestRuleStoreClassName.java:42)
	at com.carrotsearch.randomizedtesting.rules.NoShadowingOrOverridesOnMethodsRule$1.evaluate(NoShadowingOrOverridesOnMethodsRule.java:39)
	at com.carrotsearch.randomizedtesting.rules.NoShadowingOrOverridesOnMethodsRule$1.evaluate(NoShadowingOrOverridesOnMethodsRule.java:39)
	at com.carrotsearch.randomizedtesting.rules.StatementAdapter.evaluate(StatementAdapter.java:36)
	at com.carrotsearch.randomizedtesting.rules.StatementAdapter.evaluate(StatementAdapter.java:36)
	at com.carrotsearch.randomizedtesting.rules.StatementAdapter.evaluate(StatementAdapter.java:36)
	at org.apache.lucene.util.TestRuleAssertionsRequired$1.evaluate(TestRuleAssertionsRequired.java:54)
	at org.apache.lucene.util.TestRuleMarkFailure$1.evaluate(TestRuleMarkFailure.java:48)
	at org.apache.lucene.util.TestRuleIgnoreAfterMaxFailures$1.evaluate(TestRuleIgnoreAfterMaxFailures.java:65)
	at org.apache.lucene.util.TestRuleIgnoreTestSuites$1.evaluate(TestRuleIgnoreTestSuites.java:55)
	at com.carrotsearch.randomizedtesting.rules.StatementAdapter.evaluate(StatementAdapter.java:36)
	at com.carrotsearch.randomizedtesting.ThreadLeakControl$StatementRunner.run(ThreadLeakControl.java:365)
	at java.lang.Thread.run(Thread.java:745)




Build Log:
[...truncated 9609 lines...]
   [junit4] Suite: org.apache.solr.cloud.BasicDistributedZkTest
   [junit4]   2> Creating dataDir: /x1/jenkins/jenkins-slave/workspace/Lucene-Solr-Tests-trunk-Java8/solr/build/solr-core/test/J0/temp/solr.cloud.BasicDistributedZkTest_5EA6D616EDDEBD5-001/init-core-data-001
   [junit4]   2> 134490 INFO  (SUITE-BasicDistributedZkTest-seed#[5EA6D616EDDEBD5]-worker) [    ] o.a.s.BaseDistributedSearchTestCase Setting hostContext system property: /
   [junit4]   2> 134494 INFO  (TEST-BasicDistributedZkTest.test-seed#[5EA6D616EDDEBD5]) [    ] o.a.s.c.ZkTestServer STARTING ZK TEST SERVER
   [junit4]   2> 134495 INFO  (Thread-246) [    ] o.a.s.c.ZkTestServer client port:0.0.0.0/0.0.0.0:0
   [junit4]   2> 134495 INFO  (Thread-246) [    ] o.a.s.c.ZkTestServer Starting server
   [junit4]   2> 134595 INFO  (TEST-BasicDistributedZkTest.test-seed#[5EA6D616EDDEBD5]) [    ] o.a.s.c.ZkTestServer start zk server on port:36861
   [junit4]   2> 134595 INFO  (TEST-BasicDistributedZkTest.test-seed#[5EA6D616EDDEBD5]) [    ] o.a.s.c.c.SolrZkClient Using default ZkCredentialsProvider
   [junit4]   2> 134596 INFO  (TEST-BasicDistributedZkTest.test-seed#[5EA6D616EDDEBD5]) [    ] o.a.s.c.c.ConnectionManager Waiting for client to connect to ZooKeeper
   [junit4]   2> 134603 INFO  (zkCallback-39-thread-1) [    ] o.a.s.c.c.ConnectionManager Watcher org.apache.solr.common.cloud.ConnectionManager@737d3699 name:ZooKeeperConnection Watcher:127.0.0.1:36861 got event WatchedEvent state:SyncConnected type:None path:null path:null type:None
   [junit4]   2> 134603 INFO  (TEST-BasicDistributedZkTest.test-seed#[5EA6D616EDDEBD5]) [    ] o.a.s.c.c.ConnectionManager Client is connected to ZooKeeper
   [junit4]   2> 134603 INFO  (TEST-BasicDistributedZkTest.test-seed#[5EA6D616EDDEBD5]) [    ] o.a.s.c.c.SolrZkClient Using default ZkACLProvider
   [junit4]   2> 134604 INFO  (TEST-BasicDistributedZkTest.test-seed#[5EA6D616EDDEBD5]) [    ] o.a.s.c.c.SolrZkClient makePath: /solr
   [junit4]   2> 134608 INFO  (TEST-BasicDistributedZkTest.test-seed#[5EA6D616EDDEBD5]) [    ] o.a.s.c.c.SolrZkClient Using default ZkCredentialsProvider
   [junit4]   2> 134612 INFO  (TEST-BasicDistributedZkTest.test-seed#[5EA6D616EDDEBD5]) [    ] o.a.s.c.c.ConnectionManager Waiting for client to connect to ZooKeeper
   [junit4]   2> 134620 INFO  (zkCallback-40-thread-1) [    ] o.a.s.c.c.ConnectionManager Watcher org.apache.solr.common.cloud.ConnectionManager@59c1e514 name:ZooKeeperConnection Watcher:127.0.0.1:36861/solr got event WatchedEvent state:SyncConnected type:None path:null path:null type:None
   [junit4]   2> 134621 INFO  (TEST-BasicDistributedZkTest.test-seed#[5EA6D616EDDEBD5]) [    ] o.a.s.c.c.ConnectionManager Client is connected to ZooKeeper
   [junit4]   2> 134621 INFO  (TEST-BasicDistributedZkTest.test-seed#[5EA6D616EDDEBD5]) [    ] o.a.s.c.c.SolrZkClient Using default ZkACLProvider
   [junit4]   2> 134621 INFO  (TEST-BasicDistributedZkTest.test-seed#[5EA6D616EDDEBD5]) [    ] o.a.s.c.c.SolrZkClient makePath: /collections/collection1
   [junit4]   2> 134626 INFO  (TEST-BasicDistributedZkTest.test-seed#[5EA6D616EDDEBD5]) [    ] o.a.s.c.c.SolrZkClient makePath: /collections/collection1/shards
   [junit4]   2> 134628 INFO  (TEST-BasicDistributedZkTest.test-seed#[5EA6D616EDDEBD5]) [    ] o.a.s.c.c.SolrZkClient makePath: /collections/control_collection
   [junit4]   2> 134629 INFO  (TEST-BasicDistributedZkTest.test-seed#[5EA6D616EDDEBD5]) [    ] o.a.s.c.c.SolrZkClient makePath: /collections/control_collection/shards
   [junit4]   2> 134631 INFO  (TEST-BasicDistributedZkTest.test-seed#[5EA6D616EDDEBD5]) [    ] o.a.s.c.AbstractZkTestCase put /x1/jenkins/jenkins-slave/workspace/Lucene-Solr-Tests-trunk-Java8/solr/core/src/test-files/solr/collection1/conf/solrconfig-tlog.xml to /configs/conf1/solrconfig.xml
   [junit4]   2> 134632 INFO  (TEST-BasicDistributedZkTest.test-seed#[5EA6D616EDDEBD5]) [    ] o.a.s.c.c.SolrZkClient makePath: /configs/conf1/solrconfig.xml
   [junit4]   2> 134634 INFO  (TEST-BasicDistributedZkTest.test-seed#[5EA6D616EDDEBD5]) [    ] o.a.s.c.AbstractZkTestCase put /x1/jenkins/jenkins-slave/workspace/Lucene-Solr-Tests-trunk-Java8/solr/core/src/test-files/solr/collection1/conf/schema.xml to /configs/conf1/schema.xml
   [junit4]   2> 134635 INFO  (TEST-BasicDistributedZkTest.test-seed#[5EA6D616EDDEBD5]) [    ] o.a.s.c.c.SolrZkClient makePath: /configs/conf1/schema.xml
   [junit4]   2> 134637 INFO  (TEST-BasicDistributedZkTest.test-seed#[5EA6D616EDDEBD5]) [    ] o.a.s.c.AbstractZkTestCase put /x1/jenkins/jenkins-slave/workspace/Lucene-Solr-Tests-trunk-Java8/solr/core/src/test-files/solr/collection1/conf/solrconfig.snippet.randomindexconfig.xml to /configs/conf1/solrconfig.snippet.randomindexconfig.xml
   [junit4]   2> 134637 INFO  (TEST-BasicDistributedZkTest.test-seed#[5EA6D616EDDEBD5]) [    ] o.a.s.c.c.SolrZkClient makePath: /configs/conf1/solrconfig.snippet.randomindexconfig.xml
   [junit4]   2> 134639 INFO  (TEST-BasicDistributedZkTest.test-seed#[5EA6D616EDDEBD5]) [    ] o.a.s.c.AbstractZkTestCase put /x1/jenkins/jenkins-slave/workspace/Lucene-Solr-Tests-trunk-Java8/solr/core/src/test-files/solr/collection1/conf/stopwords.txt to /configs/conf1/stopwords.txt
   [junit4]   2> 134639 INFO  (TEST-BasicDistributedZkTest.test-seed#[5EA6D616EDDEBD5]) [    ] o.a.s.c.c.SolrZkClient makePath: /configs/conf1/stopwords.txt
   [junit4]   2> 134641 INFO  (TEST-BasicDistributedZkTest.test-seed#[5EA6D616EDDEBD5]) [    ] o.a.s.c.AbstractZkTestCase put /x1/jenkins/jenkins-slave/workspace/Lucene-Solr-Tests-trunk-Java8/solr/core/src/test-files/solr/collection1/conf/protwords.txt to /configs/conf1/protwords.txt
   [junit4]   2> 134641 INFO  (TEST-BasicDistributedZkTest.test-seed#[5EA6D616EDDEBD5]) [    ] o.a.s.c.c.SolrZkClient makePath: /configs/conf1/protwords.txt
   [junit4]   2> 134642 INFO  (TEST-BasicDistributedZkTest.test-seed#[5EA6D616EDDEBD5]) [    ] o.a.s.c.AbstractZkTestCase put /x1/jenkins/jenkins-slave/workspace/Lucene-Solr-Tests-trunk-Java8/solr/core/src/test-files/solr/collection1/conf/currency.xml to /configs/conf1/currency.xml
   [junit4]   2> 134643 INFO  (TEST-BasicDistributedZkTest.test-seed#[5EA6D616EDDEBD5]) [    ] o.a.s.c.c.SolrZkClient makePath: /configs/conf1/currency.xml
   [junit4]   2> 134644 INFO  (TEST-BasicDistributedZkTest.test-seed#[5EA6D616EDDEBD5]) [    ] o.a.s.c.AbstractZkTestCase put /x1/jenkins/jenkins-slave/workspace/Lucene-Solr-Tests-trunk-Java8/solr/core/src/test-files/solr/collection1/conf/enumsConfig.xml to /configs/conf1/enumsConfig.xml
   [junit4]   2> 134645 INFO  (TEST-BasicDistributedZkTest.test-seed#[5EA6D616EDDEBD5]) [    ] o.a.s.c.c.SolrZkClient makePath: /configs/conf1/enumsConfig.xml
   [junit4]   2> 134647 INFO  (TEST-BasicDistributedZkTest.test-seed#[5EA6D616EDDEBD5]) [    ] o.a.s.c.AbstractZkTestCase put /x1/jenkins/jenkins-slave/workspace/Lucene-Solr-Tests-trunk-Java8/solr/core/src/test-files/solr/collection1/conf/open-exchange-rates.json to /configs/conf1/open-exchange-rates.json
   [junit4]   2> 134648 INFO  (TEST-BasicDistributedZkTest.test-seed#[5EA6D616EDDEBD5]) [    ] o.a.s.c.c.SolrZkClient makePath: /configs/conf1/open-exchange-rates.json
   [junit4]   2> 134649 INFO  (TEST-BasicDistributedZkTest.test-seed#[5EA6D616EDDEBD5]) [    ] o.a.s.c.AbstractZkTestCase put /x1/jenkins/jenkins-slave/workspace/Lucene-Solr-Tests-trunk-Java8/solr/core/src/test-files/solr/collection1/conf/mapping-ISOLatin1Accent.txt to /configs/conf1/mapping-ISOLatin1Accent.txt
   [junit4]   2> 134650 INFO  (TEST-BasicDistributedZkTest.test-seed#[5EA6D616EDDEBD5]) [    ] o.a.s.c.c.SolrZkClient makePath: /configs/conf1/mapping-ISOLatin1Accent.txt
   [junit4]   2> 134652 INFO  (TEST-BasicDistributedZkTest.test-seed#[5EA6D616EDDEBD5]) [    ] o.a.s.c.AbstractZkTestCase put /x1/jenkins/jenkins-slave/workspace/Lucene-Solr-Tests-trunk-Java8/solr/core/src/test-files/solr/collection1/conf/old_synonyms.txt to /configs/conf1/old_synonyms.txt
   [junit4]   2> 134652 INFO  (TEST-BasicDistributedZkTest.test-seed#[5EA6D616EDDEBD5]) [    ] o.a.s.c.c.SolrZkClient makePath: /configs/conf1/old_synonyms.txt
   [junit4]   2> 134654 INFO  (TEST-BasicDistributedZkTest.test-seed#[5EA6D616EDDEBD5]) [    ] o.a.s.c.AbstractZkTestCase put /x1/jenkins/jenkins-slave/workspace/Lucene-Solr-Tests-trunk-Java8/solr/core/src/test-files/solr/collection1/conf/synonyms.txt to /configs/conf1/synonyms.txt
   [junit4]   2> 134654 INFO  (TEST-BasicDistributedZkTest.test-seed#[5EA6D616EDDEBD5]) [    ] o.a.s.c.c.SolrZkClient makePath: /configs/conf1/synonyms.txt
   [junit4]   2> 135001 INFO  (TEST-BasicDistributedZkTest.test-seed#[5EA6D616EDDEBD5]) [    ] o.a.s.SolrTestCaseJ4 Writing core.properties file to /x1/jenkins/jenkins-slave/workspace/Lucene-Solr-Tests-trunk-Java8/solr/build/solr-core/test/J0/temp/solr.cloud.BasicDistributedZkTest_5EA6D616EDDEBD5-001/control-001/cores/collection1
   [junit4]   2> 135003 INFO  (TEST-BasicDistributedZkTest.test-seed#[5EA6D616EDDEBD5]) [    ] o.e.j.s.Server jetty-9.2.11.v20150529
   [junit4]   2> 135005 INFO  (TEST-BasicDistributedZkTest.test-seed#[5EA6D616EDDEBD5]) [    ] o.e.j.s.h.ContextHandler Started o.e.j.s.ServletContextHandler@73a7a4a6{/,null,AVAILABLE}
   [junit4]   2> 135015 INFO  (TEST-BasicDistributedZkTest.test-seed#[5EA6D616EDDEBD5]) [    ] o.e.j.s.ServerConnector Started ServerConnector@246ede6f{HTTP/1.1}{127.0.0.1:54890}
   [junit4]   2> 135015 INFO  (TEST-BasicDistributedZkTest.test-seed#[5EA6D616EDDEBD5]) [    ] o.e.j.s.Server Started @138511ms
   [junit4]   2> 135015 INFO  (TEST-BasicDistributedZkTest.test-seed#[5EA6D616EDDEBD5]) [    ] o.a.s.c.s.e.JettySolrRunner Jetty properties: {solr.data.dir=/x1/jenkins/jenkins-slave/workspace/Lucene-Solr-Tests-trunk-Java8/solr/build/solr-core/test/J0/temp/solr.cloud.BasicDistributedZkTest_5EA6D616EDDEBD5-001/tempDir-001/control/data, hostContext=/, hostPort=54890, coreRootDirectory=/x1/jenkins/jenkins-slave/workspace/Lucene-Solr-Tests-trunk-Java8/solr/build/solr-core/test/J0/temp/solr.cloud.BasicDistributedZkTest_5EA6D616EDDEBD5-001/control-001/cores}
   [junit4]   2> 135016 INFO  (TEST-BasicDistributedZkTest.test-seed#[5EA6D616EDDEBD5]) [    ] o.a.s.s.SolrDispatchFilter SolrDispatchFilter.init(): sun.misc.Launcher$AppClassLoader@c387f44
   [junit4]   2> 135016 INFO  (TEST-BasicDistributedZkTest.test-seed#[5EA6D616EDDEBD5]) [    ] o.a.s.c.SolrResourceLoader new SolrResourceLoader for directory: '/x1/jenkins/jenkins-slave/workspace/Lucene-Solr-Tests-trunk-Java8/solr/build/solr-core/test/J0/temp/solr.cloud.BasicDistributedZkTest_5EA6D616EDDEBD5-001/control-001/'
   [junit4]   2> 135033 INFO  (TEST-BasicDistributedZkTest.test-seed#[5EA6D616EDDEBD5]) [    ] o.a.s.c.SolrXmlConfig Loading container configuration from /x1/jenkins/jenkins-slave/workspace/Lucene-Solr-Tests-trunk-Java8/solr/build/solr-core/test/J0/temp/solr.cloud.BasicDistributedZkTest_5EA6D616EDDEBD5-001/control-001/solr.xml
   [junit4]   2> 135038 INFO  (TEST-BasicDistributedZkTest.test-seed#[5EA6D616EDDEBD5]) [    ] o.a.s.c.CoresLocator Config-defined core root directory: /x1/jenkins/jenkins-slave/workspace/Lucene-Solr-Tests-trunk-Java8/solr/build/solr-core/test/J0/temp/solr.cloud.BasicDistributedZkTest_5EA6D616EDDEBD5-001/control-001/cores
   [junit4]   2> 135038 INFO  (TEST-BasicDistributedZkTest.test-seed#[5EA6D616EDDEBD5]) [    ] o.a.s.c.CoreContainer New CoreContainer 1894817990
   [junit4]   2> 135039 INFO  (TEST-BasicDistributedZkTest.test-seed#[5EA6D616EDDEBD5]) [    ] o.a.s.c.CoreContainer Loading cores into CoreContainer [instanceDir=/x1/jenkins/jenkins-slave/workspace/Lucene-Solr-Tests-trunk-Java8/solr/build/solr-core/test/J0/temp/solr.cloud.BasicDistributedZkTest_5EA6D616EDDEBD5-001/control-001/]
   [junit4]   2> 135039 INFO  (TEST-BasicDistributedZkTest.test-seed#[5EA6D616EDDEBD5]) [    ] o.a.s.c.CoreContainer loading shared library: /x1/jenkins/jenkins-slave/workspace/Lucene-Solr-Tests-trunk-Java8/solr/build/solr-core/test/J0/temp/solr.cloud.BasicDistributedZkTest_5EA6D616EDDEBD5-001/control-001/lib
   [junit4]   2> 135039 WARN  (TEST-BasicDistributedZkTest.test-seed#[5EA6D616EDDEBD5]) [    ] o.a.s.c.SolrResourceLoader Can't find (or read) directory to add to classloader: lib (resolved as: /x1/jenkins/jenkins-slave/workspace/Lucene-Solr-Tests-trunk-Java8/solr/build/solr-core/test/J0/temp/solr.cloud.BasicDistributedZkTest_5EA6D616EDDEBD5-001/control-001/lib).
   [junit4]   2> 135046 INFO  (TEST-BasicDistributedZkTest.test-seed#[5EA6D616EDDEBD5]) [    ] o.a.s.h.c.HttpShardHandlerFactory created with socketTimeout : 90000,urlScheme : ,connTimeout : 15000,maxConnectionsPerHost : 20,maxConnections : 10000,corePoolSize : 0,maximumPoolSize : 2147483647,maxThreadIdleTime : 5,sizeOfQueue : -1,fairnessPolicy : false,useRetries : false,
   [junit4]   2> 135048 INFO  (TEST-BasicDistributedZkTest.test-seed#[5EA6D616EDDEBD5]) [    ] o.a.s.u.UpdateShardHandler Creating UpdateShardHandler HTTP client with params: socketTimeout=340000&connTimeout=45000&retry=true
   [junit4]   2> 135048 INFO  (TEST-BasicDistributedZkTest.test-seed#[5EA6D616EDDEBD5]) [    ] o.a.s.l.LogWatcher SLF4J impl is org.slf4j.impl.Log4jLoggerFactory
   [junit4]   2> 135048 INFO  (TEST-BasicDistributedZkTest.test-seed#[5EA6D616EDDEBD5]) [    ] o.a.s.l.LogWatcher Registering Log Listener [Log4j (org.slf4j.impl.Log4jLoggerFactory)]
   [junit4]   2> 135050 INFO  (TEST-BasicDistributedZkTest.test-seed#[5EA6D616EDDEBD5]) [    ] o.a.s.c.ZkContainer Zookeeper client=127.0.0.1:36861/solr
   [junit4]   2> 135050 INFO  (TEST-BasicDistributedZkTest.test-seed#[5EA6D616EDDEBD5]) [    ] o.a.s.c.ZkController zkHost includes chroot
   [junit4]   2> 135050 INFO  (TEST-BasicDistributedZkTest.test-seed#[5EA6D616EDDEBD5]) [    ] o.a.s.c.c.SolrZkClient Using default ZkCredentialsProvider
   [junit4]   2> 135054 INFO  (TEST-BasicDistributedZkTest.test-seed#[5EA6D616EDDEBD5]) [    ] o.a.s.c.c.ConnectionManager Waiting for client to connect to ZooKeeper
   [junit4]   2> 135056 INFO  (zkCallback-42-thread-1) [    ] o.a.s.c.c.ConnectionManager Watcher org.apache.solr.common.cloud.ConnectionManager@2d1aa094 name:ZooKeeperConnection Watcher:127.0.0.1:36861 got event WatchedEvent state:SyncConnected type:None path:null path:null type:None
   [junit4]   2> 135057 INFO  (TEST-BasicDistributedZkTest.test-seed#[5EA6D616EDDEBD5]) [    ] o.a.s.c.c.ConnectionManager Client is connected to ZooKeeper
   [junit4]   2> 135057 INFO  (TEST-BasicDistributedZkTest.test-seed#[5EA6D616EDDEBD5]) [    ] o.a.s.c.c.SolrZkClient Using default ZkACLProvider
   [junit4]   2> 135059 INFO  (TEST-BasicDistributedZkTest.test-seed#[5EA6D616EDDEBD5]) [n:127.0.0.1:54890_    ] o.a.s.c.c.ConnectionManager Waiting for client to connect to ZooKeeper
   [junit4]   2> 135061 INFO  (zkCallback-43-thread-1-processing-n:127.0.0.1:54890_) [n:127.0.0.1:54890_    ] o.a.s.c.c.ConnectionManager Watcher org.apache.solr.common.cloud.ConnectionManager@58f2a64f name:ZooKeeperConnection Watcher:127.0.0.1:36861/solr got event WatchedEvent state:SyncConnected type:None path:null path:null type:None
   [junit4]   2> 135061 INFO  (TEST-BasicDistributedZkTest.test-seed#[5EA6D616EDDEBD5]) [n:127.0.0.1:54890_    ] o.a.s.c.c.ConnectionManager Client is connected to ZooKeeper
   [junit4]   2> 135065 INFO  (TEST-BasicDistributedZkTest.test-seed#[5EA6D616EDDEBD5]) [n:127.0.0.1:54890_    ] o.a.s.c.c.SolrZkClient makePath: /overseer/queue
   [junit4]   2> 135068 INFO  (TEST-BasicDistributedZkTest.test-seed#[5EA6D616EDDEBD5]) [n:127.0.0.1:54890_    ] o.a.s.c.c.SolrZkClient makePath: /overseer/collection-queue-work
   [junit4]   2> 135070 INFO  (TEST-BasicDistributedZkTest.test-seed#[5EA6D616EDDEBD5]) [n:127.0.0.1:54890_    ] o.a.s.c.c.SolrZkClient makePath: /overseer/collection-map-running
   [junit4]   2> 135073 INFO  (TEST-BasicDistributedZkTest.test-seed#[5EA6D616EDDEBD5]) [n:127.0.0.1:54890_    ] o.a.s.c.c.SolrZkClient makePath: /overseer/collection-map-completed
   [junit4]   2> 135076 INFO  (TEST-BasicDistributedZkTest.test-seed#[5EA6D616EDDEBD5]) [n:127.0.0.1:54890_    ] o.a.s.c.c.SolrZkClient makePath: /overseer/collection-map-failure
   [junit4]   2> 135078 INFO  (TEST-BasicDistributedZkTest.test-seed#[5EA6D616EDDEBD5]) [n:127.0.0.1:54890_    ] o.a.s.c.c.SolrZkClient makePath: /live_nodes
   [junit4]   2> 135080 INFO  (TEST-BasicDistributedZkTest.test-seed#[5EA6D616EDDEBD5]) [n:127.0.0.1:54890_    ] o.a.s.c.c.SolrZkClient makePath: /aliases.json
   [junit4]   2> 135082 INFO  (TEST-BasicDistributedZkTest.test-seed#[5EA6D616EDDEBD5]) [n:127.0.0.1:54890_    ] o.a.s.c.c.SolrZkClient makePath: /clusterstate.json
   [junit4]   2> 135083 INFO  (TEST-BasicDistributedZkTest.test-seed#[5EA6D616EDDEBD5]) [n:127.0.0.1:54890_    ] o.a.s.c.ZkController Register node as live in ZooKeeper:/live_nodes/127.0.0.1:54890_
   [junit4]   2> 135084 INFO  (TEST-BasicDistributedZkTest.test-seed#[5EA6D616EDDEBD5]) [n:127.0.0.1:54890_    ] o.a.s.c.c.SolrZkClient makePath: /live_nodes/127.0.0.1:54890_
   [junit4]   2> 135086 INFO  (TEST-BasicDistributedZkTest.test-seed#[5EA6D616EDDEBD5]) [n:127.0.0.1:54890_    ] o.a.s.c.c.SolrZkClient makePath: /overseer_elect
   [junit4]   2> 135087 INFO  (TEST-BasicDistributedZkTest.test-seed#[5EA6D616EDDEBD5]) [n:127.0.0.1:54890_    ] o.a.s.c.c.SolrZkClient makePath: /overseer_elect/election
   [junit4]   2> 135089 INFO  (TEST-BasicDistributedZkTest.test-seed#[5EA6D616EDDEBD5]) [n:127.0.0.1:54890_    ] o.a.s.c.Overseer Overseer (id=null) closing
   [junit4]   2> 135089 INFO  (TEST-BasicDistributedZkTest.test-seed#[5EA6D616EDDEBD5]) [n:127.0.0.1:54890_    ] o.a.s.c.LeaderElector Joined leadership election with path: /overseer_elect/election/94071865148506115-127.0.0.1:54890_-n_0000000000
   [junit4]   2> 135090 INFO  (TEST-BasicDistributedZkTest.test-seed#[5EA6D616EDDEBD5]) [n:127.0.0.1:54890_    ] o.a.s.c.OverseerElectionContext I am going to be the leader 127.0.0.1:54890_
   [junit4]   2> 135091 INFO  (TEST-BasicDistributedZkTest.test-seed#[5EA6D616EDDEBD5]) [n:127.0.0.1:54890_    ] o.a.s.c.c.SolrZkClient makePath: /overseer_elect/leader
   [junit4]   2> 135092 INFO  (TEST-BasicDistributedZkTest.test-seed#[5EA6D616EDDEBD5]) [n:127.0.0.1:54890_    ] o.a.s.c.Overseer Overseer (id=94071865148506115-127.0.0.1:54890_-n_0000000000) starting
   [junit4]   2> 135095 INFO  (TEST-BasicDistributedZkTest.test-seed#[5EA6D616EDDEBD5]) [n:127.0.0.1:54890_    ] o.a.s.c.c.SolrZkClient makePath: /overseer/queue-work
   [junit4]   2> 135104 INFO  (TEST-BasicDistributedZkTest.test-seed#[5EA6D616EDDEBD5]) [n:127.0.0.1:54890_    ] o.a.s.c.OverseerAutoReplicaFailoverThread Starting OverseerAutoReplicaFailoverThread autoReplicaFailoverWorkLoopDelay=10000 autoReplicaFailoverWaitAfterExpiration=30000 autoReplicaFailoverBadNodeExpiration=60000
   [junit4]   2> 135104 INFO  (OverseerCollectionProcessor-94071865148506115-127.0.0.1:54890_-n_0000000000) [n:127.0.0.1:54890_    ] o.a.s.c.OverseerCollectionProcessor Process current queue of collection creations
   [junit4]   2> 135104 INFO  (TEST-BasicDistributedZkTest.test-seed#[5EA6D616EDDEBD5]) [n:127.0.0.1:54890_    ] o.a.s.c.c.ZkStateReader Updating cluster state from ZooKeeper... 
   [junit4]   2> 135105 INFO  (OverseerStateUpdate-94071865148506115-127.0.0.1:54890_-n_0000000000) [n:127.0.0.1:54890_    ] o.a.s.c.Overseer Starting to work on the main queue
   [junit4]   2> 135117 INFO  (TEST-BasicDistributedZkTest.test-seed#[5EA6D616EDDEBD5]) [n:127.0.0.1:54890_    ] o.a.s.c.CoreContainer No authentication plugin used.
   [junit4]   2> 135118 INFO  (TEST-BasicDistributedZkTest.test-seed#[5EA6D616EDDEBD5]) [n:127.0.0.1:54890_    ] o.a.s.c.CoreContainer Security conf doesn't exist. Skipping setup for authorization module.
   [junit4]   2> 135119 INFO  (TEST-BasicDistributedZkTest.test-seed#[5EA6D616EDDEBD5]) [n:127.0.0.1:54890_    ] o.a.s.c.CoresLocator Looking for core definitions underneath /x1/jenkins/jenkins-slave/workspace/Lucene-Solr-Tests-trunk-Java8/solr/build/solr-core/test/J0/temp/solr.cloud.BasicDistributedZkTest_5EA6D616EDDEBD5-001/control-001/cores
   [junit4]   2> 135119 INFO  (TEST-BasicDistributedZkTest.test-seed#[5EA6D616EDDEBD5]) [n:127.0.0.1:54890_    ] o.a.s.c.SolrCore Created CoreDescriptor: {name=collection1, config=solrconfig.xml, transient=false, schema=schema.xml, loadOnStartup=true, instanceDir=/x1/jenkins/jenkins-slave/workspace/Lucene-Solr-Tests-trunk-Java8/solr/build/solr-core/test/J0/temp/solr.cloud.BasicDistributedZkTest_5EA6D616EDDEBD5-001/control-001/cores/collection1, collection=control_collection, absoluteInstDir=/x1/jenkins/jenkins-slave/workspace/Lucene-Solr-Tests-trunk-Java8/solr/build/solr-core/test/J0/temp/solr.cloud.BasicDistributedZkTest_5EA6D616EDDEBD5-001/control-001/cores/collection1/, coreNodeName=, dataDir=data/, shard=}
   [junit4]   2> 135120 INFO  (TEST-BasicDistributedZkTest.test-seed#[5EA6D616EDDEBD5]) [n:127.0.0.1:54890_    ] o.a.s.c.CoresLocator Found core collection1 in /x1/jenkins/jenkins-slave/workspace/Lucene-Solr-Tests-trunk-Java8/solr/build/solr-core/test/J0/temp/solr.cloud.BasicDistributedZkTest_5EA6D616EDDEBD5-001/control-001/cores/collection1/
   [junit4]   2> 135120 INFO  (TEST-BasicDistributedZkTest.test-seed#[5EA6D616EDDEBD5]) [n:127.0.0.1:54890_    ] o.a.s.c.CoresLocator Found 1 core definitions
   [junit4]   2> 135129 INFO  (coreLoadExecutor-240-thread-1-processing-n:127.0.0.1:54890_) [n:127.0.0.1:54890_ c:control_collection   x:collection1] o.a.s.c.ZkController publishing state=down
   [junit4]   2> 135129 INFO  (coreLoadExecutor-240-thread-1-processing-n:127.0.0.1:54890_) [n:127.0.0.1:54890_ c:control_collection   x:collection1] o.a.s.c.ZkController numShards not found on descriptor - reading it from system property
   [junit4]   2> 135130 INFO  (TEST-BasicDistributedZkTest.test-seed#[5EA6D616EDDEBD5]) [n:127.0.0.1:54890_    ] o.a.s.s.SolrDispatchFilter user.dir=/x1/jenkins/jenkins-slave/workspace/Lucene-Solr-Tests-trunk-Java8/solr/build/solr-core/test/J0
   [junit4]   2> 135130 INFO  (TEST-BasicDistributedZkTest.test-seed#[5EA6D616EDDEBD5]) [n:127.0.0.1:54890_    ] o.a.s.s.SolrDispatchFilter SolrDispatchFilter.init() done
   [junit4]   2> 135131 INFO  (zkCallback-43-thread-1-processing-n:127.0.0.1:54890_) [n:127.0.0.1:54890_    ] o.a.s.c.DistributedQueue NodeChildrenChanged fired on path /overseer/queue state SyncConnected
   [junit4]   2> 135131 INFO  (coreLoadExecutor-240-thread-1-processing-n:127.0.0.1:54890_) [n:127.0.0.1:54890_ c:control_collection   x:collection1] o.a.s.c.ZkController look for our core node name
   [junit4]   2> 135132 INFO  (OverseerStateUpdate-94071865148506115-127.0.0.1:54890_-n_0000000000) [n:127.0.0.1:54890_    ] o.a.s.c.Overseer processMessage: queueSize: 1, message = {
   [junit4]   2>   "core":"collection1",
   [junit4]   2>   "roles":null,
   [junit4]   2>   "base_url":"http://127.0.0.1:54890",
   [junit4]   2>   "node_name":"127.0.0.1:54890_",
   [junit4]   2>   "numShards":"1",
   [junit4]   2>   "state":"down",
   [junit4]   2>   "shard":null,
   [junit4]   2>   "collection":"control_collection",
   [junit4]   2>   "operation":"state"} current state version: 0
   [junit4]   2> 135133 INFO  (OverseerStateUpdate-94071865148506115-127.0.0.1:54890_-n_0000000000) [n:127.0.0.1:54890_    ] o.a.s.c.o.ReplicaMutator Update state numShards=1 message={
   [junit4]   2>   "core":"collection1",
   [junit4]   2>   "roles":null,
   [junit4]   2>   "base_url":"http://127.0.0.1:54890",
   [junit4]   2>   "node_name":"127.0.0.1:54890_",
   [junit4]   2>   "numShards":"1",
   [junit4]   2>   "state":"down",
   [junit4]   2>   "shard":null,
   [junit4]   2>   "collection":"control_collection",
   [junit4]   2>   "operation":"state"}
   [junit4]   2> 135133 INFO  (OverseerStateUpdate-94071865148506115-127.0.0.1:54890_-n_0000000000) [n:127.0.0.1:54890_    ] o.a.s.c.o.ClusterStateMutator building a new cName: control_collection
   [junit4]   2> 135133 INFO  (OverseerStateUpdate-94071865148506115-127.0.0.1:54890_-n_0000000000) [n:127.0.0.1:54890_    ] o.a.s.c.o.ReplicaMutator Assigning new node to shard shard=shard1
   [junit4]   2> 135135 INFO  (zkCallback-43-thread-1-processing-n:127.0.0.1:54890_) [n:127.0.0.1:54890_    ] o.a.s.c.c.ZkStateReader A cluster state change: WatchedEvent state:SyncConnected type:NodeDataChanged path:/clusterstate.json, has occurred - updating... (live nodes size: 1)
   [junit4]   2> 135138 INFO  (zkCallback-43-thread-1-processing-n:127.0.0.1:54890_) [n:127.0.0.1:54890_    ] o.a.s.c.c.ZkStateReader Updated cluster state version to 1
   [junit4]   2> 136131 INFO  (coreLoadExecutor-240-thread-1-processing-n:127.0.0.1:54890_) [n:127.0.0.1:54890_ c:control_collection   x:collection1] o.a.s.c.ZkController waiting to find shard id in clusterstate for collection1
   [junit4]   2> 136132 INFO  (coreLoadExecutor-240-thread-1-processing-n:127.0.0.1:54890_) [n:127.0.0.1:54890_ c:control_collection   x:collection1] o.a.s.c.ZkController Check for collection zkNode:control_collection
   [junit4]   2> 136132 INFO  (coreLoadExecutor-240-thread-1-processing-n:127.0.0.1:54890_) [n:127.0.0.1:54890_ c:control_collection   x:collection1] o.a.s.c.ZkController Collection zkNode exists
   [junit4]   2> 136133 INFO  (coreLoadExecutor-240-thread-1-processing-n:127.0.0.1:54890_) [n:127.0.0.1:54890_ c:control_collection   x:collection1] o.a.s.c.c.ZkStateReader Load collection config from:/collections/control_collection
   [junit4]   2> 136134 INFO  (coreLoadExecutor-240-thread-1-processing-n:127.0.0.1:54890_) [n:127.0.0.1:54890_ c:control_collection   x:collection1] o.a.s.c.c.ZkStateReader path=/collections/control_collection configName=conf1 specified config exists in ZooKeeper
   [junit4]   2> 136134 INFO  (coreLoadExecutor-240-thread-1-processing-n:127.0.0.1:54890_) [n:127.0.0.1:54890_ c:control_collection   x:collection1] o.a.s.c.SolrResourceLoader new SolrResourceLoader for directory: '/x1/jenkins/jenkins-slave/workspace/Lucene-Solr-Tests-trunk-Java8/solr/build/solr-core/test/J0/temp/solr.cloud.BasicDistributedZkTest_5EA6D616EDDEBD5-001/control-001/cores/collection1/'
   [junit4]   2> 136148 INFO  (coreLoadExecutor-240-thread-1-processing-n:127.0.0.1:54890_) [n:127.0.0.1:54890_ c:control_collection   x:collection1] o.a.s.c.Config loaded config solrconfig.xml with version 0 
   [junit4]   2> 136156 INFO  (coreLoadExecutor-240-thread-1-processing-n:127.0.0.1:54890_) [n:127.0.0.1:54890_ c:control_collection   x:collection1] o.a.s.c.SolrConfig current version of requestparams : -1
   [junit4]   2> 136161 INFO  (coreLoadExecutor-240-thread-1-processing-n:127.0.0.1:54890_) [n:127.0.0.1:54890_ c:control_collection   x:collection1] o.a.s.c.SolrConfig Using Lucene MatchVersion: 6.0.0
   [junit4]   2> 136170 INFO  (coreLoadExecutor-240-thread-1-processing-n:127.0.0.1:54890_) [n:127.0.0.1:54890_ c:control_collection   x:collection1] o.a.s.c.Config Loaded SolrConfig: solrconfig.xml
   [junit4]   2> 136172 INFO  (coreLoadExecutor-240-thread-1-processing-n:127.0.0.1:54890_) [n:127.0.0.1:54890_ c:control_collection   x:collection1] o.a.s.s.IndexSchema Reading Solr Schema from /configs/conf1/schema.xml
   [junit4]   2> 136177 INFO  (coreLoadExecutor-240-thread-1-processing-n:127.0.0.1:54890_) [n:127.0.0.1:54890_ c:control_collection   x:collection1] o.a.s.s.IndexSchema [collection1] Schema name=test
   [junit4]   2> 136284 INFO  (coreLoadExecutor-240-thread-1-processing-n:127.0.0.1:54890_) [n:127.0.0.1:54890_ c:control_collection   x:collection1] o.a.s.s.OpenExchangeRatesOrgProvider Initialized with rates=open-exchange-rates.json, refreshInterval=1440.
   [junit4]   2> 136291 INFO  (coreLoadExecutor-240-thread-1-processing-n:127.0.0.1:54890_) [n:127.0.0.1:54890_ c:control_collection   x:collection1] o.a.s.s.IndexSchema default search field in schema is text
   [junit4]   2> 136292 INFO  (coreLoadExecutor-240-thread-1-processing-n:127.0.0.1:54890_) [n:127.0.0.1:54890_ c:control_collection   x:collection1] o.a.s.s.IndexSchema unique key field: id
   [junit4]   2> 136305 INFO  (coreLoadExecutor-240-thread-1-processing-n:127.0.0.1:54890_) [n:127.0.0.1:54890_ c:control_collection   x:collection1] o.a.s.s.FileExchangeRateProvider Reloading exchange rates from file currency.xml
   [junit4]   2> 136307 INFO  (coreLoadExecutor-240-thread-1-processing-n:127.0.0.1:54890_) [n:127.0.0.1:54890_ c:control_collection   x:collection1] o.a.s.s.FileExchangeRateProvider Reloading exchange rates from file currency.xml
   [junit4]   2> 136310 INFO  (coreLoadExecutor-240-thread-1-processing-n:127.0.0.1:54890_) [n:127.0.0.1:54890_ c:control_collection   x:collection1] o.a.s.s.OpenExchangeRatesOrgProvider Reloading exchange rates from open-exchange-rates.json
   [junit4]   2> 136310 WARN  (coreLoadExecutor-240-thread-1-processing-n:127.0.0.1:54890_) [n:127.0.0.1:54890_ c:control_collection   x:collection1] o.a.s.s.OpenExchangeRatesOrgProvider Unknown key IMPORTANT NOTE
   [junit4]   2> 136311 WARN  (coreLoadExecutor-240-thread-1-processing-n:127.0.0.1:54890_) [n:127.0.0.1:54890_ c:control_collection   x:collection1] o.a.s.s.OpenExchangeRatesOrgProvider Expected key, got STRING
   [junit4]   2> 136311 INFO  (coreLoadExecutor-240-thread-1-processing-n:127.0.0.1:54890_) [n:127.0.0.1:54890_ c:control_collection   x:collection1] o.a.s.s.OpenExchangeRatesOrgProvider Reloading exchange rates from open-exchange-rates.json
   [junit4]   2> 136312 WARN  (coreLoadExecutor-240-thread-1-processing-n:127.0.0.1:54890_) [n:127.0.0.1:54890_ c:control_collection   x:collection1] o.a.s.s.OpenExchangeRatesOrgProvider Unknown key IMPORTANT NOTE
   [junit4]   2> 136312 WARN  (coreLoadExecutor-240-thread-1-processing-n:127.0.0.1:54890_) [n:127.0.0.1:54890_ c:control_collection   x:collection1] o.a.s.s.OpenExchangeRatesOrgProvider Expected key, got STRING
   [junit4]   2> 136312 INFO  (coreLoadExecutor-240-thread-1-processing-n:127.0.0.1:54890_) [n:127.0.0.1:54890_ c:control_collection   x:collection1] o.a.s.c.CoreContainer Creating SolrCore 'collection1' using configuration from collection control_collection
   [junit4]   2> 136312 INFO  (coreLoadExecutor-240-thread-1-processing-n:127.0.0.1:54890_) [n:127.0.0.1:54890_ c:control_collection s:shard1 r:core_node1 x:collection1] o.a.s.c.SolrCore org.apache.solr.core.MockDirectoryFactory
   [junit4]   2> 136313 INFO  (coreLoadExecutor-240-thread-1-processing-n:127.0.0.1:54890_) [n:127.0.0.1:54890_ c:control_collection s:shard1 r:core_node1 x:collection1] o.a.s.c.SolrCore [[collection1] ] Opening new SolrCore at [/x1/jenkins/jenkins-slave/workspace/Lucene-Solr-Tests-trunk-Java8/solr/build/solr-core/test/J0/temp/solr.cloud.BasicDistributedZkTest_5EA6D616EDDEBD5-001/control-001/cores/collection1/], dataDir=[null]
   [junit4]   2> 136313 INFO  (coreLoadExecutor-240-thread-1-processing-n:127.0.0.1:54890_) [n:127.0.0.1:54890_ c:control_collection s:shard1 r:core_node1 x:collection1] o.a.s.c.JmxMonitoredMap JMX monitoring is enabled. Adding Solr mbeans to JMX Server: com.sun.jmx.mbeanserver.JmxMBeanServer@33572851
   [junit4]   2> 136314 INFO  (coreLoadExecutor-240-thread-1-processing-n:127.0.0.1:54890_) [n:127.0.0.1:54890_ c:control_collection s:shard1 r:core_node1 x:collection1] o.a.s.c.CachingDirectoryFactory return new directory for /x1/jenkins/jenkins-slave/workspace/Lucene-Solr-Tests-trunk-Java8/solr/build/solr-core/test/J0/temp/solr.cloud.BasicDistributedZkTest_5EA6D616EDDEBD5-001/control-001/cores/collection1/data
   [junit4]   2> 136314 INFO  (coreLoadExecutor-240-thread-1-processing-n:127.0.0.1:54890_) [n:127.0.0.1:54890_ c:control_collection s:shard1 r:core_node1 x:collection1] o.a.s.c.SolrCore New index directory detected: old=null new=/x1/jenkins/jenkins-slave/workspace/Lucene-Solr-Tests-trunk-Java8/solr/build/solr-core/test/J0/temp/solr.cloud.BasicDistributedZkTest_5EA6D616EDDEBD5-001/control-001/cores/collection1/data/index/
   [junit4]   2> 136314 WARN  (coreLoadExecutor-240-thread-1-processing-n:127.0.0.1:54890_) [n:127.0.0.1:54890_ c:control_collection s:shard1 r:core_node1 x:collection1] o.a.s.c.SolrCore [collection1] Solr index directory '/x1/jenkins/jenkins-slave/workspace/Lucene-Solr-Tests-trunk-Java8/solr/build/solr-core/test/J0/temp/solr.cloud.BasicDistributedZkTest_5EA6D616EDDEBD5-001/control-001/cores/collection1/data/index' doesn't exist. Creating new index...
   [junit4]   2> 136314 INFO  (coreLoadExecutor-240-thread-1-processing-n:127.0.0.1:54890_) [n:127.0.0.1:54890_ c:control_collection s:shard1 r:core_node1 x:collection1] o.a.s.c.CachingDirectoryFactory return new directory for /x1/jenkins/jenkins-slave/workspace/Lucene-Solr-Tests-trunk-Java8/solr/build/solr-core/test/J0/temp/solr.cloud.BasicDistributedZkTest_5EA6D616EDDEBD5-001/control-001/cores/collection1/data/index
   [junit4]   2> 136315 INFO  (coreLoadExecutor-240-thread-1-processing-n:127.0.0.1:54890_) [n:127.0.0.1:54890_ c:control_collection s:shard1 r:core_node1 x:collection1] o.a.s.u.RandomMergePolicy RandomMergePolicy wrapping class org.apache.lucene.index.AlcoholicMergePolicy: [AlcoholicMergePolicy: minMergeSize=0, mergeFactor=10, maxMergeSize=1993444765, maxMergeSizeForForcedMerge=9223372036854775807, calibrateSizeByDeletes=true, maxMergeDocs=2147483647, maxCFSSegmentSizeMB=8.796093022207999E12, noCFSRatio=0.1]
   [junit4]   2> 136316 INFO  (coreLoadExecutor-240-thread-1-processing-n:127.0.0.1:54890_) [n:127.0.0.1:54890_ c:control_collection s:shard1 r:core_node1 x:collection1] o.a.s.c.SolrCore SolrDeletionPolicy.onCommit: commits: num=1
   [junit4]   2> 	commit{dir=MockDirectoryWrapper(RAMDirectory@557c8879 lockFactory=org.apache.lucene.store.SingleInstanceLockFactory@560c0f18),segFN=segments_1,generation=1}
   [junit4]   2> 136316 INFO  (coreLoadExecutor-240-thread-1-processing-n:127.0.0.1:54890_) [n:127.0.0.1:54890_ c:control_collection s:shard1 r:core_node1 x:collection1] o.a.s.c.SolrCore newest commit generation = 1
   [junit4]   2> 136316 INFO  (OldIndexDirectoryCleanupThreadForCore-collection1) [n:127.0.0.1:54890_ c:control_collection s:shard1 r:core_node1 x:collection1] o.a.s.c.SolrCore Looking for old index directories to cleanup for core collection1 in /x1/jenkins/jenkins-slave/workspace/Lucene-Solr-Tests-trunk-Java8/solr/build/solr-core/test/J0/temp/solr.cloud.BasicDistributedZkTest_5EA6D616EDDEBD5-001/control-001/cores/collection1/data/
   [junit4]   2> 136317 WARN  (OldIndexDirectoryCleanupThreadForCore-collection1) [n:127.0.0.1:54890_ c:control_collection s:shard1 r:core_node1 x:collection1] o.a.s.c.DirectoryFactory /x1/jenkins/jenkins-slave/workspace/Lucene-Solr-Tests-trunk-Java8/solr/build/solr-core/test/J0/temp/solr.cloud.BasicDistributedZkTest_5EA6D616EDDEBD5-001/control-001/cores/collection1/data/ does not point to a valid data directory; skipping clean-up of old index directories.
   [junit4]   2> 136326 INFO  (coreLoadExecutor-240-thread-1-processing-n:127.0.0.1:54890_) [n:127.0.0.1:54890_ c:control_collection s:shard1 r:core_node1 x:collection1] o.a.s.u.p.UpdateRequestProcessorChain creating updateRequestProcessorChain "nodistrib"
   [junit4]   2> 136327 INFO  (coreLoadExecutor-240-thread-1-processing-n:127.0.0.1:54890_) [n:127.0.0.1:54890_ c:control_collection s:shard1 r:core_node1 x:collection1] o.a.s.u.p.UpdateRequestProcessorChain creating updateRequestProcessorChain "dedupe"
   [junit4]   2> 136327 INFO  (coreLoadExecutor-240-thread-1-processing-n:127.0.0.1:54890_) [n:127.0.0.1:54890_ c:control_collection s:shard1 r:core_node1 x:collection1] o.a.s.u.p.UpdateRequestProcessorChain inserting DistributedUpdateProcessorFactory into updateRequestProcessorChain "dedupe"
   [junit4]   2> 136327 INFO  (coreLoadExecutor-240-thread-1-processing-n:127.0.0.1:54890_) [n:127.0.0.1:54890_ c:control_collection s:shard1 r:core_node1 x:collection1] o.a.s.u.p.UpdateRequestProcessorChain creating updateRequestProcessorChain "stored_sig"
   [junit4]   2> 136327 INFO  (coreLoadExecutor-240-thread-1-processing-n:127.0.0.1:54890_) [n:127.0.0.1:54890_ c:control_collection s:shard1 r:core_node1 x:collection1] o.a.s.u.p.UpdateRequestProcessorChain inserting DistributedUpdateProcessorFactory into updateRequestProcessorChain "stored_sig"
   [junit4]   2> 136327 INFO  (coreLoadExecutor-240-thread-1-processing-n:127.0.0.1:54890_) [n:127.0.0.1:54890_ c:control_collection s:shard1 r:core_node1 x:collection1] o.a.s.u.p.UpdateRequestProcessorChain creating updateRequestProcessorChain "distrib-dup-test-chain-explicit"
   [junit4]   2> 136328 INFO  (coreLoadExecutor-240-thread-1-processing-n:127.0.0.1:54890_) [n:127.0.0.1:54890_ c:control_collection s:shard1 r:core_node1 x:collection1] o.a.s.u.p.UpdateRequestProcessorChain creating updateRequestProcessorChain "distrib-dup-test-chain-implicit"
   [junit4]   2> 136328 INFO  (coreLoadExecutor-240-thread-1-processing-n:127.0.0.1:54890_) [n:127.0.0.1:54890_ c:control_collection s:shard1 r:core_node1 x:collection1] o.a.s.u.p.UpdateRequestProcessorChain inserting DistributedUpdateProcessorFactory into updateRequestProcessorChain "distrib-dup-test-chain-implicit"
   [junit4]   2> 136328 INFO  (coreLoadExecutor-240-thread-1-processing-n:127.0.0.1:54890_) [n:127.0.0.1:54890_ c:control_collection s:shard1 r:core_node1 x:collection1] o.a.s.c.SolrCore no updateRequestProcessorChain defined as default, creating implicit default
   [junit4]   2> 136330 INFO  (coreLoadExecutor-240-thread-1-processing-n:127.0.0.1:54890_) [n:127.0.0.1:54890_ c:control_collection s:shard1 r:core_node1 x:collection1] o.a.s.h.l.XMLLoader xsltCacheLifetimeSeconds=60
   [junit4]   2> 136332 INFO  (coreLoadExecutor-240-thread-1-processing-n:127.0.0.1:54890_) [n:127.0.0.1:54890_ c:control_collection s:shard1 r:core_node1 x:collection1] o.a.s.h.l.XMLLoader xsltCacheLifetimeSeconds=60
   [junit4]   2> 136334 INFO  (coreLoadExecutor-240-thread-1-processing-n:127.0.0.1:54890_) [n:127.0.0.1:54890_ c:control_collection s:shard1 r:core_node1 x:collection1] o.a.s.h.l.XMLLoader xsltCacheLifetimeSeconds=60
   [junit4]   2> 136335 INFO  (coreLoadExecutor-240-thread-1-processing-n:127.0.0.1:54890_) [n:127.0.0.1:54890_ c:control_collection s:shard1 r:core_node1 x:collection1] o.a.s.h.l.XMLLoader xsltCacheLifetimeSeconds=60
   [junit4]   2> 136338 INFO  (coreLoadExecutor-240-thread-1-processing-n:127.0.0.1:54890_) [n:127.0.0.1:54890_ c:control_collection s:shard1 r:core_node1 x:collection1] o.a.s.c.RequestHandlers Registered paths: /admin/mbeans,standard,/update/csv,/update/json/docs,/admin/luke,/admin/segments,/get,/admin/system,/replication,/admin/properties,/config,/schema,/admin/plugins,/admin/logging,/update/json,/admin/threads,/admin/ping,/update,/admin/file
   [junit4]   2> 136339 INFO  (coreLoadExecutor-240-thread-1-processing-n:127.0.0.1:54890_) [n:127.0.0.1:54890_ c:control_collection s:shard1 r:core_node1 x:collection1] o.a.s.c.SolrCore Using default statsCache cache: org.apache.solr.search.stats.LocalStatsCache
   [junit4]   2> 136340 INFO  (coreLoadExecutor-240-thread-1-processing-n:127.0.0.1:54890_) [n:127.0.0.1:54890_ c:control_collection s:shard1 r:core_node1 x:collection1] o.a.s.u.UpdateHandler Using UpdateLog implementation: org.apache.solr.update.UpdateLog
   [junit4]   2> 136340 INFO  (coreLoadExecutor-240-thread-1-processing-n:127.0.0.1:54890_) [n:127.0.0.1:54890_ c:control_collection s:shard1 r:core_node1 x:collection1] o.a.s.u.UpdateLog Initializing UpdateLog: dataDir= defaultSyncLevel=FLUSH numRecordsToKeep=100 maxNumLogsToKeep=10 numVersionBuckets=65536
   [junit4]   2> 136341 INFO  (coreLoadExecutor-240-thread-1-processing-n:127.0.0.1:54890_) [n:127.0.0.1:54890_ c:control_collection s:shard1 r:core_node1 x:collection1] o.a.s.c.SolrCore Hard AutoCommit: disabled
   [junit4]   2> 136341 INFO  (coreLoadExecutor-240-thread-1-processing-n:127.0.0.1:54890_) [n:127.0.0.1:54890_ c:control_collection s:shard1 r:core_node1 x:collection1] o.a.s.c.SolrCore Soft AutoCommit: disabled
   [junit4]   2> 136341 INFO  (coreLoadExecutor-240-thread-1-processing-n:127.0.0.1:54890_) [n:127.0.0.1:54890_ c:control_collection s:shard1 r:core_node1 x:collection1] o.a.s.u.RandomMergePolicy RandomMergePolicy wrapping class org.apache.lucene.index.LogByteSizeMergePolicy: [LogByteSizeMergePolicy: minMergeSize=1677721, mergeFactor=23, maxMergeSize=2147483648, maxMergeSizeForForcedMerge=9223372036854775807, calibrateSizeByDeletes=false, maxMergeDocs=2147483647, maxCFSSegmentSizeMB=8.796093022207999E12, noCFSRatio=0.0]
   [junit4]   2> 136342 INFO  (coreLoadExecutor-240-thread-1-processing-n:127.0.0.1:54890_) [n:127.0.0.1:54890_ c:control_collection s:shard1 r:core_node1 x:collection1] o.a.s.c.SolrCore SolrDeletionPolicy.onInit: commits: num=1
   [junit4]   2> 	commit{dir=MockDirectoryWrapper(RAMDirectory@557c8879 lockFactory=org.apache.lucene.store.SingleInstanceLockFactory@560c0f18),segFN=segments_1,generation=1}
   [junit4]   2> 136342 INFO  (coreLoadExecutor-240-thread-1-processing-n:127.0.0.1:54890_) [n:127.0.0.1:54890_ c:control_collection s:shard1 r:core_node1 x:collection1] o.a.s.c.SolrCore newest commit generation = 1
   [junit4]   2> 136342 INFO  (coreLoadExecutor-240-thread-1-processing-n:127.0.0.1:54890_) [n:127.0.0.1:54890_ c:control_collection s:shard1 r:core_node1 x:collection1] o.a.s.s.SolrIndexSearcher Opening Searcher@1b05f955[collection1] main
   [junit4]   2> 136342 INFO  (coreLoadExecutor-240-thread-1-processing-n:127.0.0.1:54890_) [n:127.0.0.1:54890_ c:control_collection s:shard1 r:core_node1 x:collection1] o.a.s.c.c.ZkStateReader Load collection config from:/collections/control_collection
   [junit4]   2> 136343 INFO  (coreLoadExecutor-240-thread-1-processing-n:127.0.0.1:54890_) [n:127.0.0.1:54890_ c:control_collection s:shard1 r:core_node1 x:collection1] o.a.s.c.c.ZkStateReader path=/collections/control_collection configName=conf1 specified config exists in ZooKeeper
   [junit4]   2> 136343 INFO  (coreLoadExecutor-240-thread-1-processing-n:127.0.0.1:54890_) [n:127.0.0.1:54890_ c:control_collection s:shard1 r:core_node1 x:collection1] o.a.s.r.ManagedResourceStorage Setting up ZooKeeper-based storage for the RestManager with znodeBase: /configs/conf1
   [junit4]   2> 136344 INFO  (coreLoadExecutor-240-thread-1-processing-n:127.0.0.1:54890_) [n:127.0.0.1:54890_ c:control_collection s:shard1 r:core_node1 x:collection1] o.a.s.r.ManagedResourceStorage Configured ZooKeeperStorageIO with znodeBase: /configs/conf1
   [junit4]   2> 136344 INFO  (coreLoadExecutor-240-thread-1-processing-n:127.0.0.1:54890_) [n:127.0.0.1:54890_ c:control_collection s:shard1 r:core_node1 x:collection1] o.a.s.r.RestManager Initializing RestManager with initArgs: {}
   [junit4]   2> 136344 INFO  (coreLoadExecutor-240-thread-1-processing-n:127.0.0.1:54890_) [n:127.0.0.1:54890_ c:control_collection s:shard1 r:core_node1 x:collection1] o.a.s.r.ManagedResourceStorage Reading _rest_managed.json using ZooKeeperStorageIO:path=/configs/conf1
   [junit4]   2> 136344 INFO  (coreLoadExecutor-240-thread-1-processing-n:127.0.0.1:54890_) [n:127.0.0.1:54890_ c:control_collection s:shard1 r:core_node1 x:collection1] o.a.s.r.ManagedResourceStorage No data found for znode /configs/conf1/_rest_managed.json
   [junit4]   2> 136345 INFO  (coreLoadExecutor-240-thread-1-processing-n:127.0.0.1:54890_) [n:127.0.0.1:54890_ c:control_collection s:shard1 r:core_node1 x:collection1] o.a.s.r.ManagedResourceStorage Loaded null at path _rest_managed.json using ZooKeeperStorageIO:path=/configs/conf1
   [junit4]   2> 136345 INFO  (coreLoadExecutor-240-thread-1-processing-n:127.0.0.1:54890_) [n:127.0.0.1:54890_ c:control_collection s:shard1 r:core_node1 x:collection1] o.a.s.r.RestManager Initializing 0 registered ManagedResources
   [junit4]   2> 136345 INFO  (coreLoadExecutor-240-thread-1-processing-n:127.0.0.1:54890_) [n:127.0.0.1:54890_ c:control_collection s:shard1 r:core_node1 x:collection1] o.a.s.h.ReplicationHandler Commits will be reserved for  10000
   [junit4]   2> 136346 INFO  (searcherExecutor-241-thread-1-processing-n:127.0.0.1:54890_ x:collection1 s:shard1 c:control_collection r:core_node1) [n:127.0.0.1:54890_ c:control_collection s:shard1 r:core_node1 x:collection1] o.a.s.c.SolrCore [collection1] Registered new searcher Searcher@1b05f955[collection1] main{ExitableDirectoryReader(UninvertingDirectoryReader())}
   [junit4]   2> 136346 INFO  (coreLoadExecutor-240-thread-1-processing-n:127.0.0.1:54890_) [n:127.0.0.1:54890_ c:control_collection s:shard1 r:core_node1 x:collection1] o.a.s.u.UpdateLog Looking up max value of version field to seed version buckets
   [junit4]   2> 136346 INFO  (coreLoadExecutor-240-thread-1-processing-n:127.0.0.1:54890_) [n:127.0.0.1:54890_ c:control_collection s:shard1 r:core_node1 x:collection1] o.a.s.u.VersionInfo Refreshing highest value of _version_ for 65536 version buckets from index
   [junit4]   2> 136346 INFO  (coreLoadExecutor-240-thread-1-processing-n:127.0.0.1:54890_) [n:127.0.0.1:54890_ c:control_collection s:shard1 r:core_node1 x:collection1] o.a.s.u.VersionInfo No terms found for _version_, cannot seed version bucket highest value from index
   [junit4]   2> 136346 INFO  (coreLoadExecutor-240-thread-1-processing-n:127.0.0.1:54890_) [n:127.0.0.1:54890_ c:control_collection s:shard1 r:core_node1 x:collection1] o.a.s.u.UpdateLog Could not find max version in index or recent updates, using new clock 1505149844311769088
   [junit4]   2> 136348 INFO  (coreLoadExecutor-240-thread-1-processing-n:127.0.0.1:54890_) [n:127.0.0.1:54890_ c:control_collection s:shard1 r:core_node1 x:collection1] o.a.s.u.UpdateLog Took 2 ms to seed version buckets with highest version 1505149844311769088
   [junit4]   2> 136348 INFO  (coreLoadExecutor-240-thread-1-processing-n:127.0.0.1:54890_) [n:127.0.0.1:54890_ c:control_collection s:shard1 r:core_node1 x:collection1] o.a.s.c.ZkController watch zkdir /configs/conf1
   [junit4]   2> 136349 INFO  (coreLoadExecutor-240-thread-1-processing-n:127.0.0.1:54890_) [n:127.0.0.1:54890_ c:control_collection s:shard1 r:core_node1 x:collection1] o.a.s.c.CoreContainer registering core: collection1
   [junit4]   2> 136350 INFO  (coreZkRegister-234-thread-1-processing-n:127.0.0.1:54890_ x:collection1 s:shard1 c:control_collection r:core_node1) [n:127.0.0.1:54890_ c:control_collection s:shard1 r:core_node1 x:collection1] o.a.s.c.ZkController Register replica - core:collection1 address:http://127.0.0.1:54890 collection:control_collection shard:shard1
   [junit4]   2> 136351 INFO  (coreZkRegister-234-thread-1-processing-n:127.0.0.1:54890_ x:collection1 s:shard1 c:control_collection r:core_node1) [n:127.0.0.1:54890_ c:control_collection s:shard1 r:core_node1 x:collection1] o.a.s.c.c.SolrZkClient makePath: /collections/control_collection/leader_elect/shard1/election
   [junit4]   2> 136354 INFO  (coreZkRegister-234-thread-1-processing-n:127.0.0.1:54890_ x:collection1 s:shard1 c:control_collection r:core_node1) [n:127.0.0.1:54890_ c:control_collection s:shard1 r:core_node1 x:collection1] o.a.s.c.LeaderElector Joined leadership election with path: /collections/control_collection/leader_elect/shard1/election/94071865148506115-core_node1-n_0000000000
   [junit4]   2> 136356 INFO  (coreZkRegister-234-thread-1-processing-n:127.0.0.1:54890_ x:collection1 s:shard1 c:control_collection r:core_node1) [n:127.0.0.1:54890_ c:control_collection s:shard1 r:core_node1 x:collection1] o.a.s.c.ShardLeaderElectionContext Running the leader process for shard shard1
   [junit4]   2> 136357 INFO  (zkCallback-43-thread-1-processing-n:127.0.0.1:54890_) [n:127.0.0.1:54890_    ] o.a.s.c.DistributedQueue NodeChildrenChanged fired on path /overseer/queue state SyncConnected
   [junit4]   2> 136358 INFO  (coreZkRegister-234-thread-1-processing-n:127.0.0.1:54890_ x:collection1 s:shard1 c:control_collection r:core_node1) [n:127.0.0.1:54890_ c:control_collection s:shard1 r:core_node1 x:collection1] o.a.s.c.ShardLeaderElectionContext Enough replicas found to continue.
   [junit4]   2> 136358 INFO  (coreZkRegister-234-thread-1-processing-n:127.0.0.1:54890_ x:collection1 s:shard1 c:control_collection r:core_node1) [n:127.0.0.1:54890_ c:control_collection s:shard1 r:core_node1 x:collection1] o.a.s.c.ShardLeaderElectionContext I may be the new leader - try and sync
   [junit4]   2> 136358 INFO  (coreZkRegister-234-thread-1-processing-n:127.0.0.1:54890_ x:collection1 s:shard1 c:control_collection r:core_node1) [n:127.0.0.1:54890_ c:control_collection s:shard1 r:core_node1 x:collection1] o.a.s.c.SyncStrategy Sync replicas to http://127.0.0.1:54890/collection1/
   [junit4]   2> 136358 INFO  (coreZkRegister-234-thread-1-processing-n:127.0.0.1:54890_ x:collection1 s:shard1 c:control_collection r:core_node1) [n:127.0.0.1:54890_ c:control_collection s:shard1 r:core_node1 x:collection1] o.a.s.c.SyncStrategy Sync Success - now sync replicas to me
   [junit4]   2> 136358 INFO  (coreZkRegister-234-thread-1-processing-n:127.0.0.1:54890_ x:collection1 s:shard1 c:control_collection r:core_node1) [n:127.0.0.1:54890_ c:control_collection s:shard1 r:core_node1 x:collection1] o.a.s.c.SyncStrategy http://127.0.0.1:54890/collection1/ has no replicas
   [junit4]   2> 136358 INFO  (OverseerStateUpdate-94071865148506115-127.0.0.1:54890_-n_0000000000) [n:127.0.0.1:54890_    ] o.a.s.c.Overseer processMessage: queueSize: 1, message = {
   [junit4]   2>   "operation":"leader",
   [junit4]   2>   "shard":"shard1",
   [junit4]   2>   "collection":"control_collection"} current state version: 1
   [junit4]   2> 136358 INFO  (coreZkRegister-234-thread-1-processing-n:127.0.0.1:54890_ x:collection1 s:shard1 c:control_collection r:core_node1) [n:127.0.0.1:54890_ c:control_collection s:shard1 r:core_node1 x:collection1] o.a.s.c.ShardLeaderElectionContext I am the new leader: http://127.0.0.1:54890/collection1/ shard1
   [junit4]   2> 136358 INFO  (coreZkRegister-234-thread-1-processing-n:127.0.0.1:54890_ x:collection1 s:shard1 c:control_collection r:core_node1) [n:127.0.0.1:54890_ c:control_collection s:shard1 r:core_node1 x:collection1] o.a.s.c.c.SolrZkClient makePath: /collections/control_collection/leaders/shard1
   [junit4]   2> 136365 INFO  (zkCallback-43-thread-1-processing-n:127.0.0.1:54890_) [n:127.0.0.1:54890_    ] o.a.s.c.DistributedQueue NodeChildrenChanged fired on path /overseer/queue state SyncConnected
   [junit4]   2> 136367 INFO  (OverseerStateUpdate-94071865148506115-127.0.0.1:54890_-n_0000000000) [n:127.0.0.1:54890_    ] o.a.s.c.Overseer processMessage: queueSize: 1, message = {
   [junit4]   2>   "operation":"leader",
   [junit4]   2>   "shard":"shard1",
   [junit4]   2>   "collection":"control_collection",
   [junit4]   2>   "base_url":"http://127.0.0.1:54890",
   [junit4]   2>   "core":"collection1",
   [junit4]   2>   "state":"active"} current state version: 1
   [junit4]   2> 136470 INFO  (zkCallback-43-thread-1-processing-n:127.0.0.1:54890_) [n:127.0.0.1:54890_    ] o.a.s.c.c.ZkStateReader A cluster state change: WatchedEvent state:SyncConnected type:NodeDataChanged path:/clusterstate.json, has occurred - updating... (live nodes size: 1)
   [junit4]   2> 136472 INFO  (zkCallback-43-thread-1-processing-n:127.0.0.1:54890_) [n:127.0.0.1:54890_    ] o.a.s.c.c.ZkStateReader Updated cluster state version to 2
   [junit4]   2> 136518 INFO  (coreZkRegister-234-thread-1-processing-n:127.0.0.1:54890_ x:collection1 s:shard1 c:control_collection r:core_node1) [n:127.0.0.1:54890_ c:control_collection s:shard1 r:core_node1 x:collection1] o.a.s.c.ZkController We are http://127.0.0.1:54890/collection1/ and leader is http://127.0.0.1:54890/collection1/
   [junit4]   2> 136518 INFO  (coreZkRegister-234-thread-1-processing-n:127.0.0.1:54890_ x:collection1 s:shard1 c:control_collection r:core_node1) [n:127.0.0.1:54890_ c:control_collection s:shard1 r:core_node1 x:collection1] o.a.s.c.ZkController No LogReplay needed for core=collection1 baseURL=http://127.0.0.1:54890
   [junit4]   2> 136518 INFO  (coreZkRegister-234-thread-1-processing-n:127.0.0.1:54890_ x:collection1 s:shard1 c:control_collection r:core_node1) [n:127.0.0.1:54890_ c:control_collection s:shard1 r:core_node1 x:collection1] o.a.s.c.ZkController I am the leader, no recovery necessary
   [junit4]   2> 136519 INFO  (coreZkRegister-234-thread-1-processing-n:127.0.0.1:54890_ x:collection1 s:shard1 c:control_collection r:core_node1) [n:127.0.0.1:54890_ c:control_collection s:shard1 r:core_node1 x:collection1] o.a.s.c.ZkController publishing state=active
   [junit4]   2> 136519 INFO  (coreZkRegister-234-thread-1-processing-n:127.0.0.1:54890_ x:collection1 s:shard1 c:control_collection r:core_node1) [n:127.0.0.1:54890_ c:control_collection s:shard1 r:core_node1 x:collection1] o.a.s.c.ZkController numShards not found on descriptor - reading it from system property
   [junit4]   2> 136521 INFO  (zkCallback-43-thread-1-processing-n:127.0.0.1:54890_) [n:127.0.0.1:54890_    ] o.a.s.c.DistributedQueue NodeChildrenChanged fired on path /overseer/queue state SyncConnected
   [junit4]   2> 136523 INFO  (OverseerStateUpdate-94071865148506115-127.0.0.1:54890_-n_0000000000) [n:127.0.0.1:54890_    ] o.a.s.c.Overseer processMessage: queueSize: 1, message = {
   [junit4]   2>   "core":"collection1",
   [junit4]   2>   "core_node_name":"core_node1",
   [junit4]   2>   "roles":null,
   [junit4]   2>   "base_url":"http://127.0.0.1:54890",
   [junit4]   2>   "node_name":"127.0.0.1:54890_",
   [junit4]   2>   "numShards":"1",
   [junit4]   2>   "state":"active",
   [junit4]   2>   "shard":"shard1",
   [junit4]   2>   "collection":"control_collection",
   [junit4]   2>   "operation":"state"} current state version: 2
   [junit4]   2> 136524 INFO  (OverseerStateUpdate-94071865148506115-127.0.0.1:54890_-n_0000000000) [n:127.0.0.1:54890_    ] o.a.s.c.o.ReplicaMutator Update state numShards=1 message={
   [junit4]   2>   "core":"collection1",
   [junit4]   2>   "core_node_name":"core_node1",
   [junit4]   2>   "roles":null,
   [junit4]   2>   "base_url":"http://127.0.0.1:54890",
   [junit4]   2>   "node_name":"127.0.0.1:54890_",
   [junit4]   2>   "numShards":"1",
   [junit4]   2>   "state":"active",
   [junit4]   2>   "shard":"shard1",
   [junit4]   2>   "collection":"control_collection",
   [junit4]   2>   "operation":"state"}
   [junit4]   2> 136634 INFO  (TEST-BasicDistributedZkTest.test-seed#[5EA6D616EDDEBD5]) [    ] o.a.s.c.c.SolrZkClient Using default ZkCredentialsProvider
   [junit4]   2> 136634 INFO  (TEST-BasicDistributedZkTest.test-seed#[5EA6D616EDDEBD5]) [    ] o.a.s.c.c.ConnectionManager Waiting for client to connect to ZooKeeper
   [junit4]   2> 136634 INFO  (zkCallback-43-thread-1-processing-n:127.0.0.1:54890_) [n:127.0.0.1:54890_    ] o.a.s.c.c.ZkStateReader A cluster state change: WatchedEvent state:SyncConnected type:NodeDataChanged path:/clusterstate.json, has occurred - updating... (live nodes size: 1)
   [junit4]   2> 136638 INFO  (zkCallback-43-thread-1-processing-n:127.0.0.1:54890_) [n:127.0.0.1:54890_    ] o.a.s.c.c.ZkStateReader Updated cluster state version to 3
   [junit4]   2> 136638 INFO  (zkCallback-45-thread-1) [    ] o.a.s.c.c.ConnectionManager Watcher org.apache.solr.common.cloud.ConnectionManager@6f7ce5ae name:ZooKeeperConnection Watcher:127.0.0.1:36861/solr got event WatchedEvent state:SyncConnected type:None path:null path:null type:None
   [junit4]   2> 136638 INFO  (TEST-BasicDistributedZkTest.test-seed#[5EA6D616EDDEBD5]) [    ] o.a.s.c.c.ConnectionManager Client is connected to ZooKeeper
   [junit4]   2> 136639 INFO  (TEST-BasicDistributedZkTest.test-seed#[5EA6D616EDDEBD5]) [    ] o.a.s.c.c.SolrZkClient Using default ZkACLProvider
   [junit4]   2> 136639 INFO  (TEST-BasicDistributedZkTest.test-seed#[5EA6D616EDDEBD5]) [    ] o.a.s.c.c.ZkStateReader Updating cluster state from ZooKeeper... 
   [junit4]   2> 136643 INFO  (TEST-BasicDistributedZkTest.test-seed#[5EA6D616EDDEBD5]) [    ] o.a.s.c.ChaosMonkey monkey: init - expire sessions:false cause connection loss:false
   [junit4]   2> 136949 INFO  (TEST-BasicDistributedZkTest.test-seed#[5EA6D616EDDEBD5]) [    ] o.a.s.SolrTestCaseJ4 Writing core.properties file to /x1/jenkins/jenkins-slave/workspace/Lucene-Solr-Tests-trunk-Java8/solr/build/solr-core/test/J0/temp/solr.cloud.BasicDistributedZkTest_5EA6D616EDDEBD5-001/shard-1-001/cores/collection1
   [junit4]   2> 136950 INFO  (TEST-BasicDistributedZkTest.test-seed#[5EA6D616EDDEBD5]) [    ] o.a.s.c.AbstractFullDistribZkTestBase create jetty 1 in directory /x1/jenkins/jenkins-slave/workspace/Lucene-Solr-Tests-trunk-Java8/solr/build/solr-core/test/J0/temp/solr.cloud.BasicDistributedZkTest_5EA6D616EDDEBD5-001/shard-1-001
   [junit4]   2> 136950 INFO  (TEST-BasicDistributedZkTest.test-seed#[5EA6D616EDDEBD5]) [    ] o.e.j.s.Server jetty-9.2.11.v20150529
   [junit4]   2> 136953 INFO  (TEST-BasicDistributedZkTest.test-seed#[5EA6D616EDDEBD5]) [    ] o.e.j.s.h.ContextHandler Started o.e.j.s.ServletContextHandler@1053844a{/,null,AVAILABLE}
   [junit4]   2> 136953 INFO  (TEST-BasicDistributedZkTest.test-seed#[5EA6D616EDDEBD5]) [    ] o.e.j.s.ServerConnector Started ServerConnector@7de37e09{HTTP/1.1}{127.0.0.1:49954}
   [junit4]   2> 136953 INFO  (TEST-BasicDistributedZkTest.test-seed#[5EA6D616EDDEBD5]) [    ] o.e.j.s.Server Started @140449ms
   [junit4]   2> 136953 INFO  (TEST-BasicDistributedZkTest.test-seed#[5EA6D616EDDEBD5]) [    ] o.a.s.c.s.e.JettySolrRunner Jetty properties: {solr.data.dir=/x1/jenkins/jenkins-slave/workspace/Lucene-Solr-Tests-trunk-Java8/solr/build/solr-core/test/J0/temp/solr.cloud.BasicDistributedZkTest_5EA6D616EDDEBD5-001/tempDir-001/jetty1, solrconfig=solrconfig.xml, hostContext=/, hostPort=49954, coreRootDirectory=/x1/jenkins/jenkins-slave/workspace/Lucene-Solr-Tests-trunk-Java8/solr/build/solr-core/test/J0/../../../../../../../../../../x1/jenkins/jenkins-slave/workspace/Lucene-Solr-Tests-trunk-Java8/solr/build/solr-core/test/J0/temp/solr.cloud.BasicDistributedZkTest_5EA6D616EDDEBD5-001/shard-1-001/cores}
   [junit4]   2> 136954 INFO  (TEST-BasicDistributedZkTest.test-seed#[5EA6D616EDDEBD5]) [    ] o.a.s.s.SolrDispatchFilter SolrDispatchFilter.init(): sun.misc.Launcher$AppClassLoader@c387f44
   [junit4]   2> 136954 INFO  (TEST-BasicDistributedZkTest.test-seed#[5EA6D616EDDEBD5]) [    ] o.a.s.c.SolrResourceLoader new SolrResourceLoader for directory: '/x1/jenkins/jenkins-slave/workspace/Lucene-Solr-Tests-trunk-Java8/solr/build/solr-core/test/J0/../../../../../../../../../../x1/jenkins/jenkins-slave/workspace/Lucene-Solr-Tests-trunk-Java8/solr/build/solr-core/test/J0/temp/solr.cloud.BasicDistributedZkTest_5EA6D616EDDEBD5-001/shard-1-001/'
   [junit4]   2> 136968 INFO  (TEST-BasicDistributedZkTest.test-seed#[5EA6D616EDDEBD5]) [    ] o.a.s.c.SolrXmlConfig Loading container configuration from /x1/jenkins/jenkins-slave/workspace/Lucene-Solr-Tests-trunk-Java8/solr/build/solr-core/test/J0/../../../../../../../../../../x1/jenkins/jenkins-slave/workspace/Lucene-Solr-Tests-trunk-Java8/solr/build/solr-core/test/J0/temp/solr.cloud.BasicDistributedZkTest_5EA6D616EDDEBD5-001/shard-1-001/solr.xml
   [junit4]   2> 136974 INFO  (TEST-BasicDistributedZkTest.test-seed#[5EA6D616EDDEBD5]) [    ] o.a.s.c.CoresLocator Config-defined core root directory: /x1/jenkins/jenkins-slave/workspace/Lucene-Solr-Tests-trunk-Java8/solr/build/solr-core/test/J0/../../../../../../../../../../x1/jenkins/jenkins-slave/workspace/Lucene-Solr-Tests-trunk-Java8/solr/build/solr-core/test/J0/temp/solr.cloud.BasicDistributedZkTest_5EA6D616EDDEBD5-001/shard-1-001/cores
   [junit4]   2> 136974 INFO  (TEST-BasicDistributedZkTest.test-seed#[5EA6D616EDDEBD5]) [    ] o.a.s.c.CoreContainer New CoreContainer 796599170
   [junit4]   2> 136974 INFO  (TEST-BasicDistributedZkTest.test-seed#[5EA6D616EDDEBD5]) [    ] o.a.s.c.CoreContainer Loading cores into CoreContainer [instanceDir=/x1/jenkins/jenkins-slave/workspace/Lucene-Solr-Tests-trunk-Java8/solr/build/solr-core/test/J0/../../../../../../../../../../x1/jenkins/jenkins-slave/workspace/Lucene-Solr-Tests-trunk-Java8/solr/build/solr-core/test/J0/temp/solr.cloud.BasicDistributedZkTest_5EA6D616EDDEBD5-001/shard-1-001/]
   [junit4]   2> 136974 INFO  (TEST-BasicDistributedZkTest.test-seed#[5EA6D616EDDEBD5]) [    ] o.a.s.c.CoreContainer loading shared library: /x1/jenkins/jenkins-slave/workspace/Lucene-Solr-Tests-trunk-Java8/solr/build/solr-core/test/J0/../../../../../../../../../../x1/jenkins/jenkins-slave/workspace/Lucene-Solr-Tests-trunk-Java8/solr/build/solr-core/test/J0/temp/solr.cloud.BasicDistributedZkTest_5EA6D616EDDEBD5-001/shard-1-001/lib
   [junit4]   2> 136974 WARN  (TEST-BasicDistributedZkTest.test-seed#[5EA6D616EDDEBD5]) [    ] o.a.s.c.SolrResourceLoader Can't find (or read) directory to add to classloader: lib (resolved as: /x1/jenkins/jenkins-slave/workspace/Lucene-Solr-Tests-trunk-Java8/solr/build/solr-core/test/J0/../../../../../../../../../../x1/jenkins/jenkins-slave/workspace/Lucene-Solr-Tests-trunk-Java8/solr/build/solr-core/test/J0/temp/solr.cloud.BasicDistributedZkTest_5EA6D616EDDEBD5-001/shard-1-001/lib).
   [junit4]   2> 136981 INFO  (TEST-BasicDistributedZkTest.test-seed#[5EA6D616EDDEBD5]) [    ] o.a.s.h.c.HttpShardHandlerFactory created with socketTimeout : 90000,urlScheme : ,connTimeout : 15000,maxConnectionsPerHost : 20,maxConnections : 10000,corePoolSize : 0,maximumPoolSize : 2147483647,maxThreadIdleTime : 5,sizeOfQueue : -1,fairnessPolicy : false,useRetries : false,
   [junit4]   2> 136983 INFO  (TEST-BasicDistributedZkTest.test-seed#[5EA6D616EDDEBD5]) [    ] o.a.s.u.UpdateShardHandler Creating UpdateShardHandler HTTP client with params: socketTimeout=340000&connTimeout=45000&retry=true
   [junit4]   2> 136983 INFO  (TEST-BasicDistributedZkTest.test-seed#[5EA6D616EDDEBD5]) [    ] o.a.s.l.LogWatcher SLF4J impl is org.slf4j.impl.Log4jLoggerFactory
   [junit4]   2> 136983 INFO  (TEST-BasicDistributedZkTest.test-seed#[5EA6D616EDDEBD5]) [    ] o.a.s.l.LogWatcher Registering Log Listener [Log4j (org.slf4j.impl.Log4jLoggerFactory)]
   [junit4]   2> 136984 INFO  (TEST-BasicDistributedZkTest.test-seed#[5EA6D616EDDEBD5]) [    ] o.a.s.c.ZkContainer Zookeeper client=127.0.0.1:36861/solr
   [junit4]   2> 136984 INFO  (TEST-BasicDistributedZkTest.test-seed#[5EA6D616EDDEBD5]) [    ] o.a.s.c.ZkController zkHost includes chroot
   [junit4]   2> 136984 INFO  (TEST-BasicDistributedZkTest.test-seed#[5EA6D616EDDEBD5]) [    ] o.a.s.c.c.SolrZkClient Using default ZkCredentialsProvider
   [junit4]   2> 136985 INFO  (TEST-BasicDistributedZkTest.test-seed#[5EA6D616EDDEBD5]) [    ] o.a.s.c.c.ConnectionManager Waiting for client to connect to ZooKeeper
   [junit4]   2> 136988 INFO  (zkCallback-47-thread-1) [    ] o.a.s.c.c.ConnectionManager Watcher org.apache.solr.common.cloud.ConnectionManager@36265640 name:ZooKeeperConnection Watcher:127.0.0.1:36861 got event WatchedEvent state:SyncConnected type:None path:null path:null type:None
   [junit4]   2> 136988 INFO  (TEST-BasicDistributedZkTest.test-seed#[5EA6D616EDDEBD5]) [    ] o.a.s.c.c.ConnectionManager Client is connected to ZooKeeper
   [junit4]   2> 136988 INFO  (TEST-BasicDistributedZkTest.test-seed#[5EA6D616EDDEBD5]) [    ] o.a.s.c.c.SolrZkClient Using default ZkACLProvider
   [junit4]   2> 136992 INFO  (TEST-BasicDistributedZkTest.test-seed#[5EA6D616EDDEBD5]) [n:127.0.0.1:49954_    ] o.a.s.c.c.ConnectionManager Waiting for client to connect to ZooKeeper
   [junit4]   2> 137001 INFO  (zkCallback-48-thread-1-processing-n:127.0.0.1:49954_) [n:127.0.0.1:49954_    ] o.a.s.c.c.ConnectionManager Watcher org.apache.solr.common.cloud.ConnectionManager@42337529 name:ZooKeeperConnection Watcher:127.0.0.1:36861/solr got event WatchedEvent state:SyncConnected type:None path:null path:null type:None
   [junit4]   2> 137001 INFO  (TEST-BasicDistributedZkTest.test-seed#[5EA6D616EDDEBD5]) [n:127.0.0.1:49954_    ] o.a.s.c.c.ConnectionManager Client is connected to ZooKeeper
   [junit4]   2> 137008 INFO  (TEST-BasicDistributedZkTest.test-seed#[5EA6D616EDDEBD5]) [n:127.0.0.1:49954_    ] o.a.s.c.c.ZkStateReader Updating cluster state from ZooKeeper... 
   [junit4]   2> 138015 INFO  (TEST-BasicDistributedZkTest.test-seed#[5EA6D616EDDEBD5]) [n:127.0.0.1:49954_    ] o.a.s.c.ZkController Register node as live in ZooKeeper:/live_nodes/127.0.0.1:49954_
   [junit4]   2> 138017 INFO  (TEST-BasicDistributedZkTest.test-seed#[5EA6D616EDDEBD5]) [n:127.0.0.1:49954_    ] o.a.s.c.c.SolrZkClient makePath: /live_nodes/127.0.0.1:49954_
   [junit4]   2> 138024 INFO  (TEST-BasicDistributedZkTest.test-seed#[5EA6D616EDDEBD5]) [n:127.0.0.1:49954_    ] o.a.s.c.Overseer Overseer (id=null) closing
   [junit4]   2> 138026 INFO  (TEST-BasicDistributedZkTest.test-seed#[5EA6D616EDDEBD5]) [n:127.0.0.1:49954_    ] o.a.s.c.LeaderElector Joined leadership election with path: /overseer_elect/election/94071865148506118-127.0.0.1:49954_-n_0000000001
   [junit4]   2> 138027 INFO  (TEST-BasicDistributedZkTest.test-seed#[5EA6D616EDDEBD5]) [n:127.0.0.1:49954_    ] o.a.s.c.LeaderElector Watching path /overseer_elect/election/94071865148506115-127.0.0.1:54890_-n_0000000000 to know if I could be the leader
   [junit4]   2> 138028 INFO  (TEST-BasicDistributedZkTest.test-seed#[5EA6D616EDDEBD5]) [n:127.0.0.1:49954_    ] o.a.s.c.CoreContainer No authentication plugin used.
   [junit4]   2> 138028 INFO  (TEST-BasicDistributedZkTest.test-seed#[5EA6D616EDDEBD5]) [n:127.0.0.1:49954_    ] o.a.s.c.CoreContainer Security conf doesn't exist. Skipping setup for authorization module.
   [junit4]   2> 138029 INFO  (TEST-BasicDistributedZkTest.test-seed#[5EA6D616EDDEBD5]) [n:127.0.0.1:49954_    ] o.a.s.c.CoresLocator Looking for core definitions underneath /x1/jenkins/jenkins-slave/workspace/Lucene-Solr-Tests-trunk-Java8/solr/build/solr-core/test/J0/../../../../../../../../../../x1/jenkins/jenkins-slave/workspace/Lucene-Solr-Tests-trunk-Java8/solr/build/solr-core/test/J0/temp/solr.cloud.BasicDistributedZkTest_5EA6D616EDDEBD5-001/shard-1-001/cores
   [junit4]   2> 138030 INFO  (TEST-BasicDistributedZkTest.test-seed#[5EA6D616EDDEBD5]) [n:127.0.0.1:49954_    ] o.a.s.c.SolrCore Created CoreDescriptor: {name=collection1, config=solrconfig.xml, transient=false, schema=schema.xml, loadOnStartup=true, instanceDir=/x1/jenkins/jenkins-slave/workspace/Lucene-Solr-Tests-trunk-Java8/solr/build/solr-core/test/J0/../../../../../../../../../../x1/jenkins/jenkins-slave/workspace/Lucene-Solr-Tests-trunk-Java8/solr/build/solr-core/test/J0/temp/solr.cloud.BasicDistributedZkTest_5EA6D616EDDEBD5-001/shard-1-001/cores/collection1, collection=collection1, absoluteInstDir=/x1/jenkins/jenkins-slave/workspace/Lucene-Solr-Tests-trunk-Java8/solr/build/solr-core/test/J0/../../../../../../../../../../x1/jenkins/jenkins-slave/workspace/Lucene-Solr-Tests-trunk-Java8/solr/build/solr-core/test/J0/temp/solr.cloud.BasicDistributedZkTest_5EA6D616EDDEBD5-001/shard-1-001/cores/collection1/, coreNodeName=, dataDir=data/, shard=}
   [junit4]   2> 138034 INFO  (TEST-BasicDistributedZkTest.test-seed#[5EA6D616EDDEBD5]) [n:127.0.0.1:49954_    ] o.a.s.c.CoresLocator Found core collection1 in /x1/jenkins/jenkins-slave/workspace/Lucene-Solr-Tests-trunk-Java8/solr/build/solr-core/test/J0/../../../../../../../../../../x1/jenkins/jenkins-slave/workspace/Lucene-Solr-Tests-trunk-Java8/solr/build/solr-core/test/J0/temp/solr.cloud.BasicDistributedZkTest_5EA6D616EDDEBD5-001/shard-1-001/cores/collection1/
   [junit4]   2> 138034 INFO  (TEST-BasicDistributedZkTest.test-seed#[5EA6D616EDDEBD5]) [n:127.0.0.1:49954_    ] o.a.s.c.CoresLocator Found 1 core definitions
   [junit4]   2> 138036 INFO  (coreLoadExecutor-251-thread-1-processing-n:127.0.0.1:49954_) [n:127.0.0.1:49954_ c:collection1   x:collection1] o.a.s.c.ZkController publishing state=down
   [junit4]   2> 138036 INFO  (coreLoadExecutor-251-thread-1-processing-n:127.0.0.1:49954_) [n:127.0.0.1:49954_ c:collection1   x:collection1] o.a.s.c.ZkController numShards not found on descriptor - reading it from system property
   [junit4]   2> 138036 INFO  (TEST-BasicDistributedZkTest.test-seed#[5EA6D616EDDEBD5]) [n:127.0.0.1:49954_    ] o.a.s.s.SolrDispatchFilter user.dir=/x1/jenkins/jenkins-slave/workspace/Lucene-Solr-Tests-trunk-Java8/solr/build/solr-core/test/J0
   [junit4]   2> 138036 INFO  (TEST-BasicDistributedZkTest.test-seed#[5EA6D616EDDEBD5]) [n:127.0.0.1:49954_    ] o.a.s.s.SolrDispatchFilter SolrDispatchFilter.init() done
   [junit4]   2> 138037 INFO  (zkCallback-43-thread-1-processing-n:127.0.0.1:54890_) [n:127.0.0.1:54890_    ] o.a.s.c.DistributedQueue NodeChildrenChanged fired on path /overseer/queue state SyncConnected
   [junit4]   2> 138038 INFO  (coreLoadExecutor-251-thread-1-processing-n:127.0.0.1:49954_) [n:127.0.0.1:49954_ c:collection1   x:collection1] o.a.s.c.ZkController look for our core node name
   [junit4]   2> 138039 INFO  (OverseerStateUpdate-94071865148506115-127.0.0.1:54890_-n_0000000000) [n:127.0.0.1:54890_    ] o.a.s.c.Overseer processMessage: queueSize: 1, message = {
   [junit4]   2>   "core":"collection1",
   [junit4]   2>   "roles":null,
   [junit4]   2>   "base_url":"http://127.0.0.1:49954",
   [junit4]   2>   "node_name":"127.0.0.1:49954_",
   [junit4]   2>   "numShards":"2",
   [junit4]   2>   "state":"down",
   [junit4]   2>   "shard":null,
   [junit4]   2>   "collection":"collection1",
   [junit4]   2>   "operation":"state"} current state version: 3
   [junit4]   2> 138040 INFO  (OverseerStateUpdate-94071865148506115-127.0.0.1:54890_-n_0000000000) [n:127.0.0.1:54890_    ] o.a.s.c.o.ReplicaMutator Update state numShards=2 message={
   [junit4]   2>   "core":"collection1",
   [junit4]   2>   "roles":null,
   [junit4]   2>   "base_url":"http://127.0.0.1:49954",
   [junit4]   2>   "node_name":"127.0.0.1:49954_",
   [junit4]   2>   "numShards":"2",
   [junit4]   2>   "state":"down",
   [junit4]   2>   "shard":null,
   [junit4]   2>   "collection":"collection1",
   [junit4]   2>   "operation":"state"}
   [junit4]   2> 138041 INFO  (OverseerStateUpdate-94071865148506115-127.0.0.1:54890_-n_0000000000) [n:127.0.0.1:54890_    ] o.a.s.c.o.ClusterStateMutator building a new cName: collection1
   [junit4]   2> 138041 INFO  (OverseerStateUpdate-94071865148506115-127.0.0.1:54890_-n_0000000000) [n:127.0.0.1:54890_    ] o.a.s.c.o.ReplicaMutator Assigning new node to shard shard=shard2
   [junit4]   2> 138157 INFO  (zkCallback-43-thread-1-processing-n:127.0.0.1:54890_) [n:127.0.0.1:54890_    ] o.a.s.c.c.ZkStateReader A cluster state change: WatchedEvent state:SyncConnected type:NodeDataChanged path:/clusterstate.json, has occurred - updating... (live nodes size: 2)
   [junit4]   2> 138157 INFO  (zkCallback-45-thread-1) [    ] o.a.s.c.c.ZkStateReader A cluster state change: WatchedEvent state:SyncConnected type:NodeDataChanged path:/clusterstate.json, has occurred - updating... (live nodes size: 2)
   [junit4]   2> 138157 INFO  (zkCallback-48-thread-1-processing-n:127.0.0.1:49954_) [n:127.0.0.1:49954_    ] o.a.s.c.c.ZkStateReader A cluster state change: WatchedEvent state:SyncConnected type:NodeDataChanged path:/clusterstate.json, has occurred - updating... (live nodes size: 2)
   [junit4]   2> 138159 INFO  (zkCallback-45-thread-1) [    ] o.a.s.c.c.ZkStateReader Updated cluster state version to 4
   [junit4]   2> 138159 INFO  (zkCallback-43-thread-1-processing-n:127.0.0.1:54890_) [n:127.0.0.1:54890_    ] o.a.s.c.c.ZkStateReader Updated cluster state version to 4
   [junit4]   2> 138164 INFO  (zkCallback-48-thread-1-processing-n:127.0.0.1:49954_) [n:127.0.0.1:49954_    ] o.a.s.c.c.ZkStateReader Updated cluster state version to 4
   [junit4]   2> 139038 INFO  (coreLoadExecutor-251-thread-1-processing-n:127.0.0.1:49954_) [n:127.0.0.1:49954_ c:collection1   x:collection1] o.a.s.c.ZkController waiting to find shard id in clusterstate for collection1
   [junit4]   2> 139039 INFO  (coreLoadExecutor-251-thread-1-processing-n:127.0.0.1:49954_) [n:127.0.0.1:49954_ c:collection1   x:collection1] o.a.s.c.ZkController Check for collection zkNode:collection1
   [junit4]   2> 139040 INFO  (coreLoadExecutor-251-thread-1-processing-n:127.0.0.1:49954_) [n:127.0.0.1:49954_ c:collection1   x:collection1] o.a.s.c.ZkController Collection zkNode exists
   [junit4]   2> 139040 INFO  (coreLoadExecutor-251-thread-1-processing-n:127.0.0.1:49954_) [n:127.0.0.1:49954_ c:collection1   x:collection1] o.a.s.c.c.ZkStateReader Load collection config from:/collections/collection1
   [junit4]   2> 139040 INFO  (coreLoadExecutor-251-thread-1-processing-n:127.0.0.1:49954_) [n:127.0.0.1:49954_ c:collection1   x:collection1] o.a.s.c.c.ZkStateReader path=/collections/collection1 configName=conf1 specified config exists in ZooKeeper
   [junit4]   2> 139041 INFO  (coreLoadExecutor-251-thread-1-processing-n:127.0.0.1:49954_) [n:127.0.0.1:49954_ c:collection1   x:collection1] o.a.s.c.SolrResourceLoader new SolrResourceLoader for directory: '/x1/jenkins/jenkins-slave/workspace/Lucene-Solr-Tests-trunk-Java8/solr/build/solr-core/test/J0/../../../../../../../../../../x1/jenkins/jenkins-slave/workspace/Lucene-Solr-Tests-trunk-Java8/solr/build/solr-core/test/J0/temp/solr.cloud.BasicDistributedZkTest_5EA6D616EDDEBD5-001/shard-1-001/cores/collection1/'
   [junit4]   2> 139057 INFO  (coreLoadExecutor-251-thread-1-processing-n:127.0.0.1:49954_) [n:127.0.0.1:49954_ c:collection1   x:collection1] o.a.s.c.Config loaded config solrconfig.xml with version 0 
   [junit4]   2> 139064 INFO  (coreLoadExecutor-251-thread-1-processing-n:127.0.0.1:49954_) [n:127.0.0.1:49954_ c:collection1   x:collection1] o.a.s.c.SolrConfig current version of requestparams : -1
   [junit4]   2> 139069 INFO  (coreLoadExecutor-251-thread-1-processing-n:127.0.0.1:49954_) [n:127.0.0.1:49954_ c:collection1   x:collection1] o.a.s.c.SolrConfig Using Lucene MatchVersion: 6.0.0
   [junit4]   2> 139078 INFO  (coreLoadExecutor-251-thread-1-processing-n:127.0.0.1:49954_) [n:127.0.0.1:49954_ c:collection1   x:collection1] o.a.s.c.Config Loaded SolrConfig: solrconfig.xml
   [junit4]   2> 139080 INFO  (coreLoadExecutor-251-thread-1-processing-n:127.0.0.1:49954_) [n:127.0.0.1:49954_ c:collection1   x:collection1] o.a.s.s.IndexSchema Reading Solr Schema from /configs/conf1/schema.xml
   [junit4]   2> 139087 INFO  (coreLoadExecutor-251-thread-1-processing-n:127.0.0.1:49954_) [n:127.0.0.1:49954_ c:collection1   x:collection1] o.a.s.s.IndexSchema [collection1] Schema name=test
   [junit4]   2> 139195 INFO  (coreLoadExecutor-251-thread-1-processing-n:127.0.0.1:49954_) [n:127.0.0.1:49954_ c:collection1   x:collection1] o.a.s.s.OpenExchangeRatesOrgProvider Initialized with rates=open-exchange-rates.json, refreshInterval=1440.
   [junit4]   2> 139202 INFO  (coreLoadExecutor-251-thread-1-processing-n:127.0.0.1:49954_) [n:127.0.0.1:49954_ c:collection1   x:collection1] o.a.s.s.IndexSchema default search field in schema is text
   [junit4]   2> 139203 INFO  (coreLoadExecutor-251-thread-1-processing-n:127.0.0.1:49954_) [n:127.0.0.1:49954_ c:collection1   x:collection1] o.a.s.s.IndexSchema unique key field: id
   [junit4]   2> 139217 INFO  (coreLoadExecutor-251-thread-1-processing-n:127.0.0.1:49954_) [n:127.0.0.1:49954_ c:collection1   x:collection1] o.a.s.s.FileExchangeRateProvider Reloading exchange rates from file currency.xml
   [junit4]   2> 139223 INFO  (coreLoadExecutor-251-thread-1-processing-n:127.0.0.1:49954_) [n:127.0.0.1:49954_ c:collection1   x:collection1] o.a.s.s.FileExchangeRateProvider Reloading exchange rates from file currency.xml
   [junit4]   2> 139230 INFO  (coreLoadExecutor-251-thread-1-processing-n:127.0.0.1:49954_) [n:127.0.0.1:49954_ c:collection1   x:collection1] o.a.s.s.OpenExchangeRatesOrgProvider Reloading exchange rates from open-exchange-rates.json
   [junit4]   2> 139231 WARN  (coreLoadExecutor-251-thread-1-processing-n:127.0.0.1:49954_) [n:127.0.0.1:49954_ c:collection1   x:collection1] o.a.s.s.OpenExchangeRatesOrgProvider Unknown key IMPORTANT NOTE
   [junit4]   2> 139231 WARN  (coreLoadExecutor-251-thread-1-processing-n:127.0.0.1:49954_) [n:127.0.0.1:49954_ c:collection1   x:collection1] o.a.s.s.OpenExchangeRatesOrgProvider Expected key, got STRING
   [junit4]   2> 139231 INFO  (coreLoadExecutor-251-thread-1-processing-n:127.0.0.1:49954_) [n:127.0.0.1:49954_ c:collection1   x:collection1] o.a.s.s.OpenExchangeRatesOrgProvider Reloading exchange rates from open-exchange-rates.json
   [junit4]   2> 139232 WARN  (coreLoadExecutor-251-thread-1-processing-n:127.0.0.1:49954_) [n:127.0.0.1:49954_ c:collection1   x:collection1] o.a.s.s.OpenExchangeRatesOrgProvider Unknown key IMPORTANT NOTE
   [junit4]   2> 139232 WARN  (coreLoadExecutor-251-thread-1-processing-n:127.0.0.1:49954_) [n:127.0.0.1:49954_ c:collection1   x:collection1] o.a.s.s.OpenExchangeRatesOrgProvider Expected key, got STRING
   [junit4]   2> 139232 INFO  (coreLoadExecutor-251-thread-1-processing-n:127.0.0.1:49954_) [n:127.0.0.1:49954_ c:collection1   x:collection1] o.a.s.c.CoreContainer Creating SolrCore 'collection1' using configuration from collection collection1
   [junit4]   2> 139233 INFO  (coreLoadExecutor-251-thread-1-processing-n:127.0.0.1:49954_) [n:127.0.0.1:49954_ c:collection1 s:shard2 r:core_node1 x:collection1] o.a.s.c.SolrCore org.apache.solr.core.MockDirectoryFactory
   [junit4]   2> 139233 INFO  (coreLoadExecutor-251-thread-1-processing-n:127.0.0.1:49954_) [n:127.0.0.1:49954_ c:collection1 s:shard2 r:core_node1 x:collection1] o.a.s.c.SolrCore [[collection1] ] Opening new SolrCore at [/x1/jenkins/jenkins-slave/workspace/Lucene-Solr-Tests-trunk-Java8/solr/build/solr-core/test/J0/../../../../../../../../../../x1/jenkins/jenkins-slave/workspace/Lucene-Solr-Tests-trunk-Java8/solr/build/solr-core/test/J0/temp/solr.cloud.BasicDistributedZkTest_5EA6D616EDDEBD5-001/shard-1-001/cores/collection1/], dataDir=[null]
   [junit4]   2> 139233 INFO  (coreLoadExecutor-251-thread-1-processing-n:127.0.0.1:49954_) [n:127.0.0.1:49954_ c:collection1 s:shard2 r:core_node1 x:collection1] o.a.s.c.JmxMonitoredMap JMX monitoring is enabled. Adding Solr mbeans to JMX Server: com.sun.jmx.mbeanserver.JmxMBeanServer@33572851
   [junit4]   2> 139234 INFO  (coreLoadExecutor-251-thread-1-processing-n:127.0.0.1:49954_) [n:127.0.0.1:49954_ c:collection1 s:shard2 r:core_node1 x:collection1] o.a.s.c.CachingDirectoryFactory return new directory for /x1/jenkins/jenkins-slave/workspace/Lucene-Solr-Tests-trunk-Java8/solr/build/solr-core/test/J0/../../../../../../../../../../x1/jenkins/jenkins-slave/workspace/Lucene-Solr-Tests-trunk-Java8/solr/build/solr-core/test/J0/temp/solr.cloud.BasicDistributedZkTest_5EA6D616EDDEBD5-001/shard-1-001/cores/collection1/data
   [junit4]   2> 139234 INFO  (coreLoadExecutor-251-thread-1-processing-n:127.0.0.1:49954_) [n:127.0.0.1:49954_ c:collection1 s:shard2 r:core_node1 x:collection1] o.a.s.c.SolrCore New index directory detected: old=null new=/x1/jenkins/jenkins-slave/workspace/Lucene-Solr-Tests-trunk-Java8/solr/build/solr-core/test/J0/../../../../../../../../../../x1/jenkins/jenkins-slave/workspace/Lucene-Solr-Tests-trunk-Java8/solr/build/solr-core/test/J0/temp/solr.cloud.BasicDistributedZkTest_5EA6D616EDDEBD5-001/shard-1-001/cores/collection1/data/index/
   [junit4]   2> 139234 WARN  (coreLoadExecutor-251-thread-1-processing-n:127.0.0.1:49954_) [n:127.0.0.1:49954_ c:collection1 s:shard2 r:core_node1 x:collection1] o.a.s.c.SolrCore [collection1] Solr index directory '/x1/jenkins/jenkins-slave/workspace/Lucene-Solr-Tests-trunk-Java8/solr/build/solr-core/test/J0/../../../../../../../../../../x1/jenkins/jenkins-slave/workspace/Lucene-Solr-Tests-trunk-Java8/solr/build/solr-core/test/J0/temp/solr.cloud.BasicDistributedZkTest_5EA6D616EDDEBD5-001/shard-1-001/cores/collection1/data/index' doesn't exist. Creating new index...
   [junit4]   2> 139235 INFO  (coreLoadExecutor-251-thread-1-processing-n:127.0.0.1:49954_) [n:127.0.0.1:49954_ c:collection1 s:shard2 r:core_node1 x:collection1] o.a.s.c.CachingDirectoryFactory return new directory for /x1/jenkins/jenkins-slave/workspace/Lucene-Solr-Tests-trunk-Java8/solr/build/solr-core/test/J0/../../../../../../../../../../x1/jenkins/jenkins-slave/workspace/Lucene-Solr-Tests-trunk-Java8/solr/build/solr-core/test/J0/temp/solr.cloud.BasicDistributedZkTest_5EA6D616EDDEBD5-001/shard-1-001/cores/collection1/data/index
   [junit4]   2> 139241 INFO  (coreLoadExecutor-251-thread-1-processing-n:127.0.0.1:49954_) [n:127.0.0.1:49954_ c:collection1 s:shard2 r:core_node1 x:collection1] o.a.s.u.RandomMergePolicy RandomMergePolicy wrapping class org.apache.lucene.index.AlcoholicMergePolicy: [AlcoholicMergePolicy: minMergeSize=0, mergeFactor=10, maxMergeSize=1993444765, maxMergeSizeForForcedMerge=9223372036854775807, calibrateSizeByDeletes=true, maxMergeDocs=2147483647, maxCFSSegmentSizeMB=8.796093022207999E12, noCFSRatio=0.1]
   [junit4]   2> 139242 INFO  (coreLoadExecutor-251-thread-1-processing-n:127.0.0.1:49954_) [n:127.0.0.1:49954_ c:collection1 s:shard2 r:core_node1 x:collection1] o.a.s.c.SolrCore SolrDeletionPolicy.onCommit: commits: num=1
   [junit4]   2> 	commit{dir=MockDirectoryWrapper(RAMDirectory@431a8e08 lockFactory=org.apache.lucene.store.SingleInstanceLockFactory@7e84c239),segFN=segments_1,generation=1}
   [junit4]   2> 139242 INFO  (coreLoadExecutor-251-thread-1-processing-n:127.0.0.1:49954_) [n:127.0.0.1:49954_ c:collection1 s:shard2 r:core_node1 x:collection1] o.a.s.c.SolrCore newest commit generation = 1
   [junit4]   2> 139250 INFO  (OldIndexDirectoryCleanupThreadForCore-collection1) [n:127.0.0.1:49954_ c:collection1 s:shard2 r:core_node1 x:collection1] o.a.s.c.SolrCore Looking for old index directories to cleanup for core collection1 in /x1/jenkins/jenkins-slave/workspace/Lucene-Solr-Tests-trunk-Java8/solr/build/solr-core/test/J0/../../../../../../../../../../x1/jenkins/jenkins-slave/workspace/Lucene-Solr-Tests-trunk-Java8/solr/build/solr-core/test/J0/temp/solr.cloud.BasicDistributedZkTest_5EA6D616EDDEBD5-001/shard-1-001/cores/collection1/data/
   [junit4]   2> 139251 WARN  (OldIndexDirectoryCleanupThreadForCore-collection1) [n:127.0.0.1:49954_ c:collection1 s:shard2 r:core_node1 x:collection1] o.a.s.c.DirectoryFactory /x1/jenkins/jenkins-slave/workspace/Lucene-Solr-Tests-trunk-Java8/solr/build/solr-core/test/J0/../../../../../../../../../../x1/jenkins/jenkins-slave/workspace/Lucene-Solr-Tests-trunk-Java8/solr/build/solr-core/test/J0/temp/solr.cloud.BasicDistributedZkTest_5EA6D616EDDEBD5-001/shard-1-001/cores/collection1/data/ does not point to a valid data directory; skipping clean-up of old index directories.
   [junit4]   2> 139256 INFO  (coreLoadExecutor-251-thread-1-processing-n:127.0.0.1:49954_) [n:127.0.0.1:49954_ c:collection1 s:shard2 r:core_node1 x:collection1] o.a.s.u.p.UpdateRequestProcessorChain creating updateRequestProcessorChain "nodistrib"
   [junit4]   2> 139257 INFO  (coreLoadExecutor-251-thread-1-processing-n:127.0.0.1:49954_) [n:127.0.0.1:49954_ c:collection1 s:shard2 r:core_node1 x:collection1] o.a.s.u.p.UpdateRequestProcessorChain creating updateRequestProcessorChain "dedupe"
   [junit4]   2> 139257 INFO  (coreLoadExecutor-251-thread-1-processing-n:127.0.0.1:49954_) [n:127.0.0.1:49954_ c:collection1 s:shard2 r:core_node1 x:collection1] o.a.s.u.p.UpdateRequestProcessorChain inserting DistributedUpdateProcessorFactory into updateRequestProcessorChain "dedupe"
   [junit4]   2> 139257 INFO  (coreLoadExecutor-251-thread-1-processing-n:127.0.0.1:49954_) [n:127.0.0.1:49954_ c:collection1 s:shard2 r:core_node1 x:collection1] o.a.s.u.p.UpdateRequestProcessorChain creating updateRequestProcessorChain "stored_sig"
   [junit4]   2> 139257 INFO  (coreLoadExecutor-251-thread-1-processing-n:127.0.0.1:49954_) [n:127.0.0.1:49954_ c:collection1 s:shard2 r:core_node1 x:collection1] o.a.s.u.p.UpdateRequestProcessorChain inserting DistributedUpdateProcessorFactory into updateRequestProcessorChain "stored_sig"
   [junit4]   2> 139259 INFO  (coreLoadExecutor-251-thread-1-processing-n:127.0.0.1:49954_) [n:127.0.0.1:49954_ c:collection1 s:shard2 r:core_node1 x:collection1] o.a.s.u.p.UpdateRequestProcessorChain creating updateRequestProcessorChain "distrib-dup-test-chain-explicit"
   [junit4]   2> 139259 INFO  (coreLoadExecutor-251-thread-1-processing-n:127.0.0.1:49954_) [n:127.0.0.1:49954_ c:collection1 s:shard2 r:core_node1 x:collection1] o.a.s.u.p.UpdateRequestProcessorChain creating updateRequestProcessorChain "distrib-dup-test-chain-implicit"
   [junit4]   2> 139260 INFO  (coreLoadExecutor-251-thread-1-processing-n:127.0.0.1:49954_) [n:127.0.0.1:49954_ c:collection1 s:shard2 r:core_node1 x:collection1] o.a.s.u.p.UpdateRequestProcessorChain inserting DistributedUpdateProcessorFactory into updateRequestProcessorChain "distrib-dup-test-chain-implicit"
   [junit4]   2> 139260 INFO  (coreLoadExecutor-251-thread-1-processing-n:127.0.0.1:49954_) [n:127.0.0.1:49954_ c:collection1 s:shard2 r:core_node1 x:collection1] o.a.s.c.SolrCore no updateRequestProcessorChain defined as default, creating implicit default
   [junit4]   2> 139262 INFO  (coreLoadExecutor-251-thread-1-processing-n:127.0.0.1:49954_) [n:127.0.0.1:49954_ c:collection1 s:shard2 r:core_node1 x:collection1] o.a.s.h.l.XMLLoader xsltCacheLifetimeSeconds=60
   [junit4]   2> 139264 INFO  (coreLoadExecutor-251-thread-1-processing-n:127.0.0.1:49954_) [n:127.0.0.1:49954_ c:collection1 s:shard2 r:core_node1 x:collection1] o.a.s.h.l.XMLLoader xsltCacheLifetimeSeconds=60
   [junit4]   2> 139265 INFO  (co

[...truncated too long message...]

0.1:38649",
   [junit4]   2>   "node_name":"127.0.0.1:38649_",
   [junit4]   2>   "numShards":"2",
   [junit4]   2>   "state":"down",
   [junit4]   2>   "shard":"shard1",
   [junit4]   2>   "collection":"collection1",
   [junit4]   2>   "operation":"state"} current state version: 23
   [junit4]   2> 165803 INFO  (TEST-BasicDistributedZkTest.test-seed#[5EA6D616EDDEBD5]) [n:127.0.0.1:38649_ c:collection1 s:shard1 r:core_node4 x:collection1] o.a.s.c.SolrCore SolrDeletionPolicy.onCommit: commits: num=2
   [junit4]   2> 	commit{dir=MockDirectoryWrapper(RAMDirectory@2a771e7 lockFactory=org.apache.lucene.store.SingleInstanceLockFactory@60b8460e),segFN=segments_7,generation=7}
   [junit4]   2> 	commit{dir=MockDirectoryWrapper(RAMDirectory@2a771e7 lockFactory=org.apache.lucene.store.SingleInstanceLockFactory@60b8460e),segFN=segments_8,generation=8}
   [junit4]   2> 165804 INFO  (OverseerStateUpdate-94071865148506124-127.0.0.1:38649_-n_0000000004) [n:127.0.0.1:38649_    ] o.a.s.c.o.ReplicaMutator Update state numShards=2 message={
   [junit4]   2>   "core":"collection1",
   [junit4]   2>   "core_node_name":"core_node4",
   [junit4]   2>   "roles":null,
   [junit4]   2>   "base_url":"http://127.0.0.1:38649",
   [junit4]   2>   "node_name":"127.0.0.1:38649_",
   [junit4]   2>   "numShards":"2",
   [junit4]   2>   "state":"down",
   [junit4]   2>   "shard":"shard1",
   [junit4]   2>   "collection":"collection1",
   [junit4]   2>   "operation":"state"}
   [junit4]   2> 165804 INFO  (TEST-BasicDistributedZkTest.test-seed#[5EA6D616EDDEBD5]) [n:127.0.0.1:38649_ c:collection1 s:shard1 r:core_node4 x:collection1] o.a.s.c.SolrCore newest commit generation = 8
   [junit4]   2> 165805 INFO  (TEST-BasicDistributedZkTest.test-seed#[5EA6D616EDDEBD5]) [n:127.0.0.1:38649_ c:collection1 s:shard1 r:core_node4 x:collection1] o.a.s.c.SolrCore [collection1] Closing main searcher on request.
   [junit4]   2> 165820 INFO  (TEST-BasicDistributedZkTest.test-seed#[5EA6D616EDDEBD5]) [n:127.0.0.1:38649_ c:collection1 s:shard1 r:core_node4 x:collection1] o.a.s.c.CachingDirectoryFactory Closing MockDirectoryFactory - 2 directories currently being tracked
   [junit4]   2> 165820 INFO  (TEST-BasicDistributedZkTest.test-seed#[5EA6D616EDDEBD5]) [n:127.0.0.1:38649_ c:collection1 s:shard1 r:core_node4 x:collection1] o.a.s.c.CachingDirectoryFactory looking to close /x1/jenkins/jenkins-slave/workspace/Lucene-Solr-Tests-trunk-Java8/solr/build/solr-core/test/J0/temp/solr.cloud.BasicDistributedZkTest_5EA6D616EDDEBD5-001/shard-4-001/cores/collection1/data/index [CachedDir<<refCount=0;path=/x1/jenkins/jenkins-slave/workspace/Lucene-Solr-Tests-trunk-Java8/solr/build/solr-core/test/J0/temp/solr.cloud.BasicDistributedZkTest_5EA6D616EDDEBD5-001/shard-4-001/cores/collection1/data/index;done=false>>]
   [junit4]   2> 165821 INFO  (TEST-BasicDistributedZkTest.test-seed#[5EA6D616EDDEBD5]) [n:127.0.0.1:38649_ c:collection1 s:shard1 r:core_node4 x:collection1] o.a.s.c.CachingDirectoryFactory Closing directory: /x1/jenkins/jenkins-slave/workspace/Lucene-Solr-Tests-trunk-Java8/solr/build/solr-core/test/J0/temp/solr.cloud.BasicDistributedZkTest_5EA6D616EDDEBD5-001/shard-4-001/cores/collection1/data/index
   [junit4]   2> 165821 INFO  (TEST-BasicDistributedZkTest.test-seed#[5EA6D616EDDEBD5]) [n:127.0.0.1:38649_ c:collection1 s:shard1 r:core_node4 x:collection1] o.a.s.c.CachingDirectoryFactory looking to close /x1/jenkins/jenkins-slave/workspace/Lucene-Solr-Tests-trunk-Java8/solr/build/solr-core/test/J0/temp/solr.cloud.BasicDistributedZkTest_5EA6D616EDDEBD5-001/shard-4-001/cores/collection1/data [CachedDir<<refCount=0;path=/x1/jenkins/jenkins-slave/workspace/Lucene-Solr-Tests-trunk-Java8/solr/build/solr-core/test/J0/temp/solr.cloud.BasicDistributedZkTest_5EA6D616EDDEBD5-001/shard-4-001/cores/collection1/data;done=false>>]
   [junit4]   2> 165821 INFO  (TEST-BasicDistributedZkTest.test-seed#[5EA6D616EDDEBD5]) [n:127.0.0.1:38649_ c:collection1 s:shard1 r:core_node4 x:collection1] o.a.s.c.CachingDirectoryFactory Closing directory: /x1/jenkins/jenkins-slave/workspace/Lucene-Solr-Tests-trunk-Java8/solr/build/solr-core/test/J0/temp/solr.cloud.BasicDistributedZkTest_5EA6D616EDDEBD5-001/shard-4-001/cores/collection1/data
   [junit4]   2> 165822 INFO  (TEST-BasicDistributedZkTest.test-seed#[5EA6D616EDDEBD5]) [n:127.0.0.1:38649_ c:collection1 s:shard1 r:core_node4 x:collection1] o.a.s.c.Overseer Overseer (id=94071865148506124-127.0.0.1:38649_-n_0000000004) closing
   [junit4]   2> 165822 INFO  (OverseerStateUpdate-94071865148506124-127.0.0.1:38649_-n_0000000004) [n:127.0.0.1:38649_    ] o.a.s.c.Overseer Overseer Loop exiting : 127.0.0.1:38649_
   [junit4]   2> 167330 WARN  (zkCallback-58-thread-2-processing-n:127.0.0.1:38649_) [n:127.0.0.1:38649_    ] o.a.s.c.c.ZkStateReader ZooKeeper watch triggered, but Solr cannot talk to ZK
   [junit4]   2> 167337 INFO  (TEST-BasicDistributedZkTest.test-seed#[5EA6D616EDDEBD5]) [    ] o.e.j.s.ServerConnector Stopped ServerConnector@53b0f2fa{HTTP/1.1}{127.0.0.1:0}
   [junit4]   2> 167337 INFO  (TEST-BasicDistributedZkTest.test-seed#[5EA6D616EDDEBD5]) [    ] o.e.j.s.h.ContextHandler Stopped o.e.j.s.ServletContextHandler@68965bef{/,null,UNAVAILABLE}
   [junit4]   2> 167345 INFO  (TEST-BasicDistributedZkTest.test-seed#[5EA6D616EDDEBD5]) [n:127.0.0.1:38649_ c:collection1 s:shard1 r:core_node4 x:collection1] o.a.s.c.ZkTestServer connecting to 127.0.0.1:36861 36861
   [junit4]   2> 167532 INFO  (Thread-246) [    ] o.a.s.c.ZkTestServer connecting to 127.0.0.1:36861 36861
   [junit4]   2> 167533 WARN  (Thread-246) [    ] o.a.s.c.ZkTestServer Watch limit violations: 
   [junit4]   2> Maximum concurrent create/delete watches above limit:
   [junit4]   2> 
   [junit4]   2> 	7	/solr/aliases.json
   [junit4]   2> 	7	/solr/clusterstate.json
   [junit4]   2> 	5	/solr/configs/conf1
   [junit4]   2> 
   [junit4]   2> Maximum concurrent children watches above limit:
   [junit4]   2> 
   [junit4]   2> 	7	/solr/live_nodes
   [junit4]   2> 	5	/solr/overseer/queue
   [junit4]   2> 	5	/solr/overseer/collection-queue-work
   [junit4]   2> 
   [junit4]   2> NOTE: reproduce with: ant test  -Dtestcase=BasicDistributedZkTest -Dtests.method=test -Dtests.seed=5EA6D616EDDEBD5 -Dtests.multiplier=2 -Dtests.slow=true -Dtests.locale=ca_ES -Dtests.timezone=Europe/Mariehamn -Dtests.asserts=true -Dtests.file.encoding=US-ASCII
   [junit4] FAILURE 33.1s J0 | BasicDistributedZkTest.test <<<
   [junit4]    > Throwable #1: java.lang.AssertionError: commitWithin did not work on node: http://127.0.0.1:49954/collection1 expected:<68> but was:<67>
   [junit4]    > 	at __randomizedtesting.SeedInfo.seed([5EA6D616EDDEBD5:8DBE52BBC021862D]:0)
   [junit4]    > 	at org.apache.solr.cloud.BasicDistributedZkTest.test(BasicDistributedZkTest.java:332)
   [junit4]    > 	at org.apache.solr.BaseDistributedSearchTestCase$ShardsRepeatRule$ShardsFixedStatement.callStatement(BaseDistributedSearchTestCase.java:960)
   [junit4]    > 	at org.apache.solr.BaseDistributedSearchTestCase$ShardsRepeatRule$ShardsStatement.evaluate(BaseDistributedSearchTestCase.java:935)
   [junit4]    > 	at java.lang.Thread.run(Thread.java:745)
   [junit4]   2> 167597 INFO  (SUITE-BasicDistributedZkTest-seed#[5EA6D616EDDEBD5]-worker) [n:127.0.0.1:38649_ c:collection1 s:shard1 r:core_node4 x:collection1] o.a.s.SolrTestCaseJ4 ###deleteCore
   [junit4]   2> NOTE: leaving temporary files on disk at: /x1/jenkins/jenkins-slave/workspace/Lucene-Solr-Tests-trunk-Java8/solr/build/solr-core/test/J0/temp/solr.cloud.BasicDistributedZkTest_5EA6D616EDDEBD5-001
   [junit4]   2> NOTE: test params are: codec=CheapBastard, sim=RandomSimilarityProvider(queryNorm=false,coord=yes): {}, locale=ca_ES, timezone=Europe/Mariehamn
   [junit4]   2> NOTE: Linux 3.13.0-52-generic amd64/Oracle Corporation 1.8.0_25 (64-bit)/cpus=4,threads=1,free=101348800,total=301465600
   [junit4]   2> NOTE: All tests run in this JVM: [TestBinaryField, TestRandomDVFaceting, SimpleMLTQParserTest, TestManagedSchemaFieldTypeResource, TestCloudManagedSchema, PeerSyncTest, EnumFieldTest, StandardRequestHandlerTest, TermVectorComponentTest, ExternalFileFieldSortTest, DateFieldTest, TestDynamicFieldResource, DefaultValueUpdateProcessorTest, BaseCdcrDistributedZkTest, TestDocBasedVersionConstraints, SmileWriterTest, BasicDistributedZkTest]
   [junit4] Completed [43/514] on J0 in 33.15s, 1 test, 1 failure <<< FAILURES!

[...truncated 1463 lines...]
BUILD FAILED
/x1/jenkins/jenkins-slave/workspace/Lucene-Solr-Tests-trunk-Java8/build.xml:526: The following error occurred while executing this line:
/x1/jenkins/jenkins-slave/workspace/Lucene-Solr-Tests-trunk-Java8/build.xml:474: The following error occurred while executing this line:
/x1/jenkins/jenkins-slave/workspace/Lucene-Solr-Tests-trunk-Java8/build.xml:61: The following error occurred while executing this line:
/x1/jenkins/jenkins-slave/workspace/Lucene-Solr-Tests-trunk-Java8/extra-targets.xml:39: The following error occurred while executing this line:
/x1/jenkins/jenkins-slave/workspace/Lucene-Solr-Tests-trunk-Java8/solr/build.xml:230: The following error occurred while executing this line:
/x1/jenkins/jenkins-slave/workspace/Lucene-Solr-Tests-trunk-Java8/solr/common-build.xml:513: The following error occurred while executing this line:
/x1/jenkins/jenkins-slave/workspace/Lucene-Solr-Tests-trunk-Java8/lucene/common-build.xml:1426: The following error occurred while executing this line:
/x1/jenkins/jenkins-slave/workspace/Lucene-Solr-Tests-trunk-Java8/lucene/common-build.xml:981: There were test failures: 514 suites, 2021 tests, 1 failure, 35 ignored (25 assumptions)

Total time: 55 minutes 22 seconds
Build step 'Invoke Ant' marked build as failure
Archiving artifacts
Sending artifact delta relative to Lucene-Solr-Tests-trunk-Java8 #119
Archived 4 artifacts
Archive block size is 32768
Received 0 blocks and 335027497 bytes
Compression is 0.0%
Took 54 sec
Recording test results
Email was triggered for: Failure
Sending email for trigger: Failure



Mime
View raw message