lucene-dev mailing list archives

Site index · List index
Message view « Date » · « Thread »
Top « Date » · « Thread »
From Apache Jenkins Server <jenk...@builds.apache.org>
Subject [JENKINS] Lucene-Solr-NightlyTests-trunk - Build # 699 - Still Failing
Date Tue, 02 Jun 2015 18:02:00 GMT
Build: https://builds.apache.org/job/Lucene-Solr-NightlyTests-trunk/699/

4 tests failed.
REGRESSION:  org.apache.solr.cloud.FullSolrCloudDistribCmdsTest.test

Error Message:
IOException occured when talking to server at: http://127.0.0.1:45372/collection1

Stack Trace:
org.apache.solr.client.solrj.SolrServerException: IOException occured when talking to server at: http://127.0.0.1:45372/collection1
	at __randomizedtesting.SeedInfo.seed([B6B3D5E88F1A1BA1:3EE7EA3221E67659]:0)
	at org.apache.solr.client.solrj.impl.HttpSolrClient.executeMethod(HttpSolrClient.java:575)
	at org.apache.solr.client.solrj.impl.HttpSolrClient.request(HttpSolrClient.java:235)
	at org.apache.solr.client.solrj.impl.HttpSolrClient.request(HttpSolrClient.java:227)
	at org.apache.solr.client.solrj.SolrRequest.process(SolrRequest.java:135)
	at org.apache.solr.client.solrj.SolrClient.query(SolrClient.java:943)
	at org.apache.solr.client.solrj.SolrClient.query(SolrClient.java:958)
	at org.apache.solr.cloud.CloudInspectUtil.compareResults(CloudInspectUtil.java:224)
	at org.apache.solr.cloud.CloudInspectUtil.compareResults(CloudInspectUtil.java:166)
	at org.apache.solr.cloud.FullSolrCloudDistribCmdsTest.testIndexingBatchPerRequestWithHttpSolrClient(FullSolrCloudDistribCmdsTest.java:676)
	at org.apache.solr.cloud.FullSolrCloudDistribCmdsTest.test(FullSolrCloudDistribCmdsTest.java:152)
	at sun.reflect.NativeMethodAccessorImpl.invoke0(Native Method)
	at sun.reflect.NativeMethodAccessorImpl.invoke(NativeMethodAccessorImpl.java:62)
	at sun.reflect.DelegatingMethodAccessorImpl.invoke(DelegatingMethodAccessorImpl.java:43)
	at java.lang.reflect.Method.invoke(Method.java:483)
	at com.carrotsearch.randomizedtesting.RandomizedRunner.invoke(RandomizedRunner.java:1627)
	at com.carrotsearch.randomizedtesting.RandomizedRunner$6.evaluate(RandomizedRunner.java:836)
	at com.carrotsearch.randomizedtesting.RandomizedRunner$7.evaluate(RandomizedRunner.java:872)
	at com.carrotsearch.randomizedtesting.RandomizedRunner$8.evaluate(RandomizedRunner.java:886)
	at org.apache.solr.BaseDistributedSearchTestCase$ShardsRepeatRule$ShardsFixedStatement.callStatement(BaseDistributedSearchTestCase.java:960)
	at org.apache.solr.BaseDistributedSearchTestCase$ShardsRepeatRule$ShardsStatement.evaluate(BaseDistributedSearchTestCase.java:935)
	at com.carrotsearch.randomizedtesting.rules.SystemPropertiesRestoreRule$1.evaluate(SystemPropertiesRestoreRule.java:57)
	at org.apache.lucene.util.TestRuleSetupTeardownChained$1.evaluate(TestRuleSetupTeardownChained.java:50)
	at org.apache.lucene.util.AbstractBeforeAfterRule$1.evaluate(AbstractBeforeAfterRule.java:46)
	at org.apache.lucene.util.TestRuleThreadAndTestName$1.evaluate(TestRuleThreadAndTestName.java:49)
	at org.apache.lucene.util.TestRuleIgnoreAfterMaxFailures$1.evaluate(TestRuleIgnoreAfterMaxFailures.java:65)
	at org.apache.lucene.util.TestRuleMarkFailure$1.evaluate(TestRuleMarkFailure.java:48)
	at com.carrotsearch.randomizedtesting.rules.StatementAdapter.evaluate(StatementAdapter.java:36)
	at com.carrotsearch.randomizedtesting.ThreadLeakControl$StatementRunner.run(ThreadLeakControl.java:365)
	at com.carrotsearch.randomizedtesting.ThreadLeakControl.forkTimeoutingTask(ThreadLeakControl.java:798)
	at com.carrotsearch.randomizedtesting.ThreadLeakControl$3.evaluate(ThreadLeakControl.java:458)
	at com.carrotsearch.randomizedtesting.RandomizedRunner.runSingleTest(RandomizedRunner.java:845)
	at com.carrotsearch.randomizedtesting.RandomizedRunner$3.evaluate(RandomizedRunner.java:747)
	at com.carrotsearch.randomizedtesting.RandomizedRunner$4.evaluate(RandomizedRunner.java:781)
	at com.carrotsearch.randomizedtesting.RandomizedRunner$5.evaluate(RandomizedRunner.java:792)
	at com.carrotsearch.randomizedtesting.rules.StatementAdapter.evaluate(StatementAdapter.java:36)
	at com.carrotsearch.randomizedtesting.rules.SystemPropertiesRestoreRule$1.evaluate(SystemPropertiesRestoreRule.java:57)
	at org.apache.lucene.util.AbstractBeforeAfterRule$1.evaluate(AbstractBeforeAfterRule.java:46)
	at com.carrotsearch.randomizedtesting.rules.StatementAdapter.evaluate(StatementAdapter.java:36)
	at org.apache.lucene.util.TestRuleStoreClassName$1.evaluate(TestRuleStoreClassName.java:42)
	at com.carrotsearch.randomizedtesting.rules.NoShadowingOrOverridesOnMethodsRule$1.evaluate(NoShadowingOrOverridesOnMethodsRule.java:39)
	at com.carrotsearch.randomizedtesting.rules.NoShadowingOrOverridesOnMethodsRule$1.evaluate(NoShadowingOrOverridesOnMethodsRule.java:39)
	at com.carrotsearch.randomizedtesting.rules.StatementAdapter.evaluate(StatementAdapter.java:36)
	at com.carrotsearch.randomizedtesting.rules.StatementAdapter.evaluate(StatementAdapter.java:36)
	at com.carrotsearch.randomizedtesting.rules.StatementAdapter.evaluate(StatementAdapter.java:36)
	at org.apache.lucene.util.TestRuleAssertionsRequired$1.evaluate(TestRuleAssertionsRequired.java:54)
	at org.apache.lucene.util.TestRuleMarkFailure$1.evaluate(TestRuleMarkFailure.java:48)
	at org.apache.lucene.util.TestRuleIgnoreAfterMaxFailures$1.evaluate(TestRuleIgnoreAfterMaxFailures.java:65)
	at org.apache.lucene.util.TestRuleIgnoreTestSuites$1.evaluate(TestRuleIgnoreTestSuites.java:55)
	at com.carrotsearch.randomizedtesting.rules.StatementAdapter.evaluate(StatementAdapter.java:36)
	at com.carrotsearch.randomizedtesting.ThreadLeakControl$StatementRunner.run(ThreadLeakControl.java:365)
	at java.lang.Thread.run(Thread.java:745)
Caused by: java.net.SocketException: Broken pipe
	at java.net.SocketOutputStream.socketWrite0(Native Method)
	at java.net.SocketOutputStream.socketWrite(SocketOutputStream.java:109)
	at java.net.SocketOutputStream.write(SocketOutputStream.java:153)
	at org.apache.http.impl.io.AbstractSessionOutputBuffer.flushBuffer(AbstractSessionOutputBuffer.java:159)
	at org.apache.http.impl.io.AbstractSessionOutputBuffer.writeLine(AbstractSessionOutputBuffer.java:258)
	at org.apache.http.impl.io.HttpRequestWriter.writeHeadLine(HttpRequestWriter.java:59)
	at org.apache.http.impl.io.HttpRequestWriter.writeHeadLine(HttpRequestWriter.java:46)
	at org.apache.http.impl.io.AbstractMessageWriter.write(AbstractMessageWriter.java:110)
	at org.apache.http.impl.AbstractHttpClientConnection.sendRequestHeader(AbstractHttpClientConnection.java:254)
	at org.apache.http.impl.conn.DefaultClientConnection.sendRequestHeader(DefaultClientConnection.java:270)
	at org.apache.http.impl.conn.ManagedClientConnectionImpl.sendRequestHeader(ManagedClientConnectionImpl.java:209)
	at org.apache.http.protocol.HttpRequestExecutor.doSendRequest(HttpRequestExecutor.java:204)
	at org.apache.http.protocol.HttpRequestExecutor.execute(HttpRequestExecutor.java:122)
	at org.apache.http.impl.client.DefaultRequestDirector.tryExecute(DefaultRequestDirector.java:685)
	at org.apache.http.impl.client.DefaultRequestDirector.execute(DefaultRequestDirector.java:487)
	at org.apache.http.impl.client.AbstractHttpClient.doExecute(AbstractHttpClient.java:882)
	at org.apache.http.impl.client.CloseableHttpClient.execute(CloseableHttpClient.java:82)
	at org.apache.http.impl.client.CloseableHttpClient.execute(CloseableHttpClient.java:107)
	at org.apache.http.impl.client.CloseableHttpClient.execute(CloseableHttpClient.java:55)
	at org.apache.solr.client.solrj.impl.HttpSolrClient.executeMethod(HttpSolrClient.java:466)
	... 50 more


REGRESSION:  org.apache.solr.handler.TestReplicationHandler.doTestReplicateAfterCoreReload

Error Message:
expected:<[{indexVersion=1433260673107,generation=2,filelist=[_5.doc, _5.fdt, _5.fdx, _5.fnm, _5.nvd, _5.nvm, _5.si, _5.tim, _5.tip, _7.doc, _7.fdt, _7.fdx, _7.fnm, _7.nvd, _7.nvm, _7.si, _7.tim, _7.tip, _8.doc, _8.fdt, _8.fdx, _8.fnm, _8.nvd, _8.nvm, _8.si, _8.tim, _8.tip, segments_2]}]> but was:<[{indexVersion=1433260673107,generation=2,filelist=[_5.doc, _5.fdt, _5.fdx, _5.fnm, _5.nvd, _5.nvm, _5.si, _5.tim, _5.tip, _7.doc, _7.fdt, _7.fdx, _7.fnm, _7.nvd, _7.nvm, _7.si, _7.tim, _7.tip, _8.doc, _8.fdt, _8.fdx, _8.fnm, _8.nvd, _8.nvm, _8.si, _8.tim, _8.tip, segments_2]}, {indexVersion=1433260673107,generation=3,filelist=[_a.doc, _a.fdt, _a.fdx, _a.fnm, _a.nvd, _a.nvm, _a.si, _a.tim, _a.tip, segments_3]}]>

Stack Trace:
java.lang.AssertionError: expected:<[{indexVersion=1433260673107,generation=2,filelist=[_5.doc, _5.fdt, _5.fdx, _5.fnm, _5.nvd, _5.nvm, _5.si, _5.tim, _5.tip, _7.doc, _7.fdt, _7.fdx, _7.fnm, _7.nvd, _7.nvm, _7.si, _7.tim, _7.tip, _8.doc, _8.fdt, _8.fdx, _8.fnm, _8.nvd, _8.nvm, _8.si, _8.tim, _8.tip, segments_2]}]> but was:<[{indexVersion=1433260673107,generation=2,filelist=[_5.doc, _5.fdt, _5.fdx, _5.fnm, _5.nvd, _5.nvm, _5.si, _5.tim, _5.tip, _7.doc, _7.fdt, _7.fdx, _7.fnm, _7.nvd, _7.nvm, _7.si, _7.tim, _7.tip, _8.doc, _8.fdt, _8.fdx, _8.fnm, _8.nvd, _8.nvm, _8.si, _8.tim, _8.tip, segments_2]}, {indexVersion=1433260673107,generation=3,filelist=[_a.doc, _a.fdt, _a.fdx, _a.fnm, _a.nvd, _a.nvm, _a.si, _a.tim, _a.tip, segments_3]}]>
	at __randomizedtesting.SeedInfo.seed([B6B3D5E88F1A1BA1:9364CED8FF5215A2]:0)
	at org.junit.Assert.fail(Assert.java:93)
	at org.junit.Assert.failNotEquals(Assert.java:647)
	at org.junit.Assert.assertEquals(Assert.java:128)
	at org.junit.Assert.assertEquals(Assert.java:147)
	at org.apache.solr.handler.TestReplicationHandler.doTestReplicateAfterCoreReload(TestReplicationHandler.java:1138)
	at sun.reflect.NativeMethodAccessorImpl.invoke0(Native Method)
	at sun.reflect.NativeMethodAccessorImpl.invoke(NativeMethodAccessorImpl.java:62)
	at sun.reflect.DelegatingMethodAccessorImpl.invoke(DelegatingMethodAccessorImpl.java:43)
	at java.lang.reflect.Method.invoke(Method.java:483)
	at com.carrotsearch.randomizedtesting.RandomizedRunner.invoke(RandomizedRunner.java:1627)
	at com.carrotsearch.randomizedtesting.RandomizedRunner$6.evaluate(RandomizedRunner.java:836)
	at com.carrotsearch.randomizedtesting.RandomizedRunner$7.evaluate(RandomizedRunner.java:872)
	at com.carrotsearch.randomizedtesting.RandomizedRunner$8.evaluate(RandomizedRunner.java:886)
	at com.carrotsearch.randomizedtesting.rules.SystemPropertiesRestoreRule$1.evaluate(SystemPropertiesRestoreRule.java:57)
	at org.apache.lucene.util.TestRuleSetupTeardownChained$1.evaluate(TestRuleSetupTeardownChained.java:50)
	at org.apache.lucene.util.AbstractBeforeAfterRule$1.evaluate(AbstractBeforeAfterRule.java:46)
	at org.apache.lucene.util.TestRuleThreadAndTestName$1.evaluate(TestRuleThreadAndTestName.java:49)
	at org.apache.lucene.util.TestRuleIgnoreAfterMaxFailures$1.evaluate(TestRuleIgnoreAfterMaxFailures.java:65)
	at org.apache.lucene.util.TestRuleMarkFailure$1.evaluate(TestRuleMarkFailure.java:48)
	at com.carrotsearch.randomizedtesting.rules.StatementAdapter.evaluate(StatementAdapter.java:36)
	at com.carrotsearch.randomizedtesting.ThreadLeakControl$StatementRunner.run(ThreadLeakControl.java:365)
	at com.carrotsearch.randomizedtesting.ThreadLeakControl.forkTimeoutingTask(ThreadLeakControl.java:798)
	at com.carrotsearch.randomizedtesting.ThreadLeakControl$3.evaluate(ThreadLeakControl.java:458)
	at com.carrotsearch.randomizedtesting.RandomizedRunner.runSingleTest(RandomizedRunner.java:845)
	at com.carrotsearch.randomizedtesting.RandomizedRunner$3.evaluate(RandomizedRunner.java:747)
	at com.carrotsearch.randomizedtesting.RandomizedRunner$4.evaluate(RandomizedRunner.java:781)
	at com.carrotsearch.randomizedtesting.RandomizedRunner$5.evaluate(RandomizedRunner.java:792)
	at com.carrotsearch.randomizedtesting.rules.StatementAdapter.evaluate(StatementAdapter.java:36)
	at com.carrotsearch.randomizedtesting.rules.SystemPropertiesRestoreRule$1.evaluate(SystemPropertiesRestoreRule.java:57)
	at org.apache.lucene.util.AbstractBeforeAfterRule$1.evaluate(AbstractBeforeAfterRule.java:46)
	at com.carrotsearch.randomizedtesting.rules.StatementAdapter.evaluate(StatementAdapter.java:36)
	at org.apache.lucene.util.TestRuleStoreClassName$1.evaluate(TestRuleStoreClassName.java:42)
	at com.carrotsearch.randomizedtesting.rules.NoShadowingOrOverridesOnMethodsRule$1.evaluate(NoShadowingOrOverridesOnMethodsRule.java:39)
	at com.carrotsearch.randomizedtesting.rules.NoShadowingOrOverridesOnMethodsRule$1.evaluate(NoShadowingOrOverridesOnMethodsRule.java:39)
	at com.carrotsearch.randomizedtesting.rules.StatementAdapter.evaluate(StatementAdapter.java:36)
	at com.carrotsearch.randomizedtesting.rules.StatementAdapter.evaluate(StatementAdapter.java:36)
	at com.carrotsearch.randomizedtesting.rules.StatementAdapter.evaluate(StatementAdapter.java:36)
	at org.apache.lucene.util.TestRuleAssertionsRequired$1.evaluate(TestRuleAssertionsRequired.java:54)
	at org.apache.lucene.util.TestRuleMarkFailure$1.evaluate(TestRuleMarkFailure.java:48)
	at org.apache.lucene.util.TestRuleIgnoreAfterMaxFailures$1.evaluate(TestRuleIgnoreAfterMaxFailures.java:65)
	at org.apache.lucene.util.TestRuleIgnoreTestSuites$1.evaluate(TestRuleIgnoreTestSuites.java:55)
	at com.carrotsearch.randomizedtesting.rules.StatementAdapter.evaluate(StatementAdapter.java:36)
	at com.carrotsearch.randomizedtesting.ThreadLeakControl$StatementRunner.run(ThreadLeakControl.java:365)
	at java.lang.Thread.run(Thread.java:745)


REGRESSION:  org.apache.solr.search.TestSearcherReuse.test

Error Message:
expected same:<Searcher@9923ad3[collection1] main{ExitableDirectoryReader(UninvertingDirectoryReader(Uninverting(_0(6.0.0):C2) Uninverting(_1(6.0.0):C1) Uninverting(_2(6.0.0):C1) Uninverting(_3(6.0.0):C1)))}> was not:<Searcher@1be3f070[collection1] main{ExitableDirectoryReader(UninvertingDirectoryReader(Uninverting(_0(6.0.0):C2) Uninverting(_1(6.0.0):C1) Uninverting(_2(6.0.0):C1) Uninverting(_3(6.0.0):C1)))}>

Stack Trace:
java.lang.AssertionError: expected same:<Searcher@9923ad3[collection1] main{ExitableDirectoryReader(UninvertingDirectoryReader(Uninverting(_0(6.0.0):C2) Uninverting(_1(6.0.0):C1) Uninverting(_2(6.0.0):C1) Uninverting(_3(6.0.0):C1)))}> was not:<Searcher@1be3f070[collection1] main{ExitableDirectoryReader(UninvertingDirectoryReader(Uninverting(_0(6.0.0):C2) Uninverting(_1(6.0.0):C1) Uninverting(_2(6.0.0):C1) Uninverting(_3(6.0.0):C1)))}>
	at __randomizedtesting.SeedInfo.seed([B6B3D5E88F1A1BA1:3EE7EA3221E67659]:0)
	at org.junit.Assert.fail(Assert.java:93)
	at org.junit.Assert.failNotSame(Assert.java:641)
	at org.junit.Assert.assertSame(Assert.java:580)
	at org.junit.Assert.assertSame(Assert.java:593)
	at org.apache.solr.search.TestSearcherReuse.assertSearcherHasNotChanged(TestSearcherReuse.java:247)
	at org.apache.solr.search.TestSearcherReuse.test(TestSearcherReuse.java:117)
	at sun.reflect.NativeMethodAccessorImpl.invoke0(Native Method)
	at sun.reflect.NativeMethodAccessorImpl.invoke(NativeMethodAccessorImpl.java:62)
	at sun.reflect.DelegatingMethodAccessorImpl.invoke(DelegatingMethodAccessorImpl.java:43)
	at java.lang.reflect.Method.invoke(Method.java:483)
	at com.carrotsearch.randomizedtesting.RandomizedRunner.invoke(RandomizedRunner.java:1627)
	at com.carrotsearch.randomizedtesting.RandomizedRunner$6.evaluate(RandomizedRunner.java:836)
	at com.carrotsearch.randomizedtesting.RandomizedRunner$7.evaluate(RandomizedRunner.java:872)
	at com.carrotsearch.randomizedtesting.RandomizedRunner$8.evaluate(RandomizedRunner.java:886)
	at com.carrotsearch.randomizedtesting.rules.SystemPropertiesRestoreRule$1.evaluate(SystemPropertiesRestoreRule.java:57)
	at org.apache.lucene.util.TestRuleSetupTeardownChained$1.evaluate(TestRuleSetupTeardownChained.java:50)
	at org.apache.lucene.util.AbstractBeforeAfterRule$1.evaluate(AbstractBeforeAfterRule.java:46)
	at org.apache.lucene.util.TestRuleThreadAndTestName$1.evaluate(TestRuleThreadAndTestName.java:49)
	at org.apache.lucene.util.TestRuleIgnoreAfterMaxFailures$1.evaluate(TestRuleIgnoreAfterMaxFailures.java:65)
	at org.apache.lucene.util.TestRuleMarkFailure$1.evaluate(TestRuleMarkFailure.java:48)
	at com.carrotsearch.randomizedtesting.rules.StatementAdapter.evaluate(StatementAdapter.java:36)
	at com.carrotsearch.randomizedtesting.ThreadLeakControl$StatementRunner.run(ThreadLeakControl.java:365)
	at com.carrotsearch.randomizedtesting.ThreadLeakControl.forkTimeoutingTask(ThreadLeakControl.java:798)
	at com.carrotsearch.randomizedtesting.ThreadLeakControl$3.evaluate(ThreadLeakControl.java:458)
	at com.carrotsearch.randomizedtesting.RandomizedRunner.runSingleTest(RandomizedRunner.java:845)
	at com.carrotsearch.randomizedtesting.RandomizedRunner$3.evaluate(RandomizedRunner.java:747)
	at com.carrotsearch.randomizedtesting.RandomizedRunner$4.evaluate(RandomizedRunner.java:781)
	at com.carrotsearch.randomizedtesting.RandomizedRunner$5.evaluate(RandomizedRunner.java:792)
	at com.carrotsearch.randomizedtesting.rules.StatementAdapter.evaluate(StatementAdapter.java:36)
	at com.carrotsearch.randomizedtesting.rules.SystemPropertiesRestoreRule$1.evaluate(SystemPropertiesRestoreRule.java:57)
	at org.apache.lucene.util.AbstractBeforeAfterRule$1.evaluate(AbstractBeforeAfterRule.java:46)
	at com.carrotsearch.randomizedtesting.rules.StatementAdapter.evaluate(StatementAdapter.java:36)
	at org.apache.lucene.util.TestRuleStoreClassName$1.evaluate(TestRuleStoreClassName.java:42)
	at com.carrotsearch.randomizedtesting.rules.NoShadowingOrOverridesOnMethodsRule$1.evaluate(NoShadowingOrOverridesOnMethodsRule.java:39)
	at com.carrotsearch.randomizedtesting.rules.NoShadowingOrOverridesOnMethodsRule$1.evaluate(NoShadowingOrOverridesOnMethodsRule.java:39)
	at com.carrotsearch.randomizedtesting.rules.StatementAdapter.evaluate(StatementAdapter.java:36)
	at com.carrotsearch.randomizedtesting.rules.StatementAdapter.evaluate(StatementAdapter.java:36)
	at com.carrotsearch.randomizedtesting.rules.StatementAdapter.evaluate(StatementAdapter.java:36)
	at org.apache.lucene.util.TestRuleAssertionsRequired$1.evaluate(TestRuleAssertionsRequired.java:54)
	at org.apache.lucene.util.TestRuleMarkFailure$1.evaluate(TestRuleMarkFailure.java:48)
	at org.apache.lucene.util.TestRuleIgnoreAfterMaxFailures$1.evaluate(TestRuleIgnoreAfterMaxFailures.java:65)
	at org.apache.lucene.util.TestRuleIgnoreTestSuites$1.evaluate(TestRuleIgnoreTestSuites.java:55)
	at com.carrotsearch.randomizedtesting.rules.StatementAdapter.evaluate(StatementAdapter.java:36)
	at com.carrotsearch.randomizedtesting.ThreadLeakControl$StatementRunner.run(ThreadLeakControl.java:365)
	at java.lang.Thread.run(Thread.java:745)


FAILED:  org.apache.solr.cloud.CollectionsAPIDistributedZkTest.test

Error Message:
Error from server at http://127.0.0.1:39863/ugloh/e: Error CREATEing SolrCore 'halfcollection_shard1_replica1': Error reading cluster properties Caused by: KeeperErrorCode = Session expired for /clusterprops.json

Stack Trace:
org.apache.solr.client.solrj.impl.HttpSolrClient$RemoteSolrException: Error from server at http://127.0.0.1:39863/ugloh/e: Error CREATEing SolrCore 'halfcollection_shard1_replica1': Error reading cluster properties Caused by: KeeperErrorCode = Session expired for /clusterprops.json
	at org.apache.solr.client.solrj.impl.HttpSolrClient.executeMethod(HttpSolrClient.java:560)
	at org.apache.solr.client.solrj.impl.HttpSolrClient.request(HttpSolrClient.java:235)
	at org.apache.solr.client.solrj.impl.HttpSolrClient.request(HttpSolrClient.java:227)
	at org.apache.solr.client.solrj.SolrClient.request(SolrClient.java:1220)
	at org.apache.solr.cloud.CollectionsAPIDistributedZkTest.makeRequest(CollectionsAPIDistributedZkTest.java:308)
	at org.apache.solr.cloud.CollectionsAPIDistributedZkTest.testErrorHandling(CollectionsAPIDistributedZkTest.java:425)
	at org.apache.solr.cloud.CollectionsAPIDistributedZkTest.test(CollectionsAPIDistributedZkTest.java:175)
	at sun.reflect.NativeMethodAccessorImpl.invoke0(Native Method)
	at sun.reflect.NativeMethodAccessorImpl.invoke(NativeMethodAccessorImpl.java:62)
	at sun.reflect.DelegatingMethodAccessorImpl.invoke(DelegatingMethodAccessorImpl.java:43)
	at java.lang.reflect.Method.invoke(Method.java:483)
	at com.carrotsearch.randomizedtesting.RandomizedRunner.invoke(RandomizedRunner.java:1627)
	at com.carrotsearch.randomizedtesting.RandomizedRunner$6.evaluate(RandomizedRunner.java:836)
	at com.carrotsearch.randomizedtesting.RandomizedRunner$7.evaluate(RandomizedRunner.java:872)
	at com.carrotsearch.randomizedtesting.RandomizedRunner$8.evaluate(RandomizedRunner.java:886)
	at org.apache.solr.BaseDistributedSearchTestCase$ShardsRepeatRule$ShardsFixedStatement.callStatement(BaseDistributedSearchTestCase.java:960)
	at org.apache.solr.BaseDistributedSearchTestCase$ShardsRepeatRule$ShardsStatement.evaluate(BaseDistributedSearchTestCase.java:935)
	at com.carrotsearch.randomizedtesting.rules.SystemPropertiesRestoreRule$1.evaluate(SystemPropertiesRestoreRule.java:57)
	at org.apache.lucene.util.TestRuleSetupTeardownChained$1.evaluate(TestRuleSetupTeardownChained.java:50)
	at org.apache.lucene.util.AbstractBeforeAfterRule$1.evaluate(AbstractBeforeAfterRule.java:46)
	at org.apache.lucene.util.TestRuleThreadAndTestName$1.evaluate(TestRuleThreadAndTestName.java:49)
	at org.apache.lucene.util.TestRuleIgnoreAfterMaxFailures$1.evaluate(TestRuleIgnoreAfterMaxFailures.java:65)
	at org.apache.lucene.util.TestRuleMarkFailure$1.evaluate(TestRuleMarkFailure.java:48)
	at com.carrotsearch.randomizedtesting.rules.StatementAdapter.evaluate(StatementAdapter.java:36)
	at com.carrotsearch.randomizedtesting.ThreadLeakControl$StatementRunner.run(ThreadLeakControl.java:365)
	at com.carrotsearch.randomizedtesting.ThreadLeakControl.forkTimeoutingTask(ThreadLeakControl.java:798)
	at com.carrotsearch.randomizedtesting.ThreadLeakControl$3.evaluate(ThreadLeakControl.java:458)
	at com.carrotsearch.randomizedtesting.RandomizedRunner.runSingleTest(RandomizedRunner.java:845)
	at com.carrotsearch.randomizedtesting.RandomizedRunner$3.evaluate(RandomizedRunner.java:747)
	at com.carrotsearch.randomizedtesting.RandomizedRunner$4.evaluate(RandomizedRunner.java:781)
	at com.carrotsearch.randomizedtesting.RandomizedRunner$5.evaluate(RandomizedRunner.java:792)
	at com.carrotsearch.randomizedtesting.rules.StatementAdapter.evaluate(StatementAdapter.java:36)
	at com.carrotsearch.randomizedtesting.rules.SystemPropertiesRestoreRule$1.evaluate(SystemPropertiesRestoreRule.java:57)
	at org.apache.lucene.util.AbstractBeforeAfterRule$1.evaluate(AbstractBeforeAfterRule.java:46)
	at com.carrotsearch.randomizedtesting.rules.StatementAdapter.evaluate(StatementAdapter.java:36)
	at org.apache.lucene.util.TestRuleStoreClassName$1.evaluate(TestRuleStoreClassName.java:42)
	at com.carrotsearch.randomizedtesting.rules.NoShadowingOrOverridesOnMethodsRule$1.evaluate(NoShadowingOrOverridesOnMethodsRule.java:39)
	at com.carrotsearch.randomizedtesting.rules.NoShadowingOrOverridesOnMethodsRule$1.evaluate(NoShadowingOrOverridesOnMethodsRule.java:39)
	at com.carrotsearch.randomizedtesting.rules.StatementAdapter.evaluate(StatementAdapter.java:36)
	at com.carrotsearch.randomizedtesting.rules.StatementAdapter.evaluate(StatementAdapter.java:36)
	at com.carrotsearch.randomizedtesting.rules.StatementAdapter.evaluate(StatementAdapter.java:36)
	at org.apache.lucene.util.TestRuleAssertionsRequired$1.evaluate(TestRuleAssertionsRequired.java:54)
	at org.apache.lucene.util.TestRuleMarkFailure$1.evaluate(TestRuleMarkFailure.java:48)
	at org.apache.lucene.util.TestRuleIgnoreAfterMaxFailures$1.evaluate(TestRuleIgnoreAfterMaxFailures.java:65)
	at org.apache.lucene.util.TestRuleIgnoreTestSuites$1.evaluate(TestRuleIgnoreTestSuites.java:55)
	at com.carrotsearch.randomizedtesting.rules.StatementAdapter.evaluate(StatementAdapter.java:36)
	at com.carrotsearch.randomizedtesting.ThreadLeakControl$StatementRunner.run(ThreadLeakControl.java:365)
	at java.lang.Thread.run(Thread.java:745)




Build Log:
[...truncated 9782 lines...]
   [junit4] Suite: org.apache.solr.cloud.FullSolrCloudDistribCmdsTest
   [junit4]   2> Creating dataDir: /x1/jenkins/jenkins-slave/workspace/Lucene-Solr-NightlyTests-trunk@2/solr/build/solr-core/test/J2/temp/solr.cloud.FullSolrCloudDistribCmdsTest B6B3D5E88F1A1BA1-001/init-core-data-001
   [junit4]   2> 93067 INFO  (SUITE-FullSolrCloudDistribCmdsTest-seed#[B6B3D5E88F1A1BA1]-worker) [    ] o.a.s.BaseDistributedSearchTestCase Setting hostContext system property: /
   [junit4]   2> 93096 INFO  (TEST-FullSolrCloudDistribCmdsTest.test-seed#[B6B3D5E88F1A1BA1]) [    ] o.a.s.c.ZkTestServer STARTING ZK TEST SERVER
   [junit4]   2> 93108 INFO  (Thread-1745) [    ] o.a.s.c.ZkTestServer client port:0.0.0.0/0.0.0.0:0
   [junit4]   2> 93108 INFO  (Thread-1745) [    ] o.a.s.c.ZkTestServer Starting server
   [junit4]   2> 93208 INFO  (TEST-FullSolrCloudDistribCmdsTest.test-seed#[B6B3D5E88F1A1BA1]) [    ] o.a.s.c.ZkTestServer start zk server on port:34997
   [junit4]   2> 93208 INFO  (TEST-FullSolrCloudDistribCmdsTest.test-seed#[B6B3D5E88F1A1BA1]) [    ] o.a.s.c.c.SolrZkClient Using default ZkCredentialsProvider
   [junit4]   2> 93252 INFO  (TEST-FullSolrCloudDistribCmdsTest.test-seed#[B6B3D5E88F1A1BA1]) [    ] o.a.s.c.c.ConnectionManager Waiting for client to connect to ZooKeeper
   [junit4]   2> 93272 INFO  (zkCallback-49-thread-1) [    ] o.a.s.c.c.ConnectionManager Watcher org.apache.solr.common.cloud.ConnectionManager@6c88ea70 name:ZooKeeperConnection Watcher:127.0.0.1:34997 got event WatchedEvent state:SyncConnected type:None path:null path:null type:None
   [junit4]   2> 93274 INFO  (TEST-FullSolrCloudDistribCmdsTest.test-seed#[B6B3D5E88F1A1BA1]) [    ] o.a.s.c.c.ConnectionManager Client is connected to ZooKeeper
   [junit4]   2> 93274 INFO  (TEST-FullSolrCloudDistribCmdsTest.test-seed#[B6B3D5E88F1A1BA1]) [    ] o.a.s.c.c.SolrZkClient Using default ZkACLProvider
   [junit4]   2> 93275 INFO  (TEST-FullSolrCloudDistribCmdsTest.test-seed#[B6B3D5E88F1A1BA1]) [    ] o.a.s.c.c.SolrZkClient makePath: /solr
   [junit4]   2> 93285 INFO  (TEST-FullSolrCloudDistribCmdsTest.test-seed#[B6B3D5E88F1A1BA1]) [    ] o.a.s.c.c.SolrZkClient Using default ZkCredentialsProvider
   [junit4]   2> 93304 INFO  (TEST-FullSolrCloudDistribCmdsTest.test-seed#[B6B3D5E88F1A1BA1]) [    ] o.a.s.c.c.ConnectionManager Waiting for client to connect to ZooKeeper
   [junit4]   2> 93322 INFO  (zkCallback-50-thread-1) [    ] o.a.s.c.c.ConnectionManager Watcher org.apache.solr.common.cloud.ConnectionManager@1846cb83 name:ZooKeeperConnection Watcher:127.0.0.1:34997/solr got event WatchedEvent state:SyncConnected type:None path:null path:null type:None
   [junit4]   2> 93322 INFO  (TEST-FullSolrCloudDistribCmdsTest.test-seed#[B6B3D5E88F1A1BA1]) [    ] o.a.s.c.c.ConnectionManager Client is connected to ZooKeeper
   [junit4]   2> 93323 INFO  (TEST-FullSolrCloudDistribCmdsTest.test-seed#[B6B3D5E88F1A1BA1]) [    ] o.a.s.c.c.SolrZkClient Using default ZkACLProvider
   [junit4]   2> 93323 INFO  (TEST-FullSolrCloudDistribCmdsTest.test-seed#[B6B3D5E88F1A1BA1]) [    ] o.a.s.c.c.SolrZkClient makePath: /collections/collection1
   [junit4]   2> 93325 INFO  (TEST-FullSolrCloudDistribCmdsTest.test-seed#[B6B3D5E88F1A1BA1]) [    ] o.a.s.c.c.SolrZkClient makePath: /collections/collection1/shards
   [junit4]   2> 93326 INFO  (TEST-FullSolrCloudDistribCmdsTest.test-seed#[B6B3D5E88F1A1BA1]) [    ] o.a.s.c.c.SolrZkClient makePath: /collections/control_collection
   [junit4]   2> 93328 INFO  (TEST-FullSolrCloudDistribCmdsTest.test-seed#[B6B3D5E88F1A1BA1]) [    ] o.a.s.c.c.SolrZkClient makePath: /collections/control_collection/shards
   [junit4]   2> 93329 INFO  (TEST-FullSolrCloudDistribCmdsTest.test-seed#[B6B3D5E88F1A1BA1]) [    ] o.a.s.c.AbstractZkTestCase put /x1/jenkins/jenkins-slave/workspace/Lucene-Solr-NightlyTests-trunk@2/solr/core/src/test-files/solr/collection1/conf/solrconfig-tlog.xml to /configs/conf1/solrconfig.xml
   [junit4]   2> 93329 INFO  (TEST-FullSolrCloudDistribCmdsTest.test-seed#[B6B3D5E88F1A1BA1]) [    ] o.a.s.c.c.SolrZkClient makePath: /configs/conf1/solrconfig.xml
   [junit4]   2> 93331 INFO  (TEST-FullSolrCloudDistribCmdsTest.test-seed#[B6B3D5E88F1A1BA1]) [    ] o.a.s.c.AbstractZkTestCase put /x1/jenkins/jenkins-slave/workspace/Lucene-Solr-NightlyTests-trunk@2/solr/core/src/test-files/solr/collection1/conf/schema15.xml to /configs/conf1/schema.xml
   [junit4]   2> 93332 INFO  (TEST-FullSolrCloudDistribCmdsTest.test-seed#[B6B3D5E88F1A1BA1]) [    ] o.a.s.c.c.SolrZkClient makePath: /configs/conf1/schema.xml
   [junit4]   2> 93333 INFO  (TEST-FullSolrCloudDistribCmdsTest.test-seed#[B6B3D5E88F1A1BA1]) [    ] o.a.s.c.AbstractZkTestCase put /x1/jenkins/jenkins-slave/workspace/Lucene-Solr-NightlyTests-trunk@2/solr/core/src/test-files/solr/collection1/conf/solrconfig.snippet.randomindexconfig.xml to /configs/conf1/solrconfig.snippet.randomindexconfig.xml
   [junit4]   2> 93333 INFO  (TEST-FullSolrCloudDistribCmdsTest.test-seed#[B6B3D5E88F1A1BA1]) [    ] o.a.s.c.c.SolrZkClient makePath: /configs/conf1/solrconfig.snippet.randomindexconfig.xml
   [junit4]   2> 93335 INFO  (TEST-FullSolrCloudDistribCmdsTest.test-seed#[B6B3D5E88F1A1BA1]) [    ] o.a.s.c.AbstractZkTestCase put /x1/jenkins/jenkins-slave/workspace/Lucene-Solr-NightlyTests-trunk@2/solr/core/src/test-files/solr/collection1/conf/stopwords.txt to /configs/conf1/stopwords.txt
   [junit4]   2> 93335 INFO  (TEST-FullSolrCloudDistribCmdsTest.test-seed#[B6B3D5E88F1A1BA1]) [    ] o.a.s.c.c.SolrZkClient makePath: /configs/conf1/stopwords.txt
   [junit4]   2> 93336 INFO  (TEST-FullSolrCloudDistribCmdsTest.test-seed#[B6B3D5E88F1A1BA1]) [    ] o.a.s.c.AbstractZkTestCase put /x1/jenkins/jenkins-slave/workspace/Lucene-Solr-NightlyTests-trunk@2/solr/core/src/test-files/solr/collection1/conf/protwords.txt to /configs/conf1/protwords.txt
   [junit4]   2> 93337 INFO  (TEST-FullSolrCloudDistribCmdsTest.test-seed#[B6B3D5E88F1A1BA1]) [    ] o.a.s.c.c.SolrZkClient makePath: /configs/conf1/protwords.txt
   [junit4]   2> 93338 INFO  (TEST-FullSolrCloudDistribCmdsTest.test-seed#[B6B3D5E88F1A1BA1]) [    ] o.a.s.c.AbstractZkTestCase put /x1/jenkins/jenkins-slave/workspace/Lucene-Solr-NightlyTests-trunk@2/solr/core/src/test-files/solr/collection1/conf/currency.xml to /configs/conf1/currency.xml
   [junit4]   2> 93338 INFO  (TEST-FullSolrCloudDistribCmdsTest.test-seed#[B6B3D5E88F1A1BA1]) [    ] o.a.s.c.c.SolrZkClient makePath: /configs/conf1/currency.xml
   [junit4]   2> 93340 INFO  (TEST-FullSolrCloudDistribCmdsTest.test-seed#[B6B3D5E88F1A1BA1]) [    ] o.a.s.c.AbstractZkTestCase put /x1/jenkins/jenkins-slave/workspace/Lucene-Solr-NightlyTests-trunk@2/solr/core/src/test-files/solr/collection1/conf/enumsConfig.xml to /configs/conf1/enumsConfig.xml
   [junit4]   2> 93340 INFO  (TEST-FullSolrCloudDistribCmdsTest.test-seed#[B6B3D5E88F1A1BA1]) [    ] o.a.s.c.c.SolrZkClient makePath: /configs/conf1/enumsConfig.xml
   [junit4]   2> 93341 INFO  (TEST-FullSolrCloudDistribCmdsTest.test-seed#[B6B3D5E88F1A1BA1]) [    ] o.a.s.c.AbstractZkTestCase put /x1/jenkins/jenkins-slave/workspace/Lucene-Solr-NightlyTests-trunk@2/solr/core/src/test-files/solr/collection1/conf/open-exchange-rates.json to /configs/conf1/open-exchange-rates.json
   [junit4]   2> 93342 INFO  (TEST-FullSolrCloudDistribCmdsTest.test-seed#[B6B3D5E88F1A1BA1]) [    ] o.a.s.c.c.SolrZkClient makePath: /configs/conf1/open-exchange-rates.json
   [junit4]   2> 93343 INFO  (TEST-FullSolrCloudDistribCmdsTest.test-seed#[B6B3D5E88F1A1BA1]) [    ] o.a.s.c.AbstractZkTestCase put /x1/jenkins/jenkins-slave/workspace/Lucene-Solr-NightlyTests-trunk@2/solr/core/src/test-files/solr/collection1/conf/mapping-ISOLatin1Accent.txt to /configs/conf1/mapping-ISOLatin1Accent.txt
   [junit4]   2> 93370 INFO  (TEST-FullSolrCloudDistribCmdsTest.test-seed#[B6B3D5E88F1A1BA1]) [    ] o.a.s.c.c.SolrZkClient makePath: /configs/conf1/mapping-ISOLatin1Accent.txt
   [junit4]   2> 93376 INFO  (TEST-FullSolrCloudDistribCmdsTest.test-seed#[B6B3D5E88F1A1BA1]) [    ] o.a.s.c.AbstractZkTestCase put /x1/jenkins/jenkins-slave/workspace/Lucene-Solr-NightlyTests-trunk@2/solr/core/src/test-files/solr/collection1/conf/old_synonyms.txt to /configs/conf1/old_synonyms.txt
   [junit4]   2> 93377 INFO  (TEST-FullSolrCloudDistribCmdsTest.test-seed#[B6B3D5E88F1A1BA1]) [    ] o.a.s.c.c.SolrZkClient makePath: /configs/conf1/old_synonyms.txt
   [junit4]   2> 93380 INFO  (TEST-FullSolrCloudDistribCmdsTest.test-seed#[B6B3D5E88F1A1BA1]) [    ] o.a.s.c.AbstractZkTestCase put /x1/jenkins/jenkins-slave/workspace/Lucene-Solr-NightlyTests-trunk@2/solr/core/src/test-files/solr/collection1/conf/synonyms.txt to /configs/conf1/synonyms.txt
   [junit4]   2> 93380 INFO  (TEST-FullSolrCloudDistribCmdsTest.test-seed#[B6B3D5E88F1A1BA1]) [    ] o.a.s.c.c.SolrZkClient makePath: /configs/conf1/synonyms.txt
   [junit4]   2> 94294 INFO  (TEST-FullSolrCloudDistribCmdsTest.test-seed#[B6B3D5E88F1A1BA1]) [    ] o.a.s.SolrTestCaseJ4 Writing core.properties file to /x1/jenkins/jenkins-slave/workspace/Lucene-Solr-NightlyTests-trunk@2/solr/build/solr-core/test/J2/temp/solr.cloud.FullSolrCloudDistribCmdsTest B6B3D5E88F1A1BA1-001/control-001/cores/collection1
   [junit4]   2> 94302 INFO  (TEST-FullSolrCloudDistribCmdsTest.test-seed#[B6B3D5E88F1A1BA1]) [    ] o.e.j.s.Server jetty-9.2.10.v20150310
   [junit4]   2> 94304 INFO  (TEST-FullSolrCloudDistribCmdsTest.test-seed#[B6B3D5E88F1A1BA1]) [    ] o.e.j.s.h.ContextHandler Started o.e.j.s.ServletContextHandler@3e268da4{/,null,AVAILABLE}
   [junit4]   2> 94306 INFO  (TEST-FullSolrCloudDistribCmdsTest.test-seed#[B6B3D5E88F1A1BA1]) [    ] o.e.j.s.ServerConnector Started ServerConnector@64de1b85{HTTP/1.1}{127.0.0.1:45372}
   [junit4]   2> 94306 INFO  (TEST-FullSolrCloudDistribCmdsTest.test-seed#[B6B3D5E88F1A1BA1]) [    ] o.e.j.s.Server Started @97916ms
   [junit4]   2> 94306 INFO  (TEST-FullSolrCloudDistribCmdsTest.test-seed#[B6B3D5E88F1A1BA1]) [    ] o.a.s.c.s.e.JettySolrRunner Jetty properties: {solr.data.dir=/x1/jenkins/jenkins-slave/workspace/Lucene-Solr-NightlyTests-trunk@2/solr/build/solr-core/test/J2/temp/solr.cloud.FullSolrCloudDistribCmdsTest B6B3D5E88F1A1BA1-001/tempDir-001/control/data, hostContext=/, hostPort=45372, coreRootDirectory=/x1/jenkins/jenkins-slave/workspace/Lucene-Solr-NightlyTests-trunk@2/solr/build/solr-core/test/J2/../../../../../../../../../../x1/jenkins/jenkins-slave/workspace/Lucene-Solr-NightlyTests-trunk@2/solr/build/solr-core/test/J2/temp/solr.cloud.FullSolrCloudDistribCmdsTest B6B3D5E88F1A1BA1-001/control-001/cores}
   [junit4]   2> 94306 INFO  (TEST-FullSolrCloudDistribCmdsTest.test-seed#[B6B3D5E88F1A1BA1]) [    ] o.a.s.s.SolrDispatchFilter SolrDispatchFilter.init()sun.misc.Launcher$AppClassLoader@c387f44
   [junit4]   2> 94307 INFO  (TEST-FullSolrCloudDistribCmdsTest.test-seed#[B6B3D5E88F1A1BA1]) [    ] o.a.s.c.SolrResourceLoader new SolrResourceLoader for directory: '/x1/jenkins/jenkins-slave/workspace/Lucene-Solr-NightlyTests-trunk@2/solr/build/solr-core/test/J2/../../../../../../../../../../x1/jenkins/jenkins-slave/workspace/Lucene-Solr-NightlyTests-trunk@2/solr/build/solr-core/test/J2/temp/solr.cloud.FullSolrCloudDistribCmdsTest B6B3D5E88F1A1BA1-001/control-001/'
   [junit4]   2> 94347 INFO  (TEST-FullSolrCloudDistribCmdsTest.test-seed#[B6B3D5E88F1A1BA1]) [    ] o.a.s.c.SolrXmlConfig Loading container configuration from /x1/jenkins/jenkins-slave/workspace/Lucene-Solr-NightlyTests-trunk@2/solr/build/solr-core/test/J2/../../../../../../../../../../x1/jenkins/jenkins-slave/workspace/Lucene-Solr-NightlyTests-trunk@2/solr/build/solr-core/test/J2/temp/solr.cloud.FullSolrCloudDistribCmdsTest B6B3D5E88F1A1BA1-001/control-001/solr.xml
   [junit4]   2> 94364 INFO  (TEST-FullSolrCloudDistribCmdsTest.test-seed#[B6B3D5E88F1A1BA1]) [    ] o.a.s.c.CoresLocator Config-defined core root directory: /x1/jenkins/jenkins-slave/workspace/Lucene-Solr-NightlyTests-trunk@2/solr/build/solr-core/test/J2/../../../../../../../../../../x1/jenkins/jenkins-slave/workspace/Lucene-Solr-NightlyTests-trunk@2/solr/build/solr-core/test/J2/temp/solr.cloud.FullSolrCloudDistribCmdsTest B6B3D5E88F1A1BA1-001/control-001/cores
   [junit4]   2> 94364 INFO  (TEST-FullSolrCloudDistribCmdsTest.test-seed#[B6B3D5E88F1A1BA1]) [    ] o.a.s.c.CoreContainer New CoreContainer 890042881
   [junit4]   2> 94364 INFO  (TEST-FullSolrCloudDistribCmdsTest.test-seed#[B6B3D5E88F1A1BA1]) [    ] o.a.s.c.CoreContainer Loading cores into CoreContainer [instanceDir=/x1/jenkins/jenkins-slave/workspace/Lucene-Solr-NightlyTests-trunk@2/solr/build/solr-core/test/J2/../../../../../../../../../../x1/jenkins/jenkins-slave/workspace/Lucene-Solr-NightlyTests-trunk@2/solr/build/solr-core/test/J2/temp/solr.cloud.FullSolrCloudDistribCmdsTest B6B3D5E88F1A1BA1-001/control-001/]
   [junit4]   2> 94364 INFO  (TEST-FullSolrCloudDistribCmdsTest.test-seed#[B6B3D5E88F1A1BA1]) [    ] o.a.s.c.CoreContainer loading shared library: /x1/jenkins/jenkins-slave/workspace/Lucene-Solr-NightlyTests-trunk@2/solr/build/solr-core/test/J2/../../../../../../../../../../x1/jenkins/jenkins-slave/workspace/Lucene-Solr-NightlyTests-trunk@2/solr/build/solr-core/test/J2/temp/solr.cloud.FullSolrCloudDistribCmdsTest B6B3D5E88F1A1BA1-001/control-001/lib
   [junit4]   2> 94365 WARN  (TEST-FullSolrCloudDistribCmdsTest.test-seed#[B6B3D5E88F1A1BA1]) [    ] o.a.s.c.SolrResourceLoader Can't find (or read) directory to add to classloader: lib (resolved as: /x1/jenkins/jenkins-slave/workspace/Lucene-Solr-NightlyTests-trunk@2/solr/build/solr-core/test/J2/../../../../../../../../../../x1/jenkins/jenkins-slave/workspace/Lucene-Solr-NightlyTests-trunk@2/solr/build/solr-core/test/J2/temp/solr.cloud.FullSolrCloudDistribCmdsTest B6B3D5E88F1A1BA1-001/control-001/lib).
   [junit4]   2> 94379 INFO  (TEST-FullSolrCloudDistribCmdsTest.test-seed#[B6B3D5E88F1A1BA1]) [    ] o.a.s.h.c.HttpShardHandlerFactory created with socketTimeout : 90000,urlScheme : ,connTimeout : 15000,maxConnectionsPerHost : 20,maxConnections : 10000,corePoolSize : 0,maximumPoolSize : 2147483647,maxThreadIdleTime : 5,sizeOfQueue : -1,fairnessPolicy : false,useRetries : false,
   [junit4]   2> 94389 INFO  (TEST-FullSolrCloudDistribCmdsTest.test-seed#[B6B3D5E88F1A1BA1]) [    ] o.a.s.u.UpdateShardHandler Creating UpdateShardHandler HTTP client with params: socketTimeout=340000&connTimeout=45000&retry=true
   [junit4]   2> 94390 INFO  (TEST-FullSolrCloudDistribCmdsTest.test-seed#[B6B3D5E88F1A1BA1]) [    ] o.a.s.l.LogWatcher SLF4J impl is org.slf4j.impl.Log4jLoggerFactory
   [junit4]   2> 94391 INFO  (TEST-FullSolrCloudDistribCmdsTest.test-seed#[B6B3D5E88F1A1BA1]) [    ] o.a.s.l.LogWatcher Registering Log Listener [Log4j (org.slf4j.impl.Log4jLoggerFactory)]
   [junit4]   2> 94391 INFO  (TEST-FullSolrCloudDistribCmdsTest.test-seed#[B6B3D5E88F1A1BA1]) [    ] o.a.s.c.ZkContainer Zookeeper client=127.0.0.1:34997/solr
   [junit4]   2> 94391 INFO  (TEST-FullSolrCloudDistribCmdsTest.test-seed#[B6B3D5E88F1A1BA1]) [    ] o.a.s.c.ZkController zkHost includes chroot
   [junit4]   2> 94391 INFO  (TEST-FullSolrCloudDistribCmdsTest.test-seed#[B6B3D5E88F1A1BA1]) [    ] o.a.s.c.c.SolrZkClient Using default ZkCredentialsProvider
   [junit4]   2> 94392 INFO  (TEST-FullSolrCloudDistribCmdsTest.test-seed#[B6B3D5E88F1A1BA1]) [    ] o.a.s.c.c.ConnectionManager Waiting for client to connect to ZooKeeper
   [junit4]   2> 94401 INFO  (zkCallback-52-thread-1) [    ] o.a.s.c.c.ConnectionManager Watcher org.apache.solr.common.cloud.ConnectionManager@1d6a1f2b name:ZooKeeperConnection Watcher:127.0.0.1:34997 got event WatchedEvent state:SyncConnected type:None path:null path:null type:None
   [junit4]   2> 94402 INFO  (TEST-FullSolrCloudDistribCmdsTest.test-seed#[B6B3D5E88F1A1BA1]) [    ] o.a.s.c.c.ConnectionManager Client is connected to ZooKeeper
   [junit4]   2> 94402 INFO  (TEST-FullSolrCloudDistribCmdsTest.test-seed#[B6B3D5E88F1A1BA1]) [    ] o.a.s.c.c.SolrZkClient Using default ZkACLProvider
   [junit4]   2> 94405 INFO  (TEST-FullSolrCloudDistribCmdsTest.test-seed#[B6B3D5E88F1A1BA1]) [n:127.0.0.1:45372_    ] o.a.s.c.c.ConnectionManager Waiting for client to connect to ZooKeeper
   [junit4]   2> 94433 INFO  (zkCallback-53-thread-1-processing-n:127.0.0.1:45372_) [n:127.0.0.1:45372_    ] o.a.s.c.c.ConnectionManager Watcher org.apache.solr.common.cloud.ConnectionManager@79dee642 name:ZooKeeperConnection Watcher:127.0.0.1:34997/solr got event WatchedEvent state:SyncConnected type:None path:null path:null type:None
   [junit4]   2> 94433 INFO  (TEST-FullSolrCloudDistribCmdsTest.test-seed#[B6B3D5E88F1A1BA1]) [n:127.0.0.1:45372_    ] o.a.s.c.c.ConnectionManager Client is connected to ZooKeeper
   [junit4]   2> 94436 INFO  (TEST-FullSolrCloudDistribCmdsTest.test-seed#[B6B3D5E88F1A1BA1]) [n:127.0.0.1:45372_    ] o.a.s.c.c.SolrZkClient makePath: /overseer/queue
   [junit4]   2> 94438 INFO  (TEST-FullSolrCloudDistribCmdsTest.test-seed#[B6B3D5E88F1A1BA1]) [n:127.0.0.1:45372_    ] o.a.s.c.c.SolrZkClient makePath: /overseer/collection-queue-work
   [junit4]   2> 94440 INFO  (TEST-FullSolrCloudDistribCmdsTest.test-seed#[B6B3D5E88F1A1BA1]) [n:127.0.0.1:45372_    ] o.a.s.c.c.SolrZkClient makePath: /overseer/collection-map-running
   [junit4]   2> 94441 INFO  (TEST-FullSolrCloudDistribCmdsTest.test-seed#[B6B3D5E88F1A1BA1]) [n:127.0.0.1:45372_    ] o.a.s.c.c.SolrZkClient makePath: /overseer/collection-map-completed
   [junit4]   2> 94443 INFO  (TEST-FullSolrCloudDistribCmdsTest.test-seed#[B6B3D5E88F1A1BA1]) [n:127.0.0.1:45372_    ] o.a.s.c.c.SolrZkClient makePath: /overseer/collection-map-failure
   [junit4]   2> 94445 INFO  (TEST-FullSolrCloudDistribCmdsTest.test-seed#[B6B3D5E88F1A1BA1]) [n:127.0.0.1:45372_    ] o.a.s.c.c.SolrZkClient makePath: /live_nodes
   [junit4]   2> 94447 INFO  (TEST-FullSolrCloudDistribCmdsTest.test-seed#[B6B3D5E88F1A1BA1]) [n:127.0.0.1:45372_    ] o.a.s.c.c.SolrZkClient makePath: /aliases.json
   [junit4]   2> 94451 INFO  (TEST-FullSolrCloudDistribCmdsTest.test-seed#[B6B3D5E88F1A1BA1]) [n:127.0.0.1:45372_    ] o.a.s.c.c.SolrZkClient makePath: /clusterstate.json
   [junit4]   2> 94452 INFO  (TEST-FullSolrCloudDistribCmdsTest.test-seed#[B6B3D5E88F1A1BA1]) [n:127.0.0.1:45372_    ] o.a.s.c.ZkController Register node as live in ZooKeeper:/live_nodes/127.0.0.1:45372_
   [junit4]   2> 94452 INFO  (TEST-FullSolrCloudDistribCmdsTest.test-seed#[B6B3D5E88F1A1BA1]) [n:127.0.0.1:45372_    ] o.a.s.c.c.SolrZkClient makePath: /live_nodes/127.0.0.1:45372_
   [junit4]   2> 94454 INFO  (TEST-FullSolrCloudDistribCmdsTest.test-seed#[B6B3D5E88F1A1BA1]) [n:127.0.0.1:45372_    ] o.a.s.c.c.SolrZkClient makePath: /overseer_elect
   [junit4]   2> 94455 INFO  (TEST-FullSolrCloudDistribCmdsTest.test-seed#[B6B3D5E88F1A1BA1]) [n:127.0.0.1:45372_    ] o.a.s.c.c.SolrZkClient makePath: /overseer_elect/election
   [junit4]   2> 94456 INFO  (TEST-FullSolrCloudDistribCmdsTest.test-seed#[B6B3D5E88F1A1BA1]) [n:127.0.0.1:45372_    ] o.a.s.c.Overseer Overseer (id=null) closing
   [junit4]   2> 94457 INFO  (TEST-FullSolrCloudDistribCmdsTest.test-seed#[B6B3D5E88F1A1BA1]) [n:127.0.0.1:45372_    ] o.a.s.c.OverseerElectionContext I am going to be the leader 127.0.0.1:45372_
   [junit4]   2> 94457 INFO  (TEST-FullSolrCloudDistribCmdsTest.test-seed#[B6B3D5E88F1A1BA1]) [n:127.0.0.1:45372_    ] o.a.s.c.c.SolrZkClient makePath: /overseer_elect/leader
   [junit4]   2> 94458 INFO  (TEST-FullSolrCloudDistribCmdsTest.test-seed#[B6B3D5E88F1A1BA1]) [n:127.0.0.1:45372_    ] o.a.s.c.Overseer Overseer (id=93929819075379203-127.0.0.1:45372_-n_0000000000) starting
   [junit4]   2> 94459 INFO  (TEST-FullSolrCloudDistribCmdsTest.test-seed#[B6B3D5E88F1A1BA1]) [n:127.0.0.1:45372_    ] o.a.s.c.c.SolrZkClient makePath: /overseer/queue-work
   [junit4]   2> 94464 INFO  (TEST-FullSolrCloudDistribCmdsTest.test-seed#[B6B3D5E88F1A1BA1]) [n:127.0.0.1:45372_    ] o.a.s.c.OverseerAutoReplicaFailoverThread Starting OverseerAutoReplicaFailoverThread autoReplicaFailoverWorkLoopDelay=10000 autoReplicaFailoverWaitAfterExpiration=30000 autoReplicaFailoverBadNodeExpiration=60000
   [junit4]   2> 94465 INFO  (OverseerStateUpdate-93929819075379203-127.0.0.1:45372_-n_0000000000) [n:127.0.0.1:45372_    ] o.a.s.c.Overseer Starting to work on the main queue
   [junit4]   2> 94468 INFO  (OverseerCollectionProcessor-93929819075379203-127.0.0.1:45372_-n_0000000000) [n:127.0.0.1:45372_    ] o.a.s.c.OverseerCollectionProcessor Process current queue of collection creations
   [junit4]   2> 94508 INFO  (TEST-FullSolrCloudDistribCmdsTest.test-seed#[B6B3D5E88F1A1BA1]) [n:127.0.0.1:45372_    ] o.a.s.c.c.ZkStateReader Updating cluster state from ZooKeeper... 
   [junit4]   2> 94512 INFO  (TEST-FullSolrCloudDistribCmdsTest.test-seed#[B6B3D5E88F1A1BA1]) [n:127.0.0.1:45372_    ] o.a.s.c.CoreContainer No authentication plugin used.
   [junit4]   2> 94513 INFO  (TEST-FullSolrCloudDistribCmdsTest.test-seed#[B6B3D5E88F1A1BA1]) [n:127.0.0.1:45372_    ] o.a.s.c.CoreContainer Security conf doesn't exist. Skipping setup for authorization module.
   [junit4]   2> 94514 INFO  (TEST-FullSolrCloudDistribCmdsTest.test-seed#[B6B3D5E88F1A1BA1]) [n:127.0.0.1:45372_    ] o.a.s.c.CoresLocator Looking for core definitions underneath /x1/jenkins/jenkins-slave/workspace/Lucene-Solr-NightlyTests-trunk@2/solr/build/solr-core/test/J2/../../../../../../../../../../x1/jenkins/jenkins-slave/workspace/Lucene-Solr-NightlyTests-trunk@2/solr/build/solr-core/test/J2/temp/solr.cloud.FullSolrCloudDistribCmdsTest B6B3D5E88F1A1BA1-001/control-001/cores
   [junit4]   2> 94515 INFO  (TEST-FullSolrCloudDistribCmdsTest.test-seed#[B6B3D5E88F1A1BA1]) [n:127.0.0.1:45372_    ] o.a.s.c.SolrCore Created CoreDescriptor: {name=collection1, config=solrconfig.xml, transient=false, schema=schema.xml, loadOnStartup=true, instanceDir=/x1/jenkins/jenkins-slave/workspace/Lucene-Solr-NightlyTests-trunk@2/solr/build/solr-core/test/J2/../../../../../../../../../../x1/jenkins/jenkins-slave/workspace/Lucene-Solr-NightlyTests-trunk@2/solr/build/solr-core/test/J2/temp/solr.cloud.FullSolrCloudDistribCmdsTest B6B3D5E88F1A1BA1-001/control-001/cores/collection1, collection=control_collection, absoluteInstDir=/x1/jenkins/jenkins-slave/workspace/Lucene-Solr-NightlyTests-trunk@2/solr/build/solr-core/test/J2/../../../../../../../../../../x1/jenkins/jenkins-slave/workspace/Lucene-Solr-NightlyTests-trunk@2/solr/build/solr-core/test/J2/temp/solr.cloud.FullSolrCloudDistribCmdsTest B6B3D5E88F1A1BA1-001/control-001/cores/collection1/, coreNodeName=, dataDir=data/, shard=}
   [junit4]   2> 94515 INFO  (TEST-FullSolrCloudDistribCmdsTest.test-seed#[B6B3D5E88F1A1BA1]) [n:127.0.0.1:45372_    ] o.a.s.c.CoresLocator Found core collection1 in /x1/jenkins/jenkins-slave/workspace/Lucene-Solr-NightlyTests-trunk@2/solr/build/solr-core/test/J2/../../../../../../../../../../x1/jenkins/jenkins-slave/workspace/Lucene-Solr-NightlyTests-trunk@2/solr/build/solr-core/test/J2/temp/solr.cloud.FullSolrCloudDistribCmdsTest B6B3D5E88F1A1BA1-001/control-001/cores/collection1/
   [junit4]   2> 94515 INFO  (TEST-FullSolrCloudDistribCmdsTest.test-seed#[B6B3D5E88F1A1BA1]) [n:127.0.0.1:45372_    ] o.a.s.c.CoresLocator Found 1 core definitions
   [junit4]   2> 94523 INFO  (coreLoadExecutor-155-thread-1-processing-n:127.0.0.1:45372_) [n:127.0.0.1:45372_ c:control_collection   x:collection1] o.a.s.c.ZkController publishing state=down
   [junit4]   2> 94523 INFO  (coreLoadExecutor-155-thread-1-processing-n:127.0.0.1:45372_) [n:127.0.0.1:45372_ c:control_collection   x:collection1] o.a.s.c.ZkController numShards not found on descriptor - reading it from system property
   [junit4]   2> 94523 INFO  (TEST-FullSolrCloudDistribCmdsTest.test-seed#[B6B3D5E88F1A1BA1]) [n:127.0.0.1:45372_    ] o.a.s.s.SolrDispatchFilter user.dir=/x1/jenkins/jenkins-slave/workspace/Lucene-Solr-NightlyTests-trunk@2/solr/build/solr-core/test/J2
   [junit4]   2> 94523 INFO  (TEST-FullSolrCloudDistribCmdsTest.test-seed#[B6B3D5E88F1A1BA1]) [n:127.0.0.1:45372_    ] o.a.s.s.SolrDispatchFilter SolrDispatchFilter.init() done
   [junit4]   2> 94524 INFO  (coreLoadExecutor-155-thread-1-processing-n:127.0.0.1:45372_) [n:127.0.0.1:45372_ c:control_collection   x:collection1] o.a.s.c.ZkController look for our core node name
   [junit4]   2> 94524 INFO  (zkCallback-53-thread-1-processing-n:127.0.0.1:45372_) [n:127.0.0.1:45372_    ] o.a.s.c.DistributedQueue NodeChildrenChanged fired on path /overseer/queue state SyncConnected
   [junit4]   2> 94526 INFO  (OverseerStateUpdate-93929819075379203-127.0.0.1:45372_-n_0000000000) [n:127.0.0.1:45372_    ] o.a.s.c.Overseer processMessage: queueSize: 1, message = {
   [junit4]   2>   "core":"collection1",
   [junit4]   2>   "roles":null,
   [junit4]   2>   "base_url":"http://127.0.0.1:45372",
   [junit4]   2>   "node_name":"127.0.0.1:45372_",
   [junit4]   2>   "numShards":"1",
   [junit4]   2>   "state":"down",
   [junit4]   2>   "shard":null,
   [junit4]   2>   "collection":"control_collection",
   [junit4]   2>   "operation":"state"} current state version: 0
   [junit4]   2> 94526 INFO  (OverseerStateUpdate-93929819075379203-127.0.0.1:45372_-n_0000000000) [n:127.0.0.1:45372_    ] o.a.s.c.o.ReplicaMutator Update state numShards=1 message={
   [junit4]   2>   "core":"collection1",
   [junit4]   2>   "roles":null,
   [junit4]   2>   "base_url":"http://127.0.0.1:45372",
   [junit4]   2>   "node_name":"127.0.0.1:45372_",
   [junit4]   2>   "numShards":"1",
   [junit4]   2>   "state":"down",
   [junit4]   2>   "shard":null,
   [junit4]   2>   "collection":"control_collection",
   [junit4]   2>   "operation":"state"}
   [junit4]   2> 94527 INFO  (OverseerStateUpdate-93929819075379203-127.0.0.1:45372_-n_0000000000) [n:127.0.0.1:45372_    ] o.a.s.c.o.ClusterStateMutator building a new cName: control_collection
   [junit4]   2> 94527 INFO  (OverseerStateUpdate-93929819075379203-127.0.0.1:45372_-n_0000000000) [n:127.0.0.1:45372_    ] o.a.s.c.o.ReplicaMutator Assigning new node to shard shard=shard1
   [junit4]   2> 94528 INFO  (zkCallback-53-thread-1-processing-n:127.0.0.1:45372_) [n:127.0.0.1:45372_    ] o.a.s.c.c.ZkStateReader A cluster state change: WatchedEvent state:SyncConnected type:NodeDataChanged path:/clusterstate.json, has occurred - updating... (live nodes size: 1)
   [junit4]   2> 94530 INFO  (zkCallback-53-thread-1-processing-n:127.0.0.1:45372_) [n:127.0.0.1:45372_    ] o.a.s.c.c.ZkStateReader Updated cluster state version to 1
   [junit4]   2> 95527 INFO  (coreLoadExecutor-155-thread-1-processing-n:127.0.0.1:45372_) [n:127.0.0.1:45372_ c:control_collection   x:collection1] o.a.s.c.ZkController waiting to find shard id in clusterstate for collection1
   [junit4]   2> 95528 INFO  (coreLoadExecutor-155-thread-1-processing-n:127.0.0.1:45372_) [n:127.0.0.1:45372_ c:control_collection   x:collection1] o.a.s.c.ZkController Check for collection zkNode:control_collection
   [junit4]   2> 95531 INFO  (coreLoadExecutor-155-thread-1-processing-n:127.0.0.1:45372_) [n:127.0.0.1:45372_ c:control_collection   x:collection1] o.a.s.c.ZkController Collection zkNode exists
   [junit4]   2> 95532 INFO  (coreLoadExecutor-155-thread-1-processing-n:127.0.0.1:45372_) [n:127.0.0.1:45372_ c:control_collection   x:collection1] o.a.s.c.c.ZkStateReader Load collection config from:/collections/control_collection
   [junit4]   2> 95532 INFO  (coreLoadExecutor-155-thread-1-processing-n:127.0.0.1:45372_) [n:127.0.0.1:45372_ c:control_collection   x:collection1] o.a.s.c.c.ZkStateReader path=/collections/control_collection configName=conf1 specified config exists in ZooKeeper
   [junit4]   2> 95533 INFO  (coreLoadExecutor-155-thread-1-processing-n:127.0.0.1:45372_) [n:127.0.0.1:45372_ c:control_collection   x:collection1] o.a.s.c.SolrResourceLoader new SolrResourceLoader for directory: '/x1/jenkins/jenkins-slave/workspace/Lucene-Solr-NightlyTests-trunk@2/solr/build/solr-core/test/J2/../../../../../../../../../../x1/jenkins/jenkins-slave/workspace/Lucene-Solr-NightlyTests-trunk@2/solr/build/solr-core/test/J2/temp/solr.cloud.FullSolrCloudDistribCmdsTest B6B3D5E88F1A1BA1-001/control-001/cores/collection1/'
   [junit4]   2> 95616 INFO  (coreLoadExecutor-155-thread-1-processing-n:127.0.0.1:45372_) [n:127.0.0.1:45372_ c:control_collection   x:collection1] o.a.s.c.Config loaded config solrconfig.xml with version 0 
   [junit4]   2> 95626 INFO  (coreLoadExecutor-155-thread-1-processing-n:127.0.0.1:45372_) [n:127.0.0.1:45372_ c:control_collection   x:collection1] o.a.s.c.SolrConfig current version of requestparams : -1
   [junit4]   2> 95630 INFO  (coreLoadExecutor-155-thread-1-processing-n:127.0.0.1:45372_) [n:127.0.0.1:45372_ c:control_collection   x:collection1] o.a.s.c.SolrConfig Using Lucene MatchVersion: 6.0.0
   [junit4]   2> 95658 INFO  (coreLoadExecutor-155-thread-1-processing-n:127.0.0.1:45372_) [n:127.0.0.1:45372_ c:control_collection   x:collection1] o.a.s.c.Config Loaded SolrConfig: solrconfig.xml
   [junit4]   2> 95664 INFO  (coreLoadExecutor-155-thread-1-processing-n:127.0.0.1:45372_) [n:127.0.0.1:45372_ c:control_collection   x:collection1] o.a.s.s.IndexSchema Reading Solr Schema from /configs/conf1/schema.xml
   [junit4]   2> 95681 INFO  (coreLoadExecutor-155-thread-1-processing-n:127.0.0.1:45372_) [n:127.0.0.1:45372_ c:control_collection   x:collection1] o.a.s.s.IndexSchema [collection1] Schema name=test
   [junit4]   2> 96022 INFO  (coreLoadExecutor-155-thread-1-processing-n:127.0.0.1:45372_) [n:127.0.0.1:45372_ c:control_collection   x:collection1] o.a.s.s.IndexSchema default search field in schema is text
   [junit4]   2> 96023 INFO  (coreLoadExecutor-155-thread-1-processing-n:127.0.0.1:45372_) [n:127.0.0.1:45372_ c:control_collection   x:collection1] o.a.s.s.IndexSchema unique key field: id
   [junit4]   2> 96024 INFO  (coreLoadExecutor-155-thread-1-processing-n:127.0.0.1:45372_) [n:127.0.0.1:45372_ c:control_collection   x:collection1] o.a.s.s.FileExchangeRateProvider Reloading exchange rates from file currency.xml
   [junit4]   2> 96028 INFO  (coreLoadExecutor-155-thread-1-processing-n:127.0.0.1:45372_) [n:127.0.0.1:45372_ c:control_collection   x:collection1] o.a.s.s.FileExchangeRateProvider Reloading exchange rates from file currency.xml
   [junit4]   2> 96052 INFO  (coreLoadExecutor-155-thread-1-processing-n:127.0.0.1:45372_) [n:127.0.0.1:45372_ c:control_collection   x:collection1] o.a.s.c.CoreContainer Creating SolrCore 'collection1' using configuration from collection control_collection
   [junit4]   2> 96053 INFO  (coreLoadExecutor-155-thread-1-processing-n:127.0.0.1:45372_) [n:127.0.0.1:45372_ c:control_collection s:shard1 r:core_node1 x:collection1] o.a.s.c.SolrCore org.apache.solr.core.MockDirectoryFactory
   [junit4]   2> 96053 INFO  (coreLoadExecutor-155-thread-1-processing-n:127.0.0.1:45372_) [n:127.0.0.1:45372_ c:control_collection s:shard1 r:core_node1 x:collection1] o.a.s.c.SolrCore [[collection1] ] Opening new SolrCore at [/x1/jenkins/jenkins-slave/workspace/Lucene-Solr-NightlyTests-trunk@2/solr/build/solr-core/test/J2/../../../../../../../../../../x1/jenkins/jenkins-slave/workspace/Lucene-Solr-NightlyTests-trunk@2/solr/build/solr-core/test/J2/temp/solr.cloud.FullSolrCloudDistribCmdsTest B6B3D5E88F1A1BA1-001/control-001/cores/collection1/], dataDir=[null]
   [junit4]   2> 96053 INFO  (coreLoadExecutor-155-thread-1-processing-n:127.0.0.1:45372_) [n:127.0.0.1:45372_ c:control_collection s:shard1 r:core_node1 x:collection1] o.a.s.c.JmxMonitoredMap JMX monitoring is enabled. Adding Solr mbeans to JMX Server: com.sun.jmx.mbeanserver.JmxMBeanServer@4a3cbfa0
   [junit4]   2> 96054 INFO  (coreLoadExecutor-155-thread-1-processing-n:127.0.0.1:45372_) [n:127.0.0.1:45372_ c:control_collection s:shard1 r:core_node1 x:collection1] o.a.s.c.CachingDirectoryFactory return new directory for /x1/jenkins/jenkins-slave/workspace/Lucene-Solr-NightlyTests-trunk@2/solr/build/solr-core/test/J2/../../../../../../../../../../x1/jenkins/jenkins-slave/workspace/Lucene-Solr-NightlyTests-trunk@2/solr/build/solr-core/test/J2/temp/solr.cloud.FullSolrCloudDistribCmdsTest B6B3D5E88F1A1BA1-001/control-001/cores/collection1/data
   [junit4]   2> 96054 INFO  (coreLoadExecutor-155-thread-1-processing-n:127.0.0.1:45372_) [n:127.0.0.1:45372_ c:control_collection s:shard1 r:core_node1 x:collection1] o.a.s.c.SolrCore New index directory detected: old=null new=/x1/jenkins/jenkins-slave/workspace/Lucene-Solr-NightlyTests-trunk@2/solr/build/solr-core/test/J2/../../../../../../../../../../x1/jenkins/jenkins-slave/workspace/Lucene-Solr-NightlyTests-trunk@2/solr/build/solr-core/test/J2/temp/solr.cloud.FullSolrCloudDistribCmdsTest B6B3D5E88F1A1BA1-001/control-001/cores/collection1/data/index/
   [junit4]   2> 96054 WARN  (coreLoadExecutor-155-thread-1-processing-n:127.0.0.1:45372_) [n:127.0.0.1:45372_ c:control_collection s:shard1 r:core_node1 x:collection1] o.a.s.c.SolrCore [collection1] Solr index directory '/x1/jenkins/jenkins-slave/workspace/Lucene-Solr-NightlyTests-trunk@2/solr/build/solr-core/test/J2/../../../../../../../../../../x1/jenkins/jenkins-slave/workspace/Lucene-Solr-NightlyTests-trunk@2/solr/build/solr-core/test/J2/temp/solr.cloud.FullSolrCloudDistribCmdsTest B6B3D5E88F1A1BA1-001/control-001/cores/collection1/data/index' doesn't exist. Creating new index...
   [junit4]   2> 96055 INFO  (coreLoadExecutor-155-thread-1-processing-n:127.0.0.1:45372_) [n:127.0.0.1:45372_ c:control_collection s:shard1 r:core_node1 x:collection1] o.a.s.c.CachingDirectoryFactory return new directory for /x1/jenkins/jenkins-slave/workspace/Lucene-Solr-NightlyTests-trunk@2/solr/build/solr-core/test/J2/../../../../../../../../../../x1/jenkins/jenkins-slave/workspace/Lucene-Solr-NightlyTests-trunk@2/solr/build/solr-core/test/J2/temp/solr.cloud.FullSolrCloudDistribCmdsTest B6B3D5E88F1A1BA1-001/control-001/cores/collection1/data/index
   [junit4]   2> 96055 INFO  (coreLoadExecutor-155-thread-1-processing-n:127.0.0.1:45372_) [n:127.0.0.1:45372_ c:control_collection s:shard1 r:core_node1 x:collection1] o.a.s.u.RandomMergePolicy RandomMergePolicy wrapping class org.apache.lucene.index.MockRandomMergePolicy: org.apache.lucene.index.MockRandomMergePolicy@77b86019
   [junit4]   2> 96056 INFO  (coreLoadExecutor-155-thread-1-processing-n:127.0.0.1:45372_) [n:127.0.0.1:45372_ c:control_collection s:shard1 r:core_node1 x:collection1] o.a.s.c.SolrCore SolrDeletionPolicy.onCommit: commits: num=1
   [junit4]   2> 	commit{dir=RawDirectoryWrapper(RAMDirectory@50287685 lockFactory=org.apache.lucene.store.SingleInstanceLockFactory@a56584c),segFN=segments_1,generation=1}
   [junit4]   2> 96056 INFO  (coreLoadExecutor-155-thread-1-processing-n:127.0.0.1:45372_) [n:127.0.0.1:45372_ c:control_collection s:shard1 r:core_node1 x:collection1] o.a.s.c.SolrCore newest commit generation = 1
   [junit4]   2> 96063 INFO  (coreLoadExecutor-155-thread-1-processing-n:127.0.0.1:45372_) [n:127.0.0.1:45372_ c:control_collection s:shard1 r:core_node1 x:collection1] o.a.s.u.p.UpdateRequestProcessorChain creating updateRequestProcessorChain "nodistrib"
   [junit4]   2> 96117 INFO  (coreLoadExecutor-155-thread-1-processing-n:127.0.0.1:45372_) [n:127.0.0.1:45372_ c:control_collection s:shard1 r:core_node1 x:collection1] o.a.s.u.p.UpdateRequestProcessorChain creating updateRequestProcessorChain "dedupe"
   [junit4]   2> 96118 INFO  (coreLoadExecutor-155-thread-1-processing-n:127.0.0.1:45372_) [n:127.0.0.1:45372_ c:control_collection s:shard1 r:core_node1 x:collection1] o.a.s.u.p.UpdateRequestProcessorChain inserting DistributedUpdateProcessorFactory into updateRequestProcessorChain "dedupe"
   [junit4]   2> 96118 INFO  (coreLoadExecutor-155-thread-1-processing-n:127.0.0.1:45372_) [n:127.0.0.1:45372_ c:control_collection s:shard1 r:core_node1 x:collection1] o.a.s.u.p.UpdateRequestProcessorChain creating updateRequestProcessorChain "stored_sig"
   [junit4]   2> 96118 INFO  (coreLoadExecutor-155-thread-1-processing-n:127.0.0.1:45372_) [n:127.0.0.1:45372_ c:control_collection s:shard1 r:core_node1 x:collection1] o.a.s.u.p.UpdateRequestProcessorChain inserting DistributedUpdateProcessorFactory into updateRequestProcessorChain "stored_sig"
   [junit4]   2> 96118 INFO  (coreLoadExecutor-155-thread-1-processing-n:127.0.0.1:45372_) [n:127.0.0.1:45372_ c:control_collection s:shard1 r:core_node1 x:collection1] o.a.s.u.p.UpdateRequestProcessorChain creating updateRequestProcessorChain "distrib-dup-test-chain-explicit"
   [junit4]   2> 96118 INFO  (coreLoadExecutor-155-thread-1-processing-n:127.0.0.1:45372_) [n:127.0.0.1:45372_ c:control_collection s:shard1 r:core_node1 x:collection1] o.a.s.u.p.UpdateRequestProcessorChain creating updateRequestProcessorChain "distrib-dup-test-chain-implicit"
   [junit4]   2> 96119 INFO  (coreLoadExecutor-155-thread-1-processing-n:127.0.0.1:45372_) [n:127.0.0.1:45372_ c:control_collection s:shard1 r:core_node1 x:collection1] o.a.s.u.p.UpdateRequestProcessorChain inserting DistributedUpdateProcessorFactory into updateRequestProcessorChain "distrib-dup-test-chain-implicit"
   [junit4]   2> 96119 INFO  (coreLoadExecutor-155-thread-1-processing-n:127.0.0.1:45372_) [n:127.0.0.1:45372_ c:control_collection s:shard1 r:core_node1 x:collection1] o.a.s.c.SolrCore no updateRequestProcessorChain defined as default, creating implicit default
   [junit4]   2> 96121 INFO  (coreLoadExecutor-155-thread-1-processing-n:127.0.0.1:45372_) [n:127.0.0.1:45372_ c:control_collection s:shard1 r:core_node1 x:collection1] o.a.s.h.l.XMLLoader xsltCacheLifetimeSeconds=60
   [junit4]   2> 96122 INFO  (coreLoadExecutor-155-thread-1-processing-n:127.0.0.1:45372_) [n:127.0.0.1:45372_ c:control_collection s:shard1 r:core_node1 x:collection1] o.a.s.h.l.XMLLoader xsltCacheLifetimeSeconds=60
   [junit4]   2> 96123 INFO  (coreLoadExecutor-155-thread-1-processing-n:127.0.0.1:45372_) [n:127.0.0.1:45372_ c:control_collection s:shard1 r:core_node1 x:collection1] o.a.s.h.l.XMLLoader xsltCacheLifetimeSeconds=60
   [junit4]   2> 96150 INFO  (coreLoadExecutor-155-thread-1-processing-n:127.0.0.1:45372_) [n:127.0.0.1:45372_ c:control_collection s:shard1 r:core_node1 x:collection1] o.a.s.h.l.XMLLoader xsltCacheLifetimeSeconds=60
   [junit4]   2> 96188 INFO  (coreLoadExecutor-155-thread-1-processing-n:127.0.0.1:45372_) [n:127.0.0.1:45372_ c:control_collection s:shard1 r:core_node1 x:collection1] o.a.s.c.RequestHandlers Registered paths: /admin/mbeans,standard,/update/csv,/update/json/docs,/admin/luke,/admin/segments,/get,/admin/system,/replication,/admin/properties,/config,/schema,/admin/plugins,/admin/logging,/update/json,/admin/threads,/admin/ping,/update,/admin/file
   [junit4]   2> 96189 INFO  (coreLoadExecutor-155-thread-1-processing-n:127.0.0.1:45372_) [n:127.0.0.1:45372_ c:control_collection s:shard1 r:core_node1 x:collection1] o.a.s.c.SolrCore Using default statsCache cache: org.apache.solr.search.stats.LocalStatsCache
   [junit4]   2> 96204 INFO  (coreLoadExecutor-155-thread-1-processing-n:127.0.0.1:45372_) [n:127.0.0.1:45372_ c:control_collection s:shard1 r:core_node1 x:collection1] o.a.s.u.UpdateHandler Using UpdateLog implementation: org.apache.solr.update.UpdateLog
   [junit4]   2> 96204 INFO  (coreLoadExecutor-155-thread-1-processing-n:127.0.0.1:45372_) [n:127.0.0.1:45372_ c:control_collection s:shard1 r:core_node1 x:collection1] o.a.s.u.UpdateLog Initializing UpdateLog: dataDir= defaultSyncLevel=FLUSH numRecordsToKeep=100 maxNumLogsToKeep=10 numVersionBuckets=65536
   [junit4]   2> 96229 INFO  (coreLoadExecutor-155-thread-1-processing-n:127.0.0.1:45372_) [n:127.0.0.1:45372_ c:control_collection s:shard1 r:core_node1 x:collection1] o.a.s.c.SolrCore Hard AutoCommit: disabled
   [junit4]   2> 96230 INFO  (coreLoadExecutor-155-thread-1-processing-n:127.0.0.1:45372_) [n:127.0.0.1:45372_ c:control_collection s:shard1 r:core_node1 x:collection1] o.a.s.c.SolrCore Soft AutoCommit: disabled
   [junit4]   2> 96243 INFO  (coreLoadExecutor-155-thread-1-processing-n:127.0.0.1:45372_) [n:127.0.0.1:45372_ c:control_collection s:shard1 r:core_node1 x:collection1] o.a.s.u.RandomMergePolicy RandomMergePolicy wrapping class org.apache.lucene.index.LogDocMergePolicy: [LogDocMergePolicy: minMergeSize=1000, mergeFactor=15, maxMergeSize=9223372036854775807, maxMergeSizeForForcedMerge=9223372036854775807, calibrateSizeByDeletes=false, maxMergeDocs=2147483647, maxCFSSegmentSizeMB=1.2197265625, noCFSRatio=0.8871236792641699]
   [junit4]   2> 96244 INFO  (coreLoadExecutor-155-thread-1-processing-n:127.0.0.1:45372_) [n:127.0.0.1:45372_ c:control_collection s:shard1 r:core_node1 x:collection1] o.a.s.c.SolrCore SolrDeletionPolicy.onInit: commits: num=1
   [junit4]   2> 	commit{dir=RawDirectoryWrapper(RAMDirectory@50287685 lockFactory=org.apache.lucene.store.SingleInstanceLockFactory@a56584c),segFN=segments_1,generation=1}
   [junit4]   2> 96244 INFO  (coreLoadExecutor-155-thread-1-processing-n:127.0.0.1:45372_) [n:127.0.0.1:45372_ c:control_collection s:shard1 r:core_node1 x:collection1] o.a.s.c.SolrCore newest commit generation = 1
   [junit4]   2> 96244 INFO  (coreLoadExecutor-155-thread-1-processing-n:127.0.0.1:45372_) [n:127.0.0.1:45372_ c:control_collection s:shard1 r:core_node1 x:collection1] o.a.s.s.SolrIndexSearcher Opening Searcher@d06c727[collection1] main
   [junit4]   2> 96245 INFO  (coreLoadExecutor-155-thread-1-processing-n:127.0.0.1:45372_) [n:127.0.0.1:45372_ c:control_collection s:shard1 r:core_node1 x:collection1] o.a.s.c.c.ZkStateReader Load collection config from:/collections/control_collection
   [junit4]   2> 96246 INFO  (coreLoadExecutor-155-thread-1-processing-n:127.0.0.1:45372_) [n:127.0.0.1:45372_ c:control_collection s:shard1 r:core_node1 x:collection1] o.a.s.c.c.ZkStateReader path=/collections/control_collection configName=conf1 specified config exists in ZooKeeper
   [junit4]   2> 96246 INFO  (coreLoadExecutor-155-thread-1-processing-n:127.0.0.1:45372_) [n:127.0.0.1:45372_ c:control_collection s:shard1 r:core_node1 x:collection1] o.a.s.r.ManagedResourceStorage Setting up ZooKeeper-based storage for the RestManager with znodeBase: /configs/conf1
   [junit4]   2> 96246 INFO  (coreLoadExecutor-155-thread-1-processing-n:127.0.0.1:45372_) [n:127.0.0.1:45372_ c:control_collection s:shard1 r:core_node1 x:collection1] o.a.s.r.ManagedResourceStorage Configured ZooKeeperStorageIO with znodeBase: /configs/conf1
   [junit4]   2> 96246 INFO  (coreLoadExecutor-155-thread-1-processing-n:127.0.0.1:45372_) [n:127.0.0.1:45372_ c:control_collection s:shard1 r:core_node1 x:collection1] o.a.s.r.RestManager Initializing RestManager with initArgs: {}
   [junit4]   2> 96246 INFO  (coreLoadExecutor-155-thread-1-processing-n:127.0.0.1:45372_) [n:127.0.0.1:45372_ c:control_collection s:shard1 r:core_node1 x:collection1] o.a.s.r.ManagedResourceStorage Reading _rest_managed.json using ZooKeeperStorageIO:path=/configs/conf1
   [junit4]   2> 96251 INFO  (coreLoadExecutor-155-thread-1-processing-n:127.0.0.1:45372_) [n:127.0.0.1:45372_ c:control_collection s:shard1 r:core_node1 x:collection1] o.a.s.r.ManagedResourceStorage No data found for znode /configs/conf1/_rest_managed.json
   [junit4]   2> 96251 INFO  (coreLoadExecutor-155-thread-1-processing-n:127.0.0.1:45372_) [n:127.0.0.1:45372_ c:control_collection s:shard1 r:core_node1 x:collection1] o.a.s.r.ManagedResourceStorage Loaded null at path _rest_managed.json using ZooKeeperStorageIO:path=/configs/conf1
   [junit4]   2> 96251 INFO  (coreLoadExecutor-155-thread-1-processing-n:127.0.0.1:45372_) [n:127.0.0.1:45372_ c:control_collection s:shard1 r:core_node1 x:collection1] o.a.s.r.RestManager Initializing 0 registered ManagedResources
   [junit4]   2> 96251 INFO  (coreLoadExecutor-155-thread-1-processing-n:127.0.0.1:45372_) [n:127.0.0.1:45372_ c:control_collection s:shard1 r:core_node1 x:collection1] o.a.s.h.ReplicationHandler Commits will be reserved for  10000
   [junit4]   2> 96252 INFO  (coreLoadExecutor-155-thread-1-processing-n:127.0.0.1:45372_) [n:127.0.0.1:45372_ c:control_collection s:shard1 r:core_node1 x:collection1] o.a.s.u.UpdateLog On first searcher opened, looking up max value of version field
   [junit4]   2> 96252 INFO  (coreLoadExecutor-155-thread-1-processing-n:127.0.0.1:45372_) [n:127.0.0.1:45372_ c:control_collection s:shard1 r:core_node1 x:collection1] o.a.s.u.VersionInfo Refreshing highest value of _version_ for 65536 version buckets from index
   [junit4]   2> 96252 INFO  (coreLoadExecutor-155-thread-1-processing-n:127.0.0.1:45372_) [n:127.0.0.1:45372_ c:control_collection s:shard1 r:core_node1 x:collection1] o.a.s.u.VersionInfo No terms found for _version_, cannot seed version bucket highest value from index
   [junit4]   2> 96252 INFO  (coreLoadExecutor-155-thread-1-processing-n:127.0.0.1:45372_) [n:127.0.0.1:45372_ c:control_collection s:shard1 r:core_node1 x:collection1] o.a.s.u.UpdateLog Could not find max version in index or recent updates, using new clock 1502877108486012928
   [junit4]   2> 96255 INFO  (searcherExecutor-156-thread-1-processing-n:127.0.0.1:45372_ x:collection1 s:shard1 c:control_collection r:core_node1) [n:127.0.0.1:45372_ c:control_collection s:shard1 r:core_node1 x:collection1] o.a.s.c.SolrCore [collection1] Registered new searcher Searcher@d06c727[collection1] main{ExitableDirectoryReader(UninvertingDirectoryReader())}
   [junit4]   2> 96257 INFO  (coreLoadExecutor-155-thread-1-processing-n:127.0.0.1:45372_) [n:127.0.0.1:45372_ c:control_collection s:shard1 r:core_node1 x:collection1] o.a.s.u.UpdateLog Took 5 ms to seed version buckets with highest version 1502877108486012928
   [junit4]   2> 96258 INFO  (coreLoadExecutor-155-thread-1-processing-n:127.0.0.1:45372_) [n:127.0.0.1:45372_ c:control_collection s:shard1 r:core_node1 x:collection1] o.a.s.c.ZkController watch zkdir /configs/conf1
   [junit4]   2> 96267 INFO  (coreLoadExecutor-155-thread-1-processing-n:127.0.0.1:45372_) [n:127.0.0.1:45372_ c:control_collection s:shard1 r:core_node1 x:collection1] o.a.s.c.CoreContainer registering core: collection1
   [junit4]   2> 96274 INFO  (coreZkRegister-149-thread-1-processing-n:127.0.0.1:45372_ x:collection1 s:shard1 c:control_collection r:core_node1) [n:127.0.0.1:45372_ c:control_collection s:shard1 r:core_node1 x:collection1] o.a.s.c.ZkController Register replica - core:collection1 address:http://127.0.0.1:45372 collection:control_collection shard:shard1
   [junit4]   2> 96275 INFO  (coreZkRegister-149-thread-1-processing-n:127.0.0.1:45372_ x:collection1 s:shard1 c:control_collection r:core_node1) [n:127.0.0.1:45372_ c:control_collection s:shard1 r:core_node1 x:collection1] o.a.s.c.c.SolrZkClient makePath: /collections/control_collection/leader_elect/shard1/election
   [junit4]   2> 96279 INFO  (coreZkRegister-149-thread-1-processing-n:127.0.0.1:45372_ x:collection1 s:shard1 c:control_collection r:core_node1) [n:127.0.0.1:45372_ c:control_collection s:shard1 r:core_node1 x:collection1] o.a.s.c.ShardLeaderElectionContext Running the leader process for shard shard1
   [junit4]   2> 96282 INFO  (zkCallback-53-thread-1-processing-n:127.0.0.1:45372_) [n:127.0.0.1:45372_    ] o.a.s.c.DistributedQueue NodeChildrenChanged fired on path /overseer/queue state SyncConnected
   [junit4]   2> 96283 INFO  (coreZkRegister-149-thread-1-processing-n:127.0.0.1:45372_ x:collection1 s:shard1 c:control_collection r:core_node1) [n:127.0.0.1:45372_ c:control_collection s:shard1 r:core_node1 x:collection1] o.a.s.c.ShardLeaderElectionContext Enough replicas found to continue.
   [junit4]   2> 96285 INFO  (OverseerStateUpdate-93929819075379203-127.0.0.1:45372_-n_0000000000) [n:127.0.0.1:45372_    ] o.a.s.c.Overseer processMessage: queueSize: 1, message = {
   [junit4]   2>   "operation":"leader",
   [junit4]   2>   "shard":"shard1",
   [junit4]   2>   "collection":"control_collection"} current state version: 1
   [junit4]   2> 96288 INFO  (zkCallback-53-thread-1-processing-n:127.0.0.1:45372_) [n:127.0.0.1:45372_    ] o.a.s.c.c.ZkStateReader A cluster state change: WatchedEvent state:SyncConnected type:NodeDataChanged path:/clusterstate.json, has occurred - updating... (live nodes size: 1)
   [junit4]   2> 96293 INFO  (zkCallback-53-thread-1-processing-n:127.0.0.1:45372_) [n:127.0.0.1:45372_    ] o.a.s.c.c.ZkStateReader Updated cluster state version to 2
   [junit4]   2> 96286 INFO  (coreZkRegister-149-thread-1-processing-n:127.0.0.1:45372_ x:collection1 s:shard1 c:control_collection r:core_node1) [n:127.0.0.1:45372_ c:control_collection s:shard1 r:core_node1 x:collection1] o.a.s.c.ShardLeaderElectionContext I may be the new leader - try and sync
   [junit4]   2> 96296 INFO  (coreZkRegister-149-thread-1-processing-n:127.0.0.1:45372_ x:collection1 s:shard1 c:control_collection r:core_node1) [n:127.0.0.1:45372_ c:control_collection s:shard1 r:core_node1 x:collection1] o.a.s.c.SyncStrategy Sync replicas to http://127.0.0.1:45372/collection1/
   [junit4]   2> 96296 INFO  (coreZkRegister-149-thread-1-processing-n:127.0.0.1:45372_ x:collection1 s:shard1 c:control_collection r:core_node1) [n:127.0.0.1:45372_ c:control_collection s:shard1 r:core_node1 x:collection1] o.a.s.c.SyncStrategy Sync Success - now sync replicas to me
   [junit4]   2> 96296 INFO  (coreZkRegister-149-thread-1-processing-n:127.0.0.1:45372_ x:collection1 s:shard1 c:control_collection r:core_node1) [n:127.0.0.1:45372_ c:control_collection s:shard1 r:core_node1 x:collection1] o.a.s.c.SyncStrategy http://127.0.0.1:45372/collection1/ has no replicas
   [junit4]   2> 96308 INFO  (coreZkRegister-149-thread-1-processing-n:127.0.0.1:45372_ x:collection1 s:shard1 c:control_collection r:core_node1) [n:127.0.0.1:45372_ c:control_collection s:shard1 r:core_node1 x:collection1] o.a.s.c.ShardLeaderElectionContext I am the new leader: http://127.0.0.1:45372/collection1/ shard1
   [junit4]   2> 96308 INFO  (coreZkRegister-149-thread-1-processing-n:127.0.0.1:45372_ x:collection1 s:shard1 c:control_collection r:core_node1) [n:127.0.0.1:45372_ c:control_collection s:shard1 r:core_node1 x:collection1] o.a.s.c.c.SolrZkClient makePath: /collections/control_collection/leaders/shard1
   [junit4]   2> 96312 INFO  (zkCallback-53-thread-1-processing-n:127.0.0.1:45372_) [n:127.0.0.1:45372_    ] o.a.s.c.DistributedQueue NodeChildrenChanged fired on path /overseer/queue state SyncConnected
   [junit4]   2> 96316 INFO  (OverseerStateUpdate-93929819075379203-127.0.0.1:45372_-n_0000000000) [n:127.0.0.1:45372_    ] o.a.s.c.Overseer processMessage: queueSize: 1, message = {
   [junit4]   2>   "operation":"leader",
   [junit4]   2>   "shard":"shard1",
   [junit4]   2>   "collection":"control_collection",
   [junit4]   2>   "base_url":"http://127.0.0.1:45372",
   [junit4]   2>   "core":"collection1",
   [junit4]   2>   "state":"active"} current state version: 2
   [junit4]   2> 96421 INFO  (zkCallback-53-thread-1-processing-n:127.0.0.1:45372_) [n:127.0.0.1:45372_    ] o.a.s.c.c.ZkStateReader A cluster state change: WatchedEvent state:SyncConnected type:NodeDataChanged path:/clusterstate.json, has occurred - updating... (live nodes size: 1)
   [junit4]   2> 96423 INFO  (zkCallback-53-thread-1-processing-n:127.0.0.1:45372_) [n:127.0.0.1:45372_    ] o.a.s.c.c.ZkStateReader Updated cluster state version to 3
   [junit4]   2> 96470 INFO  (coreZkRegister-149-thread-1-processing-n:127.0.0.1:45372_ x:collection1 s:shard1 c:control_collection r:core_node1) [n:127.0.0.1:45372_ c:control_collection s:shard1 r:core_node1 x:collection1] o.a.s.c.ZkController We are http://127.0.0.1:45372/collection1/ and leader is http://127.0.0.1:45372/collection1/
   [junit4]   2> 96471 INFO  (coreZkRegister-149-thread-1-processing-n:127.0.0.1:45372_ x:collection1 s:shard1 c:control_collection r:core_node1) [n:127.0.0.1:45372_ c:control_collection s:shard1 r:core_node1 x:collection1] o.a.s.c.ZkController No LogReplay needed for core=collection1 baseURL=http://127.0.0.1:45372
   [junit4]   2> 96471 INFO  (coreZkRegister-149-thread-1-processing-n:127.0.0.1:45372_ x:collection1 s:shard1 c:control_collection r:core_node1) [n:127.0.0.1:45372_ c:control_collection s:shard1 r:core_node1 x:collection1] o.a.s.c.ZkController I am the leader, no recovery necessary
   [junit4]   2> 96471 INFO  (coreZkRegister-149-thread-1-processing-n:127.0.0.1:45372_ x:collection1 s:shard1 c:control_collection r:core_node1) [n:127.0.0.1:45372_ c:control_collection s:shard1 r:core_node1 x:collection1] o.a.s.c.ZkController publishing state=active
   [junit4]   2> 96471 INFO  (coreZkRegister-149-thread-1-processing-n:127.0.0.1:45372_ x:collection1 s:shard1 c:control_collection r:core_node1) [n:127.0.0.1:45372_ c:control_collection s:shard1 r:core_node1 x:collection1] o.a.s.c.ZkController numShards not found on descriptor - reading it from system property
   [junit4]   2> 96472 INFO  (zkCallback-53-thread-1-processing-n:127.0.0.1:45372_) [n:127.0.0.1:45372_    ] o.a.s.c.DistributedQueue NodeChildrenChanged fired on path /overseer/queue state SyncConnected
   [junit4]   2> 96476 INFO  (OverseerStateUpdate-93929819075379203-127.0.0.1:45372_-n_0000000000) [n:127.0.0.1:45372_    ] o.a.s.c.Overseer processMessage: queueSize: 1, message = {
   [junit4]   2>   "core":"collection1",
   [junit4]   2>   "core_node_name":"core_node1",
   [junit4]   2>   "roles":null,
   [junit4]   2>   "base_url":"http://127.0.0.1:45372",
   [junit4]   2>   "node_name":"127.0.0.1:45372_",
   [junit4]   2>   "numShards":"1",
   [junit4]   2>   "state":"active",
   [junit4]   2>   "shard":"shard1",
   [junit4]   2>   "collection":"control_collection",
   [junit4]   2>   "operation":"state"} current state version: 3
   [junit4]   2> 96479 INFO  (OverseerStateUpdate-93929819075379203-127.0.0.1:45372_-n_0000000000) [n:127.0.0.1:45372_    ] o.a.s.c.o.ReplicaMutator Update state numShards=1 message={
   [junit4]   2>   "core":"collection1",
   [junit4]   2>   "core_node_name":"core_node1",
   [junit4]   2>   "roles":null,
   [junit4]   2>   "base_url":"http://127.0.0.1:45372",
   [junit4]   2>   "node_name":"127.0.0.1:45372_",
   [junit4]   2>   "numShards":"1",
   [junit4]   2>   "state":"active",
   [junit4]   2>   "shard":"shard1",
   [junit4]   2>   "collection":"control_collection",
   [junit4]   2>   "operation":"state"}
   [junit4]   2> 96529 INFO  (TEST-FullSolrCloudDistribCmdsTest.test-seed#[B6B3D5E88F1A1BA1]) [    ] o.a.s.c.c.SolrZkClient Using default ZkCredentialsProvider
   [junit4]   2> 96542 INFO  (TEST-FullSolrCloudDistribCmdsTest.test-seed#[B6B3D5E88F1A1BA1]) [    ] o.a.s.c.c.ConnectionManager Waiting for client to connect to ZooKeeper
   [junit4]   2> 96545 INFO  (zkCallback-55-thread-1) [    ] o.a.s.c.c.ConnectionManager Watcher org.apache.solr.common.cloud.ConnectionManager@290e4479 name:ZooKeeperConnection Watcher:127.0.0.1:34997/solr got event WatchedEvent state:SyncConnected type:None path:null path:null type:None
   [junit4]   2> 96545 INFO  (TEST-FullSolrCloudDistribCmdsTest.test-seed#[B6B3D5E88F1A1BA1]) [    ] o.a.s.c.c.ConnectionManager Client is connected to ZooKeeper
   [junit4]   2> 96545 INFO  (TEST-FullSolrCloudDistribCmdsTest.test-seed#[B6B3D5E88F1A1BA1]) [    ] o.a.s.c.c.SolrZkClient Using default ZkACLProvider
   [junit4]   2> 96545 INFO  (TEST-FullSolrCloudDistribCmdsTest.test-seed#[B6B3D5E88F1A1BA1]) [    ] o.a.s.c.c.ZkStateReader Updating cluster state from ZooKeeper... 
   [junit4]   2> 96560 INFO  (TEST-FullSolrCloudDistribCmdsTest.test-seed#[B6B3D5E88F1A1BA1]) [    ] o.a.s.c.ChaosMonkey monkey: init - expire sessions:false cause connection loss:false
   [junit4]   2> 96591 INFO  (zkCallback-53-thread-1-processing-n:127.0.0.1:45372_) [n:127.0.0.1:45372_    ] o.a.s.c.c.ZkStateReader A cluster state change: WatchedEvent state:SyncConnected type:NodeDataChanged path:/clusterstate.json, has occurred - updating... (live nodes size: 1)
   [junit4]   2> 96602 INFO  (zkCallback-53-thread-1-processing-n:127.0.0.1:45372_) [n:127.0.0.1:45372_    ] o.a.s.c.c.ZkStateReader Updated cluster state version to 4
   [junit4]   2> 96615 INFO  (zkCallback-55-thread-1) [    ] o.a.s.c.c.ZkStateReader A cluster state change: WatchedEvent state:SyncConnected type:NodeDataChanged path:/clusterstate.json, has occurred - updating... (live nodes size: 1)
   [junit4]   2> 96619 INFO  (zkCallback-55-thread-1) [    ] o.a.s.c.c.ZkStateReader Updated cluster state version to 4
   [junit4]   2> 97401 INFO  (TEST-FullSolrCloudDistribCmdsTest.test-seed#[B6B3D5E88F1A1BA1]) [    ] o.a.s.SolrTestCaseJ4 Writing core.properties file to /x1/jenkins/jenkins-slave/workspace/Lucene-Solr-NightlyTests-trunk@2/solr/build/solr-core/test/J2/temp/solr.cloud.FullSolrCloudDistribCmdsTest B6B3D5E88F1A1BA1-001/shard-1-001/cores/collection1
   [junit4]   2> 97402 INFO  (TEST-FullSolrCloudDistribCmdsTest.test-seed#[B6B3D5E88F1A1BA1]) [    ] o.a.s.c.AbstractFullDistribZkTestBase create jetty 1 in directory /x1/jenkins/jenkins-slave/workspace/Lucene-Solr-NightlyTests-trunk@2/solr/build/solr-core/test/J2/temp/solr.cloud.FullSolrCloudDistribCmdsTest B6B3D5E88F1A1BA1-001/shard-1-001
   [junit4]   2> 97403 INFO  (TEST-FullSolrCloudDistribCmdsTest.test-seed#[B6B3D5E88F1A1BA1]) [    ] o.e.j.s.Server jetty-9.2.10.v20150310
   [junit4]   2> 97405 INFO  (TEST-FullSolrCloudDistribCmdsTest.test-seed#[B6B3D5E88F1A1BA1]) [    ] o.e.j.s.h.ContextHandler Started o.e.j.s.ServletContextHandler@11825912{/,null,AVAILABLE}
   [junit4]   2> 97411 INFO  (TEST-FullSolrCloudDistribCmdsTest.test-seed#[B6B3D5E88F1A1BA1]) [    ] o.e.j.s.ServerConnector Started ServerConnector@23ad9bfe{HTTP/1.1}{127.0.0.1:37492}
   [junit4]   2> 97412 INFO  (TEST-FullSolrCloudDistribCmdsTest.test-seed#[B6B3D5E88F1A1BA1]) [    ] o.e.j.s.Server Started @101022ms
   [junit4]   2> 97412 INFO  (TEST-FullSolrCloudDistribCmdsTest.test-seed#[B6B3D5E88F1A1BA1]) [    ] o.a.s.c.s.e.JettySolrRunner Jetty properties: {solr.data.dir=/x1/jenkins/jenkins-slave/workspace/Lucene-Solr-NightlyTests-trunk@2/solr/build/solr-core/test/J2/temp/solr.cloud.FullSolrCloudDistribCmdsTest B6B3D5E88F1A1BA1-001/tempDir-001/jetty1, solrconfig=solrconfig.xml, hostContext=/, hostPort=37492, coreRootDirectory=/x1/jenkins/jenkins-slave/workspace/Lucene-Solr-NightlyTests-trunk@2/solr/build/solr-core/test/J2/../../../../../../../../../../x1/jenkins/jenkins-slave/workspace/Lucene-Solr-NightlyTests-trunk@2/solr/build/solr-core/test/J2/temp/solr.cloud.FullSolrCloudDistribCmdsTest B6B3D5E88F1A1BA1-001/shard-1-001/cores}
   [junit4]   2> 97412 INFO  (TEST-FullSolrCloudDistribCmdsTest.test-seed#[B6B3D5E88F1A1BA1]) [    ] o.a.s.s.SolrDispatchFilter SolrDispatchFilter.init()sun.misc.Launcher$AppClassLoader@c387f44
   [junit4]   2> 97412 INFO  (TEST-FullSolrCloudDistribCmdsTest.test-seed#[B6B3D5E88F1A1BA1]) [    ] o.a.s.c.SolrResourceLoader new SolrResourceLoader for directory: '/x1/jenkins/jenkins-slave/workspace/Lucene-Solr-NightlyTests-trunk@2/solr/build/solr-core/test/J2/../../../../../../../../../../x1/jenkins/jenkins-slave/workspace/Lucene-Solr-NightlyTests-trunk@2/solr/build/solr-core/test/J2/temp/solr.cloud.FullSolrCloudDistribCmdsTest B6B3D5E88F1A1BA1-001/shard-1-001/'
   [junit4]   2> 97430 INFO  (TEST-FullSolrCloudDistribCmdsTest.test-seed#[B6B3D5E88F1A1BA1]) [    ] o.a.s.c.SolrXmlConfig Loading container configuration from /x1/jenkins/jenkins-slave/workspace/Lucene-Solr-NightlyTests-trunk@2/solr/build/solr-core/test/J2/../../../../../../../../../../x1/jenkins/jenkins-slave/workspace/Lucene-Solr-NightlyTests-trunk@2/solr/build/solr-core/test/J2/temp/solr.cloud.FullSolrCloudDistribCmdsTest B6B3D5E88F1A1BA1-001/shard-1-001/solr.xml
   [junit4]   2> 97457 INFO  (TEST-FullSolrCloudDistribCmdsTest.test-seed#[B6B3D5E88F1A1BA1]) [    ] o.a.s.c.CoresLocator Config-defined core root directory: /x1/jenkins/jenkins-slave/workspace/Lucene-Solr-NightlyTests-trunk@2/solr/build/solr-core/test/J2/../../../../../../../../../../x1/jenkins/jenkins-slave/workspace/Lucene-Solr-NightlyTests-trunk@2/solr/build/solr-core/test/J2/temp/solr.cloud.FullSolrCloudDistribCmdsTest B6B3D5E88F1A1BA1-001/shard-1-001/cores
   [junit4]   2> 97457 INFO  (TEST-FullSolrCloudDistribCmdsTest.test-seed#[B6B3D5E88F1A1BA1]) [    ] o.a.s.c.CoreContainer New CoreContainer 265016120
   [junit4]   2> 97489 INFO  (TEST-FullSolrCloudDistribCmdsTest.test-seed#[B6B3D5E88F1A1BA1]) [    ] o.a.s.c.CoreContainer Loading cores into CoreContainer [instanceDir=/x1/jenkins/jenkins-slave/workspace/Lucene-Solr-NightlyTests-trunk@2/solr/build/solr-core/test/J2/../../../../../../../../../../x1/jenkins/jenkins-slave/workspace/Lucene-Solr-NightlyTests-trunk@2/solr/build/solr-core/test/J2/temp/solr.cloud.FullSolrCloudDistribCmdsTest B6B3D5E88F1A1BA1-001/shard-1-001/]
   [junit4]   2> 97489 INFO  (TEST-FullSolrCloudDistribCmdsTest.test-seed#[B6B3D5E88F1A1BA1]) [    ] o.a.s.c.CoreContainer loading shared library: /x1/jenkins/jenkins-slave/workspace/Lucene-Solr-NightlyTests-trunk@2/solr/build/solr-core/test/J2/../../../../../../../../../../x1/jenkins/jenkins-slave/workspace/Lucene-Solr-NightlyTests-trunk@2/solr/build/solr-core/test/J2/temp/solr.cloud.FullSolrCloudDistribCmdsTest B6B3D5E88F1A1BA1-001/shard-1-001/lib
   [junit4]   2> 97490 WARN  (TEST-FullSolrCloudDistribCmdsTest.test-seed#[B6B3D5E88F1A1BA1]) [    ] o.a.s.c.SolrResourceLoader Can't find (or read) directory to add to classloader: lib (resolved as: /x1/jenkins/jenkins-slave/workspace/Lucene-Solr-NightlyTests-trunk@2/solr/build/solr-core/test/J2/../../../../../../../../../../x1/jenkins/jenkins-slave/workspace/Lucene-Solr-NightlyTests-trunk@2/solr/build/solr-core/test/J2/temp/solr.cloud.FullSolrCloudDistribCmdsTest B6B3D5E88F1A1BA1-001/shard-1-001/lib).
   [junit4]   2> 97511 INFO  (TEST-FullSolrCloudDistribCmdsTest.test-seed#[B6B3D5E88F1A1BA1]) [    ] o.a.s.h.c.HttpShardHandlerFactory created with socketTimeout : 90000,urlScheme : ,connTimeout : 15000,maxConnectionsPerHost : 20,maxConnections : 10000,corePoolSize : 0,maximumPoolSize : 2147483647,maxThreadIdleTime : 5,sizeOfQueue : -1,fairnessPolicy : false,useRetries : false,
   [junit4]   2> 97515 INFO  (TEST-FullSolrCloudDistribCmdsTest.test-seed#[B6B3D5E88F1A1BA1]) [    ] o.a.s.u.UpdateShardHandler Creating UpdateShardHandler HTTP client with params: socketTimeout=340000&connTimeout=45000&retry=true
   [junit4]   2> 97515 INFO  (TEST-FullSolrCloudDistribCmdsTest.test-seed#[B6B3D5E88F1A1BA1]) [    ] o.a.s.l.LogWatcher SLF4J impl is org.slf4j.impl.Log4jLoggerFactory
   [junit4]   2> 97515 INFO  (TEST-FullSolrCloudDistribCmdsTest.test-seed#[B6B3D5E88F1A1BA1]) [    ] o.a.s.l.LogWatcher Registering Log Listener [Log4j (org.slf4j.impl.Log4jLoggerFactory)]
   [junit4]   2> 97515 INFO  (TEST-FullSolrCloudDistribCmdsTest.test-seed#[B6B3D5E88F1A1BA1]) [    ] o.a.s.c.ZkContainer Zookeeper client=127.0.0.1:34997/solr
   [junit4]   2> 97515 INFO  (TEST-FullSolrCloudDistribCmdsTest.test-seed#[B6B3D5E88F1A1BA1]) [    ] o.a.s.c.ZkController zkHost includes chroot
   [junit4]   2> 97516 INFO  (TEST-FullSolrCloudDistribCmdsTest.test-seed#[B6B3D5E88F1A1BA1]) [    ] o.a.s.c.c.SolrZkClient Using default ZkCredentialsProvider
   [junit4]   2> 97516 INFO  (TEST-FullSolrCloudDistribCmdsTest.test-seed#[B6B3D5E88F1A1BA1]) [    ] o.a.s.c.c.ConnectionManager Waiting for client to connect to ZooKeeper
   [junit4]   2> 97584 INFO  (zkCallback-57-thread-1) [    ] o.a.s.c.c.ConnectionManager Watcher org.apache.solr.common.cloud.ConnectionManager@429dfa14 name:ZooKeeperConnection Watcher:127.0.0.1:34997 got event WatchedEvent state:SyncConnected type:None path:null path:null type:None
   [junit4]   2> 97584 INFO  (TEST-FullSolrCloudDistribCmdsTest.test-seed#[B6B3D5E88F1A1BA1]) [    ] o.a.s.c.c.ConnectionManager Client is connected to ZooKeeper
   [junit4]   2> 97585 INFO  (TEST-FullSolrCloudDistribCmdsTest.test-seed#[B6B3D5E88F1A1BA1]) [    ] o.a.s.c.c.SolrZkClient Using default ZkACLProvider
   [junit4]   2> 97606 INFO  (TEST-FullSolrCloudDistribCmdsTest.test-seed#[B6B3D5E88F1A1BA1]) [n:127.0.0.1:37492_    ] o.a.s.c.c.ConnectionManager Waiting for client to connect to ZooKeeper
   [junit4]   2> 97680 INFO  (zkCallback-58-thread-1-processing-n:127.0.0.1:37492_) [n:127.0.0.1:37492_    ] o.a.s.c.c.ConnectionManager Watcher org.apache.solr.common.cloud.ConnectionManager@39e269cf name:ZooKeeperConnection Watcher:127.0.0.1:34997/solr got event WatchedEvent state:SyncConnected type:None path:null path:null type:None
   [junit4]   2> 97680 INFO  (TEST-FullSolrCloudDistribCmdsTest.test-seed#[B6B3D5E88F1A1BA1]) [n:127.0.0.1:37492_    ] o.a.s.c.c.ConnectionManager Client is connected to ZooKeeper
   [junit4]   2> 97684 INFO  (TEST-FullSolrCloudDistribCmdsTest.test-seed#[B6B3D5E88F1A1BA1]) [n:127.0.0.1:37492_    ] o.a.s.c.c.ZkStateReader Updating cluster state from ZooKeeper... 
   [junit4]   2> 98687 INFO  (TEST-FullSolrCloudDistribCmdsTest.test-seed#[B6B3D5E88F1A1BA1]) [n:127.0.0.1:37492_    ] o.a.s.c.ZkController Register node as live in ZooKeeper:/live_nodes/127.0.0.1:37492_
   [junit4]   2> 98688 INFO  (TEST-FullSolrCloudDistribCmdsTest.test-seed#[B6B3D5E88F1A1BA1]) [n:127.0.0.1:37492_    ] o.a.s.c.c.SolrZkClient makePath: /live_nodes/127.0.0.1:37492_
   [junit4]   2> 98691 INFO  (TEST-FullSolrCloudDistribCmdsTest.test-seed#[B6B3D5E88F1A1BA1]) [n:127.0.0.1:37492_    ] o.a.s.c.Overseer Overseer (id=null) closing
   [junit4]   2> 98693 INFO  (TEST-FullSolrCloudDistribCmdsTest.test-seed#[B6B3D5E88F1A1BA1]) [n:127.0.0.1:37492_    ] o.a.s.c.CoreContainer No authentication plugin used.
   [junit4]   2> 98693 INFO  (TEST-FullSolrCloudDistribCmdsTest.test-seed#[B6B3D5E88F1A1BA1]) [n:127.0.0.1:37492_    ] o.a.s.c.CoreContainer Security conf doesn't exist. Skipping setup for authorization module.
   [junit4]   2> 98694 INFO  (TEST-FullSolrCloudDistribCmdsTest.test-seed#[B6B3D5E88F1A1BA1]) [n:127.0.0.1:37492_    ] o.a.s.c.CoresLocator Looking for core definitions underneath /x1/jenkins/jenkins-slave/workspace/Lucene-Solr-NightlyTests-trunk@2/solr/build/solr-core/test/J2/../../../../../../../../../../x1/jenkins/jenkins-slave/workspace/Lucene-Solr-NightlyTests-trunk@2/solr/build/solr-core/test/J2/temp/solr.cloud.FullSolrCloudDistribCmdsTest B6B3D5E88F1A1BA1-001/shard-1-001/cores
   [junit4]   2> 98695 INFO  (TEST-FullSolrCloudDistribCmdsTest.test-seed#[B6B3D5E88F1A1BA1]) [n:127.0.0.1:37492_    ] o.a.s.c.SolrCore Created CoreDescriptor: {name=collection1, config=solrconfig.xml, transient=false, schema=schema.xml, loadOnStartup=true, instanceDir=/x1/jenkins/jenkins-slave/workspace/Lucene-Solr-NightlyTests-trunk@2/solr/build/solr-core/test/J2/../../../../../../../../../../x1/jenkins/jenkins-slave/workspace/Lucene-Solr-NightlyTests-trunk@2/solr/build/solr-core/test/J2/temp/solr.cloud.FullSolrCloudDistr

[...truncated too long message...]

0310.jar:/x1/jenkins/jenkins-slave/workspace/Lucene-Solr-NightlyTests-trunk@2/solr/server/lib/jetty-servlet-9.2.10.v20150310.jar:/x1/jenkins/jenkins-slave/workspace/Lucene-Solr-NightlyTests-trunk@2/solr/server/lib/jetty-servlets-9.2.10.v20150310.jar:/x1/jenkins/jenkins-slave/workspace/Lucene-Solr-NightlyTests-trunk@2/solr/server/lib/jetty-util-9.2.10.v20150310.jar:/x1/jenkins/jenkins-slave/workspace/Lucene-Solr-NightlyTests-trunk@2/solr/server/lib/jetty-webapp-9.2.10.v20150310.jar:/x1/jenkins/jenkins-slave/workspace/Lucene-Solr-NightlyTests-trunk@2/solr/server/lib/jetty-xml-9.2.10.v20150310.jar:/x1/jenkins/jenkins-slave/workspace/Lucene-Solr-NightlyTests-trunk@2/solr/example/example-DIH/solr/db/lib/derby-10.9.1.0.jar:/x1/jenkins/jenkins-slave/workspace/Lucene-Solr-NightlyTests-trunk@2/solr/example/example-DIH/solr/db/lib/hsqldb-1.8.0.10.jar:/x1/jenkins/jenkins-slave/workspace/Lucene-Solr-NightlyTests-trunk@2/lucene/build/core/classes/java:/x1/jenkins/jenkins-slave/workspace/Lucene-Solr-NightlyTests-trunk@2/lucene/test-framework/lib/junit-4.10.jar:/x1/jenkins/jenkins-slave/workspace/Lucene-Solr-NightlyTests-trunk@2/lucene/test-framework/lib/randomizedtesting-runner-2.1.13.jar:/x1/jenkins/jenkins-slave/workspace/Lucene-Solr-NightlyTests-trunk@2/solr/core/test-lib/apacheds-all-2.0.0-M15.jar:/x1/jenkins/jenkins-slave/workspace/Lucene-Solr-NightlyTests-trunk@2/solr/core/test-lib/cglib-nodep-2.2.jar:/x1/jenkins/jenkins-slave/workspace/Lucene-Solr-NightlyTests-trunk@2/solr/core/test-lib/commons-collections-3.2.1.jar:/x1/jenkins/jenkins-slave/workspace/Lucene-Solr-NightlyTests-trunk@2/solr/core/test-lib/commons-math3-3.4.1.jar:/x1/jenkins/jenkins-slave/workspace/Lucene-Solr-NightlyTests-trunk@2/solr/core/test-lib/easymock-3.0.jar:/x1/jenkins/jenkins-slave/workspace/Lucene-Solr-NightlyTests-trunk@2/solr/core/test-lib/hadoop-common-2.6.0-tests.jar:/x1/jenkins/jenkins-slave/workspace/Lucene-Solr-NightlyTests-trunk@2/solr/core/test-lib/hadoop-hdfs-2.6.0-tests.jar:/x1/jenkins/jenkins-slave/workspace/Lucene-Solr-NightlyTests-trunk@2/solr/core/test-lib/hadoop-minikdc-2.6.0.jar:/x1/jenkins/jenkins-slave/workspace/Lucene-Solr-NightlyTests-trunk@2/solr/core/test-lib/jcl-over-slf4j-1.7.7.jar:/x1/jenkins/jenkins-slave/workspace/Lucene-Solr-NightlyTests-trunk@2/solr/core/test-lib/jersey-core-1.9.jar:/x1/jenkins/jenkins-slave/workspace/Lucene-Solr-NightlyTests-trunk@2/solr/core/test-lib/jersey-server-1.9.jar:/x1/jenkins/jenkins-slave/workspace/Lucene-Solr-NightlyTests-trunk@2/solr/core/test-lib/jetty-6.1.26.jar:/x1/jenkins/jenkins-slave/workspace/Lucene-Solr-NightlyTests-trunk@2/solr/core/test-lib/jetty-util-6.1.26.jar:/x1/jenkins/jenkins-slave/workspace/Lucene-Solr-NightlyTests-trunk@2/solr/core/test-lib/objenesis-1.2.jar:/x1/jenkins/jenkins-slave/workspace/Lucene-Solr-NightlyTests-trunk@2/lucene/build/analysis/icu/lucene-analyzers-icu-6.0.0-SNAPSHOT.jar:/x1/jenkins/jenkins-slave/workspace/Lucene-Solr-NightlyTests-trunk@2/solr/build/contrib/solr-analysis-extras/classes/java:/x1/jenkins/jenkins-slave/workspace/Lucene-Solr-NightlyTests-trunk@2/solr/contrib/analysis-extras/lib/icu4j-54.1.jar:/home/jenkins/jenkins-slave/tools/hudson.tasks.Ant_AntInstallation/ant-1.8.2/lib/ant-launcher.jar:/x1/jenkins/.ant/lib/ivy-2.3.0.jar:/home/jenkins/jenkins-slave/tools/hudson.tasks.Ant_AntInstallation/ant-1.8.2/lib/ant-antlr.jar:/home/jenkins/jenkins-slave/tools/hudson.tasks.Ant_AntInstallation/ant-1.8.2/lib/ant-apache-regexp.jar:/home/jenkins/jenkins-slave/tools/hudson.tasks.Ant_AntInstallation/ant-1.8.2/lib/ant-apache-resolver.jar:/home/jenkins/jenkins-slave/tools/hudson.tasks.Ant_AntInstallation/ant-1.8.2/lib/ant-commons-net.jar:/home/jenkins/jenkins-slave/tools/hudson.tasks.Ant_AntInstallation/ant-1.8.2/lib/ant-jmf.jar:/home/jenkins/jenkins-slave/tools/hudson.tasks.Ant_AntInstallation/ant-1.8.2/lib/ant-apache-oro.jar:/home/jenkins/jenkins-slave/tools/hudson.tasks.Ant_AntInstallation/ant-1.8.2/lib/ant-apache-xalan2.jar:/home/jenkins/jenkins-slave/tools/hudson.tasks.Ant_AntInstallation/ant-1.8.2/lib/ant-commons-logging.jar:/home/jenkins/jenkins-slave/tools/hudson.tasks.Ant_AntInstallation/ant-1.8.2/lib/ant-jsch.jar:/home/jenkins/jenkins-slave/tools/hudson.tasks.Ant_AntInstallation/ant-1.8.2/lib/ant-junit4.jar:/home/jenkins/jenkins-slave/tools/hudson.tasks.Ant_AntInstallation/ant-1.8.2/lib/ant-javamail.jar:/home/jenkins/jenkins-slave/tools/hudson.tasks.Ant_AntInstallation/ant-1.8.2/lib/ant-jai.jar:/home/jenkins/jenkins-slave/tools/hudson.tasks.Ant_AntInstallation/ant-1.8.2/lib/ant-jdepend.jar:/home/jenkins/jenkins-slave/tools/hudson.tasks.Ant_AntInstallation/ant-1.8.2/lib/ant-junit.jar:/home/jenkins/jenkins-slave/tools/hudson.tasks.Ant_AntInstallation/ant-1.8.2/lib/ant-apache-bsf.jar:/home/jenkins/jenkins-slave/tools/hudson.tasks.Ant_AntInstallation/ant-1.8.2/lib/ant-swing.jar:/home/jenkins/jenkins-slave/tools/hudson.tasks.Ant_AntInstallation/ant-1.8.2/lib/ant.jar:/home/jenkins/jenkins-slave/tools/hudson.tasks.Ant_AntInstallation/ant-1.8.2/lib/ant-netrexx.jar:/home/jenkins/jenkins-slave/tools/hudson.tasks.Ant_AntInstallation/ant-1.8.2/lib/ant-apache-bcel.jar:/home/jenkins/jenkins-slave/tools/hudson.tasks.Ant_AntInstallation/ant-1.8.2/lib/ant-testutil.jar:/home/jenkins/jenkins-slave/tools/hudson.tasks.Ant_AntInstallation/ant-1.8.2/lib/ant-apache-log4j.jar:/x1/jenkins/jenkins-slave/tools/hudson.model.JDK/latest1.8/lib/tools.jar:/x1/jenkins/.ivy2/cache/com.carrotsearch.randomizedtesting/junit4-ant/jars/junit4-ant-2.1.13.jar com.carrotsearch.ant.tasks.junit4.slave.SlaveMainSafe -eventsfile /x1/jenkins/jenkins-slave/workspace/Lucene-Solr-NightlyTests-trunk@2/solr/build/solr-core/test/temp/junit4-J2-20150602_102639_156.events @/x1/jenkins/jenkins-slave/workspace/Lucene-Solr-NightlyTests-trunk@2/solr/build/solr-core/test/temp/junit4-J2-20150602_102639_156.suites
   [junit4] ERROR: JVM J2 ended with an exception: Quit event not received from the forked process? This may indicate JVM crash or runner bugs.
   [junit4] 	at com.carrotsearch.ant.tasks.junit4.JUnit4.executeSlave(JUnit4.java:1504)
   [junit4] 	at com.carrotsearch.ant.tasks.junit4.JUnit4.access$000(JUnit4.java:133)
   [junit4] 	at com.carrotsearch.ant.tasks.junit4.JUnit4$2.call(JUnit4.java:964)
   [junit4] 	at com.carrotsearch.ant.tasks.junit4.JUnit4$2.call(JUnit4.java:961)
   [junit4] 	at java.util.concurrent.FutureTask.run(FutureTask.java:266)
   [junit4] 	at java.util.concurrent.ThreadPoolExecutor.runWorker(ThreadPoolExecutor.java:1142)
   [junit4] 	at java.util.concurrent.ThreadPoolExecutor$Worker.run(ThreadPoolExecutor.java:617)
   [junit4] 	at java.lang.Thread.run(Thread.java:745)

BUILD FAILED
/x1/jenkins/jenkins-slave/workspace/Lucene-Solr-NightlyTests-trunk@2/build.xml:533: The following error occurred while executing this line:
/x1/jenkins/jenkins-slave/workspace/Lucene-Solr-NightlyTests-trunk@2/build.xml:474: The following error occurred while executing this line:
/x1/jenkins/jenkins-slave/workspace/Lucene-Solr-NightlyTests-trunk@2/build.xml:61: The following error occurred while executing this line:
/x1/jenkins/jenkins-slave/workspace/Lucene-Solr-NightlyTests-trunk@2/extra-targets.xml:39: The following error occurred while executing this line:
/x1/jenkins/jenkins-slave/workspace/Lucene-Solr-NightlyTests-trunk@2/solr/build.xml:230: The following error occurred while executing this line:
/x1/jenkins/jenkins-slave/workspace/Lucene-Solr-NightlyTests-trunk@2/solr/common-build.xml:512: The following error occurred while executing this line:
/x1/jenkins/jenkins-slave/workspace/Lucene-Solr-NightlyTests-trunk@2/lucene/common-build.xml:1418: The following error occurred while executing this line:
/x1/jenkins/jenkins-slave/workspace/Lucene-Solr-NightlyTests-trunk@2/lucene/common-build.xml:973: At least one slave process threw an exception, first: Quit event not received from the forked process? This may indicate JVM crash or runner bugs.

Total time: 300 minutes 32 seconds
Build step 'Invoke Ant' marked build as failure
Archiving artifacts
No prior successful build to compare, so performing full copy of artifacts
ERROR: Failed to archive artifacts: **/*.events,heapdumps/**,**/hs_err_pid*,README.txt
java.io.IOException: Failed to extract /home/jenkins/jenkins-slave/workspace/Lucene-Solr-NightlyTests-trunk@2/transfer of 4 files
	at hudson.FilePath.readFromTar(FilePath.java:2101)
	at hudson.FilePath.copyRecursiveTo(FilePath.java:2013)
	at jenkins.model.StandardArtifactManager.archive(StandardArtifactManager.java:61)
	at com.cloudbees.jenkins.plugins.jsync.archiver.JSyncArtifactManager.remoteSync(JSyncArtifactManager.java:107)
	at com.cloudbees.jenkins.plugins.jsync.archiver.JSyncArtifactManager.archive(JSyncArtifactManager.java:68)
	at hudson.tasks.ArtifactArchiver.perform(ArtifactArchiver.java:140)
	at hudson.tasks.BuildStepMonitor$1.perform(BuildStepMonitor.java:20)
	at hudson.model.AbstractBuild$AbstractBuildExecution.perform(AbstractBuild.java:756)
	at hudson.model.AbstractBuild$AbstractBuildExecution.performAllBuildSteps(AbstractBuild.java:720)
	at hudson.model.Build$BuildExecution.post2(Build.java:182)
	at hudson.model.AbstractBuild$AbstractBuildExecution.post(AbstractBuild.java:669)
	at hudson.model.Run.execute(Run.java:1731)
	at hudson.model.FreeStyleBuild.run(FreeStyleBuild.java:43)
	at hudson.model.ResourceController.execute(ResourceController.java:88)
	at hudson.model.Executor.run(Executor.java:232)
Caused by: java.io.IOException: unexpected EOF with 1536 bytes unread
	at hudson.org.apache.tools.tar.TarInputStream.read(TarInputStream.java:349)
	at java.io.FilterInputStream.read(FilterInputStream.java:107)
	at org.apache.commons.io.IOUtils.copyLarge(IOUtils.java:1792)
	at org.apache.commons.io.IOUtils.copyLarge(IOUtils.java:1769)
	at org.apache.commons.io.IOUtils.copy(IOUtils.java:1744)
	at hudson.util.IOUtils.copy(IOUtils.java:40)
	at hudson.FilePath.readFromTar(FilePath.java:2091)
	... 14 more
Recording test results
Email was triggered for: Failure
Sending email for trigger: Failure



Mime
View raw message