lucene-dev mailing list archives

Site index · List index
Message view « Date » · « Thread »
Top « Date » · « Thread »
From Policeman Jenkins Server <jenk...@thetaphi.de>
Subject [JENKINS] Lucene-Solr-trunk-Windows (32bit/jdk1.8.0_45) - Build # 4883 - Failure!
Date Tue, 02 Jun 2015 13:54:49 GMT
Build: http://jenkins.thetaphi.de/job/Lucene-Solr-trunk-Windows/4883/
Java: 32bit/jdk1.8.0_45 -client -XX:+UseConcMarkSweepGC

1 tests failed.
FAILED:  org.apache.solr.core.TestDynamicLoading.testDynamicLoading

Error Message:
Could not get expected value  'X val changed' for path 'x' full output: {   "responseHeader":{     "status":0,     "QTime":0},   "params":{"wt":"json"},   "context":{     "webapp":"",     "path":"/test1",     "httpMethod":"GET"},   "class":"org.apache.solr.core.BlobStoreTestRequestHandler",   "x":"X val"}

Stack Trace:
java.lang.AssertionError: Could not get expected value  'X val changed' for path 'x' full output: {
  "responseHeader":{
    "status":0,
    "QTime":0},
  "params":{"wt":"json"},
  "context":{
    "webapp":"",
    "path":"/test1",
    "httpMethod":"GET"},
  "class":"org.apache.solr.core.BlobStoreTestRequestHandler",
  "x":"X val"}
	at __randomizedtesting.SeedInfo.seed([1F7DA3084F8671A6:C7308E5FB85BD406]:0)
	at org.junit.Assert.fail(Assert.java:93)
	at org.junit.Assert.assertTrue(Assert.java:43)
	at org.apache.solr.core.TestSolrConfigHandler.testForResponseElement(TestSolrConfigHandler.java:410)
	at org.apache.solr.core.TestDynamicLoading.testDynamicLoading(TestDynamicLoading.java:260)
	at sun.reflect.NativeMethodAccessorImpl.invoke0(Native Method)
	at sun.reflect.NativeMethodAccessorImpl.invoke(NativeMethodAccessorImpl.java:62)
	at sun.reflect.DelegatingMethodAccessorImpl.invoke(DelegatingMethodAccessorImpl.java:43)
	at java.lang.reflect.Method.invoke(Method.java:497)
	at com.carrotsearch.randomizedtesting.RandomizedRunner.invoke(RandomizedRunner.java:1627)
	at com.carrotsearch.randomizedtesting.RandomizedRunner$6.evaluate(RandomizedRunner.java:836)
	at com.carrotsearch.randomizedtesting.RandomizedRunner$7.evaluate(RandomizedRunner.java:872)
	at com.carrotsearch.randomizedtesting.RandomizedRunner$8.evaluate(RandomizedRunner.java:886)
	at org.apache.solr.BaseDistributedSearchTestCase$ShardsRepeatRule$ShardsFixedStatement.callStatement(BaseDistributedSearchTestCase.java:960)
	at org.apache.solr.BaseDistributedSearchTestCase$ShardsRepeatRule$ShardsStatement.evaluate(BaseDistributedSearchTestCase.java:935)
	at com.carrotsearch.randomizedtesting.rules.SystemPropertiesRestoreRule$1.evaluate(SystemPropertiesRestoreRule.java:57)
	at org.apache.lucene.util.TestRuleSetupTeardownChained$1.evaluate(TestRuleSetupTeardownChained.java:50)
	at org.apache.lucene.util.AbstractBeforeAfterRule$1.evaluate(AbstractBeforeAfterRule.java:46)
	at org.apache.lucene.util.TestRuleThreadAndTestName$1.evaluate(TestRuleThreadAndTestName.java:49)
	at org.apache.lucene.util.TestRuleIgnoreAfterMaxFailures$1.evaluate(TestRuleIgnoreAfterMaxFailures.java:65)
	at org.apache.lucene.util.TestRuleMarkFailure$1.evaluate(TestRuleMarkFailure.java:48)
	at com.carrotsearch.randomizedtesting.rules.StatementAdapter.evaluate(StatementAdapter.java:36)
	at com.carrotsearch.randomizedtesting.ThreadLeakControl$StatementRunner.run(ThreadLeakControl.java:365)
	at com.carrotsearch.randomizedtesting.ThreadLeakControl.forkTimeoutingTask(ThreadLeakControl.java:798)
	at com.carrotsearch.randomizedtesting.ThreadLeakControl$3.evaluate(ThreadLeakControl.java:458)
	at com.carrotsearch.randomizedtesting.RandomizedRunner.runSingleTest(RandomizedRunner.java:845)
	at com.carrotsearch.randomizedtesting.RandomizedRunner$3.evaluate(RandomizedRunner.java:747)
	at com.carrotsearch.randomizedtesting.RandomizedRunner$4.evaluate(RandomizedRunner.java:781)
	at com.carrotsearch.randomizedtesting.RandomizedRunner$5.evaluate(RandomizedRunner.java:792)
	at com.carrotsearch.randomizedtesting.rules.StatementAdapter.evaluate(StatementAdapter.java:36)
	at com.carrotsearch.randomizedtesting.rules.SystemPropertiesRestoreRule$1.evaluate(SystemPropertiesRestoreRule.java:57)
	at org.apache.lucene.util.AbstractBeforeAfterRule$1.evaluate(AbstractBeforeAfterRule.java:46)
	at com.carrotsearch.randomizedtesting.rules.StatementAdapter.evaluate(StatementAdapter.java:36)
	at org.apache.lucene.util.TestRuleStoreClassName$1.evaluate(TestRuleStoreClassName.java:42)
	at com.carrotsearch.randomizedtesting.rules.NoShadowingOrOverridesOnMethodsRule$1.evaluate(NoShadowingOrOverridesOnMethodsRule.java:39)
	at com.carrotsearch.randomizedtesting.rules.NoShadowingOrOverridesOnMethodsRule$1.evaluate(NoShadowingOrOverridesOnMethodsRule.java:39)
	at com.carrotsearch.randomizedtesting.rules.StatementAdapter.evaluate(StatementAdapter.java:36)
	at com.carrotsearch.randomizedtesting.rules.StatementAdapter.evaluate(StatementAdapter.java:36)
	at com.carrotsearch.randomizedtesting.rules.StatementAdapter.evaluate(StatementAdapter.java:36)
	at org.apache.lucene.util.TestRuleAssertionsRequired$1.evaluate(TestRuleAssertionsRequired.java:54)
	at org.apache.lucene.util.TestRuleMarkFailure$1.evaluate(TestRuleMarkFailure.java:48)
	at org.apache.lucene.util.TestRuleIgnoreAfterMaxFailures$1.evaluate(TestRuleIgnoreAfterMaxFailures.java:65)
	at org.apache.lucene.util.TestRuleIgnoreTestSuites$1.evaluate(TestRuleIgnoreTestSuites.java:55)
	at com.carrotsearch.randomizedtesting.rules.StatementAdapter.evaluate(StatementAdapter.java:36)
	at com.carrotsearch.randomizedtesting.ThreadLeakControl$StatementRunner.run(ThreadLeakControl.java:365)
	at java.lang.Thread.run(Thread.java:745)




Build Log:
[...truncated 10721 lines...]
   [junit4] Suite: org.apache.solr.core.TestDynamicLoading
   [junit4]   2> Creating dataDir: C:\Users\JenkinsSlave\workspace\Lucene-Solr-trunk-Windows\solr\build\solr-core\test\J1\temp\solr.core.TestDynamicLoading 1F7DA3084F8671A6-001\init-core-data-001
   [junit4]   2> 2492276 INFO  (SUITE-TestDynamicLoading-seed#[1F7DA3084F8671A6]-worker) [    ] o.a.s.SolrTestCaseJ4 Randomized ssl (true) and clientAuth (false)
   [junit4]   2> 2492278 INFO  (SUITE-TestDynamicLoading-seed#[1F7DA3084F8671A6]-worker) [    ] o.a.s.BaseDistributedSearchTestCase Setting hostContext system property: /
   [junit4]   2> 2492281 INFO  (TEST-TestDynamicLoading.testDynamicLoading-seed#[1F7DA3084F8671A6]) [    ] o.a.s.c.ZkTestServer STARTING ZK TEST SERVER
   [junit4]   2> 2492283 INFO  (Thread-5117) [    ] o.a.s.c.ZkTestServer client port:0.0.0.0/0.0.0.0:0
   [junit4]   2> 2492283 INFO  (Thread-5117) [    ] o.a.s.c.ZkTestServer Starting server
   [junit4]   2> 2492407 INFO  (TEST-TestDynamicLoading.testDynamicLoading-seed#[1F7DA3084F8671A6]) [    ] o.a.s.c.ZkTestServer start zk server on port:59002
   [junit4]   2> 2492438 INFO  (TEST-TestDynamicLoading.testDynamicLoading-seed#[1F7DA3084F8671A6]) [    ] o.a.s.c.AbstractZkTestCase put C:\Users\JenkinsSlave\workspace\Lucene-Solr-trunk-Windows\solr\core\src\test-files\solr\collection1\conf\solrconfig-tlog.xml to /configs/conf1/solrconfig.xml
   [junit4]   2> 2492444 INFO  (TEST-TestDynamicLoading.testDynamicLoading-seed#[1F7DA3084F8671A6]) [    ] o.a.s.c.AbstractZkTestCase put C:\Users\JenkinsSlave\workspace\Lucene-Solr-trunk-Windows\solr\core\src\test-files\solr\collection1\conf\schema.xml to /configs/conf1/schema.xml
   [junit4]   2> 2492448 INFO  (TEST-TestDynamicLoading.testDynamicLoading-seed#[1F7DA3084F8671A6]) [    ] o.a.s.c.AbstractZkTestCase put C:\Users\JenkinsSlave\workspace\Lucene-Solr-trunk-Windows\solr\core\src\test-files\solr\collection1\conf\solrconfig.snippet.randomindexconfig.xml to /configs/conf1/solrconfig.snippet.randomindexconfig.xml
   [junit4]   2> 2492453 INFO  (TEST-TestDynamicLoading.testDynamicLoading-seed#[1F7DA3084F8671A6]) [    ] o.a.s.c.AbstractZkTestCase put C:\Users\JenkinsSlave\workspace\Lucene-Solr-trunk-Windows\solr\core\src\test-files\solr\collection1\conf\stopwords.txt to /configs/conf1/stopwords.txt
   [junit4]   2> 2492456 INFO  (TEST-TestDynamicLoading.testDynamicLoading-seed#[1F7DA3084F8671A6]) [    ] o.a.s.c.AbstractZkTestCase put C:\Users\JenkinsSlave\workspace\Lucene-Solr-trunk-Windows\solr\core\src\test-files\solr\collection1\conf\protwords.txt to /configs/conf1/protwords.txt
   [junit4]   2> 2492461 INFO  (TEST-TestDynamicLoading.testDynamicLoading-seed#[1F7DA3084F8671A6]) [    ] o.a.s.c.AbstractZkTestCase put C:\Users\JenkinsSlave\workspace\Lucene-Solr-trunk-Windows\solr\core\src\test-files\solr\collection1\conf\currency.xml to /configs/conf1/currency.xml
   [junit4]   2> 2492465 INFO  (TEST-TestDynamicLoading.testDynamicLoading-seed#[1F7DA3084F8671A6]) [    ] o.a.s.c.AbstractZkTestCase put C:\Users\JenkinsSlave\workspace\Lucene-Solr-trunk-Windows\solr\core\src\test-files\solr\collection1\conf\enumsConfig.xml to /configs/conf1/enumsConfig.xml
   [junit4]   2> 2492470 INFO  (TEST-TestDynamicLoading.testDynamicLoading-seed#[1F7DA3084F8671A6]) [    ] o.a.s.c.AbstractZkTestCase put C:\Users\JenkinsSlave\workspace\Lucene-Solr-trunk-Windows\solr\core\src\test-files\solr\collection1\conf\open-exchange-rates.json to /configs/conf1/open-exchange-rates.json
   [junit4]   2> 2492475 INFO  (TEST-TestDynamicLoading.testDynamicLoading-seed#[1F7DA3084F8671A6]) [    ] o.a.s.c.AbstractZkTestCase put C:\Users\JenkinsSlave\workspace\Lucene-Solr-trunk-Windows\solr\core\src\test-files\solr\collection1\conf\mapping-ISOLatin1Accent.txt to /configs/conf1/mapping-ISOLatin1Accent.txt
   [junit4]   2> 2492480 INFO  (TEST-TestDynamicLoading.testDynamicLoading-seed#[1F7DA3084F8671A6]) [    ] o.a.s.c.AbstractZkTestCase put C:\Users\JenkinsSlave\workspace\Lucene-Solr-trunk-Windows\solr\core\src\test-files\solr\collection1\conf\old_synonyms.txt to /configs/conf1/old_synonyms.txt
   [junit4]   2> 2492484 INFO  (TEST-TestDynamicLoading.testDynamicLoading-seed#[1F7DA3084F8671A6]) [    ] o.a.s.c.AbstractZkTestCase put C:\Users\JenkinsSlave\workspace\Lucene-Solr-trunk-Windows\solr\core\src\test-files\solr\collection1\conf\synonyms.txt to /configs/conf1/synonyms.txt
   [junit4]   2> 2492894 INFO  (TEST-TestDynamicLoading.testDynamicLoading-seed#[1F7DA3084F8671A6]) [    ] o.a.s.SolrTestCaseJ4 Writing core.properties file to C:\Users\JenkinsSlave\workspace\Lucene-Solr-trunk-Windows\solr\build\solr-core\test\J1\temp\solr.core.TestDynamicLoading 1F7DA3084F8671A6-001\control-001\cores\collection1
   [junit4]   2> 2492899 INFO  (TEST-TestDynamicLoading.testDynamicLoading-seed#[1F7DA3084F8671A6]) [    ] o.e.j.s.Server jetty-9.2.10.v20150310
   [junit4]   2> 2492905 INFO  (TEST-TestDynamicLoading.testDynamicLoading-seed#[1F7DA3084F8671A6]) [    ] o.e.j.s.h.ContextHandler Started o.e.j.s.ServletContextHandler@16975c5{/,null,AVAILABLE}
   [junit4]   2> 2492936 INFO  (TEST-TestDynamicLoading.testDynamicLoading-seed#[1F7DA3084F8671A6]) [    ] o.e.j.s.ServerConnector Started ServerConnector@8a3f38{SSL-http/1.1}{127.0.0.1:59012}
   [junit4]   2> 2492936 INFO  (TEST-TestDynamicLoading.testDynamicLoading-seed#[1F7DA3084F8671A6]) [    ] o.e.j.s.Server Started @2493067ms
   [junit4]   2> 2492936 INFO  (TEST-TestDynamicLoading.testDynamicLoading-seed#[1F7DA3084F8671A6]) [    ] o.a.s.c.s.e.JettySolrRunner Jetty properties: {solr.data.dir=C:\Users\JenkinsSlave\workspace\Lucene-Solr-trunk-Windows\solr\build\solr-core\test\J1\temp\solr.core.TestDynamicLoading 1F7DA3084F8671A6-001\tempDir-001/control/data, hostContext=/, hostPort=59012, coreRootDirectory=C:\Users\JenkinsSlave\workspace\Lucene-Solr-trunk-Windows\solr\build\solr-core\test\J1\..\..\..\..\..\..\..\..\..\Users\JenkinsSlave\workspace\Lucene-Solr-trunk-Windows\solr\build\solr-core\test\J1\temp\solr.core.TestDynamicLoading 1F7DA3084F8671A6-001\control-001\cores}
   [junit4]   2> 2492942 INFO  (TEST-TestDynamicLoading.testDynamicLoading-seed#[1F7DA3084F8671A6]) [    ] o.a.s.s.SolrDispatchFilter SolrDispatchFilter.init()sun.misc.Launcher$AppClassLoader@e2f2a
   [junit4]   2> 2492942 INFO  (TEST-TestDynamicLoading.testDynamicLoading-seed#[1F7DA3084F8671A6]) [    ] o.a.s.c.SolrResourceLoader new SolrResourceLoader for directory: 'C:\Users\JenkinsSlave\workspace\Lucene-Solr-trunk-Windows\solr\build\solr-core\test\J1\..\..\..\..\..\..\..\..\..\Users\JenkinsSlave\workspace\Lucene-Solr-trunk-Windows\solr\build\solr-core\test\J1\temp\solr.core.TestDynamicLoading 1F7DA3084F8671A6-001\control-001\'
   [junit4]   2> 2492990 INFO  (TEST-TestDynamicLoading.testDynamicLoading-seed#[1F7DA3084F8671A6]) [    ] o.a.s.c.SolrXmlConfig Loading container configuration from C:\Users\JenkinsSlave\workspace\Lucene-Solr-trunk-Windows\solr\build\solr-core\test\J1\..\..\..\..\..\..\..\..\..\Users\JenkinsSlave\workspace\Lucene-Solr-trunk-Windows\solr\build\solr-core\test\J1\temp\solr.core.TestDynamicLoading 1F7DA3084F8671A6-001\control-001\solr.xml
   [junit4]   2> 2493003 INFO  (TEST-TestDynamicLoading.testDynamicLoading-seed#[1F7DA3084F8671A6]) [    ] o.a.s.c.CoresLocator Config-defined core root directory: C:\Users\JenkinsSlave\workspace\Lucene-Solr-trunk-Windows\solr\build\solr-core\test\J1\..\..\..\..\..\..\..\..\..\Users\JenkinsSlave\workspace\Lucene-Solr-trunk-Windows\solr\build\solr-core\test\J1\temp\solr.core.TestDynamicLoading 1F7DA3084F8671A6-001\control-001\cores
   [junit4]   2> 2493003 INFO  (TEST-TestDynamicLoading.testDynamicLoading-seed#[1F7DA3084F8671A6]) [    ] o.a.s.c.CoreContainer New CoreContainer 6485367
   [junit4]   2> 2493003 INFO  (TEST-TestDynamicLoading.testDynamicLoading-seed#[1F7DA3084F8671A6]) [    ] o.a.s.c.CoreContainer Loading cores into CoreContainer [instanceDir=C:\Users\JenkinsSlave\workspace\Lucene-Solr-trunk-Windows\solr\build\solr-core\test\J1\..\..\..\..\..\..\..\..\..\Users\JenkinsSlave\workspace\Lucene-Solr-trunk-Windows\solr\build\solr-core\test\J1\temp\solr.core.TestDynamicLoading 1F7DA3084F8671A6-001\control-001\]
   [junit4]   2> 2493003 INFO  (TEST-TestDynamicLoading.testDynamicLoading-seed#[1F7DA3084F8671A6]) [    ] o.a.s.c.CoreContainer loading shared library: C:\Users\JenkinsSlave\workspace\Lucene-Solr-trunk-Windows\solr\build\solr-core\test\J1\..\..\..\..\..\..\..\..\..\Users\JenkinsSlave\workspace\Lucene-Solr-trunk-Windows\solr\build\solr-core\test\J1\temp\solr.core.TestDynamicLoading 1F7DA3084F8671A6-001\control-001\lib
   [junit4]   2> 2493003 WARN  (TEST-TestDynamicLoading.testDynamicLoading-seed#[1F7DA3084F8671A6]) [    ] o.a.s.c.SolrResourceLoader Can't find (or read) directory to add to classloader: lib (resolved as: C:\Users\JenkinsSlave\workspace\Lucene-Solr-trunk-Windows\solr\build\solr-core\test\J1\..\..\..\..\..\..\..\..\..\Users\JenkinsSlave\workspace\Lucene-Solr-trunk-Windows\solr\build\solr-core\test\J1\temp\solr.core.TestDynamicLoading 1F7DA3084F8671A6-001\control-001\lib).
   [junit4]   2> 2493019 INFO  (TEST-TestDynamicLoading.testDynamicLoading-seed#[1F7DA3084F8671A6]) [    ] o.a.s.h.c.HttpShardHandlerFactory created with socketTimeout : 90000,urlScheme : ,connTimeout : 15000,maxConnectionsPerHost : 20,maxConnections : 10000,corePoolSize : 0,maximumPoolSize : 2147483647,maxThreadIdleTime : 5,sizeOfQueue : -1,fairnessPolicy : false,useRetries : false,
   [junit4]   2> 2493027 INFO  (TEST-TestDynamicLoading.testDynamicLoading-seed#[1F7DA3084F8671A6]) [    ] o.a.s.u.UpdateShardHandler Creating UpdateShardHandler HTTP client with params: socketTimeout=340000&connTimeout=45000&retry=true
   [junit4]   2> 2493031 INFO  (TEST-TestDynamicLoading.testDynamicLoading-seed#[1F7DA3084F8671A6]) [    ] o.a.s.l.LogWatcher SLF4J impl is org.slf4j.impl.Log4jLoggerFactory
   [junit4]   2> 2493033 INFO  (TEST-TestDynamicLoading.testDynamicLoading-seed#[1F7DA3084F8671A6]) [    ] o.a.s.l.LogWatcher Registering Log Listener [Log4j (org.slf4j.impl.Log4jLoggerFactory)]
   [junit4]   2> 2493033 INFO  (TEST-TestDynamicLoading.testDynamicLoading-seed#[1F7DA3084F8671A6]) [    ] o.a.s.c.ZkContainer Zookeeper client=127.0.0.1:59002/solr
   [junit4]   2> 2493033 INFO  (TEST-TestDynamicLoading.testDynamicLoading-seed#[1F7DA3084F8671A6]) [    ] o.a.s.c.ZkController zkHost includes chroot
   [junit4]   2> 2493083 INFO  (TEST-TestDynamicLoading.testDynamicLoading-seed#[1F7DA3084F8671A6]) [n:127.0.0.1:59012_    ] o.a.s.c.ZkController Register node as live in ZooKeeper:/live_nodes/127.0.0.1:59012_
   [junit4]   2> 2493094 INFO  (TEST-TestDynamicLoading.testDynamicLoading-seed#[1F7DA3084F8671A6]) [n:127.0.0.1:59012_    ] o.a.s.c.Overseer Overseer (id=null) closing
   [junit4]   2> 2493098 INFO  (TEST-TestDynamicLoading.testDynamicLoading-seed#[1F7DA3084F8671A6]) [n:127.0.0.1:59012_    ] o.a.s.c.OverseerElectionContext I am going to be the leader 127.0.0.1:59012_
   [junit4]   2> 2493101 INFO  (TEST-TestDynamicLoading.testDynamicLoading-seed#[1F7DA3084F8671A6]) [n:127.0.0.1:59012_    ] o.a.s.c.Overseer Overseer (id=93929656649973764-127.0.0.1:59012_-n_0000000000) starting
   [junit4]   2> 2493120 INFO  (TEST-TestDynamicLoading.testDynamicLoading-seed#[1F7DA3084F8671A6]) [n:127.0.0.1:59012_    ] o.a.s.c.OverseerAutoReplicaFailoverThread Starting OverseerAutoReplicaFailoverThread autoReplicaFailoverWorkLoopDelay=10000 autoReplicaFailoverWaitAfterExpiration=30000 autoReplicaFailoverBadNodeExpiration=60000
   [junit4]   2> 2493121 INFO  (OverseerCollectionProcessor-93929656649973764-127.0.0.1:59012_-n_0000000000) [n:127.0.0.1:59012_    ] o.a.s.c.OverseerCollectionProcessor Process current queue of collection creations
   [junit4]   2> 2493122 INFO  (OverseerStateUpdate-93929656649973764-127.0.0.1:59012_-n_0000000000) [n:127.0.0.1:59012_    ] o.a.s.c.Overseer Starting to work on the main queue
   [junit4]   2> 2493129 INFO  (TEST-TestDynamicLoading.testDynamicLoading-seed#[1F7DA3084F8671A6]) [n:127.0.0.1:59012_    ] o.a.s.c.CoreContainer No authentication plugin used.
   [junit4]   2> 2493129 INFO  (TEST-TestDynamicLoading.testDynamicLoading-seed#[1F7DA3084F8671A6]) [n:127.0.0.1:59012_    ] o.a.s.c.CoreContainer Security conf doesn't exist. Skipping setup for authorization module.
   [junit4]   2> 2493133 INFO  (TEST-TestDynamicLoading.testDynamicLoading-seed#[1F7DA3084F8671A6]) [n:127.0.0.1:59012_    ] o.a.s.c.CoresLocator Looking for core definitions underneath C:\Users\JenkinsSlave\workspace\Lucene-Solr-trunk-Windows\solr\build\solr-core\test\J1\..\..\..\..\..\..\..\..\..\Users\JenkinsSlave\workspace\Lucene-Solr-trunk-Windows\solr\build\solr-core\test\J1\temp\solr.core.TestDynamicLoading 1F7DA3084F8671A6-001\control-001\cores
   [junit4]   2> 2493137 INFO  (TEST-TestDynamicLoading.testDynamicLoading-seed#[1F7DA3084F8671A6]) [n:127.0.0.1:59012_    ] o.a.s.c.SolrCore Created CoreDescriptor: {name=collection1, config=solrconfig.xml, transient=false, schema=schema.xml, loadOnStartup=true, instanceDir=C:\Users\JenkinsSlave\workspace\Lucene-Solr-trunk-Windows\solr\build\solr-core\test\J1\..\..\..\..\..\..\..\..\..\Users\JenkinsSlave\workspace\Lucene-Solr-trunk-Windows\solr\build\solr-core\test\J1\temp\solr.core.TestDynamicLoading 1F7DA3084F8671A6-001\control-001\cores\collection1, collection=control_collection, absoluteInstDir=C:\Users\JenkinsSlave\workspace\Lucene-Solr-trunk-Windows\solr\build\solr-core\test\J1\..\..\..\..\..\..\..\..\..\Users\JenkinsSlave\workspace\Lucene-Solr-trunk-Windows\solr\build\solr-core\test\J1\temp\solr.core.TestDynamicLoading 1F7DA3084F8671A6-001\control-001\cores\collection1\, coreNodeName=, dataDir=data\, shard=}
   [junit4]   2> 2493137 INFO  (TEST-TestDynamicLoading.testDynamicLoading-seed#[1F7DA3084F8671A6]) [n:127.0.0.1:59012_    ] o.a.s.c.CoresLocator Found core collection1 in C:\Users\JenkinsSlave\workspace\Lucene-Solr-trunk-Windows\solr\build\solr-core\test\J1\..\..\..\..\..\..\..\..\..\Users\JenkinsSlave\workspace\Lucene-Solr-trunk-Windows\solr\build\solr-core\test\J1\temp\solr.core.TestDynamicLoading 1F7DA3084F8671A6-001\control-001\cores\collection1\
   [junit4]   2> 2493137 INFO  (TEST-TestDynamicLoading.testDynamicLoading-seed#[1F7DA3084F8671A6]) [n:127.0.0.1:59012_    ] o.a.s.c.CoresLocator Found 1 core definitions
   [junit4]   2> 2493139 INFO  (TEST-TestDynamicLoading.testDynamicLoading-seed#[1F7DA3084F8671A6]) [n:127.0.0.1:59012_    ] o.a.s.s.SolrDispatchFilter user.dir=C:\Users\JenkinsSlave\workspace\Lucene-Solr-trunk-Windows\solr\build\solr-core\test\J1
   [junit4]   2> 2493139 INFO  (TEST-TestDynamicLoading.testDynamicLoading-seed#[1F7DA3084F8671A6]) [n:127.0.0.1:59012_    ] o.a.s.s.SolrDispatchFilter SolrDispatchFilter.init() done
   [junit4]   2> 2493139 INFO  (coreLoadExecutor-6920-thread-1-processing-n:127.0.0.1:59012_) [n:127.0.0.1:59012_ c:control_collection   x:collection1] o.a.s.c.ZkController publishing state=down
   [junit4]   2> 2493139 INFO  (coreLoadExecutor-6920-thread-1-processing-n:127.0.0.1:59012_) [n:127.0.0.1:59012_ c:control_collection   x:collection1] o.a.s.c.ZkController numShards not found on descriptor - reading it from system property
   [junit4]   2> 2493142 INFO  (coreLoadExecutor-6920-thread-1-processing-n:127.0.0.1:59012_) [n:127.0.0.1:59012_ c:control_collection   x:collection1] o.a.s.c.ZkController look for our core node name
   [junit4]   2> 2493142 INFO  (zkCallback-2138-thread-1-processing-n:127.0.0.1:59012_) [n:127.0.0.1:59012_    ] o.a.s.c.DistributedQueue NodeChildrenChanged fired on path /overseer/queue state SyncConnected
   [junit4]   2> 2493144 INFO  (OverseerStateUpdate-93929656649973764-127.0.0.1:59012_-n_0000000000) [n:127.0.0.1:59012_    ] o.a.s.c.Overseer processMessage: queueSize: 1, message = {
   [junit4]   2>   "core":"collection1",
   [junit4]   2>   "roles":null,
   [junit4]   2>   "base_url":"https://127.0.0.1:59012",
   [junit4]   2>   "node_name":"127.0.0.1:59012_",
   [junit4]   2>   "numShards":"1",
   [junit4]   2>   "state":"down",
   [junit4]   2>   "shard":null,
   [junit4]   2>   "collection":"control_collection",
   [junit4]   2>   "operation":"state"} current state version: 0
   [junit4]   2> 2493145 INFO  (OverseerStateUpdate-93929656649973764-127.0.0.1:59012_-n_0000000000) [n:127.0.0.1:59012_    ] o.a.s.c.o.ReplicaMutator Update state numShards=1 message={
   [junit4]   2>   "core":"collection1",
   [junit4]   2>   "roles":null,
   [junit4]   2>   "base_url":"https://127.0.0.1:59012",
   [junit4]   2>   "node_name":"127.0.0.1:59012_",
   [junit4]   2>   "numShards":"1",
   [junit4]   2>   "state":"down",
   [junit4]   2>   "shard":null,
   [junit4]   2>   "collection":"control_collection",
   [junit4]   2>   "operation":"state"}
   [junit4]   2> 2493145 INFO  (OverseerStateUpdate-93929656649973764-127.0.0.1:59012_-n_0000000000) [n:127.0.0.1:59012_    ] o.a.s.c.o.ClusterStateMutator building a new cName: control_collection
   [junit4]   2> 2493147 INFO  (OverseerStateUpdate-93929656649973764-127.0.0.1:59012_-n_0000000000) [n:127.0.0.1:59012_    ] o.a.s.c.o.ReplicaMutator Assigning new node to shard shard=shard1
   [junit4]   2> 2494395 INFO  (coreLoadExecutor-6920-thread-1-processing-n:127.0.0.1:59012_) [n:127.0.0.1:59012_ c:control_collection   x:collection1] o.a.s.c.ZkController waiting to find shard id in clusterstate for collection1
   [junit4]   2> 2494395 INFO  (coreLoadExecutor-6920-thread-1-processing-n:127.0.0.1:59012_) [n:127.0.0.1:59012_ c:control_collection   x:collection1] o.a.s.c.ZkController Check for collection zkNode:control_collection
   [junit4]   2> 2494396 INFO  (coreLoadExecutor-6920-thread-1-processing-n:127.0.0.1:59012_) [n:127.0.0.1:59012_ c:control_collection   x:collection1] o.a.s.c.ZkController Collection zkNode exists
   [junit4]   2> 2494397 INFO  (coreLoadExecutor-6920-thread-1-processing-n:127.0.0.1:59012_) [n:127.0.0.1:59012_ c:control_collection   x:collection1] o.a.s.c.SolrResourceLoader new SolrResourceLoader for directory: 'C:\Users\JenkinsSlave\workspace\Lucene-Solr-trunk-Windows\solr\build\solr-core\test\J1\..\..\..\..\..\..\..\..\..\Users\JenkinsSlave\workspace\Lucene-Solr-trunk-Windows\solr\build\solr-core\test\J1\temp\solr.core.TestDynamicLoading 1F7DA3084F8671A6-001\control-001\cores\collection1\'
   [junit4]   2> 2494430 INFO  (coreLoadExecutor-6920-thread-1-processing-n:127.0.0.1:59012_) [n:127.0.0.1:59012_ c:control_collection   x:collection1] o.a.s.c.Config loaded config solrconfig.xml with version 0 
   [junit4]   2> 2494442 INFO  (coreLoadExecutor-6920-thread-1-processing-n:127.0.0.1:59012_) [n:127.0.0.1:59012_ c:control_collection   x:collection1] o.a.s.c.SolrConfig current version of requestparams : -1
   [junit4]   2> 2494456 INFO  (coreLoadExecutor-6920-thread-1-processing-n:127.0.0.1:59012_) [n:127.0.0.1:59012_ c:control_collection   x:collection1] o.a.s.c.SolrConfig Using Lucene MatchVersion: 6.0.0
   [junit4]   2> 2494471 INFO  (coreLoadExecutor-6920-thread-1-processing-n:127.0.0.1:59012_) [n:127.0.0.1:59012_ c:control_collection   x:collection1] o.a.s.c.Config Loaded SolrConfig: solrconfig.xml
   [junit4]   2> 2494473 INFO  (coreLoadExecutor-6920-thread-1-processing-n:127.0.0.1:59012_) [n:127.0.0.1:59012_ c:control_collection   x:collection1] o.a.s.s.IndexSchema Reading Solr Schema from /configs/conf1/schema.xml
   [junit4]   2> 2494490 INFO  (coreLoadExecutor-6920-thread-1-processing-n:127.0.0.1:59012_) [n:127.0.0.1:59012_ c:control_collection   x:collection1] o.a.s.s.IndexSchema [collection1] Schema name=test
   [junit4]   2> 2494669 INFO  (coreLoadExecutor-6920-thread-1-processing-n:127.0.0.1:59012_) [n:127.0.0.1:59012_ c:control_collection   x:collection1] o.a.s.s.OpenExchangeRatesOrgProvider Initialized with rates=open-exchange-rates.json, refreshInterval=1440.
   [junit4]   2> 2494683 INFO  (coreLoadExecutor-6920-thread-1-processing-n:127.0.0.1:59012_) [n:127.0.0.1:59012_ c:control_collection   x:collection1] o.a.s.s.IndexSchema default search field in schema is text
   [junit4]   2> 2494685 INFO  (coreLoadExecutor-6920-thread-1-processing-n:127.0.0.1:59012_) [n:127.0.0.1:59012_ c:control_collection   x:collection1] o.a.s.s.IndexSchema unique key field: id
   [junit4]   2> 2494704 INFO  (coreLoadExecutor-6920-thread-1-processing-n:127.0.0.1:59012_) [n:127.0.0.1:59012_ c:control_collection   x:collection1] o.a.s.s.FileExchangeRateProvider Reloading exchange rates from file currency.xml
   [junit4]   2> 2494709 INFO  (coreLoadExecutor-6920-thread-1-processing-n:127.0.0.1:59012_) [n:127.0.0.1:59012_ c:control_collection   x:collection1] o.a.s.s.FileExchangeRateProvider Reloading exchange rates from file currency.xml
   [junit4]   2> 2494714 INFO  (coreLoadExecutor-6920-thread-1-processing-n:127.0.0.1:59012_) [n:127.0.0.1:59012_ c:control_collection   x:collection1] o.a.s.s.OpenExchangeRatesOrgProvider Reloading exchange rates from open-exchange-rates.json
   [junit4]   2> 2494715 WARN  (coreLoadExecutor-6920-thread-1-processing-n:127.0.0.1:59012_) [n:127.0.0.1:59012_ c:control_collection   x:collection1] o.a.s.s.OpenExchangeRatesOrgProvider Unknown key IMPORTANT NOTE
   [junit4]   2> 2494715 WARN  (coreLoadExecutor-6920-thread-1-processing-n:127.0.0.1:59012_) [n:127.0.0.1:59012_ c:control_collection   x:collection1] o.a.s.s.OpenExchangeRatesOrgProvider Expected key, got STRING
   [junit4]   2> 2494715 INFO  (coreLoadExecutor-6920-thread-1-processing-n:127.0.0.1:59012_) [n:127.0.0.1:59012_ c:control_collection   x:collection1] o.a.s.s.OpenExchangeRatesOrgProvider Reloading exchange rates from open-exchange-rates.json
   [junit4]   2> 2494718 WARN  (coreLoadExecutor-6920-thread-1-processing-n:127.0.0.1:59012_) [n:127.0.0.1:59012_ c:control_collection   x:collection1] o.a.s.s.OpenExchangeRatesOrgProvider Unknown key IMPORTANT NOTE
   [junit4]   2> 2494718 WARN  (coreLoadExecutor-6920-thread-1-processing-n:127.0.0.1:59012_) [n:127.0.0.1:59012_ c:control_collection   x:collection1] o.a.s.s.OpenExchangeRatesOrgProvider Expected key, got STRING
   [junit4]   2> 2494719 INFO  (coreLoadExecutor-6920-thread-1-processing-n:127.0.0.1:59012_) [n:127.0.0.1:59012_ c:control_collection   x:collection1] o.a.s.c.CoreContainer Creating SolrCore 'collection1' using configuration from collection control_collection
   [junit4]   2> 2494719 INFO  (coreLoadExecutor-6920-thread-1-processing-n:127.0.0.1:59012_) [n:127.0.0.1:59012_ c:control_collection s:shard1 r:core_node1 x:collection1] o.a.s.c.SolrCore org.apache.solr.core.MockDirectoryFactory
   [junit4]   2> 2494720 INFO  (coreLoadExecutor-6920-thread-1-processing-n:127.0.0.1:59012_) [n:127.0.0.1:59012_ c:control_collection s:shard1 r:core_node1 x:collection1] o.a.s.c.SolrCore [[collection1] ] Opening new SolrCore at [C:\Users\JenkinsSlave\workspace\Lucene-Solr-trunk-Windows\solr\build\solr-core\test\J1\..\..\..\..\..\..\..\..\..\Users\JenkinsSlave\workspace\Lucene-Solr-trunk-Windows\solr\build\solr-core\test\J1\temp\solr.core.TestDynamicLoading 1F7DA3084F8671A6-001\control-001\cores\collection1\], dataDir=[null]
   [junit4]   2> 2494720 INFO  (coreLoadExecutor-6920-thread-1-processing-n:127.0.0.1:59012_) [n:127.0.0.1:59012_ c:control_collection s:shard1 r:core_node1 x:collection1] o.a.s.c.JmxMonitoredMap JMX monitoring is enabled. Adding Solr mbeans to JMX Server: com.sun.jmx.mbeanserver.JmxMBeanServer@669fd2
   [junit4]   2> 2494721 INFO  (coreLoadExecutor-6920-thread-1-processing-n:127.0.0.1:59012_) [n:127.0.0.1:59012_ c:control_collection s:shard1 r:core_node1 x:collection1] o.a.s.c.CachingDirectoryFactory return new directory for C:\Users\JenkinsSlave\workspace\Lucene-Solr-trunk-Windows\solr\build\solr-core\test\J1\..\..\..\..\..\..\..\..\..\Users\JenkinsSlave\workspace\Lucene-Solr-trunk-Windows\solr\build\solr-core\test\J1\temp\solr.core.TestDynamicLoading 1F7DA3084F8671A6-001\control-001\cores\collection1\data\
   [junit4]   2> 2494723 INFO  (coreLoadExecutor-6920-thread-1-processing-n:127.0.0.1:59012_) [n:127.0.0.1:59012_ c:control_collection s:shard1 r:core_node1 x:collection1] o.a.s.c.SolrCore New index directory detected: old=null new=C:\Users\JenkinsSlave\workspace\Lucene-Solr-trunk-Windows\solr\build\solr-core\test\J1\..\..\..\..\..\..\..\..\..\Users\JenkinsSlave\workspace\Lucene-Solr-trunk-Windows\solr\build\solr-core\test\J1\temp\solr.core.TestDynamicLoading 1F7DA3084F8671A6-001\control-001\cores\collection1\data\index/
   [junit4]   2> 2494723 WARN  (coreLoadExecutor-6920-thread-1-processing-n:127.0.0.1:59012_) [n:127.0.0.1:59012_ c:control_collection s:shard1 r:core_node1 x:collection1] o.a.s.c.SolrCore [collection1] Solr index directory 'C:\Users\JenkinsSlave\workspace\Lucene-Solr-trunk-Windows\solr\build\solr-core\test\J1\..\..\..\..\..\..\..\..\..\Users\JenkinsSlave\workspace\Lucene-Solr-trunk-Windows\solr\build\solr-core\test\J1\temp\solr.core.TestDynamicLoading 1F7DA3084F8671A6-001\control-001\cores\collection1\data\index' doesn't exist. Creating new index...
   [junit4]   2> 2494724 INFO  (coreLoadExecutor-6920-thread-1-processing-n:127.0.0.1:59012_) [n:127.0.0.1:59012_ c:control_collection s:shard1 r:core_node1 x:collection1] o.a.s.c.CachingDirectoryFactory return new directory for C:\Users\JenkinsSlave\workspace\Lucene-Solr-trunk-Windows\solr\build\solr-core\test\J1\..\..\..\..\..\..\..\..\..\Users\JenkinsSlave\workspace\Lucene-Solr-trunk-Windows\solr\build\solr-core\test\J1\temp\solr.core.TestDynamicLoading 1F7DA3084F8671A6-001\control-001\cores\collection1\data\index
   [junit4]   2> 2494724 INFO  (coreLoadExecutor-6920-thread-1-processing-n:127.0.0.1:59012_) [n:127.0.0.1:59012_ c:control_collection s:shard1 r:core_node1 x:collection1] o.a.s.u.RandomMergePolicy RandomMergePolicy wrapping class org.apache.lucene.index.TieredMergePolicy: [TieredMergePolicy: maxMergeAtOnce=50, maxMergeAtOnceExplicit=43, maxMergedSegmentMB=8.978515625, floorSegmentMB=0.76953125, forceMergeDeletesPctAllowed=6.103467197719265, segmentsPerTier=48.0, maxCFSSegmentSizeMB=1.0068359375, noCFSRatio=0.2732990623219528
   [junit4]   2> 2494725 INFO  (coreLoadExecutor-6920-thread-1-processing-n:127.0.0.1:59012_) [n:127.0.0.1:59012_ c:control_collection s:shard1 r:core_node1 x:collection1] o.a.s.c.SolrCore SolrDeletionPolicy.onCommit: commits: num=1
   [junit4]   2> 	commit{dir=MockDirectoryWrapper(NRTCachingDirectory(RAMDirectory@54ae83 lockFactory=org.apache.lucene.store.SingleInstanceLockFactory@1fbbf80; maxCacheMB=0.505859375 maxMergeSizeMB=0.1162109375)),segFN=segments_1,generation=1}
   [junit4]   2> 2494725 INFO  (coreLoadExecutor-6920-thread-1-processing-n:127.0.0.1:59012_) [n:127.0.0.1:59012_ c:control_collection s:shard1 r:core_node1 x:collection1] o.a.s.c.SolrCore newest commit generation = 1
   [junit4]   2> 2494735 INFO  (coreLoadExecutor-6920-thread-1-processing-n:127.0.0.1:59012_) [n:127.0.0.1:59012_ c:control_collection s:shard1 r:core_node1 x:collection1] o.a.s.u.p.UpdateRequestProcessorChain creating updateRequestProcessorChain "nodistrib"
   [junit4]   2> 2494735 INFO  (coreLoadExecutor-6920-thread-1-processing-n:127.0.0.1:59012_) [n:127.0.0.1:59012_ c:control_collection s:shard1 r:core_node1 x:collection1] o.a.s.u.p.UpdateRequestProcessorChain creating updateRequestProcessorChain "dedupe"
   [junit4]   2> 2494736 INFO  (coreLoadExecutor-6920-thread-1-processing-n:127.0.0.1:59012_) [n:127.0.0.1:59012_ c:control_collection s:shard1 r:core_node1 x:collection1] o.a.s.u.p.UpdateRequestProcessorChain inserting DistributedUpdateProcessorFactory into updateRequestProcessorChain "dedupe"
   [junit4]   2> 2494736 INFO  (coreLoadExecutor-6920-thread-1-processing-n:127.0.0.1:59012_) [n:127.0.0.1:59012_ c:control_collection s:shard1 r:core_node1 x:collection1] o.a.s.u.p.UpdateRequestProcessorChain creating updateRequestProcessorChain "stored_sig"
   [junit4]   2> 2494736 INFO  (coreLoadExecutor-6920-thread-1-processing-n:127.0.0.1:59012_) [n:127.0.0.1:59012_ c:control_collection s:shard1 r:core_node1 x:collection1] o.a.s.u.p.UpdateRequestProcessorChain inserting DistributedUpdateProcessorFactory into updateRequestProcessorChain "stored_sig"
   [junit4]   2> 2494736 INFO  (coreLoadExecutor-6920-thread-1-processing-n:127.0.0.1:59012_) [n:127.0.0.1:59012_ c:control_collection s:shard1 r:core_node1 x:collection1] o.a.s.u.p.UpdateRequestProcessorChain creating updateRequestProcessorChain "distrib-dup-test-chain-explicit"
   [junit4]   2> 2494737 INFO  (coreLoadExecutor-6920-thread-1-processing-n:127.0.0.1:59012_) [n:127.0.0.1:59012_ c:control_collection s:shard1 r:core_node1 x:collection1] o.a.s.u.p.UpdateRequestProcessorChain creating updateRequestProcessorChain "distrib-dup-test-chain-implicit"
   [junit4]   2> 2494739 INFO  (coreLoadExecutor-6920-thread-1-processing-n:127.0.0.1:59012_) [n:127.0.0.1:59012_ c:control_collection s:shard1 r:core_node1 x:collection1] o.a.s.u.p.UpdateRequestProcessorChain inserting DistributedUpdateProcessorFactory into updateRequestProcessorChain "distrib-dup-test-chain-implicit"
   [junit4]   2> 2494739 INFO  (coreLoadExecutor-6920-thread-1-processing-n:127.0.0.1:59012_) [n:127.0.0.1:59012_ c:control_collection s:shard1 r:core_node1 x:collection1] o.a.s.c.SolrCore no updateRequestProcessorChain defined as default, creating implicit default
   [junit4]   2> 2494746 INFO  (coreLoadExecutor-6920-thread-1-processing-n:127.0.0.1:59012_) [n:127.0.0.1:59012_ c:control_collection s:shard1 r:core_node1 x:collection1] o.a.s.h.l.XMLLoader xsltCacheLifetimeSeconds=60
   [junit4]   2> 2494748 INFO  (coreLoadExecutor-6920-thread-1-processing-n:127.0.0.1:59012_) [n:127.0.0.1:59012_ c:control_collection s:shard1 r:core_node1 x:collection1] o.a.s.h.l.XMLLoader xsltCacheLifetimeSeconds=60
   [junit4]   2> 2494751 INFO  (coreLoadExecutor-6920-thread-1-processing-n:127.0.0.1:59012_) [n:127.0.0.1:59012_ c:control_collection s:shard1 r:core_node1 x:collection1] o.a.s.h.l.XMLLoader xsltCacheLifetimeSeconds=60
   [junit4]   2> 2494754 INFO  (coreLoadExecutor-6920-thread-1-processing-n:127.0.0.1:59012_) [n:127.0.0.1:59012_ c:control_collection s:shard1 r:core_node1 x:collection1] o.a.s.h.l.XMLLoader xsltCacheLifetimeSeconds=60
   [junit4]   2> 2494764 INFO  (coreLoadExecutor-6920-thread-1-processing-n:127.0.0.1:59012_) [n:127.0.0.1:59012_ c:control_collection s:shard1 r:core_node1 x:collection1] o.a.s.c.RequestHandlers Registered paths: /admin/mbeans,standard,/update/csv,/update/json/docs,/admin/luke,/admin/segments,/get,/admin/system,/replication,/admin/properties,/config,/schema,/admin/plugins,/admin/logging,/update/json,/admin/threads,/admin/ping,/update,/admin/file
   [junit4]   2> 2494765 INFO  (coreLoadExecutor-6920-thread-1-processing-n:127.0.0.1:59012_) [n:127.0.0.1:59012_ c:control_collection s:shard1 r:core_node1 x:collection1] o.a.s.c.SolrCore Using default statsCache cache: org.apache.solr.search.stats.LocalStatsCache
   [junit4]   2> 2494768 INFO  (coreLoadExecutor-6920-thread-1-processing-n:127.0.0.1:59012_) [n:127.0.0.1:59012_ c:control_collection s:shard1 r:core_node1 x:collection1] o.a.s.u.UpdateHandler Using UpdateLog implementation: org.apache.solr.update.UpdateLog
   [junit4]   2> 2494769 INFO  (coreLoadExecutor-6920-thread-1-processing-n:127.0.0.1:59012_) [n:127.0.0.1:59012_ c:control_collection s:shard1 r:core_node1 x:collection1] o.a.s.u.UpdateLog Initializing UpdateLog: dataDir= defaultSyncLevel=FLUSH numRecordsToKeep=100 maxNumLogsToKeep=10 numVersionBuckets=65536
   [junit4]   2> 2494772 INFO  (coreLoadExecutor-6920-thread-1-processing-n:127.0.0.1:59012_) [n:127.0.0.1:59012_ c:control_collection s:shard1 r:core_node1 x:collection1] o.a.s.c.SolrCore Hard AutoCommit: disabled
   [junit4]   2> 2494772 INFO  (coreLoadExecutor-6920-thread-1-processing-n:127.0.0.1:59012_) [n:127.0.0.1:59012_ c:control_collection s:shard1 r:core_node1 x:collection1] o.a.s.c.SolrCore Soft AutoCommit: disabled
   [junit4]   2> 2494773 INFO  (coreLoadExecutor-6920-thread-1-processing-n:127.0.0.1:59012_) [n:127.0.0.1:59012_ c:control_collection s:shard1 r:core_node1 x:collection1] o.a.s.u.RandomMergePolicy RandomMergePolicy wrapping class org.apache.lucene.index.TieredMergePolicy: [TieredMergePolicy: maxMergeAtOnce=40, maxMergeAtOnceExplicit=16, maxMergedSegmentMB=41.802734375, floorSegmentMB=1.2978515625, forceMergeDeletesPctAllowed=15.542634883042002, segmentsPerTier=32.0, maxCFSSegmentSizeMB=8.796093022207999E12, noCFSRatio=0.8535466202888378
   [junit4]   2> 2494774 INFO  (coreLoadExecutor-6920-thread-1-processing-n:127.0.0.1:59012_) [n:127.0.0.1:59012_ c:control_collection s:shard1 r:core_node1 x:collection1] o.a.s.c.SolrCore SolrDeletionPolicy.onInit: commits: num=1
   [junit4]   2> 	commit{dir=MockDirectoryWrapper(NRTCachingDirectory(RAMDirectory@54ae83 lockFactory=org.apache.lucene.store.SingleInstanceLockFactory@1fbbf80; maxCacheMB=0.505859375 maxMergeSizeMB=0.1162109375)),segFN=segments_1,generation=1}
   [junit4]   2> 2494775 INFO  (coreLoadExecutor-6920-thread-1-processing-n:127.0.0.1:59012_) [n:127.0.0.1:59012_ c:control_collection s:shard1 r:core_node1 x:collection1] o.a.s.c.SolrCore newest commit generation = 1
   [junit4]   2> 2494775 INFO  (coreLoadExecutor-6920-thread-1-processing-n:127.0.0.1:59012_) [n:127.0.0.1:59012_ c:control_collection s:shard1 r:core_node1 x:collection1] o.a.s.s.SolrIndexSearcher Opening Searcher@160b643[collection1] main
   [junit4]   2> 2494778 INFO  (coreLoadExecutor-6920-thread-1-processing-n:127.0.0.1:59012_) [n:127.0.0.1:59012_ c:control_collection s:shard1 r:core_node1 x:collection1] o.a.s.r.ManagedResourceStorage Setting up ZooKeeper-based storage for the RestManager with znodeBase: /configs/conf1
   [junit4]   2> 2494780 INFO  (coreLoadExecutor-6920-thread-1-processing-n:127.0.0.1:59012_) [n:127.0.0.1:59012_ c:control_collection s:shard1 r:core_node1 x:collection1] o.a.s.r.ManagedResourceStorage Configured ZooKeeperStorageIO with znodeBase: /configs/conf1
   [junit4]   2> 2494780 INFO  (coreLoadExecutor-6920-thread-1-processing-n:127.0.0.1:59012_) [n:127.0.0.1:59012_ c:control_collection s:shard1 r:core_node1 x:collection1] o.a.s.r.RestManager Initializing RestManager with initArgs: {}
   [junit4]   2> 2494781 INFO  (coreLoadExecutor-6920-thread-1-processing-n:127.0.0.1:59012_) [n:127.0.0.1:59012_ c:control_collection s:shard1 r:core_node1 x:collection1] o.a.s.r.ManagedResourceStorage Reading _rest_managed.json using ZooKeeperStorageIO:path=/configs/conf1
   [junit4]   2> 2494783 INFO  (coreLoadExecutor-6920-thread-1-processing-n:127.0.0.1:59012_) [n:127.0.0.1:59012_ c:control_collection s:shard1 r:core_node1 x:collection1] o.a.s.r.ManagedResourceStorage No data found for znode /configs/conf1/_rest_managed.json
   [junit4]   2> 2494784 INFO  (coreLoadExecutor-6920-thread-1-processing-n:127.0.0.1:59012_) [n:127.0.0.1:59012_ c:control_collection s:shard1 r:core_node1 x:collection1] o.a.s.r.ManagedResourceStorage Loaded null at path _rest_managed.json using ZooKeeperStorageIO:path=/configs/conf1
   [junit4]   2> 2494784 INFO  (coreLoadExecutor-6920-thread-1-processing-n:127.0.0.1:59012_) [n:127.0.0.1:59012_ c:control_collection s:shard1 r:core_node1 x:collection1] o.a.s.r.RestManager Initializing 0 registered ManagedResources
   [junit4]   2> 2494784 INFO  (coreLoadExecutor-6920-thread-1-processing-n:127.0.0.1:59012_) [n:127.0.0.1:59012_ c:control_collection s:shard1 r:core_node1 x:collection1] o.a.s.h.ReplicationHandler Commits will be reserved for  10000
   [junit4]   2> 2494786 INFO  (searcherExecutor-6921-thread-1-processing-n:127.0.0.1:59012_ x:collection1 s:shard1 c:control_collection r:core_node1) [n:127.0.0.1:59012_ c:control_collection s:shard1 r:core_node1 x:collection1] o.a.s.c.SolrCore [collection1] Registered new searcher Searcher@160b643[collection1] main{ExitableDirectoryReader(UninvertingDirectoryReader())}
   [junit4]   2> 2494786 INFO  (coreLoadExecutor-6920-thread-1-processing-n:127.0.0.1:59012_) [n:127.0.0.1:59012_ c:control_collection s:shard1 r:core_node1 x:collection1] o.a.s.u.UpdateLog On first searcher opened, looking up max value of version field
   [junit4]   2> 2494787 INFO  (coreLoadExecutor-6920-thread-1-processing-n:127.0.0.1:59012_) [n:127.0.0.1:59012_ c:control_collection s:shard1 r:core_node1 x:collection1] o.a.s.u.VersionInfo Refreshing highest value of _version_ for 65536 version buckets from index
   [junit4]   2> 2494787 INFO  (coreLoadExecutor-6920-thread-1-processing-n:127.0.0.1:59012_) [n:127.0.0.1:59012_ c:control_collection s:shard1 r:core_node1 x:collection1] o.a.s.u.VersionInfo No terms found for _version_, cannot seed version bucket highest value from index
   [junit4]   2> 2494787 INFO  (coreLoadExecutor-6920-thread-1-processing-n:127.0.0.1:59012_) [n:127.0.0.1:59012_ c:control_collection s:shard1 r:core_node1 x:collection1] o.a.s.u.UpdateLog Could not find max version in index or recent updates, using new clock 1502874509018923008
   [junit4]   2> 2494790 INFO  (coreLoadExecutor-6920-thread-1-processing-n:127.0.0.1:59012_) [n:127.0.0.1:59012_ c:control_collection s:shard1 r:core_node1 x:collection1] o.a.s.u.UpdateLog Took 3 ms to seed version buckets with highest version 1502874509018923008
   [junit4]   2> 2494791 INFO  (coreLoadExecutor-6920-thread-1-processing-n:127.0.0.1:59012_) [n:127.0.0.1:59012_ c:control_collection s:shard1 r:core_node1 x:collection1] o.a.s.c.ZkController watch zkdir /configs/conf1
   [junit4]   2> 2494792 INFO  (coreLoadExecutor-6920-thread-1-processing-n:127.0.0.1:59012_) [n:127.0.0.1:59012_ c:control_collection s:shard1 r:core_node1 x:collection1] o.a.s.c.CoreContainer registering core: collection1
   [junit4]   2> 2494794 INFO  (coreZkRegister-6914-thread-1-processing-n:127.0.0.1:59012_ x:collection1 s:shard1 c:control_collection r:core_node1) [n:127.0.0.1:59012_ c:control_collection s:shard1 r:core_node1 x:collection1] o.a.s.c.ZkController Register replica - core:collection1 address:https://127.0.0.1:59012 collection:control_collection shard:shard1
   [junit4]   2> 2494803 INFO  (coreZkRegister-6914-thread-1-processing-n:127.0.0.1:59012_ x:collection1 s:shard1 c:control_collection r:core_node1) [n:127.0.0.1:59012_ c:control_collection s:shard1 r:core_node1 x:collection1] o.a.s.c.ShardLeaderElectionContext Running the leader process for shard shard1
   [junit4]   2> 2494806 INFO  (zkCallback-2138-thread-1-processing-n:127.0.0.1:59012_) [n:127.0.0.1:59012_    ] o.a.s.c.DistributedQueue NodeChildrenChanged fired on path /overseer/queue state SyncConnected
   [junit4]   2> 2494807 INFO  (coreZkRegister-6914-thread-1-processing-n:127.0.0.1:59012_ x:collection1 s:shard1 c:control_collection r:core_node1) [n:127.0.0.1:59012_ c:control_collection s:shard1 r:core_node1 x:collection1] o.a.s.c.ShardLeaderElectionContext Enough replicas found to continue.
   [junit4]   2> 2494807 INFO  (coreZkRegister-6914-thread-1-processing-n:127.0.0.1:59012_ x:collection1 s:shard1 c:control_collection r:core_node1) [n:127.0.0.1:59012_ c:control_collection s:shard1 r:core_node1 x:collection1] o.a.s.c.ShardLeaderElectionContext I may be the new leader - try and sync
   [junit4]   2> 2494807 INFO  (coreZkRegister-6914-thread-1-processing-n:127.0.0.1:59012_ x:collection1 s:shard1 c:control_collection r:core_node1) [n:127.0.0.1:59012_ c:control_collection s:shard1 r:core_node1 x:collection1] o.a.s.c.SyncStrategy Sync replicas to https://127.0.0.1:59012/collection1/
   [junit4]   2> 2494808 INFO  (coreZkRegister-6914-thread-1-processing-n:127.0.0.1:59012_ x:collection1 s:shard1 c:control_collection r:core_node1) [n:127.0.0.1:59012_ c:control_collection s:shard1 r:core_node1 x:collection1] o.a.s.c.SyncStrategy Sync Success - now sync replicas to me
   [junit4]   2> 2494808 INFO  (coreZkRegister-6914-thread-1-processing-n:127.0.0.1:59012_ x:collection1 s:shard1 c:control_collection r:core_node1) [n:127.0.0.1:59012_ c:control_collection s:shard1 r:core_node1 x:collection1] o.a.s.c.SyncStrategy https://127.0.0.1:59012/collection1/ has no replicas
   [junit4]   2> 2494808 INFO  (coreZkRegister-6914-thread-1-processing-n:127.0.0.1:59012_ x:collection1 s:shard1 c:control_collection r:core_node1) [n:127.0.0.1:59012_ c:control_collection s:shard1 r:core_node1 x:collection1] o.a.s.c.ShardLeaderElectionContext I am the new leader: https://127.0.0.1:59012/collection1/ shard1
   [junit4]   2> 2494808 INFO  (OverseerStateUpdate-93929656649973764-127.0.0.1:59012_-n_0000000000) [n:127.0.0.1:59012_    ] o.a.s.c.Overseer processMessage: queueSize: 1, message = {
   [junit4]   2>   "operation":"leader",
   [junit4]   2>   "shard":"shard1",
   [junit4]   2>   "collection":"control_collection"} current state version: 1
   [junit4]   2> 2494817 INFO  (zkCallback-2138-thread-1-processing-n:127.0.0.1:59012_) [n:127.0.0.1:59012_    ] o.a.s.c.DistributedQueue NodeChildrenChanged fired on path /overseer/queue state SyncConnected
   [junit4]   2> 2494819 INFO  (OverseerStateUpdate-93929656649973764-127.0.0.1:59012_-n_0000000000) [n:127.0.0.1:59012_    ] o.a.s.c.Overseer processMessage: queueSize: 1, message = {
   [junit4]   2>   "operation":"leader",
   [junit4]   2>   "shard":"shard1",
   [junit4]   2>   "collection":"control_collection",
   [junit4]   2>   "base_url":"https://127.0.0.1:59012",
   [junit4]   2>   "core":"collection1",
   [junit4]   2>   "state":"active"} current state version: 1
   [junit4]   2> 2495009 INFO  (coreZkRegister-6914-thread-1-processing-n:127.0.0.1:59012_ x:collection1 s:shard1 c:control_collection r:core_node1) [n:127.0.0.1:59012_ c:control_collection s:shard1 r:core_node1 x:collection1] o.a.s.c.ZkController We are https://127.0.0.1:59012/collection1/ and leader is https://127.0.0.1:59012/collection1/
   [junit4]   2> 2495009 INFO  (coreZkRegister-6914-thread-1-processing-n:127.0.0.1:59012_ x:collection1 s:shard1 c:control_collection r:core_node1) [n:127.0.0.1:59012_ c:control_collection s:shard1 r:core_node1 x:collection1] o.a.s.c.ZkController No LogReplay needed for core=collection1 baseURL=https://127.0.0.1:59012
   [junit4]   2> 2495009 INFO  (coreZkRegister-6914-thread-1-processing-n:127.0.0.1:59012_ x:collection1 s:shard1 c:control_collection r:core_node1) [n:127.0.0.1:59012_ c:control_collection s:shard1 r:core_node1 x:collection1] o.a.s.c.ZkController I am the leader, no recovery necessary
   [junit4]   2> 2495009 INFO  (coreZkRegister-6914-thread-1-processing-n:127.0.0.1:59012_ x:collection1 s:shard1 c:control_collection r:core_node1) [n:127.0.0.1:59012_ c:control_collection s:shard1 r:core_node1 x:collection1] o.a.s.c.ZkController publishing state=active
   [junit4]   2> 2495009 INFO  (coreZkRegister-6914-thread-1-processing-n:127.0.0.1:59012_ x:collection1 s:shard1 c:control_collection r:core_node1) [n:127.0.0.1:59012_ c:control_collection s:shard1 r:core_node1 x:collection1] o.a.s.c.ZkController numShards not found on descriptor - reading it from system property
   [junit4]   2> 2495011 INFO  (zkCallback-2138-thread-1-processing-n:127.0.0.1:59012_) [n:127.0.0.1:59012_    ] o.a.s.c.DistributedQueue NodeChildrenChanged fired on path /overseer/queue state SyncConnected
   [junit4]   2> 2495013 INFO  (OverseerStateUpdate-93929656649973764-127.0.0.1:59012_-n_0000000000) [n:127.0.0.1:59012_    ] o.a.s.c.Overseer processMessage: queueSize: 1, message = {
   [junit4]   2>   "core":"collection1",
   [junit4]   2>   "core_node_name":"core_node1",
   [junit4]   2>   "roles":null,
   [junit4]   2>   "base_url":"https://127.0.0.1:59012",
   [junit4]   2>   "node_name":"127.0.0.1:59012_",
   [junit4]   2>   "numShards":"1",
   [junit4]   2>   "state":"active",
   [junit4]   2>   "shard":"shard1",
   [junit4]   2>   "collection":"control_collection",
   [junit4]   2>   "operation":"state"} current state version: 2
   [junit4]   2> 2495014 INFO  (OverseerStateUpdate-93929656649973764-127.0.0.1:59012_-n_0000000000) [n:127.0.0.1:59012_    ] o.a.s.c.o.ReplicaMutator Update state numShards=1 message={
   [junit4]   2>   "core":"collection1",
   [junit4]   2>   "core_node_name":"core_node1",
   [junit4]   2>   "roles":null,
   [junit4]   2>   "base_url":"https://127.0.0.1:59012",
   [junit4]   2>   "node_name":"127.0.0.1:59012_",
   [junit4]   2>   "numShards":"1",
   [junit4]   2>   "state":"active",
   [junit4]   2>   "shard":"shard1",
   [junit4]   2>   "collection":"control_collection",
   [junit4]   2>   "operation":"state"}
   [junit4]   2> 2495038 INFO  (TEST-TestDynamicLoading.testDynamicLoading-seed#[1F7DA3084F8671A6]) [    ] o.a.s.c.ChaosMonkey monkey: init - expire sessions:false cause connection loss:false
   [junit4]   2> 2495518 INFO  (TEST-TestDynamicLoading.testDynamicLoading-seed#[1F7DA3084F8671A6]) [    ] o.a.s.SolrTestCaseJ4 Writing core.properties file to C:\Users\JenkinsSlave\workspace\Lucene-Solr-trunk-Windows\solr\build\solr-core\test\J1\temp\solr.core.TestDynamicLoading 1F7DA3084F8671A6-001\shard-1-001\cores\collection1
   [junit4]   2> 2495523 INFO  (TEST-TestDynamicLoading.testDynamicLoading-seed#[1F7DA3084F8671A6]) [    ] o.a.s.c.AbstractFullDistribZkTestBase create jetty 1 in directory C:\Users\JenkinsSlave\workspace\Lucene-Solr-trunk-Windows\solr\build\solr-core\test\J1\temp\solr.core.TestDynamicLoading 1F7DA3084F8671A6-001\shard-1-001
   [junit4]   2> 2495524 INFO  (TEST-TestDynamicLoading.testDynamicLoading-seed#[1F7DA3084F8671A6]) [    ] o.e.j.s.Server jetty-9.2.10.v20150310
   [junit4]   2> 2495530 INFO  (TEST-TestDynamicLoading.testDynamicLoading-seed#[1F7DA3084F8671A6]) [    ] o.e.j.s.h.ContextHandler Started o.e.j.s.ServletContextHandler@122cb11{/,null,AVAILABLE}
   [junit4]   2> 2495547 INFO  (TEST-TestDynamicLoading.testDynamicLoading-seed#[1F7DA3084F8671A6]) [    ] o.e.j.s.ServerConnector Started ServerConnector@1a83de4{SSL-http/1.1}{127.0.0.1:59042}
   [junit4]   2> 2495547 INFO  (TEST-TestDynamicLoading.testDynamicLoading-seed#[1F7DA3084F8671A6]) [    ] o.e.j.s.Server Started @2495155ms
   [junit4]   2> 2495547 INFO  (TEST-TestDynamicLoading.testDynamicLoading-seed#[1F7DA3084F8671A6]) [    ] o.a.s.c.s.e.JettySolrRunner Jetty properties: {solr.data.dir=C:\Users\JenkinsSlave\workspace\Lucene-Solr-trunk-Windows\solr\build\solr-core\test\J1\temp\solr.core.TestDynamicLoading 1F7DA3084F8671A6-001\tempDir-001/jetty1, solrconfig=solrconfig.xml, hostContext=/, hostPort=59042, coreRootDirectory=C:\Users\JenkinsSlave\workspace\Lucene-Solr-trunk-Windows\solr\build\solr-core\test\J1\temp\solr.core.TestDynamicLoading 1F7DA3084F8671A6-001\shard-1-001\cores}
   [junit4]   2> 2495554 INFO  (TEST-TestDynamicLoading.testDynamicLoading-seed#[1F7DA3084F8671A6]) [    ] o.a.s.s.SolrDispatchFilter SolrDispatchFilter.init()sun.misc.Launcher$AppClassLoader@e2f2a
   [junit4]   2> 2495554 INFO  (TEST-TestDynamicLoading.testDynamicLoading-seed#[1F7DA3084F8671A6]) [    ] o.a.s.c.SolrResourceLoader new SolrResourceLoader for directory: 'C:\Users\JenkinsSlave\workspace\Lucene-Solr-trunk-Windows\solr\build\solr-core\test\J1\temp\solr.core.TestDynamicLoading 1F7DA3084F8671A6-001\shard-1-001\'
   [junit4]   2> 2495599 INFO  (TEST-TestDynamicLoading.testDynamicLoading-seed#[1F7DA3084F8671A6]) [    ] o.a.s.c.SolrXmlConfig Loading container configuration from C:\Users\JenkinsSlave\workspace\Lucene-Solr-trunk-Windows\solr\build\solr-core\test\J1\temp\solr.core.TestDynamicLoading 1F7DA3084F8671A6-001\shard-1-001\solr.xml
   [junit4]   2> 2495611 INFO  (TEST-TestDynamicLoading.testDynamicLoading-seed#[1F7DA3084F8671A6]) [    ] o.a.s.c.CoresLocator Config-defined core root directory: C:\Users\JenkinsSlave\workspace\Lucene-Solr-trunk-Windows\solr\build\solr-core\test\J1\temp\solr.core.TestDynamicLoading 1F7DA3084F8671A6-001\shard-1-001\cores
   [junit4]   2> 2495611 INFO  (TEST-TestDynamicLoading.testDynamicLoading-seed#[1F7DA3084F8671A6]) [    ] o.a.s.c.CoreContainer New CoreContainer 6856132
   [junit4]   2> 2495611 INFO  (TEST-TestDynamicLoading.testDynamicLoading-seed#[1F7DA3084F8671A6]) [    ] o.a.s.c.CoreContainer Loading cores into CoreContainer [instanceDir=C:\Users\JenkinsSlave\workspace\Lucene-Solr-trunk-Windows\solr\build\solr-core\test\J1\temp\solr.core.TestDynamicLoading 1F7DA3084F8671A6-001\shard-1-001\]
   [junit4]   2> 2495612 INFO  (TEST-TestDynamicLoading.testDynamicLoading-seed#[1F7DA3084F8671A6]) [    ] o.a.s.c.CoreContainer loading shared library: C:\Users\JenkinsSlave\workspace\Lucene-Solr-trunk-Windows\solr\build\solr-core\test\J1\temp\solr.core.TestDynamicLoading 1F7DA3084F8671A6-001\shard-1-001\lib
   [junit4]   2> 2495612 WARN  (TEST-TestDynamicLoading.testDynamicLoading-seed#[1F7DA3084F8671A6]) [    ] o.a.s.c.SolrResourceLoader Can't find (or read) directory to add to classloader: lib (resolved as: C:\Users\JenkinsSlave\workspace\Lucene-Solr-trunk-Windows\solr\build\solr-core\test\J1\temp\solr.core.TestDynamicLoading 1F7DA3084F8671A6-001\shard-1-001\lib).
   [junit4]   2> 2495629 INFO  (TEST-TestDynamicLoading.testDynamicLoading-seed#[1F7DA3084F8671A6]) [    ] o.a.s.h.c.HttpShardHandlerFactory created with socketTimeout : 90000,urlScheme : ,connTimeout : 15000,maxConnectionsPerHost : 20,maxConnections : 10000,corePoolSize : 0,maximumPoolSize : 2147483647,maxThreadIdleTime : 5,sizeOfQueue : -1,fairnessPolicy : false,useRetries : false,
   [junit4]   2> 2495638 INFO  (TEST-TestDynamicLoading.testDynamicLoading-seed#[1F7DA3084F8671A6]) [    ] o.a.s.u.UpdateShardHandler Creating UpdateShardHandler HTTP client with params: socketTimeout=340000&connTimeout=45000&retry=true
   [junit4]   2> 2495643 INFO  (TEST-TestDynamicLoading.testDynamicLoading-seed#[1F7DA3084F8671A6]) [    ] o.a.s.l.LogWatcher SLF4J impl is org.slf4j.impl.Log4jLoggerFactory
   [junit4]   2> 2495644 INFO  (TEST-TestDynamicLoading.testDynamicLoading-seed#[1F7DA3084F8671A6]) [    ] o.a.s.l.LogWatcher Registering Log Listener [Log4j (org.slf4j.impl.Log4jLoggerFactory)]
   [junit4]   2> 2495644 INFO  (TEST-TestDynamicLoading.testDynamicLoading-seed#[1F7DA3084F8671A6]) [    ] o.a.s.c.ZkContainer Zookeeper client=127.0.0.1:59002/solr
   [junit4]   2> 2495644 INFO  (TEST-TestDynamicLoading.testDynamicLoading-seed#[1F7DA3084F8671A6]) [    ] o.a.s.c.ZkController zkHost includes chroot
   [junit4]   2> 2496938 INFO  (TEST-TestDynamicLoading.testDynamicLoading-seed#[1F7DA3084F8671A6]) [n:127.0.0.1:59042_    ] o.a.s.c.ZkController Register node as live in ZooKeeper:/live_nodes/127.0.0.1:59042_
   [junit4]   2> 2496946 INFO  (TEST-TestDynamicLoading.testDynamicLoading-seed#[1F7DA3084F8671A6]) [n:127.0.0.1:59042_    ] o.a.s.c.Overseer Overseer (id=null) closing
   [junit4]   2> 2496950 INFO  (TEST-TestDynamicLoading.testDynamicLoading-seed#[1F7DA3084F8671A6]) [n:127.0.0.1:59042_    ] o.a.s.c.CoreContainer No authentication plugin used.
   [junit4]   2> 2496952 INFO  (TEST-TestDynamicLoading.testDynamicLoading-seed#[1F7DA3084F8671A6]) [n:127.0.0.1:59042_    ] o.a.s.c.CoreContainer Security conf doesn't exist. Skipping setup for authorization module.
   [junit4]   2> 2496953 INFO  (TEST-TestDynamicLoading.testDynamicLoading-seed#[1F7DA3084F8671A6]) [n:127.0.0.1:59042_    ] o.a.s.c.CoresLocator Looking for core definitions underneath C:\Users\JenkinsSlave\workspace\Lucene-Solr-trunk-Windows\solr\build\solr-core\test\J1\temp\solr.core.TestDynamicLoading 1F7DA3084F8671A6-001\shard-1-001\cores
   [junit4]   2> 2496956 INFO  (TEST-TestDynamicLoading.testDynamicLoading-seed#[1F7DA3084F8671A6]) [n:127.0.0.1:59042_    ] o.a.s.c.SolrCore Created CoreDescriptor: {name=collection1, config=solrconfig.xml, transient=false, schema=schema.xml, loadOnStartup=true, instanceDir=C:\Users\JenkinsSlave\workspace\Lucene-Solr-trunk-Windows\solr\build\solr-core\test\J1\temp\solr.core.TestDynamicLoading 1F7DA3084F8671A6-001\shard-1-001\cores\collection1, collection=collection1, absoluteInstDir=C:\Users\JenkinsSlave\workspace\Lucene-Solr-trunk-Windows\solr\build\solr-core\test\J1\temp\solr.core.TestDynamicLoading 1F7DA3084F8671A6-001\shard-1-001\cores\collection1\, coreNodeName=, dataDir=data\, shard=}
   [junit4]   2> 2496957 INFO  (TEST-TestDynamicLoading.testDynamicLoading-seed#[1F7DA3084F8671A6]) [n:127.0.0.1:59042_    ] o.a.s.c.CoresLocator Found core collection1 in C:\Users\JenkinsSlave\workspace\Lucene-Solr-trunk-Windows\solr\build\solr-core\test\J1\temp\solr.core.TestDynamicLoading 1F7DA3084F8671A6-001\shard-1-001\cores\collection1\
   [junit4]   2> 2496957 INFO  (TEST-TestDynamicLoading.testDynamicLoading-seed#[1F7DA3084F8671A6]) [n:127.0.0.1:59042_    ] o.a.s.c.CoresLocator Found 1 core definitions
   [junit4]   2> 2496962 INFO  (coreLoadExecutor-6931-thread-1-processing-n:127.0.0.1:59042_) [n:127.0.0.1:59042_ c:collection1   x:collection1] o.a.s.c.ZkController publishing state=down
   [junit4]   2> 2496963 INFO  (coreLoadExecutor-6931-thread-1-processing-n:127.0.0.1:59042_) [n:127.0.0.1:59042_ c:collection1   x:collection1] o.a.s.c.ZkController numShards not found on descriptor - reading it from system property
   [junit4]   2> 2496964 INFO  (TEST-TestDynamicLoading.testDynamicLoading-seed#[1F7DA3084F8671A6]) [n:127.0.0.1:59042_    ] o.a.s.s.SolrDispatchFilter user.dir=C:\Users\JenkinsSlave\workspace\Lucene-Solr-trunk-Windows\solr\build\solr-core\test\J1
   [junit4]   2> 2496964 INFO  (TEST-TestDynamicLoading.testDynamicLoading-seed#[1F7DA3084F8671A6]) [n:127.0.0.1:59042_    ] o.a.s.s.SolrDispatchFilter SolrDispatchFilter.init() done
   [junit4]   2> 2496964 INFO  (coreLoadExecutor-6931-thread-1-processing-n:127.0.0.1:59042_) [n:127.0.0.1:59042_ c:collection1   x:collection1] o.a.s.c.ZkController look for our core node name
   [junit4]   2> 2496964 INFO  (zkCallback-2138-thread-1-processing-n:127.0.0.1:59012_) [n:127.0.0.1:59012_    ] o.a.s.c.DistributedQueue NodeChildrenChanged fired on path /overseer/queue state SyncConnected
   [junit4]   2> 2496967 INFO  (OverseerStateUpdate-93929656649973764-127.0.0.1:59012_-n_0000000000) [n:127.0.0.1:59012_    ] o.a.s.c.Overseer processMessage: queueSize: 1, message = {
   [junit4]   2>   "core":"collection1",
   [junit4]   2>   "roles":null,
   [junit4]   2>   "base_url":"https://127.0.0.1:59042",
   [junit4]   2>   "node_name":"127.0.0.1:59042_",
   [junit4]   2>   "numShards":"2",
   [junit4]   2>   "state":"down",
   [junit4]   2>   "shard":null,
   [junit4]   2>   "collection":"collection1",
   [junit4]   2>   "operation":"state"} current state version: 3
   [junit4]   2> 2496969 INFO  (OverseerStateUpdate-93929656649973764-127.0.0.1:59012_-n_0000000000) [n:127.0.0.1:59012_    ] o.a.s.c.o.ReplicaMutator Update state numShards=2 message={
   [junit4]   2>   "core":"collection1",
   [junit4]   2>   "roles":null,
   [junit4]   2>   "base_url":"https://127.0.0.1:59042",
   [junit4]   2>   "node_name":"127.0.0.1:59042_",
   [junit4]   2>   "numShards":"2",
   [junit4]   2>   "state":"down",
   [junit4]   2>   "shard":null,
   [junit4]   2>   "collection":"collection1",
   [junit4]   2>   "operation":"state"}
   [junit4]   2> 2496969 INFO  (OverseerStateUpdate-93929656649973764-127.0.0.1:59012_-n_0000000000) [n:127.0.0.1:59012_    ] o.a.s.c.o.ClusterStateMutator building a new cName: collection1
   [junit4]   2> 2496969 INFO  (OverseerStateUpdate-93929656649973764-127.0.0.1:59012_-n_0000000000) [n:127.0.0.1:59012_    ] o.a.s.c.o.ReplicaMutator Assigning new node to shard shard=shard2
   [junit4]   2> 2498218 INFO  (coreLoadExecutor-6931-thread-1-processing-n:127.0.0.1:59042_) [n:127.0.0.1:59042_ c:collection1   x:collection1] o.a.s.c.ZkController waiting to find shard id in clusterstate for collection1
   [junit4]   2> 2498219 INFO  (coreLoadExecutor-6931-thread-1-processing-n:127.0.0.1:59042_) [n:127.0.0.1:59042_ c:collection1   x:collection1] o.a.s.c.ZkController Check for collection zkNode:collection1
   [junit4]   2> 2498224 INFO  (coreLoadExecutor-6931-thread-1-processing-n:127.0.0.1:59042_) [n:127.0.0.1:59042_ c:collection1   x:collection1] o.a.s.c.ZkController Collection zkNode exists
   [junit4]   2> 2498230 INFO  (coreLoadExecutor-6931-thread-1-processing-n:127.0.0.1:59042_) [n:127.0.0.1:59042_ c:collection1   x:collection1] o.a.s.c.SolrResourceLoader new SolrResourceLoader for directory: 'C:\Users\JenkinsSlave\workspace\Lucene-Solr-trunk-Windows\solr\build\solr-core\test\J1\temp\solr.core.TestDynamicLoading 1F7DA3084F8671A6-001\shard-1-001\cores\collection1\'
   [junit4]   2> 2498304 INFO  (coreLoadExecutor-6931-thread-1-processing-n:127.0.0.1:59042_) [n:127.0.0.1:59042_ c:collection1   x:collection1] o.a.s.c.Config loaded config solrconfig.xml with version 0 
   [junit4]   2> 2498324 INFO  (coreLoadExecutor-6931-thread-1-processing-n:127.0.0.1:59042_) [n:127.0.0.1:59042_ c:collection1   x:collection1] o.a.s.c.SolrConfig current version of requestparams : -1
   [junit4]   2> 2498334 INFO  (coreLoadExecutor-6931-thread-1-processing-n:127.0.0.1:59042_) [n:127.0.0.1:59042_ c:collection1   x:collection1] o.a.s.c.SolrConfig Using Lucene MatchVersion: 6.0.0
   [junit4]   2> 2498352 INFO  (coreLoadExecutor-6931-thread-1-processing-n:127.0.0.1:59042_) [n:127.0.0.1:59042_ c:collection1   x:collection1] o.a.s.c.Config Loaded SolrConfig: solrconfig.xml
   [junit4]   2> 2498358 INFO  (coreLoadExecutor-6931-thread-1-processing-n:127.0.0.1:59042_) [n:127.0.0.1:59042_ c:collection1   x:collection1] o.a.s.s.IndexSchema Reading Solr Schema from /configs/conf1/schema.xml
   [junit4]   2> 2498375 INFO  (coreLoadExecutor-6931-thread-1-processing-n:127.0.0.1:59042_) [n:127.0.0.1:59042_ c:collection1   x:collection1] o.a.s.s.IndexSchema [collection1] Schema name=test
   [junit4]   2> 2498597 INFO  (coreLoadExecutor-6931-thread-1-processing-n:127.0.0.1:59042_) [n:127.0.0.1:59042_ c:collection1   x:collection1] o.a.s.s.OpenExchangeRatesOrgProvider Initialized with rates=open-exchange-rates.json, refreshInterval=1440.
   [junit4]   2> 2498616 INFO  (coreLoadExecutor-6931-thread-1-processing-n:127.0.0.1:59042_) [n:127.0.0.1:59042_ c:collection1   x:collection1] o.a.s.s.IndexSchema default search field in schema is text
   [junit4]   2> 2498620 INFO  (coreLoadExecutor-6931-thread-1-processing-n:127.0.0.1:59042_) [n:127.0.0.1:59042_ c:collection1   x:collection1] o.a.s.s.IndexSchema unique key field: id
   [junit4]   2> 2498683 INFO  (coreLoadExecutor-6931-thread-1-processing-n:127.0.0.1:59042_) [n:127.0.0.1:59042_ c:collection1   x:collection1] o.a.s.s.FileExchangeRateProvider Reloading exchange rates from file currency.xml
   [junit4]   2> 2498691 INFO  (coreLoadExecutor-6931-thread-1-processing-n:127.0.0.1:59042_) [n:127.0.0.1:59042_ c:collection1   x:collection1] o.a.s.s.FileExchangeRateProvider Reloading exchange rates from file currency.xml
   [junit4]   2> 2498698 INFO  (coreLoadExecutor-6931-thread-1-processing-n:127.0.0.1:59042_) [n:127.0.0.1:59042_ c:collection1   x:collection1] o.a.s.s.OpenExchangeRatesOrgProvider Reloading exchange rates from open-exchange-rates.json
   [junit4]   2> 2498701 WARN  (coreLoadExecutor-6931-thread-1-processing-n:127.0.0.1:59042_) [n:127.0.0.1:59042_ c:collection1   x:collection1] o.a.s.s.OpenExchangeRatesOrgProvider Unknown key IMPORTANT NOTE
   [junit4]   2> 2498702 WARN  (coreLoadExecutor-6931-thread-1-processing-n:127.0.0.1:59042_) [n:127.0.0.1:59042_ c:collection1   x:collection1] o.a.s.s.OpenExchangeRatesOrgProvider Expected key, got STRING
   [junit4]   2> 2498702 INFO  (coreLoadExecutor-6931-thread-1-processing-n:127.0.0.1:59042_) [n:127.0.0.1:59042_ c:collection1   x:collection1] o.a.s.s.OpenExchangeRatesOrgProvider Reloading exchange rates from open-exchange-rates.json
   [junit4]   2> 2498705 WARN  (coreLoadExecutor-6931-thread-1-processing-n:127.0.0.1:59042_) [n:127.0.0.1:59042_ c:collection1   x:collection1] o.a.s.s.OpenExchangeRatesOrgProvider Unknown key IMPORTANT NOTE
   [junit4]   2> 2498706 WARN  (coreLoadExecutor-6931-thread-1-processing-n:127.0.0.1:59042_) [n:127.0.0.1:59042_ c:collection1   x:collection1] o.a.s.s.OpenExchangeRatesOrgProvider Expected key, got STRING
   [junit4]   2> 2498706 INFO  (coreLoadExecutor-6931-thread-1-processing-n:127.0.0.1:59042_) [n:127.0.0.1:59042_ c:collection1   x:collection1] o.a.s.c.CoreContainer Creating SolrCore 'collection1' using configuration from collection collection1
   [junit4]   2> 2498706 INFO  (coreLoadExecutor-6931-thread-1-processing-n:127.0.0.1:59042_) [n:127.0.0.1:59042_ c:collection1 s:shard2 r:core_node1 x:collection1] o.a.s.c.SolrCore org.apache.solr.core.MockDirectoryFactory
   [junit4]   2> 2498707 INFO  (coreLoadExecutor-6931-thread-1-processing-n:127.0.0.1:59042_) [n:127.0.0.1:59042_ c:collection1 s:shard2 r:core_node1 x:collection1] o.a.s.c.SolrCore [[collection1] ] Opening new SolrCore at [C:\Users\JenkinsSlave\workspace\Lucene-Solr-trunk-Windows\solr\build\solr-core\test\J1\temp\solr.core.TestDynamicLoading 1F7DA3084F8671A6-001\shard-1-001\cores\collection1\], dataDir=[null]
   [junit4]   2> 2498707 INFO  (coreLoadExecutor-6931-thread-1-processing-n:127.0.0.1:59042_) [n:127.0.0.1:59042_ c:collection1 s:shard2 r:core_node1 x:collection1] o.a.s.c.JmxMonitoredMap JMX monitoring is enabled. Adding Solr mbeans to JMX Server: com.sun.jmx.mbeanserver.JmxMBeanServer@669fd2
   [junit4]   2> 2498708 INFO  (coreLoadExecutor-6931-thread-1-processing-n:127.0.0.1:59042_) [n:127.0.0.1:59042_ c:collection1 s:shard2 r:core_node1 x:collection1] o.a.s.c.CachingDirectoryFactory return new directory for C:\Users\JenkinsSlave\workspace\Lucene-Solr-trunk-Windows\solr\build\solr-core\test\J1\temp\solr.core.TestDynamicLoading 1F7DA3084F8671A6-001\shard-1-001\cores\collection1\data\
   [junit4]   2> 2498709 INFO  (coreLoadExecutor-6931-thread-1-processing-n:127.0.0.1:59042_) [n:127.0.0.1:59042_ c:collection1 s:shard2 r:core_node1 x:collection1] o.a.s.c.SolrCore New index directory detected: old=null new=C:\Users\JenkinsSlave\workspace\Lucene-Solr-trunk-Windows\solr\build\solr-core\test\J1\temp\solr.core.TestDynamicLoading 1F7DA3084F8671A6-001\shard-1-001\cores\collection1\data\index/
   [junit4]   2> 2498709 WARN  (coreLoadExecutor-6931-thread-1-processing-n:127.0.0.1:59042_) [n:127.0.0.1:59042_ c:collection1 s:shard2 r:core_node1 x:collection1] o.a.s.c.SolrCore [collection1] Solr index directory 'C:\Users\JenkinsSlave\workspace\Lucene-Solr-trunk-Windows\solr\build\solr-core\test\J1\temp\solr.core.TestDynamicLoading 1F7DA3084F8671A6-001\shard-1-001\cores\collection1\data\index' doesn't exist. Creating new index...
   [junit4]   2> 2498711 INFO  (coreLoadExecutor-6931-thread-1-processing-n:127.0.0.1:59042_) [n:127.0.0.1:59042_ c:collection1 s:shard2 r:core_node1 x:collection1] o.a.s.c.CachingDirectoryFactory return new directory for C:\Users\JenkinsSlave\workspace\Lucene-Solr-trunk-Windows\solr\build\solr-core\test\J1\temp\solr.core.TestDynamicLoading 1F7DA3084F8671A6-001\shard-1-001\cores\collection1\data\index
   [junit4]   2> 2498711 INFO  (coreLoadExecutor-6931-thread-1-processing-n:127.0.0.1:59042_) [n:127.0.0.1:59042_ c:collection1 s:shard2 r:core_node1 x:collection1] o.a.s.u.RandomMergePolicy RandomMergePolicy wrapping class org.apache.lucene.index.TieredMergePolicy: [TieredMergePolicy: maxMergeAtOnce=50, maxMergeAtOnceExplicit=43, maxMergedSegmentMB=8.978515625, floorSegmentMB=0.76953125, forceMergeDeletesPctAllowed=6.103467197719265, segmentsPerTier=48.0, maxCFSSegmentSizeMB=1.0068359375, noCFSRatio=0.2732990623219528
   [junit4]   2> 2498712 INFO  (coreLoadExecutor-6931-thread-1-processing-n:127.0.0.1:59042_) [n:127.0.0.1:59042_ c:collection1 s:shard2 r:core_node1 x:collection1] o.a.s.c.SolrCore SolrDeletionPolicy.onCommit: commits: num=1
   [junit4]   2> 	commit{dir=MockDirectoryWrapper(NRTCachingDirectory(RAMDirectory@1d6e57d lockFactory=org.apache.lucene.store.SingleInstanceLockFactory@1fb5159; maxCacheMB=0.505859375 maxMergeSizeMB=0.1162109375)),segFN=segments_1,generation=1}
   [junit4]   2> 2498713 INFO  (coreLoadExecutor-6931-thread-1-processing-n:127.0.0.1:59042_) [n:127.0.0.1:59042_ c:collection1 s:shard2 r:core_node1 x:collection1] o.a.s.c.SolrCore newest commit generation = 1
   [junit4]   2> 2498727 INFO  (coreLoadExecutor-6931-thread-1-processing-n:127.0.0.1:59042_) [n:127.0.0.1:59042_ c:collection1 s:shard2 r:core_node1 x:collection1] o.a.s.u.p.UpdateRequestProcessorChain creating updateRequestProcessorChain "nodistrib"
   [junit4]   2> 2498728 INFO  (coreLoadExecutor-6931-thread-1-processing-n:127.0.0.1:59042_) [n:127.0.0.1:59042_ c:collection1 s:shard2 r:core_node1 x:collection1] o.a.s.u.p.UpdateRequestProcessorChain creating updateRequestProcessorChain "dedupe"
   [junit4]   2> 2498729 INFO  (coreLoadExecutor-6931-thread-1-processing-n:127.0.0.1:59042_) [n:127.0.0.1:59042_ c:collection1 s:shard2 r:core_node1 x:collection1] o.a.s.u.p.UpdateRequestProcessorChain inserting DistributedUpdateProcessorFactory into updateRequestProcessorChain "dedupe"
   [junit4]   2> 2498729 INFO  (coreLoadExecutor-6931-thread-1-processing-n:127.0.0.1:59042_) [n:127.0.0.1:59042_ c:collection1 s:shard2 r:core_node1 x:collection1] o.a.s.u.p.UpdateRequestProcessorChain creating updateRequestProcessorChain "stored_sig"
   [junit4]   2> 2498729 INFO  (coreLoadExecutor-6931-thread-1-processing-n:127.0.0.1:59042_) [n:127.0.0.1:59042_ c:collection1 s:shard2 r:core_node1 x:collection1] o.a.s.u.p.UpdateRequestProcessorChain inserting DistributedUpdateProcessorFactory into updateRequestProcessorChain "stored_sig"
   [junit4]   2> 2498729 INFO  (coreLoadExecutor-6931-thread-1-processing-n:127.0.0.1:59042_) [n:127.0.0.1:59042_ c:collection1 s:shard2 r:core_node1 x:collection1] o.a.s.u.p.UpdateRequestProcessorChain creating updateRequestProcessorChain "distrib-dup-test-chain-explicit"
   [junit4]   2> 2498730 INFO  (coreLoadExecutor-6931-thread-1-processing-n:127.0.0.1:59042_) [n:127.0.0.1:59042_ c:collection1 s:shard2 r:core_node1 x:collection1] o.a.s.u.p.UpdateRequestProcessorChain creating updateRequestProcessorChain "distrib-dup-test-chain-implicit"
   [junit4]   2> 2498731 INFO  (coreLoadExecutor-6931-thread-1-processing-n:127.0.0.1:59042_) [n:127.0.0.1:59042_ c:collection1 s:shard2 r:core_node1 x:collection1] o.a.s.u.p.UpdateRequestProcessorChain inserting DistributedUpdateProcessorFactory into updateRequestProcessorChain "distrib-dup-test-chain-implicit"
   [junit4]   2> 2498731 INFO  (coreLoadExecutor-6931-thread-1-processing-n:127.0.0.1:59042_) [n:127.0.0.1:59042_ c:collection1 s:shard2 r:core_node1 x:collection1] o.a.s.c.SolrCore no updateRequestProcessorChain defined as default, creating implicit default
   [junit4]   2> 2498741 INFO  (coreLoadExecutor-6931-thread-1-processing-n:127.0.0.1:59042_) [n:127.0.0.1:59042_ c:collection1 s:shard2 r:core_node1 x:collection1] o.a.s.h.l.XMLLoader xsltCacheLifetimeSeconds=60
   [junit4]   2> 2498746 INFO  (coreLoadExecutor-6931-thread-1-processing-n:127.0.0.1:59042_) [n:127.0.0.1:59042_ c:collection1 s:shard2 r:core_node1 x:collection1] o.a.s.h.l.XMLLoader xsltCacheLifetimeSeconds=60
   [junit4]   2> 2498750 INFO  (coreLoadExecutor-6931-thread-1-processing-n:127.0.0.1:59042_) [n:127.0.0.1:59042_ c:collection1 s:shard2 r:core_node1 x:collection1] o.a.s.h.l.XMLLoader xsltCacheLifetimeSeconds=60
   [junit4]   2> 2498755 INFO  (coreLoadExecutor-6931-thread-1-processing-n:127.0.0.1:59042_) [n:127.0.0.1:59042_ c:collection1 s:shard2 r:core_node1 x:collection1] o.a.s.h.l.XMLLoader xsltCacheLifetimeSeconds=60
   [junit4]   2> 2498805 INFO  (coreLoadExecutor-6931-thread-1-processing-n:127.0.0.1:59042_) [n:127.0.0.1:59042_ c:collection1 s:shard2 r:core_node1 x:collection1] o.a.s.c.RequestHandlers Registered paths: /admin/mbeans,standard,/update/csv,/update/json/docs,/admin/luke,/admin/segments,/get,/admin/system,/replication,/admin/properties,/config,/schema,/admin/plugins,/admin/logging,/update/json,/admin/threads,/admin/ping,/update,/admin/file
   [junit4]   2> 2498806 INFO  (coreLoadExecutor-6931-thread-1-processing-n:127.0.0.1:59042_) [n:127.0.0.1:59042_ c:collection1 s:shard2 r:core_node1 x:collection1] o.a.s.c.SolrCore Using default statsCache cache: org.apache.solr.search.stats.LocalStatsCache
   [junit4]   2> 2498809 INFO  (coreLoadExecutor-6931-thread-1-processing-n:127.0.0.1:59042_) [n:127.0.0.1:59042_ c:collection1 s:shard2 r:core_node1 x:collection1] o.a.s.u.UpdateHandler Using UpdateLog implementation: org.apache.solr.update.UpdateLog
   [junit4]   2> 2498809 INFO  (coreLoadExecutor-6931-thread-1-processing-n:127.0.0.1:59042_) [n:127.0.0.1:59042_ c:collection1 s:shard2 r:core_node1 x:collection1] o.a.s.u.UpdateLog Initializing UpdateLog: dataDir= defaultSyncLevel=FLUSH numRecordsToKeep=100 maxNumLogsToKeep=10 numVersionBuckets=65536
   [junit4]   2> 2498811 INFO  (coreLoadExecutor-6931-thread-1-processing-n:127.0.0.1:59042_) [n:127.0.0.1:59042_ c:collection1 s:shard2 r:core_node1 x:collection1] o.a.s.c.SolrCore Hard AutoCommit: disabled
   [junit4]   2> 2498811 INFO  (coreLoadExecutor-6931-thread-1-processing-n:127.0.0.1:59042_) [n:127.0.0.1:59042_ c:collection1 s:shard2 r:core_node1 x:collection1] o.a.s.c.SolrCore Soft AutoCommit: disabled
   [junit4]   2> 2498812 INFO  (coreLoadExecutor-6931-thread-1-processing-n:127.0.0.1:59042_) [n:127.0.0.1:59042_ c:collection1 s:shard2 r:core_node1 x:collection1] o.a.s.u.RandomMergePolicy RandomMergePolicy wrapping class org.apache.lucene.index.TieredMergePolicy: [TieredMergePolicy: maxMergeAtOnce=40, maxMergeAtOnceExplicit=16, maxMergedSegmentMB=41.802734375, floorSegmentMB=1.2978515625, forceMergeDeletesPctAllowed=15.542634883042002, segmentsPerTier=32.0, maxCFSSegmentSizeMB=8.796093022207999E12, noCFSRatio=0.8535466202888378
   [junit4]   2> 2498813 INFO  (coreLoadExecutor-6931-thread-1-processing-n:127.0.0.1:59042_) [n:127.0.0.1:59042_ c:collection1 s:shard2 r:core_node1 x:collection1] o.a.s.c.SolrCore SolrDeletionPolicy.onInit: commits: num=1
   [junit4]   2> 	commit{dir=MockDirectoryWrapper(NRTCachingDirectory(RAMDirectory@1d6e57d lockFactory=org.apache.lucene.store.SingleInstanceLockFactory@1fb5159; maxCacheMB=0.505859375 maxMergeSizeMB=0.1162109375)),segFN=segments_1,generation=1}
   [junit4]   2> 2498813 INFO  (coreLoadExecutor-6931-thread-1-processing-n:127.0.0.1:59042_) [n:127.0.0.1:59042_ c:collection1 s:shard2 r:core_node1 x:collection1] o.a.s.c.SolrCore newest commit generation = 1
   [junit4]   2> 2498813 INFO  (coreLoadExecutor-6931-thread-1-processing-n:127.0.0.1:59042_) [n:127.0.0.1:59042_ c:collection1 s:shard2 r:core_node1 x:collection1] o.a.s.s.SolrIndexSearcher Opening Searcher@73ed37[collection1] main
   [junit4]   2> 2498816 INFO  (coreLoadExecutor-6931-thread-1-processing-n:127.0.0.1:59042_) [n:127.0.0.1:59042_ c:collection1 s:shard2 r:core_node1 x:collection1] o.a.s.r.ManagedResourceStorage Setting up ZooKeeper-based storage for the RestManager with znodeBase: /configs/conf1
   [junit4]   2> 2498817 INFO  (coreLoadExecutor-6931-thread-1-processing-n:127.0.0.1:59042_) [n:127.0.0.1:59042_ c:collection1 s:shard2 r:core_node1 x:collection1] o.a.s.r.ManagedResourceStorage Configured ZooKeeperStorageIO with znodeBase: /configs/conf1
   [junit4]   2> 2498818 INFO  (coreLoadExecutor-6931-thread-1-processing-n:127.0.0.1:59042_) [n:127.0.0.1:59042_ c:collection1 s:shard2 r:core_node1 x:collection1] o.a.s.r.RestManager Initializing RestManager with initArgs: {}
   [junit4]   2> 2498818 INFO  (coreLoadExecutor-6931-thread-1-processing-n:127.0.0.1:59042_) [n:127.0.0.1:59042_ c:collection1 s:shard2 r:core_node1 x:collection1] o.a.s.r.ManagedResourceStorage Reading _rest_managed.json using ZooKeeperStorageIO:path=/configs/conf1
   [junit4]   2> 2498820 INFO  (coreLoadExecutor-6931-thread-1-processing-n:127.0.0.1:59042_) [n:127.0.0.1:59042_ c:collection1 s:shard2 r:core_node1 x:collection1] o.a.s.r.ManagedResourceStorage No data found for znode /configs/conf1/_rest_managed.json
   [junit4]   2> 2498820 INFO  (coreLoadExecutor-6931-thread-1-processing-n:127.0.0.1:59042_) [n:127.0.0.1:59042_ c:collection1 s:shard2 r:core_node1 x:collection1] o.a.s.r.ManagedResourceStorage Loaded null at path _rest_managed.json using ZooKeeperStorageIO:path=/configs/conf1
   [junit4]   2> 2498821 INFO  (coreLoadExecutor-6931-thread-1-processing-n:127.0.0.1:59042_) [n:127.0.0.1:59042_ c:collection1 s:shard2 r:core_node1 x:collection1] o.a.s.r.RestManager Initializing 0 registered ManagedResources
   [junit4]   2> 2498821 INFO  (coreLoadExecutor-6931-thread-1-processing-n:127.0.0.1:59042_) [n:127.0.0.1:59042_ c:collection1 s:shard2 r:core_node1 x:collection1] o.a.s.h.ReplicationHandler Commits will be reserved for  10000
   [junit4]   2> 2498823 INFO  (searcherExecutor-6932-thread-1-processing-n:127.0.0.1:59042_ x:collection1 s:shard2 c:collection1 r:core_node1) [n:127.0.0.1:59042_ c:collection1 s:shard2 r:core_node1 x:collection1] o.a.s.c.SolrCore [collection1] Registered new searcher Searcher@73ed37[collection1] main{ExitableDirectoryReader(UninvertingDirectoryReader())}
   [junit4]   2> 2498824 INFO  (coreLoadExecutor-6931-thread-1-processing-n:127.0.0.1:59042_) [n:127.0.0.1:59042_ c:collection1 s:shard2 r:core_node1 x:collection1] o.a.s.u.UpdateLog On first searcher opened, looking up max value of version field
   [junit4]   2> 2498824 INFO  (coreLoadExecutor-6931-thread-1-processing-n:127.0.0.1:59042_) [n:127.0.0.1:59042_ c:collection1 s:shard2 r:core_node1 x:collection1] o.a.s.u.VersionInfo Refreshing highest value of _version_ for 65536 version buckets from index
   [junit4]   2> 2498824 INFO  (coreLoadExecutor-6931-thread-1-processing-n:127.0.0.1:59042_) [n:127.0.0.1:59042_ c:collection1 s:shard2 r:core_node1 x:collection1] o.a.s.u.VersionInfo No terms found for _version_, cannot seed version bucket highest value from index
   [junit4]   2> 2498824 INFO  (coreLoadExecutor-6931-thread-1-processing-n:127.0.0.1:59042_) [n:127.0.0.1:59042_ c:collection1 s:shard2 r:core_node1 x:collection1] o.a.s.u.UpdateLog Could not find max version in index or recent updates, using new clock 1502874513252024320
   [junit4]   2> 2498828 INFO  (coreLoadExecutor-6931-thread-1-processing-n:127.0.0.1:59042_) [n:127.0.0.1:59042_ c:collection1 s:shard2 r:core_node1 x:collection1] o.a.s.u.UpdateLog Took 4 ms to seed version buckets with highest version 1502874513252024320
   [junit4]   2> 2498828 INFO  (coreLoadExecutor-6931-thread-1-processing-n:127.0.0.1:59042_) [n:127.0.0.1:59042_ c:collection1 s:shard2 r:core_node1 x:collection1] o.a.s.c.ZkController watch zkdir /configs/conf1
   [junit4]   2> 2498829 INFO  (coreLoadExecutor-6931-thread-1-processing-n:127.0.0.1:59042_) [n:127.0.0.1:59042_ c:collection1 s:shard2 r:core_node1 x:collection1] o.a.s.c.CoreContainer registering core: collection1
   [junit4]   2> 2498832 INFO  (coreZkRegister-6926-thread-1-processing-n:127.0.0.1:59042_ x:collection1 s:shard2 c:collection1 r:core_node1) [n:127.0.0.1:59042_ c:collection1 s:shard2 r:core_node1 x:collection1] o.a.s.c.ZkController Register replica - core:collection1 address:https://127.0.0.1:59042 collection:collection1 shard:shard2
   [junit4]   2> 2498853 INFO  (coreZkRegister-6926-thread-1-processing-n:127.0.0.1:59042_ x:collection1 s:shard2 c:collection1 r:core_node1) [n:127.0.0.1:59042_ c:collection1 s:shard2 r:core_node1 x:collection1] o.a.s.c.ShardLeaderElectionContext Running the leader process for shard shard2
   [junit4]   2> 2498856 INFO  (zkCallback-2138-thread-1-processing-n:127.0.0.1:59012_) [n:127.0.0.1:59012_    ] o.a.s.c.DistributedQueue NodeChildrenChanged fired on path /overseer/queue state SyncConnected
   [junit4]   2> 2498858 INFO  (coreZkRegister-6926-thread-1-processing-n:127.0.0.1:59042_ x:collection1 s:shard2 c:collection1 r:core_node1) [n:127.0.0.1:59042_ c:collection1 s:shard2 r:core_node1 x:collection1] o.a.s.c.ShardLeaderElectionContext Enough replicas found to continue.
   [junit4]   2> 2498858 INFO  (coreZkRegister-6926-thread-1-processing-n:127.0.0.1:59042_ x:collection1 s:shard2 c:collection1 r:core_node1) [n:127.0.0.1:59042_ c:collection1 s:shard2 r:core_node1 x:collection1] o.a.s.c.ShardLeaderElectionContext I may be the new leader - try and sync
   [junit4]   2> 2498858 INFO  (coreZkRegister-6926-thread-1-processing-n:127.0.0.1:59042_ x:collection1 s:shard2 c:collection1 r:core_node1) [n:127.0.0.1:59042_ c:collection1 s:shard2 r:core_node1 x:collection1] o.a.s.c.SyncStrategy Sync replicas to https://127.0.0.1:59042/collection1/
   [junit4]   2> 2498859 INFO  (coreZkRegister-6926-thread-1-processing-n:127.0.0.1:59042_ x:collection1 s:shard2 c:collection1 r:core_node1) [n:127.0.0.1:59042_ c:collection1 s:shard2 r:core_node1 x:collection1] o.a.s.c.SyncStrategy Sync Success - now sync replicas to me
   [junit4]   2> 2498859 INFO  (coreZkRegister-6926-thread-1-processing-n:127.0.0.1:59042_ x:collection1 s:shard2 c:collection1 r:core_node1) [n:127.0.0.1:59042_ c:collection1 s:shard2 r:core_node1 x:collection1] o.a.s.c.SyncStrategy https://127.0.0.1:59042/collection1/ has no replicas
   [junit4]   2> 2498859 INFO  (coreZkRegister-6926-thread-1-processing-n:127.0.0.1:59042_ x:collection1 s:shard2 c:collection1 r:core_node1) [n:127.0.0.1:59042_ c:collection1 s:shard2 r:core_node1 x:collection1] o.a.s.c.ShardLeaderElectionContext I am the new leader: https://127.0.0.1:59042/collection1/ shard2
   [junit4]   2> 2498860 INFO  (OverseerStateUpdate-93929656649973764-127.0.0.1:59012_-n_0000000000) [n:127.0.0.1:59012_    ] o.a.s.c.Overseer processMessage: queueSize: 1, message = {
   [junit4]   2>   "operation":"leader",
   [junit4]   2>   "shard":"shard2",
   [junit4]   2>   "collection":"collection1"} current state version: 4
   [junit4]   2> 2498878 INFO  (OverseerStateUpdate-93929656649973764-127.0.0.1:59012_-n_0000000000) [n:127.0.0.1:59012_    ] o.a.s.c.Overseer processMessage: queueSize: 1, message = {
   [junit4]   2>   "operation":"leader",
   [junit4]   2>   "shard":"shard2",
   [junit4]   2>   "collection":"collection1",
   [junit4]   2>   "base_url":"https://127.0.0.1:59042",
   [junit4]   2>   "core":"collection1",
   [junit4]   2>   "state":"active"} current state version: 5
   [junit4]   2> 2498883 INFO  (zkCallback-2138-thread-1-processing-n:127.0.0.1:59012_) [n:127.0.0.1:59012_    ] o.a.s.c.DistributedQueue NodeChildrenChanged fired on path /overseer/queue state SyncConnected
   [junit4]   2> 2498944 INFO  (coreZkRegister-6926-thread-1-processing-n:127.0.0.1:59042_ x:collection1 s:shard2 c:collection1 r:core_node1) [n:127.0.0.1:59042_ c:collection1 s:shard2 r:core_node1 x:collection1] o.a.s.c.ZkController We are https://127.0.0.1:59042/collection1/ and leader is https://127.0.0.1:59042/collection1/
   [junit4]   2> 2498944 INFO  (coreZkRegister-6926-thread-1-processing-n:127.0.0.1:59042_ x:collection1 s:shard2 c:collection1 r:core_node1) [n:127.0.0.1:59042_ c:collection1 s:shard2 r:core_node1 x:collection1] o.a.s.c.ZkController No LogReplay needed for core=collection1 baseURL=https://127.0.0.1:59042
   [junit4]   2> 2498944 INFO  (coreZkRegister-6926-thread-1-processing-n:127.0.0.1:59042_ x:collection1 s:shard2 c:collection1 r:core_node1) [n:127.0.0.1:59042_ c:collection1 s:shard2 r:core_node1 x:collection1] o.a.s.c.ZkController I am the leader, no recovery necessary
   [junit4]   2> 2498944 INFO  (coreZkRegister-6926-thread-1-processing-n:127.0.0.1:59042_ x:collection1 s:shard2 c:collection1 r:core_node1) [n:127.0.0.1:59042_ c:collection1 s:shard2 r:core_node1 x:collection1] o.a.s.c.ZkController publishing state=active
   [junit4]   2> 2498944 INFO  (coreZkRegister-6926-thread-1-processing-n:127.0.0.1:59042_ x:collection1 s:shard2 c:collection1 r:core_node1) [n:127.0.0.1:59042_ c:collection1 s:shard2 r:core_node1 x:collection1] o.a.s.c.ZkController numShards not found on descriptor - reading it from system property
   [junit4]   2> 2498949 INFO  (zkCallback-2138-thread-1-processing-n:127.0.0.1:59012_) [n:127.0.0.1:59012_    ] o.a.s.c.DistributedQueue NodeChildrenChanged fired on path /overseer/queue state SyncConnected
   [junit4]   2> 2498953 INFO  (OverseerStateUpdate-93929656649973764-127.0.0.1:59012_-n_0000000000) [n:127.0.0.1:59012_    ] o.a.s.c.Overseer processMessage: queueSize: 1, message = {
   [junit4]   2>   "core":"collection1",
   [junit4]   2>   "core_node_name":"core_node1",
   [junit4]   2>   "roles":null,
   [junit4]   2>   "base_url":"https://127.0.0.1:59042",
   [junit4]   2>   "node_name":"127.0.0.1:59042_",
   [junit4]   2>   "numShards":"2",
   [junit4]   2>   "state":"active",
   [junit4]   2>   "shard":"shard2",
   [junit4]   2>   "collection":"collection1",
   [junit4]   2>   "operation":"state"} current state version: 6
   [junit4]   2> 2498953 INFO  (OverseerStateUpdate-93929656649973764-127.0.0.1:59012_-n_0000000000) [n:127.0.0.1:59012_    ] o.a.s.c.o.ReplicaMutator Update state numShards=2 message={
   [junit4]   2>   "core":"collection1",
   [junit4]   2>   "core_node_name":"core_node1",
   [junit4]   2>   "roles":null,
   [junit4]   2>   "base_url":"https://127.0.0.1:59042",
   [junit4]   2>   "node_name":"127.0.0.1:59042_",
   [junit4]   2>   "numShards":"2",
   [junit4]   2>   "state":"active",
   [junit4]   2>   "shard":"shard2",
   [junit4]   2>   "collection":"collection1",
   [junit4]   2>   "operation":"state"}
   [junit4]   2> 2499593 INFO  (TEST-TestDynamicLoading.testDynamicLoading-seed#[1F7DA3084F8671A6]) [    ] o.a.s.SolrTestCaseJ4 Writing core.properties file to C:\Users\JenkinsSlave\workspace\Lucene-Solr-trunk-Windows\solr\build\solr-core\test\J1\temp\solr.core.TestDynamicLoading 1F7DA3084F8671A6-001\shard-2-001\cores\collection1
   [junit4]   2> 2499598 INFO  (TEST-TestDynamicLoading.testDynamicLoading-seed#[1F7DA3084F8671A6]) [    ] o.a.s.c.AbstractFullDistribZkTestBase create jetty 2 in directory C:\Users\JenkinsSlave\workspace\Lucene-Solr-trunk-Windows\solr\build\solr-core\test\J1\temp\solr.core.TestDynamicLoading 1F7DA3084F8671A6-001\shard-2-001
   [junit4]   2> 2499603 INFO  (TEST-TestDynamicLoading.testDynamicLoading-seed#[1F7DA3084F8671A6]) [    ] o.e.j.s.Server jetty-9.2.10.v20150310
   [junit4]   2> 2499617 INFO  (TEST-TestDynamicLoading.testDynamicLoading-seed#[1F7DA3084F8671A6]) [    ] o.e.j.s.h.ContextHandler Started o.e.j.s.ServletContextHandler@12ee82{/,null,AVAILABLE}
   [junit4]   2> 2499639 INFO  (TEST-TestDynamicLoading.testDynamicLoading-seed#[1F7DA3084F8671A6]) [    ] o.e.j.s.ServerConnector Started ServerConnector@108fac6{SSL-http/1.1}{127.0.0.1:59063}
   [junit4]   2> 2499639 INFO  (TEST-TestDynamicLoading.testDynamicLoading-seed#[1F7DA3084F8671A6]) [    ] o.e.j.s.Server Started @2498715ms
   [junit4]   2> 2499639 INFO  (TEST-TestDynamicLoading.testDynamicLoading-seed#[1F7DA3084F8671A6]) [    ] o.a.s.c.s.e.JettySolrRunner Jetty properties: {solr.data.dir=C:\Users\JenkinsSlave\workspace\Lucene-Solr-trunk-Windows\solr\build\solr-core\test\J1\temp\solr.core.TestDynamicLoading 1F7DA3084F8671A6-001\tempDir-001/jetty2, solrconfig=solrconfig.xml, hostContext=/, hostPort=59063, coreRootDirectory=C:\Users\JenkinsSlave\workspace\Lucene-Solr-trunk-Windows\solr\build\solr-core\test\J1\temp\solr.core.TestDynamicLoading 1F7DA3084F8671A6-001\shard-2-001\cores}
   [junit4]   2> 2499644 INFO  (TEST-TestDynamicLoading.testDynamicLoading-seed#[1F7DA3084F8671A6]) [    ] o.a.s.s.SolrDispatchFilter SolrDispatchFilter.init()sun.misc.Launcher$AppClassLoader@e2f2a
   [junit4]   2> 2499646 INFO  (TEST-TestDynamicLoading.testDynamicLoading-seed#[1F7DA3084F8671A6]) [    ] o.a.s.c.SolrResourceLoader new SolrResourceLoader for directory: 'C:\Users\JenkinsSlave\workspace\Lucene-Solr-trunk-Windows\solr\build\solr-core\test\J1\temp\solr.core.TestDynamicLoading 1F7DA3084F8671A6-001\shard-2-001\'
   [junit4]   2> 2499714 INFO  (TEST-TestDynamicLoading.testDynamicLoading-seed#[1F7DA3084F8671A6]) [    ] o.a.s.c.SolrXmlConfig Loading container configuration from C:\Users\JenkinsSlave\workspace\Lucene-Solr-trunk-Windows\solr\build\solr-core\test\J1\temp\solr.core.TestDynamicLoading 1F7DA3084F8671A6-001\shard-2-001\solr.xml
   [junit4]   2> 2499729 INFO  (TEST-TestDynamicLoading.testDynamicLoading-seed#[1F7DA3084F8671A6]) [    ] o.a.s.c.CoresLocator Config-defined core root directory: C:\Users\JenkinsSlave\workspace\Lucene-Solr-trunk-Windows\solr\build\solr-core\test\J1\temp\solr.core.TestDynamicLoading 1F7DA3084F8671A6-001\shard-2-001\cores
   [junit4]   2> 2499729 INFO  (TEST-TestDynamicLoading.testDynamicLoading-seed#[1F7DA3084F8671A6]) [    ] o.a.s.c.CoreContainer New CoreContainer 3375433
   [junit4]   2> 2499729 INFO  (TEST-TestDynamicLoading.testDynamicLoading-seed#[1F7DA3084F8671A6]) [    ] o.a.s.c.CoreContainer Loading cores into CoreContainer [instanceDir=C:\Users\JenkinsSlave\workspace

[...truncated too long message...]

nContextBase.runLeaderProcess(ElectionContext.java:136)
   [junit4]   2> 	... 12 more
   [junit4]   2> 
   [junit4]   2> 2561414 INFO  (TEST-TestDynamicLoading.testDynamicLoading-seed#[1F7DA3084F8671A6]) [    ] o.e.j.s.ServerConnector Stopped ServerConnector@181e52d{SSL-http/1.1}{127.0.0.1:0}
   [junit4]   2> 2561415 INFO  (TEST-TestDynamicLoading.testDynamicLoading-seed#[1F7DA3084F8671A6]) [    ] o.e.j.s.h.ContextHandler Stopped o.e.j.s.ServletContextHandler@1e231d{/,null,UNAVAILABLE}
   [junit4]   2> 2561419 INFO  (TEST-TestDynamicLoading.testDynamicLoading-seed#[1F7DA3084F8671A6]) [n:127.0.0.1:59100_ c:collection1 s:shard1 r:core_node4 x:collection1] o.a.s.c.ZkTestServer connecting to 127.0.0.1:59002 59002
   [junit4]   2> 2564162 INFO  (Thread-5117) [    ] o.a.s.c.ZkTestServer connecting to 127.0.0.1:59002 59002
   [junit4]   2> 2564164 WARN  (Thread-5117) [    ] o.a.s.c.ZkTestServer Watch limit violations: 
   [junit4]   2> Maximum concurrent create/delete watches above limit:
   [junit4]   2> 
   [junit4]   2> 	40	/solr/configs/conf1
   [junit4]   2> 	6	/solr/aliases.json
   [junit4]   2> 	6	/solr/clusterstate.json
   [junit4]   2> 	2	/solr/configs/.system
   [junit4]   2> 	2	/solr/collections/.system/state.json
   [junit4]   2> 
   [junit4]   2> Maximum concurrent children watches above limit:
   [junit4]   2> 
   [junit4]   2> 	6	/solr/live_nodes
   [junit4]   2> 	4	/solr/overseer/collection-queue-work
   [junit4]   2> 	3	/solr/overseer/queue
   [junit4]   2> 
   [junit4]   2> NOTE: reproduce with: ant test  -Dtestcase=TestDynamicLoading -Dtests.method=testDynamicLoading -Dtests.seed=1F7DA3084F8671A6 -Dtests.slow=true -Dtests.locale=es_CR -Dtests.timezone=Asia/Taipei -Dtests.asserts=true -Dtests.file.encoding=UTF-8
   [junit4] FAILURE 71.9s J1 | TestDynamicLoading.testDynamicLoading <<<
   [junit4]    > Throwable #1: java.lang.AssertionError: Could not get expected value  'X val changed' for path 'x' full output: {
   [junit4]    >   "responseHeader":{
   [junit4]    >     "status":0,
   [junit4]    >     "QTime":0},
   [junit4]    >   "params":{"wt":"json"},
   [junit4]    >   "context":{
   [junit4]    >     "webapp":"",
   [junit4]    >     "path":"/test1",
   [junit4]    >     "httpMethod":"GET"},
   [junit4]    >   "class":"org.apache.solr.core.BlobStoreTestRequestHandler",
   [junit4]    >   "x":"X val"}
   [junit4]    > 	at __randomizedtesting.SeedInfo.seed([1F7DA3084F8671A6:C7308E5FB85BD406]:0)
   [junit4]    > 	at org.apache.solr.core.TestSolrConfigHandler.testForResponseElement(TestSolrConfigHandler.java:410)
   [junit4]    > 	at org.apache.solr.core.TestDynamicLoading.testDynamicLoading(TestDynamicLoading.java:260)
   [junit4]    > 	at org.apache.solr.BaseDistributedSearchTestCase$ShardsRepeatRule$ShardsFixedStatement.callStatement(BaseDistributedSearchTestCase.java:960)
   [junit4]    > 	at org.apache.solr.BaseDistributedSearchTestCase$ShardsRepeatRule$ShardsStatement.evaluate(BaseDistributedSearchTestCase.java:935)
   [junit4]    > 	at java.lang.Thread.run(Thread.java:745)
   [junit4]   2> 2564182 INFO  (SUITE-TestDynamicLoading-seed#[1F7DA3084F8671A6]-worker) [n:127.0.0.1:59100_ c:collection1 s:shard1 r:core_node4 x:collection1] o.a.s.SolrTestCaseJ4 ###deleteCore
   [junit4]   2> NOTE: leaving temporary files on disk at: C:\Users\JenkinsSlave\workspace\Lucene-Solr-trunk-Windows\solr\build\solr-core\test\J1\temp\solr.core.TestDynamicLoading 1F7DA3084F8671A6-001
   [junit4]   2> NOTE: test params are: codec=Lucene50, sim=RandomSimilarityProvider(queryNorm=true,coord=yes): {}, locale=es_CR, timezone=Asia/Taipei
   [junit4]   2> NOTE: Windows 7 6.1 x86/Oracle Corporation 1.8.0_45 (32-bit)/cpus=3,threads=1,free=112779376,total=518979584
   [junit4]   2> NOTE: All tests run in this JVM: [TestRTGBase, TestBulkSchemaAPI, ZkStateWriterTest, TermVectorComponentTest, SSLMigrationTest, TestDocSet, CopyFieldTest, TestManagedSchemaDynamicFieldResource, BasicDistributedZk2Test, HdfsWriteToMultipleCollectionsTest, TestExpandComponent, SolrXmlInZkTest, TestUtils, SolrCloudExampleTest, DateFieldTest, FastVectorHighlighterTest, TestSchemaResource, PluginInfoTest, ZkNodePropsTest, ConnectionManagerTest, ZkSolrClientTest, IndexSchemaTest, SchemaVersionSpecificBehaviorTest, TestDefaultSearchFieldResource, CurrencyFieldXmlFileTest, CollectionsAPIDistributedZkTest, SearchHandlerTest, HighlighterConfigTest, TestRemoteStreaming, CursorMarkTest, SolrRequestParserTest, QueryParsingTest, OverseerCollectionProcessorTest, TestSolrJ, TestReplicaProperties, TestDefaultSimilarityFactory, PolyFieldTest, TestSchemaSimilarityResource, TestCoreDiscovery, TestHighFrequencyDictionaryFactory, TestLuceneMatchVersion, TestHighlightDedupGrouping, TestRequestStatusCollectionAPI, LeaderFailoverAfterPartitionTest, ExternalFileFieldSortTest, IndexBasedSpellCheckerTest, ConvertedLegacyTest, SolrCmdDistributorTest, TestJoin, HdfsChaosMonkeySafeLeaderTest, FileUtilsTest, TestSolrXml, TestClassNameShortening, OpenExchangeRatesOrgProviderTest, StatsComponentTest, SimplePostToolTest, CollectionStateFormat2Test, TestMiniSolrCloudClusterSSL, TestMiniSolrCloudCluster, TestStressUserVersions, MergeStrategyTest, DistributedTermsComponentTest, UpdateRequestProcessorFactoryTest, CloudMLTQParserTest, TestDefaultStatsCache, HdfsRecoveryZkTest, IgnoreCommitOptimizeUpdateProcessorFactoryTest, StressHdfsTest, FullSolrCloudDistribCmdsTest, SharedFSAutoReplicaFailoverUtilsTest, ChaosMonkeySafeLeaderTest, MBeansHandlerTest, TestRecovery, TestMergePolicyConfig, ShardSplitTest, TestPHPSerializedResponseWriter, CSVRequestHandlerTest, UpdateParamsTest, CollectionReloadTest, XsltUpdateRequestHandlerTest, TestNamedUpdateProcessors, TestCryptoKeys, LeaderElectionIntegrationTest, TestSortingResponseWriter, DisMaxRequestHandlerTest, TestInfoStreamLogging, RecoveryAfterSoftCommitTest, CdcrVersionReplicationTest, QueryResultKeyTest, TermsComponentTest, DistributedQueryComponentCustomSortTest, SuggesterTSTTest, TestReRankQParserPlugin, TestReplicationHandlerBackup, PrimitiveFieldTypeTest, TestAuthorizationFramework, OutOfBoxZkACLAndCredentialsProvidersTest, DocumentBuilderTest, TestClusterStateMutator, MoreLikeThisHandlerTest, TestSolr4Spatial, ResourceLoaderTest, TestCustomSort, BasicFunctionalityTest, JsonLoaderTest, TestBlendedInfixSuggestions, FileBasedSpellCheckerTest, CdcrUpdateLogTest, DistributedIntervalFacetingTest, TestFastOutputStream, AtomicUpdatesTest, TestJsonFacets, SpellingQueryConverterTest, TestPseudoReturnFields, DistanceUnitsTest, ConcurrentDeleteAndCreateCollectionTest, NotRequiredUniqueKeyTest, WordBreakSolrSpellCheckerTest, SolrTestCaseJ4Test, HighlighterTest, SyncSliceTest, BasicZkTest, TestReplicationHandler, ShardRoutingCustomTest, AutoCommitTest, TestDistributedGrouping, ZkControllerTest, TestReload, TestStressVersions, TestRangeQuery, SolrCoreTest, QueryElevationComponentTest, TestFiltering, TestIndexSearcher, CurrencyFieldOpenExchangeTest, SolrIndexSplitterTest, AnalysisAfterCoreReloadTest, SignatureUpdateProcessorFactoryTest, SuggesterFSTTest, CoreAdminHandlerTest, TestTrie, SpatialFilterTest, TestAtomicUpdateErrorCases, QueryEqualityTest, StatelessScriptUpdateProcessorFactoryTest, StandardRequestHandlerTest, TestReversedWildcardFilterFactory, RequestHandlersTest, TestIndexingPerformance, TestSolrQueryParser, LoggingHandlerTest, RegexBoostProcessorTest, TestCollationField, ReturnFieldsTest, TestCSVResponseWriter, UniqFieldsUpdateProcessorFactoryTest, BinaryUpdateRequestHandlerTest, TestLFUCache, EchoParamsTest, TestDFRSimilarityFactory, TestLMDirichletSimilarityFactory, TestFastWriter, TestFastLRUCache, DateMathParserTest, TestSystemIdResolver, PrimUtilsTest, TestSuggestSpellingConverter, DOMUtilTest, RAMDirectoryFactoryTest, UUIDFieldTest, DistributedMLTComponentTest, TestCursorMarkWithoutUniqueKey, TestDistributedMissingSort, TestSimpleTrackingShardHandler, TestEmbeddedSolrServerConstructors, TestJettySolrRunner, ActionThrottleTest, AssignTest, AsyncMigrateRouteKeyTest, DeleteLastCustomShardedReplicaTest, DistribDocExpirationUpdateProcessorTest, LeaderInitiatedRecoveryOnCommitTest, MultiThreadedOCPTest, OverriddenZkACLAndCredentialsProvidersTest, RemoteQueryErrorTest, ReplicationFactorTest, SimpleCollectionCreateDeleteTest, TestAuthenticationFramework, TestDistribDocBasedVersion, TestLeaderElectionZkExpiry, TriLevelCompositeIdRoutingTest, CachingDirectoryFactoryTest, ExitableDirectoryReaderTest, HdfsDirectoryFactoryTest, TestConfigOverlay, TestDynamicLoading]
   [junit4] Completed [420/503] on J1 in 71.96s, 1 test, 1 failure <<< FAILURES!

[...truncated 258 lines...]
BUILD FAILED
C:\Users\JenkinsSlave\workspace\Lucene-Solr-trunk-Windows\build.xml:526: The following error occurred while executing this line:
C:\Users\JenkinsSlave\workspace\Lucene-Solr-trunk-Windows\build.xml:474: The following error occurred while executing this line:
C:\Users\JenkinsSlave\workspace\Lucene-Solr-trunk-Windows\build.xml:61: The following error occurred while executing this line:
C:\Users\JenkinsSlave\workspace\Lucene-Solr-trunk-Windows\extra-targets.xml:39: The following error occurred while executing this line:
C:\Users\JenkinsSlave\workspace\Lucene-Solr-trunk-Windows\solr\build.xml:230: The following error occurred while executing this line:
C:\Users\JenkinsSlave\workspace\Lucene-Solr-trunk-Windows\solr\common-build.xml:512: The following error occurred while executing this line:
C:\Users\JenkinsSlave\workspace\Lucene-Solr-trunk-Windows\lucene\common-build.xml:1418: The following error occurred while executing this line:
C:\Users\JenkinsSlave\workspace\Lucene-Solr-trunk-Windows\lucene\common-build.xml:973: There were test failures: 503 suites, 1986 tests, 1 failure, 67 ignored (34 assumptions)

Total time: 66 minutes 34 seconds
Build step 'Invoke Ant' marked build as failure
Archiving artifacts
Recording test results
Email was triggered for: Failure - Any
Sending email for trigger: Failure - Any



Mime
View raw message