lucene-dev mailing list archives

Site index · List index
Message view « Date » · « Thread »
Top « Date » · « Thread »
From Apache Jenkins Server <jenk...@builds.apache.org>
Subject [JENKINS] Lucene-Solr-Tests-5.x-Java7 - Build # 3289 - Failure
Date Wed, 01 Jul 2015 20:09:06 GMT
Build: https://builds.apache.org/job/Lucene-Solr-Tests-5.x-Java7/3289/

1 tests failed.
REGRESSION:  org.apache.solr.core.TestDynamicLoading.testDynamicLoading

Error Message:
Could not get expected value  'X val changed' for path 'x' full output: {   "responseHeader":{     "status":0,     "QTime":0},   "params":{"wt":"json"},   "context":{     "httpMethod":"GET",     "webapp":"/zm/se",     "path":"/test1"},   "class":"org.apache.solr.core.BlobStoreTestRequestHandler",   "x":"X val"}

Stack Trace:
java.lang.AssertionError: Could not get expected value  'X val changed' for path 'x' full output: {
  "responseHeader":{
    "status":0,
    "QTime":0},
  "params":{"wt":"json"},
  "context":{
    "httpMethod":"GET",
    "webapp":"/zm/se",
    "path":"/test1"},
  "class":"org.apache.solr.core.BlobStoreTestRequestHandler",
  "x":"X val"}
	at __randomizedtesting.SeedInfo.seed([80FA4BC1811FA9C0:58B7669676C20C60]:0)
	at org.junit.Assert.fail(Assert.java:93)
	at org.junit.Assert.assertTrue(Assert.java:43)
	at org.apache.solr.core.TestSolrConfigHandler.testForResponseElement(TestSolrConfigHandler.java:410)
	at org.apache.solr.core.TestDynamicLoading.testDynamicLoading(TestDynamicLoading.java:260)
	at sun.reflect.NativeMethodAccessorImpl.invoke0(Native Method)
	at sun.reflect.NativeMethodAccessorImpl.invoke(NativeMethodAccessorImpl.java:57)
	at sun.reflect.DelegatingMethodAccessorImpl.invoke(DelegatingMethodAccessorImpl.java:43)
	at java.lang.reflect.Method.invoke(Method.java:606)
	at com.carrotsearch.randomizedtesting.RandomizedRunner.invoke(RandomizedRunner.java:1627)
	at com.carrotsearch.randomizedtesting.RandomizedRunner$6.evaluate(RandomizedRunner.java:836)
	at com.carrotsearch.randomizedtesting.RandomizedRunner$7.evaluate(RandomizedRunner.java:872)
	at com.carrotsearch.randomizedtesting.RandomizedRunner$8.evaluate(RandomizedRunner.java:886)
	at org.apache.solr.BaseDistributedSearchTestCase$ShardsRepeatRule$ShardsFixedStatement.callStatement(BaseDistributedSearchTestCase.java:960)
	at org.apache.solr.BaseDistributedSearchTestCase$ShardsRepeatRule$ShardsStatement.evaluate(BaseDistributedSearchTestCase.java:935)
	at com.carrotsearch.randomizedtesting.rules.SystemPropertiesRestoreRule$1.evaluate(SystemPropertiesRestoreRule.java:57)
	at org.apache.lucene.util.TestRuleSetupTeardownChained$1.evaluate(TestRuleSetupTeardownChained.java:50)
	at org.apache.lucene.util.AbstractBeforeAfterRule$1.evaluate(AbstractBeforeAfterRule.java:46)
	at org.apache.lucene.util.TestRuleThreadAndTestName$1.evaluate(TestRuleThreadAndTestName.java:49)
	at org.apache.lucene.util.TestRuleIgnoreAfterMaxFailures$1.evaluate(TestRuleIgnoreAfterMaxFailures.java:65)
	at org.apache.lucene.util.TestRuleMarkFailure$1.evaluate(TestRuleMarkFailure.java:48)
	at com.carrotsearch.randomizedtesting.rules.StatementAdapter.evaluate(StatementAdapter.java:36)
	at com.carrotsearch.randomizedtesting.ThreadLeakControl$StatementRunner.run(ThreadLeakControl.java:365)
	at com.carrotsearch.randomizedtesting.ThreadLeakControl.forkTimeoutingTask(ThreadLeakControl.java:798)
	at com.carrotsearch.randomizedtesting.ThreadLeakControl$3.evaluate(ThreadLeakControl.java:458)
	at com.carrotsearch.randomizedtesting.RandomizedRunner.runSingleTest(RandomizedRunner.java:845)
	at com.carrotsearch.randomizedtesting.RandomizedRunner$3.evaluate(RandomizedRunner.java:747)
	at com.carrotsearch.randomizedtesting.RandomizedRunner$4.evaluate(RandomizedRunner.java:781)
	at com.carrotsearch.randomizedtesting.RandomizedRunner$5.evaluate(RandomizedRunner.java:792)
	at com.carrotsearch.randomizedtesting.rules.StatementAdapter.evaluate(StatementAdapter.java:36)
	at com.carrotsearch.randomizedtesting.rules.SystemPropertiesRestoreRule$1.evaluate(SystemPropertiesRestoreRule.java:57)
	at org.apache.lucene.util.AbstractBeforeAfterRule$1.evaluate(AbstractBeforeAfterRule.java:46)
	at com.carrotsearch.randomizedtesting.rules.StatementAdapter.evaluate(StatementAdapter.java:36)
	at org.apache.lucene.util.TestRuleStoreClassName$1.evaluate(TestRuleStoreClassName.java:42)
	at com.carrotsearch.randomizedtesting.rules.NoShadowingOrOverridesOnMethodsRule$1.evaluate(NoShadowingOrOverridesOnMethodsRule.java:39)
	at com.carrotsearch.randomizedtesting.rules.NoShadowingOrOverridesOnMethodsRule$1.evaluate(NoShadowingOrOverridesOnMethodsRule.java:39)
	at com.carrotsearch.randomizedtesting.rules.StatementAdapter.evaluate(StatementAdapter.java:36)
	at com.carrotsearch.randomizedtesting.rules.StatementAdapter.evaluate(StatementAdapter.java:36)
	at com.carrotsearch.randomizedtesting.rules.StatementAdapter.evaluate(StatementAdapter.java:36)
	at org.apache.lucene.util.TestRuleAssertionsRequired$1.evaluate(TestRuleAssertionsRequired.java:54)
	at org.apache.lucene.util.TestRuleMarkFailure$1.evaluate(TestRuleMarkFailure.java:48)
	at org.apache.lucene.util.TestRuleIgnoreAfterMaxFailures$1.evaluate(TestRuleIgnoreAfterMaxFailures.java:65)
	at org.apache.lucene.util.TestRuleIgnoreTestSuites$1.evaluate(TestRuleIgnoreTestSuites.java:55)
	at com.carrotsearch.randomizedtesting.rules.StatementAdapter.evaluate(StatementAdapter.java:36)
	at com.carrotsearch.randomizedtesting.ThreadLeakControl$StatementRunner.run(ThreadLeakControl.java:365)
	at java.lang.Thread.run(Thread.java:745)




Build Log:
[...truncated 10301 lines...]
   [junit4] Suite: org.apache.solr.core.TestDynamicLoading
   [junit4]   2> Creating dataDir: /x1/jenkins/jenkins-slave/workspace/Lucene-Solr-Tests-5.x-Java7/solr/build/solr-core/test/J1/temp/solr.core.TestDynamicLoading_80FA4BC1811FA9C0-001/init-core-data-001
   [junit4]   2> 1321835 INFO  (SUITE-TestDynamicLoading-seed#[80FA4BC1811FA9C0]-worker) [    ] o.a.s.SolrTestCaseJ4 Randomized ssl (false) and clientAuth (false)
   [junit4]   2> 1321836 INFO  (SUITE-TestDynamicLoading-seed#[80FA4BC1811FA9C0]-worker) [    ] o.a.s.BaseDistributedSearchTestCase Setting hostContext system property: /zm/se
   [junit4]   2> 1321841 INFO  (TEST-TestDynamicLoading.testDynamicLoading-seed#[80FA4BC1811FA9C0]) [    ] o.a.s.c.ZkTestServer STARTING ZK TEST SERVER
   [junit4]   2> 1321841 INFO  (Thread-2577) [    ] o.a.s.c.ZkTestServer client port:0.0.0.0/0.0.0.0:0
   [junit4]   2> 1321841 INFO  (Thread-2577) [    ] o.a.s.c.ZkTestServer Starting server
   [junit4]   2> 1321941 INFO  (TEST-TestDynamicLoading.testDynamicLoading-seed#[80FA4BC1811FA9C0]) [    ] o.a.s.c.ZkTestServer start zk server on port:39028
   [junit4]   2> 1321942 INFO  (TEST-TestDynamicLoading.testDynamicLoading-seed#[80FA4BC1811FA9C0]) [    ] o.a.s.c.c.SolrZkClient Using default ZkCredentialsProvider
   [junit4]   2> 1321942 INFO  (TEST-TestDynamicLoading.testDynamicLoading-seed#[80FA4BC1811FA9C0]) [    ] o.a.s.c.c.ConnectionManager Waiting for client to connect to ZooKeeper
   [junit4]   2> 1321947 INFO  (zkCallback-1496-thread-1) [    ] o.a.s.c.c.ConnectionManager Watcher org.apache.solr.common.cloud.ConnectionManager@70534f4b name:ZooKeeperConnection Watcher:127.0.0.1:39028 got event WatchedEvent state:SyncConnected type:None path:null path:null type:None
   [junit4]   2> 1321947 INFO  (TEST-TestDynamicLoading.testDynamicLoading-seed#[80FA4BC1811FA9C0]) [    ] o.a.s.c.c.ConnectionManager Client is connected to ZooKeeper
   [junit4]   2> 1321947 INFO  (TEST-TestDynamicLoading.testDynamicLoading-seed#[80FA4BC1811FA9C0]) [    ] o.a.s.c.c.SolrZkClient Using default ZkACLProvider
   [junit4]   2> 1321948 INFO  (TEST-TestDynamicLoading.testDynamicLoading-seed#[80FA4BC1811FA9C0]) [    ] o.a.s.c.c.SolrZkClient makePath: /solr
   [junit4]   2> 1321950 INFO  (TEST-TestDynamicLoading.testDynamicLoading-seed#[80FA4BC1811FA9C0]) [    ] o.a.s.c.c.SolrZkClient Using default ZkCredentialsProvider
   [junit4]   2> 1321951 INFO  (TEST-TestDynamicLoading.testDynamicLoading-seed#[80FA4BC1811FA9C0]) [    ] o.a.s.c.c.ConnectionManager Waiting for client to connect to ZooKeeper
   [junit4]   2> 1321952 INFO  (zkCallback-1497-thread-1) [    ] o.a.s.c.c.ConnectionManager Watcher org.apache.solr.common.cloud.ConnectionManager@68b2cc3d name:ZooKeeperConnection Watcher:127.0.0.1:39028/solr got event WatchedEvent state:SyncConnected type:None path:null path:null type:None
   [junit4]   2> 1321953 INFO  (TEST-TestDynamicLoading.testDynamicLoading-seed#[80FA4BC1811FA9C0]) [    ] o.a.s.c.c.ConnectionManager Client is connected to ZooKeeper
   [junit4]   2> 1321953 INFO  (TEST-TestDynamicLoading.testDynamicLoading-seed#[80FA4BC1811FA9C0]) [    ] o.a.s.c.c.SolrZkClient Using default ZkACLProvider
   [junit4]   2> 1321953 INFO  (TEST-TestDynamicLoading.testDynamicLoading-seed#[80FA4BC1811FA9C0]) [    ] o.a.s.c.c.SolrZkClient makePath: /collections/collection1
   [junit4]   2> 1321955 INFO  (TEST-TestDynamicLoading.testDynamicLoading-seed#[80FA4BC1811FA9C0]) [    ] o.a.s.c.c.SolrZkClient makePath: /collections/collection1/shards
   [junit4]   2> 1321956 INFO  (TEST-TestDynamicLoading.testDynamicLoading-seed#[80FA4BC1811FA9C0]) [    ] o.a.s.c.c.SolrZkClient makePath: /collections/control_collection
   [junit4]   2> 1321958 INFO  (TEST-TestDynamicLoading.testDynamicLoading-seed#[80FA4BC1811FA9C0]) [    ] o.a.s.c.c.SolrZkClient makePath: /collections/control_collection/shards
   [junit4]   2> 1321960 INFO  (TEST-TestDynamicLoading.testDynamicLoading-seed#[80FA4BC1811FA9C0]) [    ] o.a.s.c.AbstractZkTestCase put /x1/jenkins/jenkins-slave/workspace/Lucene-Solr-Tests-5.x-Java7/solr/core/src/test-files/solr/collection1/conf/solrconfig-tlog.xml to /configs/conf1/solrconfig.xml
   [junit4]   2> 1321960 INFO  (TEST-TestDynamicLoading.testDynamicLoading-seed#[80FA4BC1811FA9C0]) [    ] o.a.s.c.c.SolrZkClient makePath: /configs/conf1/solrconfig.xml
   [junit4]   2> 1321964 INFO  (TEST-TestDynamicLoading.testDynamicLoading-seed#[80FA4BC1811FA9C0]) [    ] o.a.s.c.AbstractZkTestCase put /x1/jenkins/jenkins-slave/workspace/Lucene-Solr-Tests-5.x-Java7/solr/core/src/test-files/solr/collection1/conf/schema.xml to /configs/conf1/schema.xml
   [junit4]   2> 1321965 INFO  (TEST-TestDynamicLoading.testDynamicLoading-seed#[80FA4BC1811FA9C0]) [    ] o.a.s.c.c.SolrZkClient makePath: /configs/conf1/schema.xml
   [junit4]   2> 1321968 INFO  (TEST-TestDynamicLoading.testDynamicLoading-seed#[80FA4BC1811FA9C0]) [    ] o.a.s.c.AbstractZkTestCase put /x1/jenkins/jenkins-slave/workspace/Lucene-Solr-Tests-5.x-Java7/solr/core/src/test-files/solr/collection1/conf/solrconfig.snippet.randomindexconfig.xml to /configs/conf1/solrconfig.snippet.randomindexconfig.xml
   [junit4]   2> 1321968 INFO  (TEST-TestDynamicLoading.testDynamicLoading-seed#[80FA4BC1811FA9C0]) [    ] o.a.s.c.c.SolrZkClient makePath: /configs/conf1/solrconfig.snippet.randomindexconfig.xml
   [junit4]   2> 1321970 INFO  (TEST-TestDynamicLoading.testDynamicLoading-seed#[80FA4BC1811FA9C0]) [    ] o.a.s.c.AbstractZkTestCase put /x1/jenkins/jenkins-slave/workspace/Lucene-Solr-Tests-5.x-Java7/solr/core/src/test-files/solr/collection1/conf/stopwords.txt to /configs/conf1/stopwords.txt
   [junit4]   2> 1321970 INFO  (TEST-TestDynamicLoading.testDynamicLoading-seed#[80FA4BC1811FA9C0]) [    ] o.a.s.c.c.SolrZkClient makePath: /configs/conf1/stopwords.txt
   [junit4]   2> 1321972 INFO  (TEST-TestDynamicLoading.testDynamicLoading-seed#[80FA4BC1811FA9C0]) [    ] o.a.s.c.AbstractZkTestCase put /x1/jenkins/jenkins-slave/workspace/Lucene-Solr-Tests-5.x-Java7/solr/core/src/test-files/solr/collection1/conf/protwords.txt to /configs/conf1/protwords.txt
   [junit4]   2> 1321972 INFO  (TEST-TestDynamicLoading.testDynamicLoading-seed#[80FA4BC1811FA9C0]) [    ] o.a.s.c.c.SolrZkClient makePath: /configs/conf1/protwords.txt
   [junit4]   2> 1321974 INFO  (TEST-TestDynamicLoading.testDynamicLoading-seed#[80FA4BC1811FA9C0]) [    ] o.a.s.c.AbstractZkTestCase put /x1/jenkins/jenkins-slave/workspace/Lucene-Solr-Tests-5.x-Java7/solr/core/src/test-files/solr/collection1/conf/currency.xml to /configs/conf1/currency.xml
   [junit4]   2> 1321974 INFO  (TEST-TestDynamicLoading.testDynamicLoading-seed#[80FA4BC1811FA9C0]) [    ] o.a.s.c.c.SolrZkClient makePath: /configs/conf1/currency.xml
   [junit4]   2> 1321976 INFO  (TEST-TestDynamicLoading.testDynamicLoading-seed#[80FA4BC1811FA9C0]) [    ] o.a.s.c.AbstractZkTestCase put /x1/jenkins/jenkins-slave/workspace/Lucene-Solr-Tests-5.x-Java7/solr/core/src/test-files/solr/collection1/conf/enumsConfig.xml to /configs/conf1/enumsConfig.xml
   [junit4]   2> 1321976 INFO  (TEST-TestDynamicLoading.testDynamicLoading-seed#[80FA4BC1811FA9C0]) [    ] o.a.s.c.c.SolrZkClient makePath: /configs/conf1/enumsConfig.xml
   [junit4]   2> 1321978 INFO  (TEST-TestDynamicLoading.testDynamicLoading-seed#[80FA4BC1811FA9C0]) [    ] o.a.s.c.AbstractZkTestCase put /x1/jenkins/jenkins-slave/workspace/Lucene-Solr-Tests-5.x-Java7/solr/core/src/test-files/solr/collection1/conf/open-exchange-rates.json to /configs/conf1/open-exchange-rates.json
   [junit4]   2> 1321979 INFO  (TEST-TestDynamicLoading.testDynamicLoading-seed#[80FA4BC1811FA9C0]) [    ] o.a.s.c.c.SolrZkClient makePath: /configs/conf1/open-exchange-rates.json
   [junit4]   2> 1321981 INFO  (TEST-TestDynamicLoading.testDynamicLoading-seed#[80FA4BC1811FA9C0]) [    ] o.a.s.c.AbstractZkTestCase put /x1/jenkins/jenkins-slave/workspace/Lucene-Solr-Tests-5.x-Java7/solr/core/src/test-files/solr/collection1/conf/mapping-ISOLatin1Accent.txt to /configs/conf1/mapping-ISOLatin1Accent.txt
   [junit4]   2> 1321981 INFO  (TEST-TestDynamicLoading.testDynamicLoading-seed#[80FA4BC1811FA9C0]) [    ] o.a.s.c.c.SolrZkClient makePath: /configs/conf1/mapping-ISOLatin1Accent.txt
   [junit4]   2> 1321983 INFO  (TEST-TestDynamicLoading.testDynamicLoading-seed#[80FA4BC1811FA9C0]) [    ] o.a.s.c.AbstractZkTestCase put /x1/jenkins/jenkins-slave/workspace/Lucene-Solr-Tests-5.x-Java7/solr/core/src/test-files/solr/collection1/conf/old_synonyms.txt to /configs/conf1/old_synonyms.txt
   [junit4]   2> 1321983 INFO  (TEST-TestDynamicLoading.testDynamicLoading-seed#[80FA4BC1811FA9C0]) [    ] o.a.s.c.c.SolrZkClient makePath: /configs/conf1/old_synonyms.txt
   [junit4]   2> 1321985 INFO  (TEST-TestDynamicLoading.testDynamicLoading-seed#[80FA4BC1811FA9C0]) [    ] o.a.s.c.AbstractZkTestCase put /x1/jenkins/jenkins-slave/workspace/Lucene-Solr-Tests-5.x-Java7/solr/core/src/test-files/solr/collection1/conf/synonyms.txt to /configs/conf1/synonyms.txt
   [junit4]   2> 1321986 INFO  (TEST-TestDynamicLoading.testDynamicLoading-seed#[80FA4BC1811FA9C0]) [    ] o.a.s.c.c.SolrZkClient makePath: /configs/conf1/synonyms.txt
   [junit4]   2> 1322282 INFO  (TEST-TestDynamicLoading.testDynamicLoading-seed#[80FA4BC1811FA9C0]) [    ] o.a.s.SolrTestCaseJ4 Writing core.properties file to /x1/jenkins/jenkins-slave/workspace/Lucene-Solr-Tests-5.x-Java7/solr/build/solr-core/test/J1/temp/solr.core.TestDynamicLoading_80FA4BC1811FA9C0-001/control-001/cores/collection1
   [junit4]   2> 1322284 INFO  (TEST-TestDynamicLoading.testDynamicLoading-seed#[80FA4BC1811FA9C0]) [    ] o.e.j.s.Server jetty-9.2.11.v20150529
   [junit4]   2> 1322287 INFO  (TEST-TestDynamicLoading.testDynamicLoading-seed#[80FA4BC1811FA9C0]) [    ] o.e.j.s.h.ContextHandler Started o.e.j.s.ServletContextHandler@4b7dcdbf{/zm/se,null,AVAILABLE}
   [junit4]   2> 1322288 INFO  (TEST-TestDynamicLoading.testDynamicLoading-seed#[80FA4BC1811FA9C0]) [    ] o.e.j.s.ServerConnector Started ServerConnector@9a4099e{HTTP/1.1}{127.0.0.1:53641}
   [junit4]   2> 1322288 INFO  (TEST-TestDynamicLoading.testDynamicLoading-seed#[80FA4BC1811FA9C0]) [    ] o.e.j.s.Server Started @1325350ms
   [junit4]   2> 1322288 INFO  (TEST-TestDynamicLoading.testDynamicLoading-seed#[80FA4BC1811FA9C0]) [    ] o.a.s.c.s.e.JettySolrRunner Jetty properties: {hostContext=/zm/se, hostPort=53641, coreRootDirectory=/x1/jenkins/jenkins-slave/workspace/Lucene-Solr-Tests-5.x-Java7/solr/build/solr-core/test/J1/../../../../../../../../../../x1/jenkins/jenkins-slave/workspace/Lucene-Solr-Tests-5.x-Java7/solr/build/solr-core/test/J1/temp/solr.core.TestDynamicLoading_80FA4BC1811FA9C0-001/control-001/cores, solr.data.dir=/x1/jenkins/jenkins-slave/workspace/Lucene-Solr-Tests-5.x-Java7/solr/build/solr-core/test/J1/temp/solr.core.TestDynamicLoading_80FA4BC1811FA9C0-001/tempDir-001/control/data}
   [junit4]   2> 1322289 INFO  (TEST-TestDynamicLoading.testDynamicLoading-seed#[80FA4BC1811FA9C0]) [    ] o.a.s.s.SolrDispatchFilter SolrDispatchFilter.init(): sun.misc.Launcher$AppClassLoader@1fe91485
   [junit4]   2> 1322289 INFO  (TEST-TestDynamicLoading.testDynamicLoading-seed#[80FA4BC1811FA9C0]) [    ] o.a.s.c.SolrResourceLoader new SolrResourceLoader for directory: '/x1/jenkins/jenkins-slave/workspace/Lucene-Solr-Tests-5.x-Java7/solr/build/solr-core/test/J1/../../../../../../../../../../x1/jenkins/jenkins-slave/workspace/Lucene-Solr-Tests-5.x-Java7/solr/build/solr-core/test/J1/temp/solr.core.TestDynamicLoading_80FA4BC1811FA9C0-001/control-001/'
   [junit4]   2> 1322308 INFO  (TEST-TestDynamicLoading.testDynamicLoading-seed#[80FA4BC1811FA9C0]) [    ] o.a.s.c.SolrXmlConfig Loading container configuration from /x1/jenkins/jenkins-slave/workspace/Lucene-Solr-Tests-5.x-Java7/solr/build/solr-core/test/J1/../../../../../../../../../../x1/jenkins/jenkins-slave/workspace/Lucene-Solr-Tests-5.x-Java7/solr/build/solr-core/test/J1/temp/solr.core.TestDynamicLoading_80FA4BC1811FA9C0-001/control-001/solr.xml
   [junit4]   2> 1322324 INFO  (TEST-TestDynamicLoading.testDynamicLoading-seed#[80FA4BC1811FA9C0]) [    ] o.a.s.c.CoresLocator Config-defined core root directory: /x1/jenkins/jenkins-slave/workspace/Lucene-Solr-Tests-5.x-Java7/solr/build/solr-core/test/J1/../../../../../../../../../../x1/jenkins/jenkins-slave/workspace/Lucene-Solr-Tests-5.x-Java7/solr/build/solr-core/test/J1/temp/solr.core.TestDynamicLoading_80FA4BC1811FA9C0-001/control-001/cores
   [junit4]   2> 1322324 INFO  (TEST-TestDynamicLoading.testDynamicLoading-seed#[80FA4BC1811FA9C0]) [    ] o.a.s.c.CoreContainer New CoreContainer 227621516
   [junit4]   2> 1322324 INFO  (TEST-TestDynamicLoading.testDynamicLoading-seed#[80FA4BC1811FA9C0]) [    ] o.a.s.c.CoreContainer Loading cores into CoreContainer [instanceDir=/x1/jenkins/jenkins-slave/workspace/Lucene-Solr-Tests-5.x-Java7/solr/build/solr-core/test/J1/../../../../../../../../../../x1/jenkins/jenkins-slave/workspace/Lucene-Solr-Tests-5.x-Java7/solr/build/solr-core/test/J1/temp/solr.core.TestDynamicLoading_80FA4BC1811FA9C0-001/control-001/]
   [junit4]   2> 1322325 INFO  (TEST-TestDynamicLoading.testDynamicLoading-seed#[80FA4BC1811FA9C0]) [    ] o.a.s.c.CoreContainer loading shared library: /x1/jenkins/jenkins-slave/workspace/Lucene-Solr-Tests-5.x-Java7/solr/build/solr-core/test/J1/../../../../../../../../../../x1/jenkins/jenkins-slave/workspace/Lucene-Solr-Tests-5.x-Java7/solr/build/solr-core/test/J1/temp/solr.core.TestDynamicLoading_80FA4BC1811FA9C0-001/control-001/lib
   [junit4]   2> 1322325 WARN  (TEST-TestDynamicLoading.testDynamicLoading-seed#[80FA4BC1811FA9C0]) [    ] o.a.s.c.SolrResourceLoader Can't find (or read) directory to add to classloader: lib (resolved as: /x1/jenkins/jenkins-slave/workspace/Lucene-Solr-Tests-5.x-Java7/solr/build/solr-core/test/J1/../../../../../../../../../../x1/jenkins/jenkins-slave/workspace/Lucene-Solr-Tests-5.x-Java7/solr/build/solr-core/test/J1/temp/solr.core.TestDynamicLoading_80FA4BC1811FA9C0-001/control-001/lib).
   [junit4]   2> 1322334 INFO  (TEST-TestDynamicLoading.testDynamicLoading-seed#[80FA4BC1811FA9C0]) [    ] o.a.s.h.c.HttpShardHandlerFactory created with socketTimeout : 90000,urlScheme : ,connTimeout : 15000,maxConnectionsPerHost : 20,maxConnections : 10000,corePoolSize : 0,maximumPoolSize : 2147483647,maxThreadIdleTime : 5,sizeOfQueue : -1,fairnessPolicy : false,useRetries : false,
   [junit4]   2> 1322336 INFO  (TEST-TestDynamicLoading.testDynamicLoading-seed#[80FA4BC1811FA9C0]) [    ] o.a.s.u.UpdateShardHandler Creating UpdateShardHandler HTTP client with params: socketTimeout=340000&connTimeout=45000&retry=true
   [junit4]   2> 1322337 INFO  (TEST-TestDynamicLoading.testDynamicLoading-seed#[80FA4BC1811FA9C0]) [    ] o.a.s.l.LogWatcher SLF4J impl is org.slf4j.impl.Log4jLoggerFactory
   [junit4]   2> 1322337 INFO  (TEST-TestDynamicLoading.testDynamicLoading-seed#[80FA4BC1811FA9C0]) [    ] o.a.s.l.LogWatcher Registering Log Listener [Log4j (org.slf4j.impl.Log4jLoggerFactory)]
   [junit4]   2> 1322337 INFO  (TEST-TestDynamicLoading.testDynamicLoading-seed#[80FA4BC1811FA9C0]) [    ] o.a.s.c.ZkContainer Zookeeper client=127.0.0.1:39028/solr
   [junit4]   2> 1322337 INFO  (TEST-TestDynamicLoading.testDynamicLoading-seed#[80FA4BC1811FA9C0]) [    ] o.a.s.c.ZkController zkHost includes chroot
   [junit4]   2> 1322337 INFO  (TEST-TestDynamicLoading.testDynamicLoading-seed#[80FA4BC1811FA9C0]) [    ] o.a.s.c.c.SolrZkClient Using default ZkCredentialsProvider
   [junit4]   2> 1322343 INFO  (TEST-TestDynamicLoading.testDynamicLoading-seed#[80FA4BC1811FA9C0]) [    ] o.a.s.c.c.ConnectionManager Waiting for client to connect to ZooKeeper
   [junit4]   2> 1322363 INFO  (zkCallback-1499-thread-1) [    ] o.a.s.c.c.ConnectionManager Watcher org.apache.solr.common.cloud.ConnectionManager@6566b66c name:ZooKeeperConnection Watcher:127.0.0.1:39028 got event WatchedEvent state:SyncConnected type:None path:null path:null type:None
   [junit4]   2> 1322363 INFO  (TEST-TestDynamicLoading.testDynamicLoading-seed#[80FA4BC1811FA9C0]) [    ] o.a.s.c.c.ConnectionManager Client is connected to ZooKeeper
   [junit4]   2> 1322363 INFO  (TEST-TestDynamicLoading.testDynamicLoading-seed#[80FA4BC1811FA9C0]) [    ] o.a.s.c.c.SolrZkClient Using default ZkACLProvider
   [junit4]   2> 1322370 INFO  (TEST-TestDynamicLoading.testDynamicLoading-seed#[80FA4BC1811FA9C0]) [n:127.0.0.1:53641_zm%2Fse    ] o.a.s.c.c.ConnectionManager Waiting for client to connect to ZooKeeper
   [junit4]   2> 1322372 INFO  (zkCallback-1500-thread-1-processing-n:127.0.0.1:53641_zm%2Fse) [n:127.0.0.1:53641_zm%2Fse    ] o.a.s.c.c.ConnectionManager Watcher org.apache.solr.common.cloud.ConnectionManager@bcce1e6 name:ZooKeeperConnection Watcher:127.0.0.1:39028/solr got event WatchedEvent state:SyncConnected type:None path:null path:null type:None
   [junit4]   2> 1322372 INFO  (TEST-TestDynamicLoading.testDynamicLoading-seed#[80FA4BC1811FA9C0]) [n:127.0.0.1:53641_zm%2Fse    ] o.a.s.c.c.ConnectionManager Client is connected to ZooKeeper
   [junit4]   2> 1322374 INFO  (TEST-TestDynamicLoading.testDynamicLoading-seed#[80FA4BC1811FA9C0]) [n:127.0.0.1:53641_zm%2Fse    ] o.a.s.c.c.SolrZkClient makePath: /overseer/queue
   [junit4]   2> 1322376 INFO  (TEST-TestDynamicLoading.testDynamicLoading-seed#[80FA4BC1811FA9C0]) [n:127.0.0.1:53641_zm%2Fse    ] o.a.s.c.c.SolrZkClient makePath: /overseer/collection-queue-work
   [junit4]   2> 1322379 INFO  (TEST-TestDynamicLoading.testDynamicLoading-seed#[80FA4BC1811FA9C0]) [n:127.0.0.1:53641_zm%2Fse    ] o.a.s.c.c.SolrZkClient makePath: /overseer/collection-map-running
   [junit4]   2> 1322382 INFO  (TEST-TestDynamicLoading.testDynamicLoading-seed#[80FA4BC1811FA9C0]) [n:127.0.0.1:53641_zm%2Fse    ] o.a.s.c.c.SolrZkClient makePath: /overseer/collection-map-completed
   [junit4]   2> 1322385 INFO  (TEST-TestDynamicLoading.testDynamicLoading-seed#[80FA4BC1811FA9C0]) [n:127.0.0.1:53641_zm%2Fse    ] o.a.s.c.c.SolrZkClient makePath: /overseer/collection-map-failure
   [junit4]   2> 1322388 INFO  (TEST-TestDynamicLoading.testDynamicLoading-seed#[80FA4BC1811FA9C0]) [n:127.0.0.1:53641_zm%2Fse    ] o.a.s.c.c.SolrZkClient makePath: /live_nodes
   [junit4]   2> 1322390 INFO  (TEST-TestDynamicLoading.testDynamicLoading-seed#[80FA4BC1811FA9C0]) [n:127.0.0.1:53641_zm%2Fse    ] o.a.s.c.c.SolrZkClient makePath: /aliases.json
   [junit4]   2> 1322392 INFO  (TEST-TestDynamicLoading.testDynamicLoading-seed#[80FA4BC1811FA9C0]) [n:127.0.0.1:53641_zm%2Fse    ] o.a.s.c.c.SolrZkClient makePath: /clusterstate.json
   [junit4]   2> 1322393 INFO  (TEST-TestDynamicLoading.testDynamicLoading-seed#[80FA4BC1811FA9C0]) [n:127.0.0.1:53641_zm%2Fse    ] o.a.s.c.ZkController Register node as live in ZooKeeper:/live_nodes/127.0.0.1:53641_zm%2Fse
   [junit4]   2> 1322394 INFO  (TEST-TestDynamicLoading.testDynamicLoading-seed#[80FA4BC1811FA9C0]) [n:127.0.0.1:53641_zm%2Fse    ] o.a.s.c.c.SolrZkClient makePath: /live_nodes/127.0.0.1:53641_zm%2Fse
   [junit4]   2> 1322396 INFO  (TEST-TestDynamicLoading.testDynamicLoading-seed#[80FA4BC1811FA9C0]) [n:127.0.0.1:53641_zm%2Fse    ] o.a.s.c.c.SolrZkClient makePath: /overseer_elect
   [junit4]   2> 1322397 INFO  (TEST-TestDynamicLoading.testDynamicLoading-seed#[80FA4BC1811FA9C0]) [n:127.0.0.1:53641_zm%2Fse    ] o.a.s.c.c.SolrZkClient makePath: /overseer_elect/election
   [junit4]   2> 1322398 INFO  (TEST-TestDynamicLoading.testDynamicLoading-seed#[80FA4BC1811FA9C0]) [n:127.0.0.1:53641_zm%2Fse    ] o.a.s.c.Overseer Overseer (id=null) closing
   [junit4]   2> 1322399 INFO  (TEST-TestDynamicLoading.testDynamicLoading-seed#[80FA4BC1811FA9C0]) [n:127.0.0.1:53641_zm%2Fse    ] o.a.s.c.LeaderElector Joined leadership election with path: /overseer_elect/election/94095328152190979-127.0.0.1:53641_zm%2Fse-n_0000000000
   [junit4]   2> 1322400 INFO  (TEST-TestDynamicLoading.testDynamicLoading-seed#[80FA4BC1811FA9C0]) [n:127.0.0.1:53641_zm%2Fse    ] o.a.s.c.OverseerElectionContext I am going to be the leader 127.0.0.1:53641_zm%2Fse
   [junit4]   2> 1322401 INFO  (TEST-TestDynamicLoading.testDynamicLoading-seed#[80FA4BC1811FA9C0]) [n:127.0.0.1:53641_zm%2Fse    ] o.a.s.c.c.SolrZkClient makePath: /overseer_elect/leader
   [junit4]   2> 1322403 INFO  (TEST-TestDynamicLoading.testDynamicLoading-seed#[80FA4BC1811FA9C0]) [n:127.0.0.1:53641_zm%2Fse    ] o.a.s.c.Overseer Overseer (id=94095328152190979-127.0.0.1:53641_zm%2Fse-n_0000000000) starting
   [junit4]   2> 1322405 INFO  (TEST-TestDynamicLoading.testDynamicLoading-seed#[80FA4BC1811FA9C0]) [n:127.0.0.1:53641_zm%2Fse    ] o.a.s.c.c.SolrZkClient makePath: /overseer/queue-work
   [junit4]   2> 1322413 INFO  (TEST-TestDynamicLoading.testDynamicLoading-seed#[80FA4BC1811FA9C0]) [n:127.0.0.1:53641_zm%2Fse    ] o.a.s.c.OverseerAutoReplicaFailoverThread Starting OverseerAutoReplicaFailoverThread autoReplicaFailoverWorkLoopDelay=10000 autoReplicaFailoverWaitAfterExpiration=30000 autoReplicaFailoverBadNodeExpiration=60000
   [junit4]   2> 1322414 INFO  (OverseerCollectionProcessor-94095328152190979-127.0.0.1:53641_zm%2Fse-n_0000000000) [n:127.0.0.1:53641_zm%2Fse    ] o.a.s.c.OverseerCollectionProcessor Process current queue of collection creations
   [junit4]   2> 1322415 INFO  (TEST-TestDynamicLoading.testDynamicLoading-seed#[80FA4BC1811FA9C0]) [n:127.0.0.1:53641_zm%2Fse    ] o.a.s.c.c.ZkStateReader Updating cluster state from ZooKeeper... 
   [junit4]   2> 1322415 INFO  (OverseerStateUpdate-94095328152190979-127.0.0.1:53641_zm%2Fse-n_0000000000) [n:127.0.0.1:53641_zm%2Fse    ] o.a.s.c.Overseer Starting to work on the main queue
   [junit4]   2> 1322424 INFO  (TEST-TestDynamicLoading.testDynamicLoading-seed#[80FA4BC1811FA9C0]) [n:127.0.0.1:53641_zm%2Fse    ] o.a.s.c.CoreContainer No authentication plugin used.
   [junit4]   2> 1322425 INFO  (TEST-TestDynamicLoading.testDynamicLoading-seed#[80FA4BC1811FA9C0]) [n:127.0.0.1:53641_zm%2Fse    ] o.a.s.c.CoreContainer Security conf doesn't exist. Skipping setup for authorization module.
   [junit4]   2> 1322426 INFO  (TEST-TestDynamicLoading.testDynamicLoading-seed#[80FA4BC1811FA9C0]) [n:127.0.0.1:53641_zm%2Fse    ] o.a.s.c.CoresLocator Looking for core definitions underneath /x1/jenkins/jenkins-slave/workspace/Lucene-Solr-Tests-5.x-Java7/solr/build/solr-core/test/J1/../../../../../../../../../../x1/jenkins/jenkins-slave/workspace/Lucene-Solr-Tests-5.x-Java7/solr/build/solr-core/test/J1/temp/solr.core.TestDynamicLoading_80FA4BC1811FA9C0-001/control-001/cores
   [junit4]   2> 1322428 INFO  (TEST-TestDynamicLoading.testDynamicLoading-seed#[80FA4BC1811FA9C0]) [n:127.0.0.1:53641_zm%2Fse    ] o.a.s.c.SolrCore Created CoreDescriptor: {dataDir=data/, name=collection1, coreNodeName=, collection=control_collection, absoluteInstDir=/x1/jenkins/jenkins-slave/workspace/Lucene-Solr-Tests-5.x-Java7/solr/build/solr-core/test/J1/../../../../../../../../../../x1/jenkins/jenkins-slave/workspace/Lucene-Solr-Tests-5.x-Java7/solr/build/solr-core/test/J1/temp/solr.core.TestDynamicLoading_80FA4BC1811FA9C0-001/control-001/cores/collection1/, schema=schema.xml, config=solrconfig.xml, transient=false, loadOnStartup=true, instanceDir=/x1/jenkins/jenkins-slave/workspace/Lucene-Solr-Tests-5.x-Java7/solr/build/solr-core/test/J1/../../../../../../../../../../x1/jenkins/jenkins-slave/workspace/Lucene-Solr-Tests-5.x-Java7/solr/build/solr-core/test/J1/temp/solr.core.TestDynamicLoading_80FA4BC1811FA9C0-001/control-001/cores/collection1, shard=}
   [junit4]   2> 1322428 INFO  (TEST-TestDynamicLoading.testDynamicLoading-seed#[80FA4BC1811FA9C0]) [n:127.0.0.1:53641_zm%2Fse    ] o.a.s.c.CoresLocator Found core collection1 in /x1/jenkins/jenkins-slave/workspace/Lucene-Solr-Tests-5.x-Java7/solr/build/solr-core/test/J1/../../../../../../../../../../x1/jenkins/jenkins-slave/workspace/Lucene-Solr-Tests-5.x-Java7/solr/build/solr-core/test/J1/temp/solr.core.TestDynamicLoading_80FA4BC1811FA9C0-001/control-001/cores/collection1/
   [junit4]   2> 1322428 INFO  (TEST-TestDynamicLoading.testDynamicLoading-seed#[80FA4BC1811FA9C0]) [n:127.0.0.1:53641_zm%2Fse    ] o.a.s.c.CoresLocator Found 1 core definitions
   [junit4]   2> 1322430 INFO  (coreLoadExecutor-3025-thread-1-processing-n:127.0.0.1:53641_zm%2Fse) [n:127.0.0.1:53641_zm%2Fse c:control_collection   x:collection1] o.a.s.c.ZkController publishing state=down
   [junit4]   2> 1322430 INFO  (TEST-TestDynamicLoading.testDynamicLoading-seed#[80FA4BC1811FA9C0]) [n:127.0.0.1:53641_zm%2Fse    ] o.a.s.s.SolrDispatchFilter user.dir=/x1/jenkins/jenkins-slave/workspace/Lucene-Solr-Tests-5.x-Java7/solr/build/solr-core/test/J1
   [junit4]   2> 1322430 INFO  (TEST-TestDynamicLoading.testDynamicLoading-seed#[80FA4BC1811FA9C0]) [n:127.0.0.1:53641_zm%2Fse    ] o.a.s.s.SolrDispatchFilter SolrDispatchFilter.init() done
   [junit4]   2> 1322430 INFO  (coreLoadExecutor-3025-thread-1-processing-n:127.0.0.1:53641_zm%2Fse) [n:127.0.0.1:53641_zm%2Fse c:control_collection   x:collection1] o.a.s.c.ZkController numShards not found on descriptor - reading it from system property
   [junit4]   2> 1322432 INFO  (coreLoadExecutor-3025-thread-1-processing-n:127.0.0.1:53641_zm%2Fse) [n:127.0.0.1:53641_zm%2Fse c:control_collection   x:collection1] o.a.s.c.ZkController look for our core node name
   [junit4]   2> 1322432 INFO  (zkCallback-1500-thread-1-processing-n:127.0.0.1:53641_zm%2Fse) [n:127.0.0.1:53641_zm%2Fse    ] o.a.s.c.DistributedQueue NodeChildrenChanged fired on path /overseer/queue state SyncConnected
   [junit4]   2> 1322433 INFO  (OverseerStateUpdate-94095328152190979-127.0.0.1:53641_zm%2Fse-n_0000000000) [n:127.0.0.1:53641_zm%2Fse    ] o.a.s.c.Overseer processMessage: queueSize: 1, message = {
   [junit4]   2>   "roles":null,
   [junit4]   2>   "core":"collection1",
   [junit4]   2>   "numShards":"1",
   [junit4]   2>   "state":"down",
   [junit4]   2>   "operation":"state",
   [junit4]   2>   "collection":"control_collection",
   [junit4]   2>   "shard":null,
   [junit4]   2>   "node_name":"127.0.0.1:53641_zm%2Fse",
   [junit4]   2>   "base_url":"http://127.0.0.1:53641/zm/se"} current state version: 0
   [junit4]   2> 1322433 INFO  (OverseerStateUpdate-94095328152190979-127.0.0.1:53641_zm%2Fse-n_0000000000) [n:127.0.0.1:53641_zm%2Fse    ] o.a.s.c.o.ReplicaMutator Update state numShards=1 message={
   [junit4]   2>   "roles":null,
   [junit4]   2>   "core":"collection1",
   [junit4]   2>   "numShards":"1",
   [junit4]   2>   "state":"down",
   [junit4]   2>   "operation":"state",
   [junit4]   2>   "collection":"control_collection",
   [junit4]   2>   "shard":null,
   [junit4]   2>   "node_name":"127.0.0.1:53641_zm%2Fse",
   [junit4]   2>   "base_url":"http://127.0.0.1:53641/zm/se"}
   [junit4]   2> 1322434 INFO  (OverseerStateUpdate-94095328152190979-127.0.0.1:53641_zm%2Fse-n_0000000000) [n:127.0.0.1:53641_zm%2Fse    ] o.a.s.c.o.ClusterStateMutator building a new cName: control_collection
   [junit4]   2> 1322434 INFO  (OverseerStateUpdate-94095328152190979-127.0.0.1:53641_zm%2Fse-n_0000000000) [n:127.0.0.1:53641_zm%2Fse    ] o.a.s.c.o.ReplicaMutator Assigning new node to shard shard=shard1
   [junit4]   2> 1322435 INFO  (zkCallback-1500-thread-1-processing-n:127.0.0.1:53641_zm%2Fse) [n:127.0.0.1:53641_zm%2Fse    ] o.a.s.c.c.ZkStateReader A cluster state change: WatchedEvent state:SyncConnected type:NodeDataChanged path:/clusterstate.json, has occurred - updating... (live nodes size: 1)
   [junit4]   2> 1322436 INFO  (zkCallback-1500-thread-1-processing-n:127.0.0.1:53641_zm%2Fse) [n:127.0.0.1:53641_zm%2Fse    ] o.a.s.c.c.ZkStateReader Updated cluster state version to 1
   [junit4]   2> 1323432 INFO  (coreLoadExecutor-3025-thread-1-processing-n:127.0.0.1:53641_zm%2Fse) [n:127.0.0.1:53641_zm%2Fse c:control_collection   x:collection1] o.a.s.c.ZkController waiting to find shard id in clusterstate for collection1
   [junit4]   2> 1323433 INFO  (coreLoadExecutor-3025-thread-1-processing-n:127.0.0.1:53641_zm%2Fse) [n:127.0.0.1:53641_zm%2Fse c:control_collection   x:collection1] o.a.s.c.ZkController Check for collection zkNode:control_collection
   [junit4]   2> 1323433 INFO  (coreLoadExecutor-3025-thread-1-processing-n:127.0.0.1:53641_zm%2Fse) [n:127.0.0.1:53641_zm%2Fse c:control_collection   x:collection1] o.a.s.c.ZkController Collection zkNode exists
   [junit4]   2> 1323434 INFO  (coreLoadExecutor-3025-thread-1-processing-n:127.0.0.1:53641_zm%2Fse) [n:127.0.0.1:53641_zm%2Fse c:control_collection   x:collection1] o.a.s.c.c.ZkStateReader Load collection config from:/collections/control_collection
   [junit4]   2> 1323434 INFO  (coreLoadExecutor-3025-thread-1-processing-n:127.0.0.1:53641_zm%2Fse) [n:127.0.0.1:53641_zm%2Fse c:control_collection   x:collection1] o.a.s.c.c.ZkStateReader path=/collections/control_collection configName=conf1 specified config exists in ZooKeeper
   [junit4]   2> 1323435 INFO  (coreLoadExecutor-3025-thread-1-processing-n:127.0.0.1:53641_zm%2Fse) [n:127.0.0.1:53641_zm%2Fse c:control_collection   x:collection1] o.a.s.c.SolrResourceLoader new SolrResourceLoader for directory: '/x1/jenkins/jenkins-slave/workspace/Lucene-Solr-Tests-5.x-Java7/solr/build/solr-core/test/J1/../../../../../../../../../../x1/jenkins/jenkins-slave/workspace/Lucene-Solr-Tests-5.x-Java7/solr/build/solr-core/test/J1/temp/solr.core.TestDynamicLoading_80FA4BC1811FA9C0-001/control-001/cores/collection1/'
   [junit4]   2> 1323454 INFO  (coreLoadExecutor-3025-thread-1-processing-n:127.0.0.1:53641_zm%2Fse) [n:127.0.0.1:53641_zm%2Fse c:control_collection   x:collection1] o.a.s.c.Config loaded config solrconfig.xml with version 0 
   [junit4]   2> 1323461 INFO  (coreLoadExecutor-3025-thread-1-processing-n:127.0.0.1:53641_zm%2Fse) [n:127.0.0.1:53641_zm%2Fse c:control_collection   x:collection1] o.a.s.c.SolrConfig current version of requestparams : -1
   [junit4]   2> 1323476 INFO  (coreLoadExecutor-3025-thread-1-processing-n:127.0.0.1:53641_zm%2Fse) [n:127.0.0.1:53641_zm%2Fse c:control_collection   x:collection1] o.a.s.c.SolrConfig Using Lucene MatchVersion: 5.3.0
   [junit4]   2> 1323509 INFO  (coreLoadExecutor-3025-thread-1-processing-n:127.0.0.1:53641_zm%2Fse) [n:127.0.0.1:53641_zm%2Fse c:control_collection   x:collection1] o.a.s.c.Config Loaded SolrConfig: solrconfig.xml
   [junit4]   2> 1323511 INFO  (coreLoadExecutor-3025-thread-1-processing-n:127.0.0.1:53641_zm%2Fse) [n:127.0.0.1:53641_zm%2Fse c:control_collection   x:collection1] o.a.s.s.IndexSchema Reading Solr Schema from /configs/conf1/schema.xml
   [junit4]   2> 1323525 INFO  (coreLoadExecutor-3025-thread-1-processing-n:127.0.0.1:53641_zm%2Fse) [n:127.0.0.1:53641_zm%2Fse c:control_collection   x:collection1] o.a.s.s.IndexSchema [collection1] Schema name=test
   [junit4]   2> 1323801 INFO  (coreLoadExecutor-3025-thread-1-processing-n:127.0.0.1:53641_zm%2Fse) [n:127.0.0.1:53641_zm%2Fse c:control_collection   x:collection1] o.a.s.s.OpenExchangeRatesOrgProvider Initialized with rates=open-exchange-rates.json, refreshInterval=1440.
   [junit4]   2> 1323812 INFO  (coreLoadExecutor-3025-thread-1-processing-n:127.0.0.1:53641_zm%2Fse) [n:127.0.0.1:53641_zm%2Fse c:control_collection   x:collection1] o.a.s.s.IndexSchema default search field in schema is text
   [junit4]   2> 1323814 INFO  (coreLoadExecutor-3025-thread-1-processing-n:127.0.0.1:53641_zm%2Fse) [n:127.0.0.1:53641_zm%2Fse c:control_collection   x:collection1] o.a.s.s.IndexSchema unique key field: id
   [junit4]   2> 1323824 INFO  (coreLoadExecutor-3025-thread-1-processing-n:127.0.0.1:53641_zm%2Fse) [n:127.0.0.1:53641_zm%2Fse c:control_collection   x:collection1] o.a.s.s.FileExchangeRateProvider Reloading exchange rates from file currency.xml
   [junit4]   2> 1323829 INFO  (coreLoadExecutor-3025-thread-1-processing-n:127.0.0.1:53641_zm%2Fse) [n:127.0.0.1:53641_zm%2Fse c:control_collection   x:collection1] o.a.s.s.FileExchangeRateProvider Reloading exchange rates from file currency.xml
   [junit4]   2> 1323832 INFO  (coreLoadExecutor-3025-thread-1-processing-n:127.0.0.1:53641_zm%2Fse) [n:127.0.0.1:53641_zm%2Fse c:control_collection   x:collection1] o.a.s.s.OpenExchangeRatesOrgProvider Reloading exchange rates from open-exchange-rates.json
   [junit4]   2> 1323833 WARN  (coreLoadExecutor-3025-thread-1-processing-n:127.0.0.1:53641_zm%2Fse) [n:127.0.0.1:53641_zm%2Fse c:control_collection   x:collection1] o.a.s.s.OpenExchangeRatesOrgProvider Unknown key IMPORTANT NOTE
   [junit4]   2> 1323833 WARN  (coreLoadExecutor-3025-thread-1-processing-n:127.0.0.1:53641_zm%2Fse) [n:127.0.0.1:53641_zm%2Fse c:control_collection   x:collection1] o.a.s.s.OpenExchangeRatesOrgProvider Expected key, got STRING
   [junit4]   2> 1323834 INFO  (coreLoadExecutor-3025-thread-1-processing-n:127.0.0.1:53641_zm%2Fse) [n:127.0.0.1:53641_zm%2Fse c:control_collection   x:collection1] o.a.s.s.OpenExchangeRatesOrgProvider Reloading exchange rates from open-exchange-rates.json
   [junit4]   2> 1323834 WARN  (coreLoadExecutor-3025-thread-1-processing-n:127.0.0.1:53641_zm%2Fse) [n:127.0.0.1:53641_zm%2Fse c:control_collection   x:collection1] o.a.s.s.OpenExchangeRatesOrgProvider Unknown key IMPORTANT NOTE
   [junit4]   2> 1323835 WARN  (coreLoadExecutor-3025-thread-1-processing-n:127.0.0.1:53641_zm%2Fse) [n:127.0.0.1:53641_zm%2Fse c:control_collection   x:collection1] o.a.s.s.OpenExchangeRatesOrgProvider Expected key, got STRING
   [junit4]   2> 1323835 INFO  (coreLoadExecutor-3025-thread-1-processing-n:127.0.0.1:53641_zm%2Fse) [n:127.0.0.1:53641_zm%2Fse c:control_collection   x:collection1] o.a.s.c.CoreContainer Creating SolrCore 'collection1' using configuration from collection control_collection
   [junit4]   2> 1323835 INFO  (coreLoadExecutor-3025-thread-1-processing-n:127.0.0.1:53641_zm%2Fse) [n:127.0.0.1:53641_zm%2Fse c:control_collection s:shard1 r:core_node1 x:collection1] o.a.s.c.SolrCore org.apache.solr.core.MockDirectoryFactory
   [junit4]   2> 1323835 INFO  (coreLoadExecutor-3025-thread-1-processing-n:127.0.0.1:53641_zm%2Fse) [n:127.0.0.1:53641_zm%2Fse c:control_collection s:shard1 r:core_node1 x:collection1] o.a.s.c.SolrCore [[collection1] ] Opening new SolrCore at [/x1/jenkins/jenkins-slave/workspace/Lucene-Solr-Tests-5.x-Java7/solr/build/solr-core/test/J1/../../../../../../../../../../x1/jenkins/jenkins-slave/workspace/Lucene-Solr-Tests-5.x-Java7/solr/build/solr-core/test/J1/temp/solr.core.TestDynamicLoading_80FA4BC1811FA9C0-001/control-001/cores/collection1/], dataDir=[null]
   [junit4]   2> 1323835 INFO  (coreLoadExecutor-3025-thread-1-processing-n:127.0.0.1:53641_zm%2Fse) [n:127.0.0.1:53641_zm%2Fse c:control_collection s:shard1 r:core_node1 x:collection1] o.a.s.c.JmxMonitoredMap JMX monitoring is enabled. Adding Solr mbeans to JMX Server: com.sun.jmx.mbeanserver.JmxMBeanServer@78691d
   [junit4]   2> 1323836 INFO  (coreLoadExecutor-3025-thread-1-processing-n:127.0.0.1:53641_zm%2Fse) [n:127.0.0.1:53641_zm%2Fse c:control_collection s:shard1 r:core_node1 x:collection1] o.a.s.c.CachingDirectoryFactory return new directory for /x1/jenkins/jenkins-slave/workspace/Lucene-Solr-Tests-5.x-Java7/solr/build/solr-core/test/J1/../../../../../../../../../../x1/jenkins/jenkins-slave/workspace/Lucene-Solr-Tests-5.x-Java7/solr/build/solr-core/test/J1/temp/solr.core.TestDynamicLoading_80FA4BC1811FA9C0-001/control-001/cores/collection1/data
   [junit4]   2> 1323836 INFO  (coreLoadExecutor-3025-thread-1-processing-n:127.0.0.1:53641_zm%2Fse) [n:127.0.0.1:53641_zm%2Fse c:control_collection s:shard1 r:core_node1 x:collection1] o.a.s.c.SolrCore New index directory detected: old=null new=/x1/jenkins/jenkins-slave/workspace/Lucene-Solr-Tests-5.x-Java7/solr/build/solr-core/test/J1/../../../../../../../../../../x1/jenkins/jenkins-slave/workspace/Lucene-Solr-Tests-5.x-Java7/solr/build/solr-core/test/J1/temp/solr.core.TestDynamicLoading_80FA4BC1811FA9C0-001/control-001/cores/collection1/data/index/
   [junit4]   2> 1323837 WARN  (coreLoadExecutor-3025-thread-1-processing-n:127.0.0.1:53641_zm%2Fse) [n:127.0.0.1:53641_zm%2Fse c:control_collection s:shard1 r:core_node1 x:collection1] o.a.s.c.SolrCore [collection1] Solr index directory '/x1/jenkins/jenkins-slave/workspace/Lucene-Solr-Tests-5.x-Java7/solr/build/solr-core/test/J1/../../../../../../../../../../x1/jenkins/jenkins-slave/workspace/Lucene-Solr-Tests-5.x-Java7/solr/build/solr-core/test/J1/temp/solr.core.TestDynamicLoading_80FA4BC1811FA9C0-001/control-001/cores/collection1/data/index' doesn't exist. Creating new index...
   [junit4]   2> 1323837 INFO  (coreLoadExecutor-3025-thread-1-processing-n:127.0.0.1:53641_zm%2Fse) [n:127.0.0.1:53641_zm%2Fse c:control_collection s:shard1 r:core_node1 x:collection1] o.a.s.c.CachingDirectoryFactory return new directory for /x1/jenkins/jenkins-slave/workspace/Lucene-Solr-Tests-5.x-Java7/solr/build/solr-core/test/J1/../../../../../../../../../../x1/jenkins/jenkins-slave/workspace/Lucene-Solr-Tests-5.x-Java7/solr/build/solr-core/test/J1/temp/solr.core.TestDynamicLoading_80FA4BC1811FA9C0-001/control-001/cores/collection1/data/index
   [junit4]   2> 1323837 INFO  (coreLoadExecutor-3025-thread-1-processing-n:127.0.0.1:53641_zm%2Fse) [n:127.0.0.1:53641_zm%2Fse c:control_collection s:shard1 r:core_node1 x:collection1] o.a.s.u.RandomMergePolicy RandomMergePolicy wrapping class org.apache.lucene.index.TieredMergePolicy: [TieredMergePolicy: maxMergeAtOnce=30, maxMergeAtOnceExplicit=37, maxMergedSegmentMB=86.2021484375, floorSegmentMB=0.21484375, forceMergeDeletesPctAllowed=16.654640094904423, segmentsPerTier=15.0, maxCFSSegmentSizeMB=8.796093022207999E12, noCFSRatio=0.8846303236790726
   [junit4]   2> 1323839 INFO  (coreLoadExecutor-3025-thread-1-processing-n:127.0.0.1:53641_zm%2Fse) [n:127.0.0.1:53641_zm%2Fse c:control_collection s:shard1 r:core_node1 x:collection1] o.a.s.c.SolrCore SolrDeletionPolicy.onCommit: commits: num=1
   [junit4]   2> 	commit{dir=MockDirectoryWrapper(RAMDirectory@3cf57969 lockFactory=org.apache.lucene.store.SingleInstanceLockFactory@17f5fbc3),segFN=segments_1,generation=1}
   [junit4]   2> 1323839 INFO  (coreLoadExecutor-3025-thread-1-processing-n:127.0.0.1:53641_zm%2Fse) [n:127.0.0.1:53641_zm%2Fse c:control_collection s:shard1 r:core_node1 x:collection1] o.a.s.c.SolrCore newest commit generation = 1
   [junit4]   2> 1323839 INFO  (OldIndexDirectoryCleanupThreadForCore-collection1) [n:127.0.0.1:53641_zm%2Fse c:control_collection s:shard1 r:core_node1 x:collection1] o.a.s.c.SolrCore Looking for old index directories to cleanup for core collection1 in /x1/jenkins/jenkins-slave/workspace/Lucene-Solr-Tests-5.x-Java7/solr/build/solr-core/test/J1/../../../../../../../../../../x1/jenkins/jenkins-slave/workspace/Lucene-Solr-Tests-5.x-Java7/solr/build/solr-core/test/J1/temp/solr.core.TestDynamicLoading_80FA4BC1811FA9C0-001/control-001/cores/collection1/data/
   [junit4]   2> 1323840 WARN  (OldIndexDirectoryCleanupThreadForCore-collection1) [n:127.0.0.1:53641_zm%2Fse c:control_collection s:shard1 r:core_node1 x:collection1] o.a.s.c.DirectoryFactory /x1/jenkins/jenkins-slave/workspace/Lucene-Solr-Tests-5.x-Java7/solr/build/solr-core/test/J1/../../../../../../../../../../x1/jenkins/jenkins-slave/workspace/Lucene-Solr-Tests-5.x-Java7/solr/build/solr-core/test/J1/temp/solr.core.TestDynamicLoading_80FA4BC1811FA9C0-001/control-001/cores/collection1/data/ does not point to a valid data directory; skipping clean-up of old index directories.
   [junit4]   2> 1323845 INFO  (coreLoadExecutor-3025-thread-1-processing-n:127.0.0.1:53641_zm%2Fse) [n:127.0.0.1:53641_zm%2Fse c:control_collection s:shard1 r:core_node1 x:collection1] o.a.s.u.p.UpdateRequestProcessorChain creating updateRequestProcessorChain "nodistrib"
   [junit4]   2> 1323846 INFO  (coreLoadExecutor-3025-thread-1-processing-n:127.0.0.1:53641_zm%2Fse) [n:127.0.0.1:53641_zm%2Fse c:control_collection s:shard1 r:core_node1 x:collection1] o.a.s.u.p.UpdateRequestProcessorChain creating updateRequestProcessorChain "dedupe"
   [junit4]   2> 1323846 INFO  (coreLoadExecutor-3025-thread-1-processing-n:127.0.0.1:53641_zm%2Fse) [n:127.0.0.1:53641_zm%2Fse c:control_collection s:shard1 r:core_node1 x:collection1] o.a.s.u.p.UpdateRequestProcessorChain inserting DistributedUpdateProcessorFactory into updateRequestProcessorChain "dedupe"
   [junit4]   2> 1323846 INFO  (coreLoadExecutor-3025-thread-1-processing-n:127.0.0.1:53641_zm%2Fse) [n:127.0.0.1:53641_zm%2Fse c:control_collection s:shard1 r:core_node1 x:collection1] o.a.s.u.p.UpdateRequestProcessorChain creating updateRequestProcessorChain "stored_sig"
   [junit4]   2> 1323847 INFO  (coreLoadExecutor-3025-thread-1-processing-n:127.0.0.1:53641_zm%2Fse) [n:127.0.0.1:53641_zm%2Fse c:control_collection s:shard1 r:core_node1 x:collection1] o.a.s.u.p.UpdateRequestProcessorChain inserting DistributedUpdateProcessorFactory into updateRequestProcessorChain "stored_sig"
   [junit4]   2> 1323847 INFO  (coreLoadExecutor-3025-thread-1-processing-n:127.0.0.1:53641_zm%2Fse) [n:127.0.0.1:53641_zm%2Fse c:control_collection s:shard1 r:core_node1 x:collection1] o.a.s.u.p.UpdateRequestProcessorChain creating updateRequestProcessorChain "distrib-dup-test-chain-explicit"
   [junit4]   2> 1323847 INFO  (coreLoadExecutor-3025-thread-1-processing-n:127.0.0.1:53641_zm%2Fse) [n:127.0.0.1:53641_zm%2Fse c:control_collection s:shard1 r:core_node1 x:collection1] o.a.s.u.p.UpdateRequestProcessorChain creating updateRequestProcessorChain "distrib-dup-test-chain-implicit"
   [junit4]   2> 1323848 INFO  (coreLoadExecutor-3025-thread-1-processing-n:127.0.0.1:53641_zm%2Fse) [n:127.0.0.1:53641_zm%2Fse c:control_collection s:shard1 r:core_node1 x:collection1] o.a.s.u.p.UpdateRequestProcessorChain inserting DistributedUpdateProcessorFactory into updateRequestProcessorChain "distrib-dup-test-chain-implicit"
   [junit4]   2> 1323848 INFO  (coreLoadExecutor-3025-thread-1-processing-n:127.0.0.1:53641_zm%2Fse) [n:127.0.0.1:53641_zm%2Fse c:control_collection s:shard1 r:core_node1 x:collection1] o.a.s.c.SolrCore no updateRequestProcessorChain defined as default, creating implicit default
   [junit4]   2> 1323852 INFO  (coreLoadExecutor-3025-thread-1-processing-n:127.0.0.1:53641_zm%2Fse) [n:127.0.0.1:53641_zm%2Fse c:control_collection s:shard1 r:core_node1 x:collection1] o.a.s.h.l.XMLLoader xsltCacheLifetimeSeconds=60
   [junit4]   2> 1323853 INFO  (coreLoadExecutor-3025-thread-1-processing-n:127.0.0.1:53641_zm%2Fse) [n:127.0.0.1:53641_zm%2Fse c:control_collection s:shard1 r:core_node1 x:collection1] o.a.s.h.l.XMLLoader xsltCacheLifetimeSeconds=60
   [junit4]   2> 1323854 INFO  (coreLoadExecutor-3025-thread-1-processing-n:127.0.0.1:53641_zm%2Fse) [n:127.0.0.1:53641_zm%2Fse c:control_collection s:shard1 r:core_node1 x:collection1] o.a.s.h.l.XMLLoader xsltCacheLifetimeSeconds=60
   [junit4]   2> 1323856 INFO  (coreLoadExecutor-3025-thread-1-processing-n:127.0.0.1:53641_zm%2Fse) [n:127.0.0.1:53641_zm%2Fse c:control_collection s:shard1 r:core_node1 x:collection1] o.a.s.h.l.XMLLoader xsltCacheLifetimeSeconds=60
   [junit4]   2> 1323860 INFO  (coreLoadExecutor-3025-thread-1-processing-n:127.0.0.1:53641_zm%2Fse) [n:127.0.0.1:53641_zm%2Fse c:control_collection s:shard1 r:core_node1 x:collection1] o.a.s.c.RequestHandlers Registered paths: /admin/threads,/admin/logging,/admin/mbeans,/admin/ping,/admin/plugins,/get,standard,/admin/system,/config,/update/csv,/admin/properties,/replication,/schema,/update/json,/update,/admin/segments,/admin/file,/admin/luke,/update/json/docs
   [junit4]   2> 1323861 INFO  (coreLoadExecutor-3025-thread-1-processing-n:127.0.0.1:53641_zm%2Fse) [n:127.0.0.1:53641_zm%2Fse c:control_collection s:shard1 r:core_node1 x:collection1] o.a.s.c.SolrCore Using default statsCache cache: org.apache.solr.search.stats.LocalStatsCache
   [junit4]   2> 1323862 INFO  (coreLoadExecutor-3025-thread-1-processing-n:127.0.0.1:53641_zm%2Fse) [n:127.0.0.1:53641_zm%2Fse c:control_collection s:shard1 r:core_node1 x:collection1] o.a.s.u.UpdateHandler Using UpdateLog implementation: org.apache.solr.update.UpdateLog
   [junit4]   2> 1323862 INFO  (coreLoadExecutor-3025-thread-1-processing-n:127.0.0.1:53641_zm%2Fse) [n:127.0.0.1:53641_zm%2Fse c:control_collection s:shard1 r:core_node1 x:collection1] o.a.s.u.UpdateLog Initializing UpdateLog: dataDir= defaultSyncLevel=FLUSH numRecordsToKeep=100 maxNumLogsToKeep=10 numVersionBuckets=65536
   [junit4]   2> 1323863 INFO  (coreLoadExecutor-3025-thread-1-processing-n:127.0.0.1:53641_zm%2Fse) [n:127.0.0.1:53641_zm%2Fse c:control_collection s:shard1 r:core_node1 x:collection1] o.a.s.c.SolrCore Hard AutoCommit: disabled
   [junit4]   2> 1323863 INFO  (coreLoadExecutor-3025-thread-1-processing-n:127.0.0.1:53641_zm%2Fse) [n:127.0.0.1:53641_zm%2Fse c:control_collection s:shard1 r:core_node1 x:collection1] o.a.s.c.SolrCore Soft AutoCommit: disabled
   [junit4]   2> 1323864 INFO  (coreLoadExecutor-3025-thread-1-processing-n:127.0.0.1:53641_zm%2Fse) [n:127.0.0.1:53641_zm%2Fse c:control_collection s:shard1 r:core_node1 x:collection1] o.a.s.u.RandomMergePolicy RandomMergePolicy wrapping class org.apache.lucene.index.LogDocMergePolicy: [LogDocMergePolicy: minMergeSize=1000, mergeFactor=22, maxMergeSize=9223372036854775807, maxMergeSizeForForcedMerge=9223372036854775807, calibrateSizeByDeletes=false, maxMergeDocs=2147483647, maxCFSSegmentSizeMB=8.796093022207999E12, noCFSRatio=0.0]
   [junit4]   2> 1323864 INFO  (coreLoadExecutor-3025-thread-1-processing-n:127.0.0.1:53641_zm%2Fse) [n:127.0.0.1:53641_zm%2Fse c:control_collection s:shard1 r:core_node1 x:collection1] o.a.s.c.SolrCore SolrDeletionPolicy.onInit: commits: num=1
   [junit4]   2> 	commit{dir=MockDirectoryWrapper(RAMDirectory@3cf57969 lockFactory=org.apache.lucene.store.SingleInstanceLockFactory@17f5fbc3),segFN=segments_1,generation=1}
   [junit4]   2> 1323864 INFO  (coreLoadExecutor-3025-thread-1-processing-n:127.0.0.1:53641_zm%2Fse) [n:127.0.0.1:53641_zm%2Fse c:control_collection s:shard1 r:core_node1 x:collection1] o.a.s.c.SolrCore newest commit generation = 1
   [junit4]   2> 1323865 INFO  (coreLoadExecutor-3025-thread-1-processing-n:127.0.0.1:53641_zm%2Fse) [n:127.0.0.1:53641_zm%2Fse c:control_collection s:shard1 r:core_node1 x:collection1] o.a.s.s.SolrIndexSearcher Opening Searcher@41453955[collection1] main
   [junit4]   2> 1323865 INFO  (coreLoadExecutor-3025-thread-1-processing-n:127.0.0.1:53641_zm%2Fse) [n:127.0.0.1:53641_zm%2Fse c:control_collection s:shard1 r:core_node1 x:collection1] o.a.s.c.c.ZkStateReader Load collection config from:/collections/control_collection
   [junit4]   2> 1323866 INFO  (coreLoadExecutor-3025-thread-1-processing-n:127.0.0.1:53641_zm%2Fse) [n:127.0.0.1:53641_zm%2Fse c:control_collection s:shard1 r:core_node1 x:collection1] o.a.s.c.c.ZkStateReader path=/collections/control_collection configName=conf1 specified config exists in ZooKeeper
   [junit4]   2> 1323866 INFO  (coreLoadExecutor-3025-thread-1-processing-n:127.0.0.1:53641_zm%2Fse) [n:127.0.0.1:53641_zm%2Fse c:control_collection s:shard1 r:core_node1 x:collection1] o.a.s.r.ManagedResourceStorage Setting up ZooKeeper-based storage for the RestManager with znodeBase: /configs/conf1
   [junit4]   2> 1323867 INFO  (coreLoadExecutor-3025-thread-1-processing-n:127.0.0.1:53641_zm%2Fse) [n:127.0.0.1:53641_zm%2Fse c:control_collection s:shard1 r:core_node1 x:collection1] o.a.s.r.ManagedResourceStorage Configured ZooKeeperStorageIO with znodeBase: /configs/conf1
   [junit4]   2> 1323867 INFO  (coreLoadExecutor-3025-thread-1-processing-n:127.0.0.1:53641_zm%2Fse) [n:127.0.0.1:53641_zm%2Fse c:control_collection s:shard1 r:core_node1 x:collection1] o.a.s.r.RestManager Initializing RestManager with initArgs: {}
   [junit4]   2> 1323867 INFO  (coreLoadExecutor-3025-thread-1-processing-n:127.0.0.1:53641_zm%2Fse) [n:127.0.0.1:53641_zm%2Fse c:control_collection s:shard1 r:core_node1 x:collection1] o.a.s.r.ManagedResourceStorage Reading _rest_managed.json using ZooKeeperStorageIO:path=/configs/conf1
   [junit4]   2> 1323868 INFO  (coreLoadExecutor-3025-thread-1-processing-n:127.0.0.1:53641_zm%2Fse) [n:127.0.0.1:53641_zm%2Fse c:control_collection s:shard1 r:core_node1 x:collection1] o.a.s.r.ManagedResourceStorage No data found for znode /configs/conf1/_rest_managed.json
   [junit4]   2> 1323868 INFO  (coreLoadExecutor-3025-thread-1-processing-n:127.0.0.1:53641_zm%2Fse) [n:127.0.0.1:53641_zm%2Fse c:control_collection s:shard1 r:core_node1 x:collection1] o.a.s.r.ManagedResourceStorage Loaded null at path _rest_managed.json using ZooKeeperStorageIO:path=/configs/conf1
   [junit4]   2> 1323868 INFO  (coreLoadExecutor-3025-thread-1-processing-n:127.0.0.1:53641_zm%2Fse) [n:127.0.0.1:53641_zm%2Fse c:control_collection s:shard1 r:core_node1 x:collection1] o.a.s.r.RestManager Initializing 0 registered ManagedResources
   [junit4]   2> 1323868 INFO  (coreLoadExecutor-3025-thread-1-processing-n:127.0.0.1:53641_zm%2Fse) [n:127.0.0.1:53641_zm%2Fse c:control_collection s:shard1 r:core_node1 x:collection1] o.a.s.h.ReplicationHandler Commits will be reserved for  10000
   [junit4]   2> 1323869 INFO  (searcherExecutor-3026-thread-1-processing-x:collection1 c:control_collection r:core_node1 s:shard1 n:127.0.0.1:53641_zm%2Fse) [n:127.0.0.1:53641_zm%2Fse c:control_collection s:shard1 r:core_node1 x:collection1] o.a.s.c.SolrCore [collection1] Registered new searcher Searcher@41453955[collection1] main{ExitableDirectoryReader(UninvertingDirectoryReader())}
   [junit4]   2> 1323869 INFO  (coreLoadExecutor-3025-thread-1-processing-n:127.0.0.1:53641_zm%2Fse) [n:127.0.0.1:53641_zm%2Fse c:control_collection s:shard1 r:core_node1 x:collection1] o.a.s.u.UpdateLog Looking up max value of version field to seed version buckets
   [junit4]   2> 1323870 INFO  (coreLoadExecutor-3025-thread-1-processing-n:127.0.0.1:53641_zm%2Fse) [n:127.0.0.1:53641_zm%2Fse c:control_collection s:shard1 r:core_node1 x:collection1] o.a.s.u.VersionInfo Refreshing highest value of _version_ for 65536 version buckets from index
   [junit4]   2> 1323870 INFO  (coreLoadExecutor-3025-thread-1-processing-n:127.0.0.1:53641_zm%2Fse) [n:127.0.0.1:53641_zm%2Fse c:control_collection s:shard1 r:core_node1 x:collection1] o.a.s.u.VersionInfo No terms found for _version_, cannot seed version bucket highest value from index
   [junit4]   2> 1323870 INFO  (coreLoadExecutor-3025-thread-1-processing-n:127.0.0.1:53641_zm%2Fse) [n:127.0.0.1:53641_zm%2Fse c:control_collection s:shard1 r:core_node1 x:collection1] o.a.s.u.UpdateLog Could not find max version in index or recent updates, using new clock 1505525252556324864
   [junit4]   2> 1323872 INFO  (coreLoadExecutor-3025-thread-1-processing-n:127.0.0.1:53641_zm%2Fse) [n:127.0.0.1:53641_zm%2Fse c:control_collection s:shard1 r:core_node1 x:collection1] o.a.s.u.UpdateLog Took 2 ms to seed version buckets with highest version 1505525252556324864
   [junit4]   2> 1323872 INFO  (coreLoadExecutor-3025-thread-1-processing-n:127.0.0.1:53641_zm%2Fse) [n:127.0.0.1:53641_zm%2Fse c:control_collection s:shard1 r:core_node1 x:collection1] o.a.s.c.ZkController watch zkdir /configs/conf1
   [junit4]   2> 1323873 INFO  (coreLoadExecutor-3025-thread-1-processing-n:127.0.0.1:53641_zm%2Fse) [n:127.0.0.1:53641_zm%2Fse c:control_collection s:shard1 r:core_node1 x:collection1] o.a.s.c.CoreContainer registering core: collection1
   [junit4]   2> 1323874 INFO  (coreZkRegister-3019-thread-1-processing-x:collection1 c:control_collection r:core_node1 s:shard1 n:127.0.0.1:53641_zm%2Fse) [n:127.0.0.1:53641_zm%2Fse c:control_collection s:shard1 r:core_node1 x:collection1] o.a.s.c.ZkController Register replica - core:collection1 address:http://127.0.0.1:53641/zm/se collection:control_collection shard:shard1
   [junit4]   2> 1323874 INFO  (coreZkRegister-3019-thread-1-processing-x:collection1 c:control_collection r:core_node1 s:shard1 n:127.0.0.1:53641_zm%2Fse) [n:127.0.0.1:53641_zm%2Fse c:control_collection s:shard1 r:core_node1 x:collection1] o.a.s.c.c.SolrZkClient makePath: /collections/control_collection/leader_elect/shard1/election
   [junit4]   2> 1323879 INFO  (coreZkRegister-3019-thread-1-processing-x:collection1 c:control_collection r:core_node1 s:shard1 n:127.0.0.1:53641_zm%2Fse) [n:127.0.0.1:53641_zm%2Fse c:control_collection s:shard1 r:core_node1 x:collection1] o.a.s.c.LeaderElector Joined leadership election with path: /collections/control_collection/leader_elect/shard1/election/94095328152190979-core_node1-n_0000000000
   [junit4]   2> 1323880 INFO  (coreZkRegister-3019-thread-1-processing-x:collection1 c:control_collection r:core_node1 s:shard1 n:127.0.0.1:53641_zm%2Fse) [n:127.0.0.1:53641_zm%2Fse c:control_collection s:shard1 r:core_node1 x:collection1] o.a.s.c.ShardLeaderElectionContext Running the leader process for shard shard1
   [junit4]   2> 1323882 INFO  (zkCallback-1500-thread-1-processing-n:127.0.0.1:53641_zm%2Fse) [n:127.0.0.1:53641_zm%2Fse    ] o.a.s.c.DistributedQueue NodeChildrenChanged fired on path /overseer/queue state SyncConnected
   [junit4]   2> 1323882 INFO  (coreZkRegister-3019-thread-1-processing-x:collection1 c:control_collection r:core_node1 s:shard1 n:127.0.0.1:53641_zm%2Fse) [n:127.0.0.1:53641_zm%2Fse c:control_collection s:shard1 r:core_node1 x:collection1] o.a.s.c.ShardLeaderElectionContext Enough replicas found to continue.
   [junit4]   2> 1323882 INFO  (coreZkRegister-3019-thread-1-processing-x:collection1 c:control_collection r:core_node1 s:shard1 n:127.0.0.1:53641_zm%2Fse) [n:127.0.0.1:53641_zm%2Fse c:control_collection s:shard1 r:core_node1 x:collection1] o.a.s.c.ShardLeaderElectionContext I may be the new leader - try and sync
   [junit4]   2> 1323882 INFO  (coreZkRegister-3019-thread-1-processing-x:collection1 c:control_collection r:core_node1 s:shard1 n:127.0.0.1:53641_zm%2Fse) [n:127.0.0.1:53641_zm%2Fse c:control_collection s:shard1 r:core_node1 x:collection1] o.a.s.c.SyncStrategy Sync replicas to http://127.0.0.1:53641/zm/se/collection1/
   [junit4]   2> 1323882 INFO  (coreZkRegister-3019-thread-1-processing-x:collection1 c:control_collection r:core_node1 s:shard1 n:127.0.0.1:53641_zm%2Fse) [n:127.0.0.1:53641_zm%2Fse c:control_collection s:shard1 r:core_node1 x:collection1] o.a.s.c.SyncStrategy Sync Success - now sync replicas to me
   [junit4]   2> 1323882 INFO  (coreZkRegister-3019-thread-1-processing-x:collection1 c:control_collection r:core_node1 s:shard1 n:127.0.0.1:53641_zm%2Fse) [n:127.0.0.1:53641_zm%2Fse c:control_collection s:shard1 r:core_node1 x:collection1] o.a.s.c.SyncStrategy http://127.0.0.1:53641/zm/se/collection1/ has no replicas
   [junit4]   2> 1323882 INFO  (OverseerStateUpdate-94095328152190979-127.0.0.1:53641_zm%2Fse-n_0000000000) [n:127.0.0.1:53641_zm%2Fse    ] o.a.s.c.Overseer processMessage: queueSize: 1, message = {
   [junit4]   2>   "operation":"leader",
   [junit4]   2>   "shard":"shard1",
   [junit4]   2>   "collection":"control_collection"} current state version: 1
   [junit4]   2> 1323883 INFO  (coreZkRegister-3019-thread-1-processing-x:collection1 c:control_collection r:core_node1 s:shard1 n:127.0.0.1:53641_zm%2Fse) [n:127.0.0.1:53641_zm%2Fse c:control_collection s:shard1 r:core_node1 x:collection1] o.a.s.c.ShardLeaderElectionContext I am the new leader: http://127.0.0.1:53641/zm/se/collection1/ shard1
   [junit4]   2> 1323883 INFO  (coreZkRegister-3019-thread-1-processing-x:collection1 c:control_collection r:core_node1 s:shard1 n:127.0.0.1:53641_zm%2Fse) [n:127.0.0.1:53641_zm%2Fse c:control_collection s:shard1 r:core_node1 x:collection1] o.a.s.c.c.SolrZkClient makePath: /collections/control_collection/leaders/shard1
   [junit4]   2> 1323887 INFO  (zkCallback-1500-thread-1-processing-n:127.0.0.1:53641_zm%2Fse) [n:127.0.0.1:53641_zm%2Fse    ] o.a.s.c.DistributedQueue NodeChildrenChanged fired on path /overseer/queue state SyncConnected
   [junit4]   2> 1323888 INFO  (OverseerStateUpdate-94095328152190979-127.0.0.1:53641_zm%2Fse-n_0000000000) [n:127.0.0.1:53641_zm%2Fse    ] o.a.s.c.Overseer processMessage: queueSize: 1, message = {
   [junit4]   2>   "operation":"leader",
   [junit4]   2>   "shard":"shard1",
   [junit4]   2>   "collection":"control_collection",
   [junit4]   2>   "base_url":"http://127.0.0.1:53641/zm/se",
   [junit4]   2>   "core":"collection1",
   [junit4]   2>   "state":"active"} current state version: 1
   [junit4]   2> 1323933 INFO  (TEST-TestDynamicLoading.testDynamicLoading-seed#[80FA4BC1811FA9C0]) [    ] o.a.s.c.c.SolrZkClient Using default ZkCredentialsProvider
   [junit4]   2> 1323934 INFO  (TEST-TestDynamicLoading.testDynamicLoading-seed#[80FA4BC1811FA9C0]) [    ] o.a.s.c.c.ConnectionManager Waiting for client to connect to ZooKeeper
   [junit4]   2> 1323936 INFO  (zkCallback-1502-thread-1) [    ] o.a.s.c.c.ConnectionManager Watcher org.apache.solr.common.cloud.ConnectionManager@3572aa77 name:ZooKeeperConnection Watcher:127.0.0.1:39028/solr got event WatchedEvent state:SyncConnected type:None path:null path:null type:None
   [junit4]   2> 1323936 INFO  (TEST-TestDynamicLoading.testDynamicLoading-seed#[80FA4BC1811FA9C0]) [    ] o.a.s.c.c.ConnectionManager Client is connected to ZooKeeper
   [junit4]   2> 1323936 INFO  (TEST-TestDynamicLoading.testDynamicLoading-seed#[80FA4BC1811FA9C0]) [    ] o.a.s.c.c.SolrZkClient Using default ZkACLProvider
   [junit4]   2> 1323937 INFO  (TEST-TestDynamicLoading.testDynamicLoading-seed#[80FA4BC1811FA9C0]) [    ] o.a.s.c.c.ZkStateReader Updating cluster state from ZooKeeper... 
   [junit4]   2> 1323939 INFO  (TEST-TestDynamicLoading.testDynamicLoading-seed#[80FA4BC1811FA9C0]) [    ] o.a.s.c.ChaosMonkey monkey: init - expire sessions:false cause connection loss:false
   [junit4]   2> 1323940 INFO  (TEST-TestDynamicLoading.testDynamicLoading-seed#[80FA4BC1811FA9C0]) [    ] o.a.s.c.AbstractFullDistribZkTestBase Creating collection1 with stateFormat=2
   [junit4]   2> 1323940 INFO  (TEST-TestDynamicLoading.testDynamicLoading-seed#[80FA4BC1811FA9C0]) [    ] o.a.s.c.c.SolrZkClient Using default ZkCredentialsProvider
   [junit4]   2> 1323940 INFO  (TEST-TestDynamicLoading.testDynamicLoading-seed#[80FA4BC1811FA9C0]) [    ] o.a.s.c.c.ConnectionManager Waiting for client to connect to ZooKeeper
   [junit4]   2> 1323941 INFO  (zkCallback-1503-thread-1) [    ] o.a.s.c.c.ConnectionManager Watcher org.apache.solr.common.cloud.ConnectionManager@38078df5 name:ZooKeeperConnection Watcher:127.0.0.1:39028/solr got event WatchedEvent state:SyncConnected type:None path:null path:null type:None
   [junit4]   2> 1323942 INFO  (TEST-TestDynamicLoading.testDynamicLoading-seed#[80FA4BC1811FA9C0]) [    ] o.a.s.c.c.ConnectionManager Client is connected to ZooKeeper
   [junit4]   2> 1323942 INFO  (TEST-TestDynamicLoading.testDynamicLoading-seed#[80FA4BC1811FA9C0]) [    ] o.a.s.c.c.SolrZkClient Using default ZkACLProvider
   [junit4]   2> 1323944 INFO  (zkCallback-1500-thread-1-processing-n:127.0.0.1:53641_zm%2Fse) [n:127.0.0.1:53641_zm%2Fse    ] o.a.s.c.DistributedQueue NodeChildrenChanged fired on path /overseer/queue state SyncConnected
   [junit4]   2> 1323946 INFO  (OverseerStateUpdate-94095328152190979-127.0.0.1:53641_zm%2Fse-n_0000000000) [n:127.0.0.1:53641_zm%2Fse    ] o.a.s.c.Overseer processMessage: queueSize: 1, message = {
   [junit4]   2>   "operation":"create",
   [junit4]   2>   "name":"collection1",
   [junit4]   2>   "numShards":"2",
   [junit4]   2>   "stateFormat":"2"} current state version: 1
   [junit4]   2> 1323946 INFO  (OverseerStateUpdate-94095328152190979-127.0.0.1:53641_zm%2Fse-n_0000000000) [n:127.0.0.1:53641_zm%2Fse    ] o.a.s.c.o.ClusterStateMutator building a new cName: collection1
   [junit4]   2> 1323947 INFO  (zkCallback-1500-thread-1-processing-n:127.0.0.1:53641_zm%2Fse) [n:127.0.0.1:53641_zm%2Fse    ] o.a.s.c.c.ZkStateReader A cluster state change: WatchedEvent state:SyncConnected type:NodeDataChanged path:/clusterstate.json, has occurred - updating... (live nodes size: 1)
   [junit4]   2> 1323947 INFO  (zkCallback-1502-thread-1) [    ] o.a.s.c.c.ZkStateReader A cluster state change: WatchedEvent state:SyncConnected type:NodeDataChanged path:/clusterstate.json, has occurred - updating... (live nodes size: 1)
   [junit4]   2> 1323949 INFO  (zkCallback-1502-thread-1) [    ] o.a.s.c.c.ZkStateReader Updated cluster state version to 2
   [junit4]   2> 1323950 INFO  (zkCallback-1500-thread-1-processing-n:127.0.0.1:53641_zm%2Fse) [n:127.0.0.1:53641_zm%2Fse    ] o.a.s.c.c.ZkStateReader Updated cluster state version to 2
   [junit4]   2> 1323988 INFO  (coreZkRegister-3019-thread-1-processing-x:collection1 c:control_collection r:core_node1 s:shard1 n:127.0.0.1:53641_zm%2Fse) [n:127.0.0.1:53641_zm%2Fse c:control_collection s:shard1 r:core_node1 x:collection1] o.a.s.c.ZkController We are http://127.0.0.1:53641/zm/se/collection1/ and leader is http://127.0.0.1:53641/zm/se/collection1/
   [junit4]   2> 1323989 INFO  (coreZkRegister-3019-thread-1-processing-x:collection1 c:control_collection r:core_node1 s:shard1 n:127.0.0.1:53641_zm%2Fse) [n:127.0.0.1:53641_zm%2Fse c:control_collection s:shard1 r:core_node1 x:collection1] o.a.s.c.ZkController No LogReplay needed for core=collection1 baseURL=http://127.0.0.1:53641/zm/se
   [junit4]   2> 1323989 INFO  (coreZkRegister-3019-thread-1-processing-x:collection1 c:control_collection r:core_node1 s:shard1 n:127.0.0.1:53641_zm%2Fse) [n:127.0.0.1:53641_zm%2Fse c:control_collection s:shard1 r:core_node1 x:collection1] o.a.s.c.ZkController I am the leader, no recovery necessary
   [junit4]   2> 1323989 INFO  (coreZkRegister-3019-thread-1-processing-x:collection1 c:control_collection r:core_node1 s:shard1 n:127.0.0.1:53641_zm%2Fse) [n:127.0.0.1:53641_zm%2Fse c:control_collection s:shard1 r:core_node1 x:collection1] o.a.s.c.ZkController publishing state=active
   [junit4]   2> 1323989 INFO  (coreZkRegister-3019-thread-1-processing-x:collection1 c:control_collection r:core_node1 s:shard1 n:127.0.0.1:53641_zm%2Fse) [n:127.0.0.1:53641_zm%2Fse c:control_collection s:shard1 r:core_node1 x:collection1] o.a.s.c.ZkController numShards not found on descriptor - reading it from system property
   [junit4]   2> 1323991 INFO  (zkCallback-1500-thread-1-processing-n:127.0.0.1:53641_zm%2Fse) [n:127.0.0.1:53641_zm%2Fse    ] o.a.s.c.DistributedQueue NodeChildrenChanged fired on path /overseer/queue state SyncConnected
   [junit4]   2> 1323992 INFO  (OverseerStateUpdate-94095328152190979-127.0.0.1:53641_zm%2Fse-n_0000000000) [n:127.0.0.1:53641_zm%2Fse    ] o.a.s.c.Overseer processMessage: queueSize: 1, message = {
   [junit4]   2>   "roles":null,
   [junit4]   2>   "core":"collection1",
   [junit4]   2>   "numShards":"2",
   [junit4]   2>   "state":"active",
   [junit4]   2>   "operation":"state",
   [junit4]   2>   "collection":"control_collection",
   [junit4]   2>   "shard":"shard1",
   [junit4]   2>   "core_node_name":"core_node1",
   [junit4]   2>   "node_name":"127.0.0.1:53641_zm%2Fse",
   [junit4]   2>   "base_url":"http://127.0.0.1:53641/zm/se"} current state version: 2
   [junit4]   2> 1323993 INFO  (OverseerStateUpdate-94095328152190979-127.0.0.1:53641_zm%2Fse-n_0000000000) [n:127.0.0.1:53641_zm%2Fse    ] o.a.s.c.o.ReplicaMutator Update state numShards=2 message={
   [junit4]   2>   "roles":null,
   [junit4]   2>   "core":"collection1",
   [junit4]   2>   "numShards":"2",
   [junit4]   2>   "state":"active",
   [junit4]   2>   "operation":"state",
   [junit4]   2>   "collection":"control_collection",
   [junit4]   2>   "shard":"shard1",
   [junit4]   2>   "core_node_name":"core_node1",
   [junit4]   2>   "node_name":"127.0.0.1:53641_zm%2Fse",
   [junit4]   2>   "base_url":"http://127.0.0.1:53641/zm/se"}
   [junit4]   2> 1323994 INFO  (OverseerStateUpdate-94095328152190979-127.0.0.1:53641_zm%2Fse-n_0000000000) [n:127.0.0.1:53641_zm%2Fse    ] o.a.s.c.o.ZkStateWriter going to create_collection /collections/collection1/state.json
   [junit4]   2> 1323995 INFO  (zkCallback-1502-thread-1) [    ] o.a.s.c.c.ZkStateReader A cluster state change: WatchedEvent state:SyncConnected type:NodeDataChanged path:/clusterstate.json, has occurred - updating... (live nodes size: 1)
   [junit4]   2> 1323996 INFO  (zkCallback-1500-thread-1-processing-n:127.0.0.1:53641_zm%2Fse) [n:127.0.0.1:53641_zm%2Fse    ] o.a.s.c.c.ZkStateReader A cluster state change: WatchedEvent state:SyncConnected type:NodeDataChanged path:/clusterstate.json, has occurred - updating... (live nodes size: 1)
   [junit4]   2> 1323997 INFO  (zkCallback-1502-thread-1) [    ] o.a.s.c.c.ZkStateReader Updated cluster state version to 3
   [junit4]   2> 1323998 INFO  (zkCallback-1500-thread-1-processing-n:127.0.0.1:53641_zm%2Fse) [n:127.0.0.1:53641_zm%2Fse    ] o.a.s.c.c.ZkStateReader Updated cluster state version to 3
   [junit4]   2> 1324101 INFO  (zkCallback-1500-thread-1-processing-n:127.0.0.1:53641_zm%2Fse) [n:127.0.0.1:53641_zm%2Fse    ] o.a.s.c.c.ZkStateReader A cluster state change: WatchedEvent state:SyncConnected type:NodeDataChanged path:/clusterstate.json, has occurred - updating... (live nodes size: 1)
   [junit4]   2> 1324101 INFO  (zkCallback-1502-thread-1) [    ] o.a.s.c.c.ZkStateReader A cluster state change: WatchedEvent state:SyncConnected type:NodeDataChanged path:/clusterstate.json, has occurred - updating... (live nodes size: 1)
   [junit4]   2> 1324104 INFO  (zkCallback-1502-thread-1) [    ] o.a.s.c.c.ZkStateReader Updated cluster state version to 4
   [junit4]   2> 1324104 INFO  (zkCallback-1500-thread-1-processing-n:127.0.0.1:53641_zm%2Fse) [n:127.0.0.1:53641_zm%2Fse    ] o.a.s.c.c.ZkStateReader Updated cluster state version to 4
   [junit4]   2> 1324307 INFO  (TEST-TestDynamicLoading.testDynamicLoading-seed#[80FA4BC1811FA9C0]) [    ] o.a.s.SolrTestCaseJ4 Writing core.properties file to /x1/jenkins/jenkins-slave/workspace/Lucene-Solr-Tests-5.x-Java7/solr/build/solr-core/test/J1/temp/solr.core.TestDynamicLoading_80FA4BC1811FA9C0-001/shard-1-001/cores/collection1
   [junit4]   2> 1324308 INFO  (TEST-TestDynamicLoading.testDynamicLoading-seed#[80FA4BC1811FA9C0]) [    ] o.a.s.c.AbstractFullDistribZkTestBase create jetty 1 in directory /x1/jenkins/jenkins-slave/workspace/Lucene-Solr-Tests-5.x-Java7/solr/build/solr-core/test/J1/temp/solr.core.TestDynamicLoading_80FA4BC1811FA9C0-001/shard-1-001
   [junit4]   2> 1324310 INFO  (TEST-TestDynamicLoading.testDynamicLoading-seed#[80FA4BC1811FA9C0]) [    ] o.e.j.s.Server jetty-9.2.11.v20150529
   [junit4]   2> 1324313 INFO  (TEST-TestDynamicLoading.testDynamicLoading-seed#[80FA4BC1811FA9C0]) [    ] o.e.j.s.h.ContextHandler Started o.e.j.s.ServletContextHandler@358df82e{/zm/se,null,AVAILABLE}
   [junit4]   2> 1324313 INFO  (TEST-TestDynamicLoading.testDynamicLoading-seed#[80FA4BC1811FA9C0]) [    ] o.e.j.s.ServerConnector Started ServerConnector@72607057{HTTP/1.1}{127.0.0.1:51377}
   [junit4]   2> 1324314 INFO  (TEST-TestDynamicLoading.testDynamicLoading-seed#[80FA4BC1811FA9C0]) [    ] o.e.j.s.Server Started @1327376ms
   [junit4]   2> 1324314 INFO  (TEST-TestDynamicLoading.testDynamicLoading-seed#[80FA4BC1811FA9C0]) [    ] o.a.s.c.s.e.JettySolrRunner Jetty properties: {hostContext=/zm/se, solr.data.dir=/x1/jenkins/jenkins-slave/workspace/Lucene-Solr-Tests-5.x-Java7/solr/build/solr-core/test/J1/temp/solr.core.TestDynamicLoading_80FA4BC1811FA9C0-001/tempDir-001/jetty1, coreRootDirectory=/x1/jenkins/jenkins-slave/workspace/Lucene-Solr-Tests-5.x-Java7/solr/build/solr-core/test/J1/temp/solr.core.TestDynamicLoading_80FA4BC1811FA9C0-001/shard-1-001/cores, solrconfig=solrconfig.xml, hostPort=51377}
   [junit4]   2> 1324315 INFO  (TEST-TestDynamicLoading.testDynamicLoading-seed#[80FA4BC1811FA9C0]) [    ] o.a.s.s.SolrDispatchFilter SolrDispatchFilter.init(): sun.misc.Launcher$AppClassLoader@1fe91485
   [junit4]   2> 1324315 INFO  (TEST-TestDynamicLoading.testDynamicLoading-seed#[80FA4BC1811FA9C0]) [    ] o.a.s.c.SolrResourceLoader new SolrResourceLoader for directory: '/x1/jenkins/jenkins-slave/workspace/Lucene-Solr-Tests-5.x-Java7/solr/build/solr-core/test/J1/temp/solr.core.TestDynamicLoading_80FA4BC1811FA9C0-001/shard-1-001/'
   [junit4]   2> 1324343 INFO  (TEST-TestDynamicLoading.testDynamicLoading-seed#[80FA4BC1811FA9C0]) [    ] o.a.s.c.SolrXmlConfig Loading container configuration from /x1/jenkins/jenkins-slave/workspace/Lucene-Solr-Tests-5.x-Java7/solr/build/solr-core/test/J1/temp/solr.core.TestDynamicLoading_80FA4BC1811FA9C0-001/shard-1-001/solr.xml
   [junit4]   2> 1324364 INFO  (TEST-TestDynamicLoading.testDynamicLoading-seed#[80FA4BC1811FA9C0]) [    ] o.a.s.c.CoresLocator Config-defined core root directory: /x1/jenkins/jenkins-slave/workspace/Lucene-Solr-Tests-5.x-Java7/solr/build/solr-core/test/J1/temp/solr.core.TestDynamicLoading_80FA4BC1811FA9C0-001/shard-1-001/cores
   [junit4]   2> 1324364 INFO  (TEST-TestDynamicLoading.testDynamicLoading-seed#[80FA4BC1811FA9C0]) [    ] o.a.s.c.CoreContainer New CoreContainer 978236958
   [junit4]   2> 1324364 INFO  (TEST-TestDynamicLoading.testDynamicLoading-seed#[80FA4BC1811FA9C0]) [    ] o.a.s.c.CoreContainer Loading cores into CoreContainer [instanceDir=/x1/jenkins/jenkins-slave/workspace/Lucene-Solr-Tests-5.x-Java7/solr/build/solr-core/test/J1/temp/solr.core.TestDynamicLoading_80FA4BC1811FA9C0-001/shard-1-001/]
   [junit4]   2> 1324365 INFO  (TEST-TestDynamicLoading.testDynamicLoading-seed#[80FA4BC1811FA9C0]) [    ] o.a.s.c.CoreContainer loading shared library: /x1/jenkins/jenkins-slave/workspace/Lucene-Solr-Tests-5.x-Java7/solr/build/solr-core/test/J1/temp/solr.core.TestDynamicLoading_80FA4BC1811FA9C0-001/shard-1-001/lib
   [junit4]   2> 1324365 WARN  (TEST-TestDynamicLoading.testDynamicLoading-seed#[80FA4BC1811FA9C0]) [    ] o.a.s.c.SolrResourceLoader Can't find (or read) directory to add to classloader: lib (resolved as: /x1/jenkins/jenkins-slave/workspace/Lucene-Solr-Tests-5.x-Java7/solr/build/solr-core/test/J1/temp/solr.core.TestDynamicLoading_80FA4BC1811FA9C0-001/shard-1-001/lib).
   [junit4]   2> 1324374 INFO  (TEST-TestDynamicLoading.testDynamicLoading-seed#[80FA4BC1811FA9C0]) [    ] o.a.s.h.c.HttpShardHandlerFactory created with socketTimeout : 90000,urlScheme : ,connTimeout : 15000,maxConnectionsPerHost : 20,maxConnections : 10000,corePoolSize : 0,maximumPoolSize : 2147483647,maxThreadIdleTime : 5,sizeOfQueue : -1,fairnessPolicy : false,useRetries : false,
   [junit4]   2> 1324375 INFO  (TEST-TestDynamicLoading.testDynamicLoading-seed#[80FA4BC1811FA9C0]) [    ] o.a.s.u.UpdateShardHandler Creating UpdateShardHandler HTTP client with params: socketTimeout=340000&connTimeout=45000&retry=true
   [junit4]   2> 1324376 INFO  (TEST-TestDynamicLoading.testDynamicLoading-seed#[80FA4BC1811FA9C0]) [    ] o.a.s.l.LogWatcher SLF4J impl is org.slf4j.impl.Log4jLoggerFactory
   [junit4]   2> 1324376 INFO  (TEST-TestDynamicLoading.testDynamicLoading-seed#[80FA4BC1811FA9C0]) [    ] o.a.s.l.LogWatcher Registering Log Listener [Log4j (org.slf4j.impl.Log4jLoggerFactory)]
   [junit4]   2> 1324376 INFO  (TEST-TestDynamicLoading.testDynamicLoading-seed#[80FA4BC1811FA9C0]) [    ] o.a.s.c.ZkContainer Zookeeper client=127.0.0.1:39028/solr
   [junit4]   2> 1324376 INFO  (TEST-TestDynamicLoading.testDynamicLoading-seed#[80FA4BC1811FA9C0]) [    ] o.a.s.c.ZkController zkHost includes chroot
   [junit4]   2> 1324377 INFO  (TEST-TestDynamicLoading.testDynamicLoading-seed#[80FA4BC1811FA9C0]) [    ] o.a.s.c.c.SolrZkClient Using default ZkCredentialsProvider
   [junit4]   2> 1324377 INFO  (TEST-TestDynamicLoading.testDynamicLoading-seed#[80FA4BC1811FA9C0]) [    ] o.a.s.c.c.ConnectionManager Waiting for client to connect to ZooKeeper
   [junit4]   2> 1324379 INFO  (zkCallback-1505-thread-1) [    ] o.a.s.c.c.ConnectionManager Watcher org.apache.solr.common.cloud.ConnectionManager@3c7ab560 name:ZooKeeperConnection Watcher:127.0.0.1:39028 got event WatchedEvent state:SyncConnected type:None path:null path:null type:None
   [junit4]   2> 1324380 INFO  (TEST-TestDynamicLoading.testDynamicLoading-seed#[80FA4BC1811FA9C0]) [    ] o.a.s.c.c.ConnectionManager Client is connected to ZooKeeper
   [junit4]   2> 1324380 INFO  (TEST-TestDynamicLoading.testDynamicLoading-seed#[80FA4BC1811FA9C0]) [    ] o.a.s.c.c.SolrZkClient Using default ZkACLProvider
   [junit4]   2> 1324383 INFO  (TEST-TestDynamicLoading.testDynamicLoading-seed#[80FA4BC1811FA9C0]) [n:127.0.0.1:51377_zm%2Fse    ] o.a.s.c.c.ConnectionManager Waiting for client to connect to ZooKeeper
   [junit4]   2> 1324385 INFO  (zkCallback-1506-thread-1-processing-n:127.0.0.1:51377_zm%2Fse) [n:127.0.0.1:51377_zm%2Fse    ] o.a.s.c.c.ConnectionManager Watcher org.apache.solr.common.cloud.ConnectionManager@641483d8 name:ZooKeeperConnection Watcher:127.0.0.1:39028/solr got event WatchedEvent state:SyncConnected type:None path:null path:null type:None
   [junit4]   2> 1324386 INFO  (TEST-TestDynamicLoading.testDynamicLoading-seed#[80FA4BC1811FA9C0]) [n:127.0.0.1:51377_zm%2Fse    ] o.a.s.c.c.ConnectionManager Client is connected to ZooKeeper
   [junit4]   2> 1324391 INFO  (TEST-TestDynamicLoading.testDynamicLoading-seed#[80FA4BC1811FA9C0]) [n:127.0.0.1:51377_zm%2Fse    ] o.a.s.c.c.ZkStateReader Updating cluster state from ZooKeeper... 
   [junit4]   2> 1325397 INFO  (TEST-TestDynamicLoading.testDynamicLoading-seed#[80FA4BC1811FA9C0]) [n:127.0.0.1:51377_zm%2Fse    ] o.a.s.c.ZkController Register node as live in ZooKeeper:/live_nodes/127.0.0.1:51377_zm%2Fse
   [junit4]   2> 1325398 INFO  (TEST-TestDynamicLoading.testDynamicLoading-seed#[80FA4BC1811FA9C0]) [n:127.0.0.1:51377_zm%2Fse    ] o.a.s.c.c.SolrZkClient makePath: /live_nodes/127.0.0.1:51377_zm%2Fse
   [junit4]   2> 1325403 INFO  (TEST-TestDynamicLoading.testDynamicLoading-seed#[80FA4BC1811FA9C0]) [n:127.0.0.1:51377_zm%2Fse    ] o.a.s.c.Overseer Overseer (id=null) closing
   [junit4]   2> 1325404 INFO  (TEST-TestDynamicLoading.testDynamicLoading-seed#[80FA4BC1811FA9C0]) [n:127.0.0.1:51377_zm%2Fse    ] o.a.s.c.LeaderElector Joined leadership election with path: /overseer_elect/election/94095328152190983-127.0.0.1:51377_zm%2Fse-n_0000000001
   [junit4]   2> 1325406 INFO  (TEST-TestDynamicLoading.testDynamicLoading-seed#[80FA4BC1811FA9C0]) [n:127.0.0.1:51377_zm%2Fse    ] o.a.s.c.LeaderElector Watching path /overseer_elect/election/94095328152190979-127.0.0.1:53641_zm%2Fse-n_0000000000 to know if I could be the leader
   [junit4]   2> 1325406 INFO  (TEST-TestDynamicLoading.testDynamicLoading-seed#[80FA4BC1811FA9C0]) [n:127.0.0.1:51377_zm%2Fse    ] o.a.s.c.CoreContainer No authentication plugin used.
   [junit4]   2> 1325407 INFO  (TEST-TestDynamicLoading.testDynamicLoading-seed#[80FA4BC1811FA9C0]) [n:127.0.0.1:51377_zm%2Fse    ] o.a.s.c.CoreContainer Security conf doesn't exist. Skipping setup for authorization module.
   [junit4]   2> 1325408 INFO  (TEST-TestDynamicLoading.testDynamicLoading-seed#[80FA4BC1811FA9C0]) [n:127.0.0.1:51377_zm%2Fse    ] o.a.s.c.CoresLocator Looking for core definitions underneath /x1/jenkins/jenkins-slave/workspace/Lucene-Solr-Tests-5.x-Java7/solr/build/solr-core/test/J1/temp/solr.core.TestDynamicLoading_80FA4BC1811FA9C0-001/shard-1-001/cores
   [junit4]   2> 1325409 INFO  (TEST-TestDynamicLoading.testDynamicLoading-seed#[80FA4BC1811FA9C0]) [n:127.0.0.1:51377_zm%2Fse    ] o.a.s.c.SolrCore Created CoreDescriptor: {shard=, collection=collection1, schema=schema.xml, loadOnStartup=true, absoluteInstDir=/x1/jenkins/jenkins-slave/workspace/Lucene-Solr-Tests-5.x-Java7/solr/build/solr-core/test/J1/temp/solr.core.TestDynamicLoading_80FA4BC1811FA9C0-001/shard-1-001/cores/collection1/, dataDir=data/, coreNodeName=, name=collection1, instanceDir=/x1/jenkins/jenkins-slave/workspace/Lucene-Solr-Tests-5.x-Java7/solr/build/solr-core/test/J1/temp/solr.core.TestDynamicLoading_80FA4BC1811FA9C0-001/shard-1-001/cores/collection1, config=solrconfig.xml, transient=false}
   [junit4]   2> 1325410 INFO  (TEST-TestDynamicLoading.testDynamicLoading-seed#[80FA4BC1811FA9C0]) [n:127.0.0.1:51377_zm%2Fse    ] o.a.s.c.CoresLocator Found core collection1 in /x1/jenkins/jenkins-slave/workspace/Lucene-Solr-Tests-5.x-Java7/solr/build/solr-core/test/J1/temp/solr.core.TestDynamicLoading_80FA4BC1811FA9C0-001/shard-1-001/cores/collection1/
   [junit4]   2> 1325410 INFO  (TEST-TestDynamicLoading.testDynamicLoading-seed#[80FA4BC1811FA9C0]) [n:127.0.0.1:51377_zm%2Fse    ] o.a.s.c.CoresLocator Found 1 core definitions
   [junit4]   2> 1325412 INFO  (TEST-TestDynamicLoading.testDynamicLoading-seed#[80FA4BC1811FA9C0]) [n:127.0.0.1:51377_zm%2Fse    ] o.a.s.s.SolrDispatchFilter user.dir=/x1/jenkins/jenkins-slave/workspace/Lucene-Solr-Tests-5.x-Java7/solr/build/solr-core/test/J1
   [junit4]   2> 1325413 INFO  (TEST-TestDynamicLoading.testDynamicLoading-seed#[80FA4BC1811FA9C0]) [n:127.0.0.1:51377_zm%2Fse    ] o.a.s.s.SolrDispatchFilter SolrDispatchFilter.init() done
   [junit4]   2> 1325414 INFO  (coreLoadExecutor-3036-thread-1-processing-n:127.0.0.1:51377_zm%2Fse) [n:127.0.0.1:51377_zm%2Fse c:collection1   x:collection1] o.a.s.c.ZkController publishing state=down
   [junit4]   2> 1325414 INFO  (coreLoadExecutor-3036-thread-1-processing-n:127.0.0.1:51377_zm%2Fse) [n:127.0.0.1:51377_zm%2Fse c:collection1   x:collection1] o.a.s.c.ZkController numShards not found on descriptor - reading it from system property
   [junit4]   2> 1325417 INFO  (zkCallback-1500-thread-1-processing-n:127.0.0.1:53641_zm%2Fse) [n:127.0.0.1:53641_zm%2Fse    ] o.a.s.c.DistributedQueue NodeChildrenChanged fired on path /overseer/queue state SyncConnected
   [junit4]   2> 1325418 INFO  (coreLoadExecutor-3036-thread-1-processing-n:127.0.0.1:51377_zm%2Fse) [n:127.0.0.1:51377_zm%2Fse c:collection1   x:collection1] o.a.s.c.ZkController Registering watch for external collection collection1
   [junit4]   2> 1325418 INFO  (coreLoadExecutor-3036-thread-1-processing-n:127.0.0.1:51377_zm%2Fse) [n:127.0.0.1:51377_zm%2Fse c:collection1   x:collection1] o.a.s.c.c.ZkStateReader addZkWatch collection1
   [junit4]   2> 1325418 INFO  (OverseerStateUpdate-94095328152190979-127.0.0.1:53641_zm%2Fse-n_0000000000) [n:127.0.0.1:53641_zm%2Fse    ] o.a.s.c.Overseer processMessage: queueSize: 1, message = {
   [junit4]   2>   "roles":null,
   [junit4]   2>   "core":"collection1",
   [junit4]   2>   "numShards":"2",
   [junit4]   2>   "state":"down",
   [junit4]   2>   "operation":"state",
   [junit4]   2>   "collection":"collection1",
   [junit4]   2>   "shard":null,
   [junit4]   2>   "node_name":"127.0.0.1:51377_zm%2Fse",
   [junit4]   2>   "base_url":"http://127.0.0.1:51377/zm/se"} current state version: 4
   [junit4]   2> 1325419 INFO  (coreLoadExecutor-3036-thread-1-processing-n:127.0.0.1:51377_zm%2Fse) [n:127.0.0.1:51377_zm%2Fse c:collection1   x:collection1] o.a.s.c.c.ZkStateReader Updating collection state at /collections/collection1/state.json from ZooKeeper... 
   [junit4]   2> 1325419 INFO  (OverseerStateUpdate-94095328152190979-127.0.0.1:53641_zm%2Fse-n_0000000000) [n:127.0.0.1:53641_zm%2Fse    ] o.a.s.c.o.ReplicaMutator Update state numShards=2 message={
   [junit4]   2>   "roles":null,
   [junit4]   2>   "core":"collection1",
   [junit4]   2>   "numShards":"2",
   [junit4]   2>   "state":"down",
   [junit4]   2>   "operation":"state",
   [junit4]   2>   "collection":"collection1",
   [junit4]   2>   "shard":null,
   [junit4]   2>   "node_name":"127.0.0.1:51377_zm%2Fse",
   [junit4]   2>   "base_url":"http://127.0.0.1:51377/zm/se"}
   [junit4]   2> 1325419 INFO  (OverseerStateUpdate-94095328152190979-127.0.0.1:53641_zm%2Fse-n_0000000000) [n:127.0.0.1:53641_zm%2Fse    ] o.a.s.c.o.ReplicaMutator Collection already exists with numShards=2
   [junit4]   2> 1325420 INFO  (OverseerStateUpdate-94095328152190979-127.0.0.1:53641_zm%2Fse-n_0000000000) [n:127.0.0.1:53641_zm%2Fse    ] o.a.s.c.o.ReplicaMutator Assigning new node to shard shard=shard1
   [junit4]   2> 1325422 INFO  (coreLoadExecutor-3036-thread-1-processing-n:127.0.0.1:51377_zm%2Fse) [n:127.0.0.1:51377_zm%2Fse c:collection1   x:collection1] o.a.s.c.c.ZkStateReader Updating data for collection1 to ver 0 
   [junit4]   2> 1325423 INFO  (coreLoadExecutor-3036-thread-1-processing-n:127.0.0.1:51377_zm%2Fse) [n:127.0.0.1:51377_zm%2Fse c:collection1   x:collection1] o.a.s.c.ZkController look for our core node name
   [junit4]   2> 1325524 INFO  (OverseerStateUpdate-94095328152190979-127.0.0.1:53641_zm%2Fse-n_0000000000) [n:127.0.0.1:53641_zm%2Fse    ] o.a.s.c.o.ZkStateWriter going to update_collection /collections/collection1/state.json version: 0
   [junit4]   2> 1325525 INFO  (zkCallback-1506-thread-1-processing-n:127.0.0.1:51377_zm%2Fse) [n:127.0.0.1:51377_zm%2Fse    ] o.a.s.c.c.ZkStateReader A cluster state change: WatchedEvent state:SyncConnected type:NodeDataChanged path:/collections/collection1/state.json for collection collection1 has occurred - updating... (live nodes size: 2)
   [junit4]   2> 1325526 INFO  (zkCallback-1506-thread-1-processing-n:127.0.0.1:51377_zm%2Fse) [n:127.0.0.1:51377_zm%2Fse    ] o.a.s.c.c.ZkStateReader Updating data for collection1 to ver 1 
   [junit4]   2> 1326423 INFO  (coreLoadExecutor-3036-thread-1-processing-n:127.0.0.1:51377_zm%2Fse) [n:127.0.0.1:51377_zm%2Fse c:collection1   x:collection1] o.a.s.c.ZkController waiting to find shard id in clusterstate for collection1
   [junit4]   2> 1326424 INFO  (coreLoadExecutor-3036-thread-1-processing-n:127.0.0.1:51377_zm%2Fse) [n:127.0.0.1:51377_zm%2Fse c:collection1   x:collection1] o.a.s.c.ZkController Check for collection zkNode:collection1
   [junit4]   2> 1326424 INFO  (coreLoadExecutor-3036-thread-1-processing-n:127.0.0.1:51377_zm%2Fse) [n:127.0.0.1:51377_zm%2Fse c:collection1   x:collection1] o.a.s.c.ZkController Collection zkNode exists
   [junit4]   2> 1326424 INFO  (coreLoadExecutor-3036-thread-1-processing-n:127.0.0.1:51377_zm%2Fse) [n:127.0.0.1:51377_zm%2Fse c:collection1   x:collection1] o.a.s.c.c.ZkStateReader Load collection config from:/collections/collection1
   [junit4]   2> 1326425 INFO  (coreLoadExecutor-3036-thread-1-processing-n:127.0.0.1:51377_zm%2Fse) [n:127.0.0.1:51377_zm%2Fse c:collection1   x:collection1] o.a.s.c.c.ZkStateReader path=/collections/collection1 configName=conf1 specified config exists in ZooKeeper
   [junit4]   2> 1326425 INFO  (coreLoadExecutor-3036-thread-1-processing-n:127.0.0.1:51377_zm%2Fse) [n:127.0.0.1:51377_zm%2Fse c:collection1   x:collection1] o.a.s.c.SolrResourceLoader new SolrResourceLoader for directory: '/x1/jenkins/jenkins-slave/workspace/Lucene-Solr-Tests-5.x-Java7/solr/build/solr-core/test/J1/temp/solr.core.TestDynamicLoading_80FA4BC1811FA9C0-001/shard-1-001/cores/collection1/'
   [junit4]   2> 1326441 INFO  (coreLoadExecutor-3036-thread-1-processing-n:127.0.0.1:51377_zm%2Fse) [n:127.0.0.1:51377_zm%2Fse c:collection1   x:collection1] o.a.s.c.Config loaded config solrconfig.xml with version 0 
   [junit4]   2> 1326447 INFO  (coreLoadExecutor-3036-thread-1-processing-n:127.0.0.1:51377_zm%2Fse) [n:127.0.0.1:51377_zm%2Fse c:collection1   x:collection1] o.a.s.c.SolrConfig current version of requestparams : -1
   [junit4]   2> 1326460 INFO  (coreLoadExecutor-3036-thread-1-processing-n:127.0.0.1:51377_zm%2Fse) [n:127.0.0.1:51377_zm%2Fse c:collection1   x:collection1] o.a.s.c.SolrConfig Using Lucene MatchVersion: 5.3.0
   [junit4]   2> 1326502 INFO  (coreLoadExecutor-3036-thread-1-processing-n:127.0.0.1:51377_zm%2Fse) [n:127.0.0.1:51377_zm%2Fse c:collection1   x:collection1] o.a.s.c.Config Loaded SolrConfig: solrconfig.xml
   [junit4]   2> 1326503 INFO  (coreLoadExecutor-3036-thread-1-processing-n:127.0.0.1:51377_zm%2Fse) [n:127.0.0.1:51377_zm%2Fse c:collection1   x:collection1] o.a.s.s.IndexSchema Reading Solr Schema from /configs/conf1/schema.xml
   [junit4]   2> 1326510 INFO  (coreLoadExecutor-3036-thread-1-processing-n:127.0.0.1:51377_zm%2Fse) [n:127.0.0.1:51377_zm%2Fse c:collection1   x:collection1] o.a.s.s.IndexSchema [collection1] Schema name=test
   [junit4]   2> 1326749 INFO  (coreLoadExecutor-3036-thread-1-processing-n:127.0.0.1:51377_zm%2Fse) [n:127.0.0.1:51377_zm%2Fse c:collection1   x:collection1] o.a.s.s.OpenExchangeRatesOrgProvider Initialized with rates=open-exchange-rates.json, refreshInterval=1440.
   [junit4]   2> 1326757 INFO  (coreLoadExecutor-3036-thread-1-processing-n:127.0.0.1:51377_zm%2Fse) [n:127.0.0.1:51377_zm%2Fse c:collection1   x:collection1] o.a.s.s.IndexSchema default search field in schema is text
   [junit4]   2> 1326760 INFO  (coreLoadExecutor-3036-thread-1-processing-n:127.0.0.1:51377_zm%2Fse) [n:127.0.0.1:51377_zm%2Fse c:collection1   x:collection1] o.a.s.s.IndexSchema unique key field: id
   [junit4]   2> 1326773 INFO  (coreLoadExecutor-3036-thread-1-processing-n:127.0.0.1:51377_zm%2Fse) [n:127.0.0.1:51377_zm%2Fse c:collection1   x:collection1] o.a.s.s.FileExchangeRateProvider Reloading exchange rates from file currency.xml
   [junit4]   2> 1326776 INFO  (coreLoadExecutor-3036-thread-1-processing-n:127.0.0.1:51377_zm%2Fse) [n:127.0.0.1:51377_zm%2Fse c:collection1   x:collection1] o.a.s.s.FileExchangeRateProvider Reloading exchange rates from file currency.xml
   [junit4]   2> 1326779 INFO  (coreLoadExecut

[...truncated too long message...]

2 
   [junit4]   2> 1383806 INFO  (TEST-TestDynamicLoading.testDynamicLoading-seed#[80FA4BC1811FA9C0]) [n:127.0.0.1:46052_zm%2Fse c:collection1 s:shard2 r:core_node4 x:collection1] o.a.s.c.CachingDirectoryFactory looking to close /x1/jenkins/jenkins-slave/workspace/Lucene-Solr-Tests-5.x-Java7/solr/build/solr-core/test/J1/../../../../../../../../../../x1/jenkins/jenkins-slave/workspace/Lucene-Solr-Tests-5.x-Java7/solr/build/solr-core/test/J1/temp/solr.core.TestDynamicLoading_80FA4BC1811FA9C0-001/shard-4-001/cores/collection1/data [CachedDir<<refCount=0;path=/x1/jenkins/jenkins-slave/workspace/Lucene-Solr-Tests-5.x-Java7/solr/build/solr-core/test/J1/../../../../../../../../../../x1/jenkins/jenkins-slave/workspace/Lucene-Solr-Tests-5.x-Java7/solr/build/solr-core/test/J1/temp/solr.core.TestDynamicLoading_80FA4BC1811FA9C0-001/shard-4-001/cores/collection1/data;done=false>>]
   [junit4]   2> 1383807 INFO  (TEST-TestDynamicLoading.testDynamicLoading-seed#[80FA4BC1811FA9C0]) [n:127.0.0.1:46052_zm%2Fse c:collection1 s:shard2 r:core_node4 x:collection1] o.a.s.c.CachingDirectoryFactory Closing directory: /x1/jenkins/jenkins-slave/workspace/Lucene-Solr-Tests-5.x-Java7/solr/build/solr-core/test/J1/../../../../../../../../../../x1/jenkins/jenkins-slave/workspace/Lucene-Solr-Tests-5.x-Java7/solr/build/solr-core/test/J1/temp/solr.core.TestDynamicLoading_80FA4BC1811FA9C0-001/shard-4-001/cores/collection1/data
   [junit4]   2> 1383807 INFO  (TEST-TestDynamicLoading.testDynamicLoading-seed#[80FA4BC1811FA9C0]) [n:127.0.0.1:46052_zm%2Fse c:collection1 s:shard2 r:core_node4 x:collection1] o.a.s.c.Overseer Overseer (id=94095328152190989-127.0.0.1:46052_zm%2Fse-n_0000000004) closing
   [junit4]   2> 1383807 INFO  (OverseerStateUpdate-94095328152190989-127.0.0.1:46052_zm%2Fse-n_0000000004) [n:127.0.0.1:46052_zm%2Fse    ] o.a.s.c.Overseer Overseer Loop exiting : 127.0.0.1:46052_zm%2Fse
   [junit4]   2> 1383810 WARN  (zkCallback-1516-thread-1-processing-n:127.0.0.1:46052_zm%2Fse) [n:127.0.0.1:46052_zm%2Fse    ] o.a.s.c.c.ZkStateReader ZooKeeper watch triggered, but Solr cannot talk to ZK
   [junit4]   2> 1383812 INFO  (TEST-TestDynamicLoading.testDynamicLoading-seed#[80FA4BC1811FA9C0]) [    ] o.e.j.s.ServerConnector Stopped ServerConnector@7db30ce{HTTP/1.1}{127.0.0.1:0}
   [junit4]   2> 1383812 INFO  (TEST-TestDynamicLoading.testDynamicLoading-seed#[80FA4BC1811FA9C0]) [    ] o.e.j.s.h.ContextHandler Stopped o.e.j.s.ServletContextHandler@5246dd48{/zm/se,null,UNAVAILABLE}
   [junit4]   2> 1383814 INFO  (TEST-TestDynamicLoading.testDynamicLoading-seed#[80FA4BC1811FA9C0]) [n:127.0.0.1:46052_zm%2Fse c:collection1 s:shard2 r:core_node4 x:collection1] o.a.s.c.ZkTestServer connecting to 127.0.0.1:39028 39028
   [junit4]   2> 1383993 INFO  (Thread-2577) [    ] o.a.s.c.ZkTestServer connecting to 127.0.0.1:39028 39028
   [junit4]   2> 1383994 WARN  (Thread-2577) [    ] o.a.s.c.ZkTestServer Watch limit violations: 
   [junit4]   2> Maximum concurrent create/delete watches above limit:
   [junit4]   2> 
   [junit4]   2> 	40	/solr/configs/conf1
   [junit4]   2> 	6	/solr/clusterstate.json
   [junit4]   2> 	6	/solr/aliases.json
   [junit4]   2> 	4	/solr/collections/collection1/state.json
   [junit4]   2> 	2	/solr/configs/.system
   [junit4]   2> 	2	/solr/collections/.system/state.json
   [junit4]   2> 
   [junit4]   2> Maximum concurrent children watches above limit:
   [junit4]   2> 
   [junit4]   2> 	6	/solr/live_nodes
   [junit4]   2> 	5	/solr/overseer/collection-queue-work
   [junit4]   2> 	3	/solr/overseer/queue
   [junit4]   2> 
   [junit4]   2> NOTE: reproduce with: ant test  -Dtestcase=TestDynamicLoading -Dtests.method=testDynamicLoading -Dtests.seed=80FA4BC1811FA9C0 -Dtests.multiplier=2 -Dtests.slow=true -Dtests.locale=es_BO -Dtests.timezone=Etc/GMT-3 -Dtests.asserts=true -Dtests.file.encoding=UTF-8
   [junit4] FAILURE 62.2s J1 | TestDynamicLoading.testDynamicLoading <<<
   [junit4]    > Throwable #1: java.lang.AssertionError: Could not get expected value  'X val changed' for path 'x' full output: {
   [junit4]    >   "responseHeader":{
   [junit4]    >     "status":0,
   [junit4]    >     "QTime":0},
   [junit4]    >   "params":{"wt":"json"},
   [junit4]    >   "context":{
   [junit4]    >     "httpMethod":"GET",
   [junit4]    >     "webapp":"/zm/se",
   [junit4]    >     "path":"/test1"},
   [junit4]    >   "class":"org.apache.solr.core.BlobStoreTestRequestHandler",
   [junit4]    >   "x":"X val"}
   [junit4]    > 	at __randomizedtesting.SeedInfo.seed([80FA4BC1811FA9C0:58B7669676C20C60]:0)
   [junit4]    > 	at org.apache.solr.core.TestSolrConfigHandler.testForResponseElement(TestSolrConfigHandler.java:410)
   [junit4]    > 	at org.apache.solr.core.TestDynamicLoading.testDynamicLoading(TestDynamicLoading.java:260)
   [junit4]    > 	at org.apache.solr.BaseDistributedSearchTestCase$ShardsRepeatRule$ShardsFixedStatement.callStatement(BaseDistributedSearchTestCase.java:960)
   [junit4]    > 	at org.apache.solr.BaseDistributedSearchTestCase$ShardsRepeatRule$ShardsStatement.evaluate(BaseDistributedSearchTestCase.java:935)
   [junit4]    > 	at java.lang.Thread.run(Thread.java:745)
   [junit4]   2> 1384012 INFO  (SUITE-TestDynamicLoading-seed#[80FA4BC1811FA9C0]-worker) [n:127.0.0.1:46052_zm%2Fse c:collection1 s:shard2 r:core_node4 x:collection1] o.a.s.SolrTestCaseJ4 ###deleteCore
   [junit4]   2> NOTE: leaving temporary files on disk at: /x1/jenkins/jenkins-slave/workspace/Lucene-Solr-Tests-5.x-Java7/solr/build/solr-core/test/J1/temp/solr.core.TestDynamicLoading_80FA4BC1811FA9C0-001
   [junit4]   2> Jul 01, 2015 4:00:26 PM com.carrotsearch.randomizedtesting.ThreadLeakControl checkThreadLeaks
   [junit4]   2> WARNING: Will linger awaiting termination of 1 leaked thread(s).
   [junit4]   2> NOTE: test params are: codec=Asserting(Lucene53): {size=PostingsFormat(name=Memory doPackFST= true), md5=FSTOrd50, version=PostingsFormat(name=Memory doPackFST= false), blobName=PostingsFormat(name=Memory doPackFST= false), timestamp=FSTOrd50, id=FST50, _version_=FSTOrd50}, docValues:{}, sim=DefaultSimilarity, locale=es_BO, timezone=Etc/GMT-3
   [junit4]   2> NOTE: Linux 3.13.0-52-generic amd64/Oracle Corporation 1.7.0_72 (64-bit)/cpus=4,threads=1,free=217234512,total=519045120
   [junit4]   2> NOTE: All tests run in this JVM: [HdfsDirectoryTest, TestDefaultSimilarityFactory, EnumFieldTest, DistributedQueueTest, SolrIndexConfigTest, TestRealTimeGet, QueryElevationComponentTest, TestSchemaSimilarityResource, DebugComponentTest, FieldAnalysisRequestHandlerTest, SpatialRPTFieldTypeTest, ExitableDirectoryReaderTest, TestSolrQueryParserDefaultOperatorResource, DistributedIntervalFacetingTest, RecoveryZkTest, SliceStateTest, MoreLikeThisHandlerTest, TestElisionMultitermQuery, TestManagedSchemaFieldResource, SolrCoreCheckLockOnStartupTest, TestClassNameShortening, MBeansHandlerTest, TestTrackingShardHandlerFactory, TestBinaryResponseWriter, TestPseudoReturnFields, TestRTimer, CleanupOldIndexTest, TestMiniSolrCloudClusterSSL, TimeZoneUtilsTest, NoCacheHeaderTest, DefaultValueUpdateProcessorTest, SharedFSAutoReplicaFailoverTest, TestSolrXml, ShardSplitTest, LoggingHandlerTest, TestCSVResponseWriter, SchemaVersionSpecificBehaviorTest, TestCloudInspectUtil, RequiredFieldsTest, TestJettySolrRunner, TestExpandComponent, XsltUpdateRequestHandlerTest, TestNamedUpdateProcessors, ClusterStateTest, PreAnalyzedFieldTest, MinimalSchemaTest, HighlighterTest, TestRandomDVFaceting, TestFastOutputStream, TestWriterPerf, FullSolrCloudDistribCmdsTest, TestLuceneMatchVersion, TestFaceting, SpellCheckCollatorTest, TestRestoreCore, TestChildDocTransformer, SpellingQueryConverterTest, SynonymTokenizerTest, SimpleFacetsTest, DateFieldTest, CopyFieldTest, TestDistributedGrouping, TestStressReorder, TestBlobHandler, HdfsRecoveryZkTest, RecoveryAfterSoftCommitTest, TestCollapseQParserPlugin, DistributedQueryComponentOptimizationTest, TestSolrQueryParserResource, DocumentAnalysisRequestHandlerTest, TestDocSet, BasicZkTest, InfoHandlerTest, TestFieldTypeCollectionResource, TestFieldTypeResource, TestSimpleTrackingShardHandler, UUIDFieldTest, ZkSolrClientTest, TestSolrDeletionPolicy1, JSONWriterTest, TestCloudManagedSchemaConcurrent, BasicDistributedZkTest, TestCloudSchemaless, SyncSliceTest, DistributedVersionInfoTest, TestRebalanceLeaders, TestDynamicLoading]
   [junit4] Completed [272/507] on J1 in 63.21s, 1 test, 1 failure <<< FAILURES!

[...truncated 735 lines...]
BUILD FAILED
/x1/jenkins/jenkins-slave/workspace/Lucene-Solr-Tests-5.x-Java7/build.xml:536: The following error occurred while executing this line:
/x1/jenkins/jenkins-slave/workspace/Lucene-Solr-Tests-5.x-Java7/build.xml:484: The following error occurred while executing this line:
/x1/jenkins/jenkins-slave/workspace/Lucene-Solr-Tests-5.x-Java7/build.xml:61: The following error occurred while executing this line:
/x1/jenkins/jenkins-slave/workspace/Lucene-Solr-Tests-5.x-Java7/extra-targets.xml:39: The following error occurred while executing this line:
/x1/jenkins/jenkins-slave/workspace/Lucene-Solr-Tests-5.x-Java7/solr/build.xml:230: The following error occurred while executing this line:
/x1/jenkins/jenkins-slave/workspace/Lucene-Solr-Tests-5.x-Java7/solr/common-build.xml:512: The following error occurred while executing this line:
/x1/jenkins/jenkins-slave/workspace/Lucene-Solr-Tests-5.x-Java7/lucene/common-build.xml:1444: The following error occurred while executing this line:
/x1/jenkins/jenkins-slave/workspace/Lucene-Solr-Tests-5.x-Java7/lucene/common-build.xml:999: There were test failures: 507 suites, 2008 tests, 1 failure, 59 ignored (25 assumptions)

Total time: 52 minutes 20 seconds
Build step 'Invoke Ant' marked build as failure
Archiving artifacts
Sending artifact delta relative to Lucene-Solr-Tests-5.x-Java7 #3288
Archived 4 artifacts
Archive block size is 32768
Received 0 blocks and 292147452 bytes
Compression is 0.0%
Took 49 sec
Recording test results
Email was triggered for: Failure
Sending email for trigger: Failure



Mime
View raw message