lucene-dev mailing list archives

Site index · List index
Message view « Date » · « Thread »
Top « Date » · « Thread »
From Policeman Jenkins Server <jenk...@thetaphi.de>
Subject [JENKINS] Lucene-Solr-trunk-MacOSX (64bit/jdk1.8.0) - Build # 2470 - Failure!
Date Wed, 01 Jul 2015 08:55:08 GMT
Build: http://jenkins.thetaphi.de/job/Lucene-Solr-trunk-MacOSX/2470/
Java: 64bit/jdk1.8.0 -XX:+UseCompressedOops -XX:+UseSerialGC

1 tests failed.
FAILED:  org.apache.solr.cloud.TestRebalanceLeaders.test

Error Message:
No live SolrServers available to handle this request:[http://127.0.0.1:49233, http://127.0.0.1:49221, http://127.0.0.1:49227, http://127.0.0.1:49237, http://127.0.0.1:49213]

Stack Trace:
org.apache.solr.client.solrj.SolrServerException: No live SolrServers available to handle this request:[http://127.0.0.1:49233, http://127.0.0.1:49221, http://127.0.0.1:49227, http://127.0.0.1:49237, http://127.0.0.1:49213]
	at __randomizedtesting.SeedInfo.seed([D2D180EDCD1FAE30:5A85BF3763E3C3C8]:0)
	at org.apache.solr.client.solrj.impl.LBHttpSolrClient.request(LBHttpSolrClient.java:355)
	at org.apache.solr.client.solrj.impl.CloudSolrClient.sendRequest(CloudSolrClient.java:1086)
	at org.apache.solr.client.solrj.impl.CloudSolrClient.requestWithRetryOnStaleState(CloudSolrClient.java:856)
	at org.apache.solr.client.solrj.impl.CloudSolrClient.request(CloudSolrClient.java:799)
	at org.apache.solr.client.solrj.SolrClient.request(SolrClient.java:1220)
	at org.apache.solr.cloud.TestRebalanceLeaders.issueCommands(TestRebalanceLeaders.java:280)
	at org.apache.solr.cloud.TestRebalanceLeaders.rebalanceLeaderTest(TestRebalanceLeaders.java:107)
	at org.apache.solr.cloud.TestRebalanceLeaders.test(TestRebalanceLeaders.java:73)
	at sun.reflect.NativeMethodAccessorImpl.invoke0(Native Method)
	at sun.reflect.NativeMethodAccessorImpl.invoke(NativeMethodAccessorImpl.java:62)
	at sun.reflect.DelegatingMethodAccessorImpl.invoke(DelegatingMethodAccessorImpl.java:43)
	at java.lang.reflect.Method.invoke(Method.java:497)
	at com.carrotsearch.randomizedtesting.RandomizedRunner.invoke(RandomizedRunner.java:1627)
	at com.carrotsearch.randomizedtesting.RandomizedRunner$6.evaluate(RandomizedRunner.java:836)
	at com.carrotsearch.randomizedtesting.RandomizedRunner$7.evaluate(RandomizedRunner.java:872)
	at com.carrotsearch.randomizedtesting.RandomizedRunner$8.evaluate(RandomizedRunner.java:886)
	at org.apache.solr.BaseDistributedSearchTestCase$ShardsRepeatRule$ShardsFixedStatement.callStatement(BaseDistributedSearchTestCase.java:960)
	at org.apache.solr.BaseDistributedSearchTestCase$ShardsRepeatRule$ShardsStatement.evaluate(BaseDistributedSearchTestCase.java:935)
	at com.carrotsearch.randomizedtesting.rules.SystemPropertiesRestoreRule$1.evaluate(SystemPropertiesRestoreRule.java:57)
	at org.apache.lucene.util.TestRuleSetupTeardownChained$1.evaluate(TestRuleSetupTeardownChained.java:50)
	at org.apache.lucene.util.AbstractBeforeAfterRule$1.evaluate(AbstractBeforeAfterRule.java:46)
	at org.apache.lucene.util.TestRuleThreadAndTestName$1.evaluate(TestRuleThreadAndTestName.java:49)
	at org.apache.lucene.util.TestRuleIgnoreAfterMaxFailures$1.evaluate(TestRuleIgnoreAfterMaxFailures.java:65)
	at org.apache.lucene.util.TestRuleMarkFailure$1.evaluate(TestRuleMarkFailure.java:48)
	at com.carrotsearch.randomizedtesting.rules.StatementAdapter.evaluate(StatementAdapter.java:36)
	at com.carrotsearch.randomizedtesting.ThreadLeakControl$StatementRunner.run(ThreadLeakControl.java:365)
	at com.carrotsearch.randomizedtesting.ThreadLeakControl.forkTimeoutingTask(ThreadLeakControl.java:798)
	at com.carrotsearch.randomizedtesting.ThreadLeakControl$3.evaluate(ThreadLeakControl.java:458)
	at com.carrotsearch.randomizedtesting.RandomizedRunner.runSingleTest(RandomizedRunner.java:845)
	at com.carrotsearch.randomizedtesting.RandomizedRunner$3.evaluate(RandomizedRunner.java:747)
	at com.carrotsearch.randomizedtesting.RandomizedRunner$4.evaluate(RandomizedRunner.java:781)
	at com.carrotsearch.randomizedtesting.RandomizedRunner$5.evaluate(RandomizedRunner.java:792)
	at com.carrotsearch.randomizedtesting.rules.StatementAdapter.evaluate(StatementAdapter.java:36)
	at com.carrotsearch.randomizedtesting.rules.SystemPropertiesRestoreRule$1.evaluate(SystemPropertiesRestoreRule.java:57)
	at org.apache.lucene.util.AbstractBeforeAfterRule$1.evaluate(AbstractBeforeAfterRule.java:46)
	at com.carrotsearch.randomizedtesting.rules.StatementAdapter.evaluate(StatementAdapter.java:36)
	at org.apache.lucene.util.TestRuleStoreClassName$1.evaluate(TestRuleStoreClassName.java:42)
	at com.carrotsearch.randomizedtesting.rules.NoShadowingOrOverridesOnMethodsRule$1.evaluate(NoShadowingOrOverridesOnMethodsRule.java:39)
	at com.carrotsearch.randomizedtesting.rules.NoShadowingOrOverridesOnMethodsRule$1.evaluate(NoShadowingOrOverridesOnMethodsRule.java:39)
	at com.carrotsearch.randomizedtesting.rules.StatementAdapter.evaluate(StatementAdapter.java:36)
	at com.carrotsearch.randomizedtesting.rules.StatementAdapter.evaluate(StatementAdapter.java:36)
	at com.carrotsearch.randomizedtesting.rules.StatementAdapter.evaluate(StatementAdapter.java:36)
	at org.apache.lucene.util.TestRuleAssertionsRequired$1.evaluate(TestRuleAssertionsRequired.java:54)
	at org.apache.lucene.util.TestRuleMarkFailure$1.evaluate(TestRuleMarkFailure.java:48)
	at org.apache.lucene.util.TestRuleIgnoreAfterMaxFailures$1.evaluate(TestRuleIgnoreAfterMaxFailures.java:65)
	at org.apache.lucene.util.TestRuleIgnoreTestSuites$1.evaluate(TestRuleIgnoreTestSuites.java:55)
	at com.carrotsearch.randomizedtesting.rules.StatementAdapter.evaluate(StatementAdapter.java:36)
	at com.carrotsearch.randomizedtesting.ThreadLeakControl$StatementRunner.run(ThreadLeakControl.java:365)
	at java.lang.Thread.run(Thread.java:745)
Caused by: org.apache.solr.client.solrj.impl.HttpSolrClient$RemoteSolrException: Error from server at http://127.0.0.1:49221: Expected mime type application/octet-stream but got text/html. <html>
<head>
<meta http-equiv="Content-Type" content="text/html;charset=ISO-8859-1"/>
<title>Error 500 </title>
</head>
<body>
<h2>HTTP ERROR: 500</h2>
<p>Problem accessing /admin/collections. Reason:
<pre>    {trace=java.lang.AssertionError
	at org.apache.solr.common.util.ByteUtils.UTF8toUTF16(ByteUtils.java:36)
	at org.apache.solr.common.util.ByteUtils.UTF8toUTF16(ByteUtils.java:64)
	at org.apache.solr.common.cloud.ZkStateReader.fromJSON(ZkStateReader.java:151)
	at org.apache.solr.common.cloud.ZkNodeProps.load(ZkNodeProps.java:92)
	at org.apache.solr.cloud.DistributedQueue.containsTaskWithRequestId(DistributedQueue.java:127)
	at org.apache.solr.handler.admin.CollectionsHandler.overseerCollectionQueueContains(CollectionsHandler.java:255)
	at org.apache.solr.handler.admin.CollectionsHandler.handleResponse(CollectionsHandler.java:210)
	at org.apache.solr.handler.admin.CollectionsHandler.handleResponse(CollectionsHandler.java:190)
	at org.apache.solr.handler.admin.RebalanceLeaders.rejoinElection(RebalanceLeaders.java:269)
	at org.apache.solr.handler.admin.RebalanceLeaders.insurePreferredIsLeader(RebalanceLeaders.java:184)
	at org.apache.solr.handler.admin.RebalanceLeaders.execute(RebalanceLeaders.java:91)
	at org.apache.solr.handler.admin.CollectionsHandler$CollectionOperation$23.call(CollectionsHandler.java:684)
	at org.apache.solr.handler.admin.CollectionsHandler.handleRequestBody(CollectionsHandler.java:165)
	at org.apache.solr.handler.RequestHandlerBase.handleRequest(RequestHandlerBase.java:143)
	at org.apache.solr.servlet.HttpSolrCall.handleAdminRequest(HttpSolrCall.java:654)
	at org.apache.solr.servlet.HttpSolrCall.call(HttpSolrCall.java:433)
	at org.apache.solr.servlet.SolrDispatchFilter.doFilter(SolrDispatchFilter.java:227)
	at org.apache.solr.servlet.SolrDispatchFilter.doFilter(SolrDispatchFilter.java:196)
	at org.eclipse.jetty.servlet.ServletHandler$CachedChain.doFilter(ServletHandler.java:1652)
	at org.apache.solr.client.solrj.embedded.JettySolrRunner$DebugFilter.doFilter(JettySolrRunner.java:106)
	at org.eclipse.jetty.servlet.ServletHandler$CachedChain.doFilter(ServletHandler.java:1652)
	at org.eclipse.jetty.servlets.UserAgentFilter.doFilter(UserAgentFilter.java:83)
	at org.eclipse.jetty.servlets.GzipFilter.doFilter(GzipFilter.java:364)
	at org.eclipse.jetty.servlet.ServletHandler$CachedChain.doFilter(ServletHandler.java:1652)
	at org.eclipse.jetty.servlet.ServletHandler.doHandle(ServletHandler.java:585)
	at org.eclipse.jetty.server.session.SessionHandler.doHandle(SessionHandler.java:221)
	at org.eclipse.jetty.server.handler.ContextHandler.doHandle(ContextHandler.java:1127)
	at org.eclipse.jetty.servlet.ServletHandler.doScope(ServletHandler.java:515)
	at org.eclipse.jetty.server.session.SessionHandler.doScope(SessionHandler.java:185)
	at org.eclipse.jetty.server.handler.ContextHandler.doScope(ContextHandler.java:1061)
	at org.eclipse.jetty.server.handler.ScopedHandler.handle(ScopedHandler.java:141)
	at org.eclipse.jetty.server.handler.HandlerWrapper.handle(HandlerWrapper.java:97)
	at org.eclipse.jetty.server.Server.handle(Server.java:499)
	at org.eclipse.jetty.server.HttpChannel.handle(HttpChannel.java:310)
	at org.eclipse.jetty.server.HttpConnection.onFillable(HttpConnection.java:257)
	at org.eclipse.jetty.io.AbstractConnection$2.run(AbstractConnection.java:540)
	at org.eclipse.jetty.util.thread.QueuedThreadPool.runJob(QueuedThreadPool.java:635)
	at org.eclipse.jetty.util.thread.QueuedThreadPool$3.run(QueuedThreadPool.java:555)
	at java.lang.Thread.run(Thread.java:745)
,code=500}</pre></p>
<hr /><i><small>Powered by Jetty://</small></i>
</body>
</html>

	at org.apache.solr.client.solrj.impl.HttpSolrClient.executeMethod(HttpSolrClient.java:528)
	at org.apache.solr.client.solrj.impl.HttpSolrClient.request(HttpSolrClient.java:234)
	at org.apache.solr.client.solrj.impl.HttpSolrClient.request(HttpSolrClient.java:226)
	at org.apache.solr.client.solrj.impl.LBHttpSolrClient.doRequest(LBHttpSolrClient.java:376)
	at org.apache.solr.client.solrj.impl.LBHttpSolrClient.request(LBHttpSolrClient.java:344)
	... 48 more




Build Log:
[...truncated 9742 lines...]
   [junit4] Suite: org.apache.solr.cloud.TestRebalanceLeaders
   [junit4]   2> Creating dataDir: /Users/jenkins/workspace/Lucene-Solr-trunk-MacOSX/solr/build/solr-core/test/J1/temp/solr.cloud.TestRebalanceLeaders_D2D180EDCD1FAE30-001/init-core-data-001
   [junit4]   2> 521892 INFO  (SUITE-TestRebalanceLeaders-seed#[D2D180EDCD1FAE30]-worker) [    ] o.a.s.SolrTestCaseJ4 Randomized ssl (false) and clientAuth (false)
   [junit4]   2> 521893 INFO  (SUITE-TestRebalanceLeaders-seed#[D2D180EDCD1FAE30]-worker) [    ] o.a.s.BaseDistributedSearchTestCase Setting hostContext system property: /
   [junit4]   2> 521901 INFO  (TEST-TestRebalanceLeaders.test-seed#[D2D180EDCD1FAE30]) [    ] o.a.s.c.ZkTestServer STARTING ZK TEST SERVER
   [junit4]   2> 521902 INFO  (Thread-1152) [    ] o.a.s.c.ZkTestServer client port:0.0.0.0/0.0.0.0:0
   [junit4]   2> 521902 INFO  (Thread-1152) [    ] o.a.s.c.ZkTestServer Starting server
   [junit4]   2> 522004 INFO  (TEST-TestRebalanceLeaders.test-seed#[D2D180EDCD1FAE30]) [    ] o.a.s.c.ZkTestServer start zk server on port:49208
   [junit4]   2> 522004 INFO  (TEST-TestRebalanceLeaders.test-seed#[D2D180EDCD1FAE30]) [    ] o.a.s.c.c.SolrZkClient Using default ZkCredentialsProvider
   [junit4]   2> 522006 INFO  (TEST-TestRebalanceLeaders.test-seed#[D2D180EDCD1FAE30]) [    ] o.a.s.c.c.ConnectionManager Waiting for client to connect to ZooKeeper
   [junit4]   2> 522023 INFO  (zkCallback-356-thread-1) [    ] o.a.s.c.c.ConnectionManager Watcher org.apache.solr.common.cloud.ConnectionManager@58c7754c name:ZooKeeperConnection Watcher:127.0.0.1:49208 got event WatchedEvent state:SyncConnected type:None path:null path:null type:None
   [junit4]   2> 522023 INFO  (TEST-TestRebalanceLeaders.test-seed#[D2D180EDCD1FAE30]) [    ] o.a.s.c.c.ConnectionManager Client is connected to ZooKeeper
   [junit4]   2> 522024 INFO  (TEST-TestRebalanceLeaders.test-seed#[D2D180EDCD1FAE30]) [    ] o.a.s.c.c.SolrZkClient Using default ZkACLProvider
   [junit4]   2> 522024 INFO  (TEST-TestRebalanceLeaders.test-seed#[D2D180EDCD1FAE30]) [    ] o.a.s.c.c.SolrZkClient makePath: /solr
   [junit4]   2> 522029 INFO  (TEST-TestRebalanceLeaders.test-seed#[D2D180EDCD1FAE30]) [    ] o.a.s.c.c.SolrZkClient Using default ZkCredentialsProvider
   [junit4]   2> 522030 INFO  (TEST-TestRebalanceLeaders.test-seed#[D2D180EDCD1FAE30]) [    ] o.a.s.c.c.ConnectionManager Waiting for client to connect to ZooKeeper
   [junit4]   2> 522034 INFO  (zkCallback-357-thread-1) [    ] o.a.s.c.c.ConnectionManager Watcher org.apache.solr.common.cloud.ConnectionManager@254d69a1 name:ZooKeeperConnection Watcher:127.0.0.1:49208/solr got event WatchedEvent state:SyncConnected type:None path:null path:null type:None
   [junit4]   2> 522034 INFO  (TEST-TestRebalanceLeaders.test-seed#[D2D180EDCD1FAE30]) [    ] o.a.s.c.c.ConnectionManager Client is connected to ZooKeeper
   [junit4]   2> 522035 INFO  (TEST-TestRebalanceLeaders.test-seed#[D2D180EDCD1FAE30]) [    ] o.a.s.c.c.SolrZkClient Using default ZkACLProvider
   [junit4]   2> 522035 INFO  (TEST-TestRebalanceLeaders.test-seed#[D2D180EDCD1FAE30]) [    ] o.a.s.c.c.SolrZkClient makePath: /collections/collection1
   [junit4]   2> 522041 INFO  (TEST-TestRebalanceLeaders.test-seed#[D2D180EDCD1FAE30]) [    ] o.a.s.c.c.SolrZkClient makePath: /collections/collection1/shards
   [junit4]   2> 522044 INFO  (TEST-TestRebalanceLeaders.test-seed#[D2D180EDCD1FAE30]) [    ] o.a.s.c.c.SolrZkClient makePath: /collections/control_collection
   [junit4]   2> 522047 INFO  (TEST-TestRebalanceLeaders.test-seed#[D2D180EDCD1FAE30]) [    ] o.a.s.c.c.SolrZkClient makePath: /collections/control_collection/shards
   [junit4]   2> 522052 INFO  (TEST-TestRebalanceLeaders.test-seed#[D2D180EDCD1FAE30]) [    ] o.a.s.c.AbstractZkTestCase put /Users/jenkins/workspace/Lucene-Solr-trunk-MacOSX/solr/core/src/test-files/solr/collection1/conf/solrconfig-tlog.xml to /configs/conf1/solrconfig.xml
   [junit4]   2> 522052 INFO  (TEST-TestRebalanceLeaders.test-seed#[D2D180EDCD1FAE30]) [    ] o.a.s.c.c.SolrZkClient makePath: /configs/conf1/solrconfig.xml
   [junit4]   2> 522058 INFO  (TEST-TestRebalanceLeaders.test-seed#[D2D180EDCD1FAE30]) [    ] o.a.s.c.AbstractZkTestCase put /Users/jenkins/workspace/Lucene-Solr-trunk-MacOSX/solr/core/src/test-files/solr/collection1/conf/schema15.xml to /configs/conf1/schema.xml
   [junit4]   2> 522058 INFO  (TEST-TestRebalanceLeaders.test-seed#[D2D180EDCD1FAE30]) [    ] o.a.s.c.c.SolrZkClient makePath: /configs/conf1/schema.xml
   [junit4]   2> 522063 INFO  (TEST-TestRebalanceLeaders.test-seed#[D2D180EDCD1FAE30]) [    ] o.a.s.c.AbstractZkTestCase put /Users/jenkins/workspace/Lucene-Solr-trunk-MacOSX/solr/core/src/test-files/solr/collection1/conf/solrconfig.snippet.randomindexconfig.xml to /configs/conf1/solrconfig.snippet.randomindexconfig.xml
   [junit4]   2> 522063 INFO  (TEST-TestRebalanceLeaders.test-seed#[D2D180EDCD1FAE30]) [    ] o.a.s.c.c.SolrZkClient makePath: /configs/conf1/solrconfig.snippet.randomindexconfig.xml
   [junit4]   2> 522067 INFO  (TEST-TestRebalanceLeaders.test-seed#[D2D180EDCD1FAE30]) [    ] o.a.s.c.AbstractZkTestCase put /Users/jenkins/workspace/Lucene-Solr-trunk-MacOSX/solr/core/src/test-files/solr/collection1/conf/stopwords.txt to /configs/conf1/stopwords.txt
   [junit4]   2> 522067 INFO  (TEST-TestRebalanceLeaders.test-seed#[D2D180EDCD1FAE30]) [    ] o.a.s.c.c.SolrZkClient makePath: /configs/conf1/stopwords.txt
   [junit4]   2> 522071 INFO  (TEST-TestRebalanceLeaders.test-seed#[D2D180EDCD1FAE30]) [    ] o.a.s.c.AbstractZkTestCase put /Users/jenkins/workspace/Lucene-Solr-trunk-MacOSX/solr/core/src/test-files/solr/collection1/conf/protwords.txt to /configs/conf1/protwords.txt
   [junit4]   2> 522071 INFO  (TEST-TestRebalanceLeaders.test-seed#[D2D180EDCD1FAE30]) [    ] o.a.s.c.c.SolrZkClient makePath: /configs/conf1/protwords.txt
   [junit4]   2> 522075 INFO  (TEST-TestRebalanceLeaders.test-seed#[D2D180EDCD1FAE30]) [    ] o.a.s.c.AbstractZkTestCase put /Users/jenkins/workspace/Lucene-Solr-trunk-MacOSX/solr/core/src/test-files/solr/collection1/conf/currency.xml to /configs/conf1/currency.xml
   [junit4]   2> 522076 INFO  (TEST-TestRebalanceLeaders.test-seed#[D2D180EDCD1FAE30]) [    ] o.a.s.c.c.SolrZkClient makePath: /configs/conf1/currency.xml
   [junit4]   2> 522080 INFO  (TEST-TestRebalanceLeaders.test-seed#[D2D180EDCD1FAE30]) [    ] o.a.s.c.AbstractZkTestCase put /Users/jenkins/workspace/Lucene-Solr-trunk-MacOSX/solr/core/src/test-files/solr/collection1/conf/enumsConfig.xml to /configs/conf1/enumsConfig.xml
   [junit4]   2> 522080 INFO  (TEST-TestRebalanceLeaders.test-seed#[D2D180EDCD1FAE30]) [    ] o.a.s.c.c.SolrZkClient makePath: /configs/conf1/enumsConfig.xml
   [junit4]   2> 522084 INFO  (TEST-TestRebalanceLeaders.test-seed#[D2D180EDCD1FAE30]) [    ] o.a.s.c.AbstractZkTestCase put /Users/jenkins/workspace/Lucene-Solr-trunk-MacOSX/solr/core/src/test-files/solr/collection1/conf/open-exchange-rates.json to /configs/conf1/open-exchange-rates.json
   [junit4]   2> 522085 INFO  (TEST-TestRebalanceLeaders.test-seed#[D2D180EDCD1FAE30]) [    ] o.a.s.c.c.SolrZkClient makePath: /configs/conf1/open-exchange-rates.json
   [junit4]   2> 522089 INFO  (TEST-TestRebalanceLeaders.test-seed#[D2D180EDCD1FAE30]) [    ] o.a.s.c.AbstractZkTestCase put /Users/jenkins/workspace/Lucene-Solr-trunk-MacOSX/solr/core/src/test-files/solr/collection1/conf/mapping-ISOLatin1Accent.txt to /configs/conf1/mapping-ISOLatin1Accent.txt
   [junit4]   2> 522089 INFO  (TEST-TestRebalanceLeaders.test-seed#[D2D180EDCD1FAE30]) [    ] o.a.s.c.c.SolrZkClient makePath: /configs/conf1/mapping-ISOLatin1Accent.txt
   [junit4]   2> 522093 INFO  (TEST-TestRebalanceLeaders.test-seed#[D2D180EDCD1FAE30]) [    ] o.a.s.c.AbstractZkTestCase put /Users/jenkins/workspace/Lucene-Solr-trunk-MacOSX/solr/core/src/test-files/solr/collection1/conf/old_synonyms.txt to /configs/conf1/old_synonyms.txt
   [junit4]   2> 522093 INFO  (TEST-TestRebalanceLeaders.test-seed#[D2D180EDCD1FAE30]) [    ] o.a.s.c.c.SolrZkClient makePath: /configs/conf1/old_synonyms.txt
   [junit4]   2> 522096 INFO  (TEST-TestRebalanceLeaders.test-seed#[D2D180EDCD1FAE30]) [    ] o.a.s.c.AbstractZkTestCase put /Users/jenkins/workspace/Lucene-Solr-trunk-MacOSX/solr/core/src/test-files/solr/collection1/conf/synonyms.txt to /configs/conf1/synonyms.txt
   [junit4]   2> 522097 INFO  (TEST-TestRebalanceLeaders.test-seed#[D2D180EDCD1FAE30]) [    ] o.a.s.c.c.SolrZkClient makePath: /configs/conf1/synonyms.txt
   [junit4]   2> 522445 INFO  (TEST-TestRebalanceLeaders.test-seed#[D2D180EDCD1FAE30]) [    ] o.a.s.SolrTestCaseJ4 Writing core.properties file to /Users/jenkins/workspace/Lucene-Solr-trunk-MacOSX/solr/build/solr-core/test/J1/temp/solr.cloud.TestRebalanceLeaders_D2D180EDCD1FAE30-001/control-001/cores/collection1
   [junit4]   2> 522450 INFO  (TEST-TestRebalanceLeaders.test-seed#[D2D180EDCD1FAE30]) [    ] o.e.j.s.Server jetty-9.2.11.v20150529
   [junit4]   2> 522453 INFO  (TEST-TestRebalanceLeaders.test-seed#[D2D180EDCD1FAE30]) [    ] o.e.j.s.h.ContextHandler Started o.e.j.s.ServletContextHandler@3e7f47f6{/,null,AVAILABLE}
   [junit4]   2> 522467 INFO  (TEST-TestRebalanceLeaders.test-seed#[D2D180EDCD1FAE30]) [    ] o.e.j.s.ServerConnector Started ServerConnector@4fd6b371{HTTP/1.1}{127.0.0.1:49213}
   [junit4]   2> 522467 INFO  (TEST-TestRebalanceLeaders.test-seed#[D2D180EDCD1FAE30]) [    ] o.e.j.s.Server Started @528047ms
   [junit4]   2> 522467 INFO  (TEST-TestRebalanceLeaders.test-seed#[D2D180EDCD1FAE30]) [    ] o.a.s.c.s.e.JettySolrRunner Jetty properties: {solr.data.dir=/Users/jenkins/workspace/Lucene-Solr-trunk-MacOSX/solr/build/solr-core/test/J1/temp/solr.cloud.TestRebalanceLeaders_D2D180EDCD1FAE30-001/tempDir-001/control/data, hostContext=/, hostPort=49213, coreRootDirectory=/Users/jenkins/workspace/Lucene-Solr-trunk-MacOSX/solr/build/solr-core/test/J1/../../../../../../../../../Users/jenkins/workspace/Lucene-Solr-trunk-MacOSX/solr/build/solr-core/test/J1/temp/solr.cloud.TestRebalanceLeaders_D2D180EDCD1FAE30-001/control-001/cores}
   [junit4]   2> 522467 INFO  (TEST-TestRebalanceLeaders.test-seed#[D2D180EDCD1FAE30]) [    ] o.a.s.s.SolrDispatchFilter SolrDispatchFilter.init(): sun.misc.Launcher$AppClassLoader@74a14482
   [junit4]   2> 522467 INFO  (TEST-TestRebalanceLeaders.test-seed#[D2D180EDCD1FAE30]) [    ] o.a.s.c.SolrResourceLoader new SolrResourceLoader for directory: '/Users/jenkins/workspace/Lucene-Solr-trunk-MacOSX/solr/build/solr-core/test/J1/../../../../../../../../../Users/jenkins/workspace/Lucene-Solr-trunk-MacOSX/solr/build/solr-core/test/J1/temp/solr.cloud.TestRebalanceLeaders_D2D180EDCD1FAE30-001/control-001/'
   [junit4]   2> 522502 INFO  (TEST-TestRebalanceLeaders.test-seed#[D2D180EDCD1FAE30]) [    ] o.a.s.c.SolrXmlConfig Loading container configuration from /Users/jenkins/workspace/Lucene-Solr-trunk-MacOSX/solr/build/solr-core/test/J1/../../../../../../../../../Users/jenkins/workspace/Lucene-Solr-trunk-MacOSX/solr/build/solr-core/test/J1/temp/solr.cloud.TestRebalanceLeaders_D2D180EDCD1FAE30-001/control-001/solr.xml
   [junit4]   2> 522510 INFO  (TEST-TestRebalanceLeaders.test-seed#[D2D180EDCD1FAE30]) [    ] o.a.s.c.CoresLocator Config-defined core root directory: /Users/jenkins/workspace/Lucene-Solr-trunk-MacOSX/solr/build/solr-core/test/J1/../../../../../../../../../Users/jenkins/workspace/Lucene-Solr-trunk-MacOSX/solr/build/solr-core/test/J1/temp/solr.cloud.TestRebalanceLeaders_D2D180EDCD1FAE30-001/control-001/cores
   [junit4]   2> 522510 INFO  (TEST-TestRebalanceLeaders.test-seed#[D2D180EDCD1FAE30]) [    ] o.a.s.c.CoreContainer New CoreContainer 803325571
   [junit4]   2> 522510 INFO  (TEST-TestRebalanceLeaders.test-seed#[D2D180EDCD1FAE30]) [    ] o.a.s.c.CoreContainer Loading cores into CoreContainer [instanceDir=/Users/jenkins/workspace/Lucene-Solr-trunk-MacOSX/solr/build/solr-core/test/J1/../../../../../../../../../Users/jenkins/workspace/Lucene-Solr-trunk-MacOSX/solr/build/solr-core/test/J1/temp/solr.cloud.TestRebalanceLeaders_D2D180EDCD1FAE30-001/control-001/]
   [junit4]   2> 522511 INFO  (TEST-TestRebalanceLeaders.test-seed#[D2D180EDCD1FAE30]) [    ] o.a.s.c.CoreContainer loading shared library: /Users/jenkins/workspace/Lucene-Solr-trunk-MacOSX/solr/build/solr-core/test/J1/../../../../../../../../../Users/jenkins/workspace/Lucene-Solr-trunk-MacOSX/solr/build/solr-core/test/J1/temp/solr.cloud.TestRebalanceLeaders_D2D180EDCD1FAE30-001/control-001/lib
   [junit4]   2> 522511 WARN  (TEST-TestRebalanceLeaders.test-seed#[D2D180EDCD1FAE30]) [    ] o.a.s.c.SolrResourceLoader Can't find (or read) directory to add to classloader: lib (resolved as: /Users/jenkins/workspace/Lucene-Solr-trunk-MacOSX/solr/build/solr-core/test/J1/../../../../../../../../../Users/jenkins/workspace/Lucene-Solr-trunk-MacOSX/solr/build/solr-core/test/J1/temp/solr.cloud.TestRebalanceLeaders_D2D180EDCD1FAE30-001/control-001/lib).
   [junit4]   2> 522519 INFO  (TEST-TestRebalanceLeaders.test-seed#[D2D180EDCD1FAE30]) [    ] o.a.s.h.c.HttpShardHandlerFactory created with socketTimeout : 90000,urlScheme : ,connTimeout : 15000,maxConnectionsPerHost : 20,maxConnections : 10000,corePoolSize : 0,maximumPoolSize : 2147483647,maxThreadIdleTime : 5,sizeOfQueue : -1,fairnessPolicy : false,useRetries : false,
   [junit4]   2> 522532 INFO  (TEST-TestRebalanceLeaders.test-seed#[D2D180EDCD1FAE30]) [    ] o.a.s.u.UpdateShardHandler Creating UpdateShardHandler HTTP client with params: socketTimeout=340000&connTimeout=45000&retry=true
   [junit4]   2> 522533 INFO  (TEST-TestRebalanceLeaders.test-seed#[D2D180EDCD1FAE30]) [    ] o.a.s.l.LogWatcher SLF4J impl is org.slf4j.impl.Log4jLoggerFactory
   [junit4]   2> 522534 INFO  (TEST-TestRebalanceLeaders.test-seed#[D2D180EDCD1FAE30]) [    ] o.a.s.l.LogWatcher Registering Log Listener [Log4j (org.slf4j.impl.Log4jLoggerFactory)]
   [junit4]   2> 522534 INFO  (TEST-TestRebalanceLeaders.test-seed#[D2D180EDCD1FAE30]) [    ] o.a.s.c.ZkContainer Zookeeper client=127.0.0.1:49208/solr
   [junit4]   2> 522534 INFO  (TEST-TestRebalanceLeaders.test-seed#[D2D180EDCD1FAE30]) [    ] o.a.s.c.ZkController zkHost includes chroot
   [junit4]   2> 522534 INFO  (TEST-TestRebalanceLeaders.test-seed#[D2D180EDCD1FAE30]) [    ] o.a.s.c.c.SolrZkClient Using default ZkCredentialsProvider
   [junit4]   2> 522535 INFO  (TEST-TestRebalanceLeaders.test-seed#[D2D180EDCD1FAE30]) [    ] o.a.s.c.c.ConnectionManager Waiting for client to connect to ZooKeeper
   [junit4]   2> 522537 INFO  (zkCallback-359-thread-1) [    ] o.a.s.c.c.ConnectionManager Watcher org.apache.solr.common.cloud.ConnectionManager@1a89088d name:ZooKeeperConnection Watcher:127.0.0.1:49208 got event WatchedEvent state:SyncConnected type:None path:null path:null type:None
   [junit4]   2> 522537 INFO  (TEST-TestRebalanceLeaders.test-seed#[D2D180EDCD1FAE30]) [    ] o.a.s.c.c.ConnectionManager Client is connected to ZooKeeper
   [junit4]   2> 522538 INFO  (TEST-TestRebalanceLeaders.test-seed#[D2D180EDCD1FAE30]) [    ] o.a.s.c.c.SolrZkClient Using default ZkACLProvider
   [junit4]   2> 522541 INFO  (TEST-TestRebalanceLeaders.test-seed#[D2D180EDCD1FAE30]) [n:127.0.0.1:49213_    ] o.a.s.c.c.ConnectionManager Waiting for client to connect to ZooKeeper
   [junit4]   2> 522543 INFO  (zkCallback-360-thread-1-processing-n:127.0.0.1:49213_) [n:127.0.0.1:49213_    ] o.a.s.c.c.ConnectionManager Watcher org.apache.solr.common.cloud.ConnectionManager@18540b08 name:ZooKeeperConnection Watcher:127.0.0.1:49208/solr got event WatchedEvent state:SyncConnected type:None path:null path:null type:None
   [junit4]   2> 522543 INFO  (TEST-TestRebalanceLeaders.test-seed#[D2D180EDCD1FAE30]) [n:127.0.0.1:49213_    ] o.a.s.c.c.ConnectionManager Client is connected to ZooKeeper
   [junit4]   2> 522545 INFO  (TEST-TestRebalanceLeaders.test-seed#[D2D180EDCD1FAE30]) [n:127.0.0.1:49213_    ] o.a.s.c.c.SolrZkClient makePath: /overseer/queue
   [junit4]   2> 522549 INFO  (TEST-TestRebalanceLeaders.test-seed#[D2D180EDCD1FAE30]) [n:127.0.0.1:49213_    ] o.a.s.c.c.SolrZkClient makePath: /overseer/collection-queue-work
   [junit4]   2> 522554 INFO  (TEST-TestRebalanceLeaders.test-seed#[D2D180EDCD1FAE30]) [n:127.0.0.1:49213_    ] o.a.s.c.c.SolrZkClient makePath: /overseer/collection-map-running
   [junit4]   2> 522559 INFO  (TEST-TestRebalanceLeaders.test-seed#[D2D180EDCD1FAE30]) [n:127.0.0.1:49213_    ] o.a.s.c.c.SolrZkClient makePath: /overseer/collection-map-completed
   [junit4]   2> 522563 INFO  (TEST-TestRebalanceLeaders.test-seed#[D2D180EDCD1FAE30]) [n:127.0.0.1:49213_    ] o.a.s.c.c.SolrZkClient makePath: /overseer/collection-map-failure
   [junit4]   2> 522569 INFO  (TEST-TestRebalanceLeaders.test-seed#[D2D180EDCD1FAE30]) [n:127.0.0.1:49213_    ] o.a.s.c.c.SolrZkClient makePath: /live_nodes
   [junit4]   2> 522572 INFO  (TEST-TestRebalanceLeaders.test-seed#[D2D180EDCD1FAE30]) [n:127.0.0.1:49213_    ] o.a.s.c.c.SolrZkClient makePath: /aliases.json
   [junit4]   2> 522576 INFO  (TEST-TestRebalanceLeaders.test-seed#[D2D180EDCD1FAE30]) [n:127.0.0.1:49213_    ] o.a.s.c.c.SolrZkClient makePath: /clusterstate.json
   [junit4]   2> 522581 INFO  (TEST-TestRebalanceLeaders.test-seed#[D2D180EDCD1FAE30]) [n:127.0.0.1:49213_    ] o.a.s.c.ZkController Register node as live in ZooKeeper:/live_nodes/127.0.0.1:49213_
   [junit4]   2> 522582 INFO  (TEST-TestRebalanceLeaders.test-seed#[D2D180EDCD1FAE30]) [n:127.0.0.1:49213_    ] o.a.s.c.c.SolrZkClient makePath: /live_nodes/127.0.0.1:49213_
   [junit4]   2> 522586 INFO  (TEST-TestRebalanceLeaders.test-seed#[D2D180EDCD1FAE30]) [n:127.0.0.1:49213_    ] o.a.s.c.c.SolrZkClient makePath: /overseer_elect
   [junit4]   2> 522590 INFO  (TEST-TestRebalanceLeaders.test-seed#[D2D180EDCD1FAE30]) [n:127.0.0.1:49213_    ] o.a.s.c.c.SolrZkClient makePath: /overseer_elect/election
   [junit4]   2> 522594 INFO  (TEST-TestRebalanceLeaders.test-seed#[D2D180EDCD1FAE30]) [n:127.0.0.1:49213_    ] o.a.s.c.Overseer Overseer (id=null) closing
   [junit4]   2> 522595 INFO  (TEST-TestRebalanceLeaders.test-seed#[D2D180EDCD1FAE30]) [n:127.0.0.1:49213_    ] o.a.s.c.LeaderElector Joined leadership election with path: /overseer_elect/election/94092552254390275-127.0.0.1:49213_-n_0000000000
   [junit4]   2> 522598 INFO  (TEST-TestRebalanceLeaders.test-seed#[D2D180EDCD1FAE30]) [n:127.0.0.1:49213_    ] o.a.s.c.OverseerElectionContext I am going to be the leader 127.0.0.1:49213_
   [junit4]   2> 522598 INFO  (TEST-TestRebalanceLeaders.test-seed#[D2D180EDCD1FAE30]) [n:127.0.0.1:49213_    ] o.a.s.c.c.SolrZkClient makePath: /overseer_elect/leader
   [junit4]   2> 522602 INFO  (TEST-TestRebalanceLeaders.test-seed#[D2D180EDCD1FAE30]) [n:127.0.0.1:49213_    ] o.a.s.c.Overseer Overseer (id=94092552254390275-127.0.0.1:49213_-n_0000000000) starting
   [junit4]   2> 522607 INFO  (TEST-TestRebalanceLeaders.test-seed#[D2D180EDCD1FAE30]) [n:127.0.0.1:49213_    ] o.a.s.c.c.SolrZkClient makePath: /overseer/queue-work
   [junit4]   2> 522622 INFO  (TEST-TestRebalanceLeaders.test-seed#[D2D180EDCD1FAE30]) [n:127.0.0.1:49213_    ] o.a.s.c.OverseerAutoReplicaFailoverThread Starting OverseerAutoReplicaFailoverThread autoReplicaFailoverWorkLoopDelay=10000 autoReplicaFailoverWaitAfterExpiration=30000 autoReplicaFailoverBadNodeExpiration=60000
   [junit4]   2> 522623 INFO  (OverseerCollectionProcessor-94092552254390275-127.0.0.1:49213_-n_0000000000) [n:127.0.0.1:49213_    ] o.a.s.c.OverseerCollectionProcessor Process current queue of collection creations
   [junit4]   2> 522623 INFO  (TEST-TestRebalanceLeaders.test-seed#[D2D180EDCD1FAE30]) [n:127.0.0.1:49213_    ] o.a.s.c.c.ZkStateReader Updating cluster state from ZooKeeper... 
   [junit4]   2> 522624 INFO  (OverseerStateUpdate-94092552254390275-127.0.0.1:49213_-n_0000000000) [n:127.0.0.1:49213_    ] o.a.s.c.Overseer Starting to work on the main queue
   [junit4]   2> 522636 INFO  (TEST-TestRebalanceLeaders.test-seed#[D2D180EDCD1FAE30]) [n:127.0.0.1:49213_    ] o.a.s.c.CoreContainer No authentication plugin used.
   [junit4]   2> 522637 INFO  (TEST-TestRebalanceLeaders.test-seed#[D2D180EDCD1FAE30]) [n:127.0.0.1:49213_    ] o.a.s.c.CoreContainer Security conf doesn't exist. Skipping setup for authorization module.
   [junit4]   2> 522638 INFO  (TEST-TestRebalanceLeaders.test-seed#[D2D180EDCD1FAE30]) [n:127.0.0.1:49213_    ] o.a.s.c.CoresLocator Looking for core definitions underneath /Users/jenkins/workspace/Lucene-Solr-trunk-MacOSX/solr/build/solr-core/test/J1/../../../../../../../../../Users/jenkins/workspace/Lucene-Solr-trunk-MacOSX/solr/build/solr-core/test/J1/temp/solr.cloud.TestRebalanceLeaders_D2D180EDCD1FAE30-001/control-001/cores
   [junit4]   2> 522641 INFO  (TEST-TestRebalanceLeaders.test-seed#[D2D180EDCD1FAE30]) [n:127.0.0.1:49213_    ] o.a.s.c.SolrCore Created CoreDescriptor: {name=collection1, config=solrconfig.xml, transient=false, schema=schema.xml, loadOnStartup=true, instanceDir=/Users/jenkins/workspace/Lucene-Solr-trunk-MacOSX/solr/build/solr-core/test/J1/../../../../../../../../../Users/jenkins/workspace/Lucene-Solr-trunk-MacOSX/solr/build/solr-core/test/J1/temp/solr.cloud.TestRebalanceLeaders_D2D180EDCD1FAE30-001/control-001/cores/collection1, collection=control_collection, absoluteInstDir=/Users/jenkins/workspace/Lucene-Solr-trunk-MacOSX/solr/build/solr-core/test/J1/../../../../../../../../../Users/jenkins/workspace/Lucene-Solr-trunk-MacOSX/solr/build/solr-core/test/J1/temp/solr.cloud.TestRebalanceLeaders_D2D180EDCD1FAE30-001/control-001/cores/collection1/, coreNodeName=, dataDir=data/, shard=}
   [junit4]   2> 522642 INFO  (TEST-TestRebalanceLeaders.test-seed#[D2D180EDCD1FAE30]) [n:127.0.0.1:49213_    ] o.a.s.c.CoresLocator Found core collection1 in /Users/jenkins/workspace/Lucene-Solr-trunk-MacOSX/solr/build/solr-core/test/J1/../../../../../../../../../Users/jenkins/workspace/Lucene-Solr-trunk-MacOSX/solr/build/solr-core/test/J1/temp/solr.cloud.TestRebalanceLeaders_D2D180EDCD1FAE30-001/control-001/cores/collection1/
   [junit4]   2> 522642 INFO  (TEST-TestRebalanceLeaders.test-seed#[D2D180EDCD1FAE30]) [n:127.0.0.1:49213_    ] o.a.s.c.CoresLocator Found 1 core definitions
   [junit4]   2> 522643 INFO  (coreLoadExecutor-1468-thread-1-processing-n:127.0.0.1:49213_) [n:127.0.0.1:49213_ c:control_collection   x:collection1] o.a.s.c.ZkController publishing state=down
   [junit4]   2> 522643 INFO  (coreLoadExecutor-1468-thread-1-processing-n:127.0.0.1:49213_) [n:127.0.0.1:49213_ c:control_collection   x:collection1] o.a.s.c.ZkController numShards not found on descriptor - reading it from system property
   [junit4]   2> 522643 INFO  (TEST-TestRebalanceLeaders.test-seed#[D2D180EDCD1FAE30]) [n:127.0.0.1:49213_    ] o.a.s.s.SolrDispatchFilter user.dir=/Users/jenkins/workspace/Lucene-Solr-trunk-MacOSX/solr/build/solr-core/test/J1
   [junit4]   2> 522643 INFO  (TEST-TestRebalanceLeaders.test-seed#[D2D180EDCD1FAE30]) [n:127.0.0.1:49213_    ] o.a.s.s.SolrDispatchFilter SolrDispatchFilter.init() done
   [junit4]   2> 522644 INFO  (coreLoadExecutor-1468-thread-1-processing-n:127.0.0.1:49213_) [n:127.0.0.1:49213_ c:control_collection   x:collection1] o.a.s.c.ZkController look for our core node name
   [junit4]   2> 522644 INFO  (zkCallback-360-thread-1-processing-n:127.0.0.1:49213_) [n:127.0.0.1:49213_    ] o.a.s.c.DistributedQueue NodeChildrenChanged fired on path /overseer/queue state SyncConnected
   [junit4]   2> 522646 INFO  (OverseerStateUpdate-94092552254390275-127.0.0.1:49213_-n_0000000000) [n:127.0.0.1:49213_    ] o.a.s.c.Overseer processMessage: queueSize: 1, message = {
   [junit4]   2>   "core":"collection1",
   [junit4]   2>   "roles":null,
   [junit4]   2>   "base_url":"http://127.0.0.1:49213",
   [junit4]   2>   "node_name":"127.0.0.1:49213_",
   [junit4]   2>   "numShards":"1",
   [junit4]   2>   "state":"down",
   [junit4]   2>   "shard":null,
   [junit4]   2>   "collection":"control_collection",
   [junit4]   2>   "operation":"state"} current state version: 0
   [junit4]   2> 522647 INFO  (OverseerStateUpdate-94092552254390275-127.0.0.1:49213_-n_0000000000) [n:127.0.0.1:49213_    ] o.a.s.c.o.ReplicaMutator Update state numShards=1 message={
   [junit4]   2>   "core":"collection1",
   [junit4]   2>   "roles":null,
   [junit4]   2>   "base_url":"http://127.0.0.1:49213",
   [junit4]   2>   "node_name":"127.0.0.1:49213_",
   [junit4]   2>   "numShards":"1",
   [junit4]   2>   "state":"down",
   [junit4]   2>   "shard":null,
   [junit4]   2>   "collection":"control_collection",
   [junit4]   2>   "operation":"state"}
   [junit4]   2> 522647 INFO  (OverseerStateUpdate-94092552254390275-127.0.0.1:49213_-n_0000000000) [n:127.0.0.1:49213_    ] o.a.s.c.o.ClusterStateMutator building a new cName: control_collection
   [junit4]   2> 522647 INFO  (OverseerStateUpdate-94092552254390275-127.0.0.1:49213_-n_0000000000) [n:127.0.0.1:49213_    ] o.a.s.c.o.ReplicaMutator Assigning new node to shard shard=shard1
   [junit4]   2> 522650 INFO  (zkCallback-360-thread-1-processing-n:127.0.0.1:49213_) [n:127.0.0.1:49213_    ] o.a.s.c.c.ZkStateReader A cluster state change: WatchedEvent state:SyncConnected type:NodeDataChanged path:/clusterstate.json, has occurred - updating... (live nodes size: 1)
   [junit4]   2> 522654 INFO  (zkCallback-360-thread-1-processing-n:127.0.0.1:49213_) [n:127.0.0.1:49213_    ] o.a.s.c.c.ZkStateReader Updated cluster state version to 1
   [junit4]   2> 523646 INFO  (coreLoadExecutor-1468-thread-1-processing-n:127.0.0.1:49213_) [n:127.0.0.1:49213_ c:control_collection   x:collection1] o.a.s.c.ZkController waiting to find shard id in clusterstate for collection1
   [junit4]   2> 523646 INFO  (coreLoadExecutor-1468-thread-1-processing-n:127.0.0.1:49213_) [n:127.0.0.1:49213_ c:control_collection   x:collection1] o.a.s.c.ZkController Check for collection zkNode:control_collection
   [junit4]   2> 523648 INFO  (coreLoadExecutor-1468-thread-1-processing-n:127.0.0.1:49213_) [n:127.0.0.1:49213_ c:control_collection   x:collection1] o.a.s.c.ZkController Collection zkNode exists
   [junit4]   2> 523648 INFO  (coreLoadExecutor-1468-thread-1-processing-n:127.0.0.1:49213_) [n:127.0.0.1:49213_ c:control_collection   x:collection1] o.a.s.c.c.ZkStateReader Load collection config from:/collections/control_collection
   [junit4]   2> 523650 INFO  (coreLoadExecutor-1468-thread-1-processing-n:127.0.0.1:49213_) [n:127.0.0.1:49213_ c:control_collection   x:collection1] o.a.s.c.c.ZkStateReader path=/collections/control_collection configName=conf1 specified config exists in ZooKeeper
   [junit4]   2> 523650 INFO  (coreLoadExecutor-1468-thread-1-processing-n:127.0.0.1:49213_) [n:127.0.0.1:49213_ c:control_collection   x:collection1] o.a.s.c.SolrResourceLoader new SolrResourceLoader for directory: '/Users/jenkins/workspace/Lucene-Solr-trunk-MacOSX/solr/build/solr-core/test/J1/../../../../../../../../../Users/jenkins/workspace/Lucene-Solr-trunk-MacOSX/solr/build/solr-core/test/J1/temp/solr.cloud.TestRebalanceLeaders_D2D180EDCD1FAE30-001/control-001/cores/collection1/'
   [junit4]   2> 523675 INFO  (coreLoadExecutor-1468-thread-1-processing-n:127.0.0.1:49213_) [n:127.0.0.1:49213_ c:control_collection   x:collection1] o.a.s.c.Config loaded config solrconfig.xml with version 0 
   [junit4]   2> 523684 INFO  (coreLoadExecutor-1468-thread-1-processing-n:127.0.0.1:49213_) [n:127.0.0.1:49213_ c:control_collection   x:collection1] o.a.s.c.SolrConfig current version of requestparams : -1
   [junit4]   2> 523688 INFO  (coreLoadExecutor-1468-thread-1-processing-n:127.0.0.1:49213_) [n:127.0.0.1:49213_ c:control_collection   x:collection1] o.a.s.c.SolrConfig Using Lucene MatchVersion: 6.0.0
   [junit4]   2> 523698 INFO  (coreLoadExecutor-1468-thread-1-processing-n:127.0.0.1:49213_) [n:127.0.0.1:49213_ c:control_collection   x:collection1] o.a.s.c.Config Loaded SolrConfig: solrconfig.xml
   [junit4]   2> 523701 INFO  (coreLoadExecutor-1468-thread-1-processing-n:127.0.0.1:49213_) [n:127.0.0.1:49213_ c:control_collection   x:collection1] o.a.s.s.IndexSchema Reading Solr Schema from /configs/conf1/schema.xml
   [junit4]   2> 523708 INFO  (coreLoadExecutor-1468-thread-1-processing-n:127.0.0.1:49213_) [n:127.0.0.1:49213_ c:control_collection   x:collection1] o.a.s.s.IndexSchema [collection1] Schema name=test
   [junit4]   2> 523817 INFO  (coreLoadExecutor-1468-thread-1-processing-n:127.0.0.1:49213_) [n:127.0.0.1:49213_ c:control_collection   x:collection1] o.a.s.s.IndexSchema default search field in schema is text
   [junit4]   2> 523818 INFO  (coreLoadExecutor-1468-thread-1-processing-n:127.0.0.1:49213_) [n:127.0.0.1:49213_ c:control_collection   x:collection1] o.a.s.s.IndexSchema unique key field: id
   [junit4]   2> 523819 INFO  (coreLoadExecutor-1468-thread-1-processing-n:127.0.0.1:49213_) [n:127.0.0.1:49213_ c:control_collection   x:collection1] o.a.s.s.FileExchangeRateProvider Reloading exchange rates from file currency.xml
   [junit4]   2> 523826 INFO  (coreLoadExecutor-1468-thread-1-processing-n:127.0.0.1:49213_) [n:127.0.0.1:49213_ c:control_collection   x:collection1] o.a.s.s.FileExchangeRateProvider Reloading exchange rates from file currency.xml
   [junit4]   2> 523894 INFO  (coreLoadExecutor-1468-thread-1-processing-n:127.0.0.1:49213_) [n:127.0.0.1:49213_ c:control_collection   x:collection1] o.a.s.c.CoreContainer Creating SolrCore 'collection1' using configuration from collection control_collection
   [junit4]   2> 523894 INFO  (coreLoadExecutor-1468-thread-1-processing-n:127.0.0.1:49213_) [n:127.0.0.1:49213_ c:control_collection s:shard1 r:core_node1 x:collection1] o.a.s.c.SolrCore org.apache.solr.core.MockDirectoryFactory
   [junit4]   2> 523895 INFO  (coreLoadExecutor-1468-thread-1-processing-n:127.0.0.1:49213_) [n:127.0.0.1:49213_ c:control_collection s:shard1 r:core_node1 x:collection1] o.a.s.c.SolrCore [[collection1] ] Opening new SolrCore at [/Users/jenkins/workspace/Lucene-Solr-trunk-MacOSX/solr/build/solr-core/test/J1/../../../../../../../../../Users/jenkins/workspace/Lucene-Solr-trunk-MacOSX/solr/build/solr-core/test/J1/temp/solr.cloud.TestRebalanceLeaders_D2D180EDCD1FAE30-001/control-001/cores/collection1/], dataDir=[null]
   [junit4]   2> 523895 INFO  (coreLoadExecutor-1468-thread-1-processing-n:127.0.0.1:49213_) [n:127.0.0.1:49213_ c:control_collection s:shard1 r:core_node1 x:collection1] o.a.s.c.JmxMonitoredMap JMX monitoring is enabled. Adding Solr mbeans to JMX Server: com.sun.jmx.mbeanserver.JmxMBeanServer@49bb834f
   [junit4]   2> 523896 INFO  (coreLoadExecutor-1468-thread-1-processing-n:127.0.0.1:49213_) [n:127.0.0.1:49213_ c:control_collection s:shard1 r:core_node1 x:collection1] o.a.s.c.CachingDirectoryFactory return new directory for /Users/jenkins/workspace/Lucene-Solr-trunk-MacOSX/solr/build/solr-core/test/J1/../../../../../../../../../Users/jenkins/workspace/Lucene-Solr-trunk-MacOSX/solr/build/solr-core/test/J1/temp/solr.cloud.TestRebalanceLeaders_D2D180EDCD1FAE30-001/control-001/cores/collection1/data
   [junit4]   2> 523896 INFO  (coreLoadExecutor-1468-thread-1-processing-n:127.0.0.1:49213_) [n:127.0.0.1:49213_ c:control_collection s:shard1 r:core_node1 x:collection1] o.a.s.c.SolrCore New index directory detected: old=null new=/Users/jenkins/workspace/Lucene-Solr-trunk-MacOSX/solr/build/solr-core/test/J1/../../../../../../../../../Users/jenkins/workspace/Lucene-Solr-trunk-MacOSX/solr/build/solr-core/test/J1/temp/solr.cloud.TestRebalanceLeaders_D2D180EDCD1FAE30-001/control-001/cores/collection1/data/index/
   [junit4]   2> 523896 WARN  (coreLoadExecutor-1468-thread-1-processing-n:127.0.0.1:49213_) [n:127.0.0.1:49213_ c:control_collection s:shard1 r:core_node1 x:collection1] o.a.s.c.SolrCore [collection1] Solr index directory '/Users/jenkins/workspace/Lucene-Solr-trunk-MacOSX/solr/build/solr-core/test/J1/../../../../../../../../../Users/jenkins/workspace/Lucene-Solr-trunk-MacOSX/solr/build/solr-core/test/J1/temp/solr.cloud.TestRebalanceLeaders_D2D180EDCD1FAE30-001/control-001/cores/collection1/data/index' doesn't exist. Creating new index...
   [junit4]   2> 523896 INFO  (coreLoadExecutor-1468-thread-1-processing-n:127.0.0.1:49213_) [n:127.0.0.1:49213_ c:control_collection s:shard1 r:core_node1 x:collection1] o.a.s.c.CachingDirectoryFactory return new directory for /Users/jenkins/workspace/Lucene-Solr-trunk-MacOSX/solr/build/solr-core/test/J1/../../../../../../../../../Users/jenkins/workspace/Lucene-Solr-trunk-MacOSX/solr/build/solr-core/test/J1/temp/solr.cloud.TestRebalanceLeaders_D2D180EDCD1FAE30-001/control-001/cores/collection1/data/index
   [junit4]   2> 523897 INFO  (coreLoadExecutor-1468-thread-1-processing-n:127.0.0.1:49213_) [n:127.0.0.1:49213_ c:control_collection s:shard1 r:core_node1 x:collection1] o.a.s.u.RandomMergePolicy RandomMergePolicy wrapping class org.apache.lucene.index.TieredMergePolicy: [TieredMergePolicy: maxMergeAtOnce=49, maxMergeAtOnceExplicit=44, maxMergedSegmentMB=61.53125, floorSegmentMB=1.90234375, forceMergeDeletesPctAllowed=11.812113112963683, segmentsPerTier=37.0, maxCFSSegmentSizeMB=8.796093022207999E12, noCFSRatio=0.6856146028559873
   [junit4]   2> 523898 INFO  (coreLoadExecutor-1468-thread-1-processing-n:127.0.0.1:49213_) [n:127.0.0.1:49213_ c:control_collection s:shard1 r:core_node1 x:collection1] o.a.s.c.SolrCore SolrDeletionPolicy.onCommit: commits: num=1
   [junit4]   2> 	commit{dir=MockDirectoryWrapper(RAMDirectory@a900976 lockFactory=org.apache.lucene.store.SingleInstanceLockFactory@181c6712),segFN=segments_1,generation=1}
   [junit4]   2> 523901 INFO  (coreLoadExecutor-1468-thread-1-processing-n:127.0.0.1:49213_) [n:127.0.0.1:49213_ c:control_collection s:shard1 r:core_node1 x:collection1] o.a.s.c.SolrCore newest commit generation = 1
   [junit4]   2> 523902 INFO  (OldIndexDirectoryCleanupThreadForCore-collection1) [n:127.0.0.1:49213_ c:control_collection s:shard1 r:core_node1 x:collection1] o.a.s.c.SolrCore Looking for old index directories to cleanup for core collection1 in /Users/jenkins/workspace/Lucene-Solr-trunk-MacOSX/solr/build/solr-core/test/J1/../../../../../../../../../Users/jenkins/workspace/Lucene-Solr-trunk-MacOSX/solr/build/solr-core/test/J1/temp/solr.cloud.TestRebalanceLeaders_D2D180EDCD1FAE30-001/control-001/cores/collection1/data/
   [junit4]   2> 523903 WARN  (OldIndexDirectoryCleanupThreadForCore-collection1) [n:127.0.0.1:49213_ c:control_collection s:shard1 r:core_node1 x:collection1] o.a.s.c.DirectoryFactory /Users/jenkins/workspace/Lucene-Solr-trunk-MacOSX/solr/build/solr-core/test/J1/../../../../../../../../../Users/jenkins/workspace/Lucene-Solr-trunk-MacOSX/solr/build/solr-core/test/J1/temp/solr.cloud.TestRebalanceLeaders_D2D180EDCD1FAE30-001/control-001/cores/collection1/data/ does not point to a valid data directory; skipping clean-up of old index directories.
   [junit4]   2> 523908 INFO  (coreLoadExecutor-1468-thread-1-processing-n:127.0.0.1:49213_) [n:127.0.0.1:49213_ c:control_collection s:shard1 r:core_node1 x:collection1] o.a.s.u.p.UpdateRequestProcessorChain creating updateRequestProcessorChain "nodistrib"
   [junit4]   2> 523908 INFO  (coreLoadExecutor-1468-thread-1-processing-n:127.0.0.1:49213_) [n:127.0.0.1:49213_ c:control_collection s:shard1 r:core_node1 x:collection1] o.a.s.u.p.UpdateRequestProcessorChain creating updateRequestProcessorChain "dedupe"
   [junit4]   2> 523908 INFO  (coreLoadExecutor-1468-thread-1-processing-n:127.0.0.1:49213_) [n:127.0.0.1:49213_ c:control_collection s:shard1 r:core_node1 x:collection1] o.a.s.u.p.UpdateRequestProcessorChain inserting DistributedUpdateProcessorFactory into updateRequestProcessorChain "dedupe"
   [junit4]   2> 523908 INFO  (coreLoadExecutor-1468-thread-1-processing-n:127.0.0.1:49213_) [n:127.0.0.1:49213_ c:control_collection s:shard1 r:core_node1 x:collection1] o.a.s.u.p.UpdateRequestProcessorChain creating updateRequestProcessorChain "stored_sig"
   [junit4]   2> 523908 INFO  (coreLoadExecutor-1468-thread-1-processing-n:127.0.0.1:49213_) [n:127.0.0.1:49213_ c:control_collection s:shard1 r:core_node1 x:collection1] o.a.s.u.p.UpdateRequestProcessorChain inserting DistributedUpdateProcessorFactory into updateRequestProcessorChain "stored_sig"
   [junit4]   2> 523909 INFO  (coreLoadExecutor-1468-thread-1-processing-n:127.0.0.1:49213_) [n:127.0.0.1:49213_ c:control_collection s:shard1 r:core_node1 x:collection1] o.a.s.u.p.UpdateRequestProcessorChain creating updateRequestProcessorChain "distrib-dup-test-chain-explicit"
   [junit4]   2> 523909 INFO  (coreLoadExecutor-1468-thread-1-processing-n:127.0.0.1:49213_) [n:127.0.0.1:49213_ c:control_collection s:shard1 r:core_node1 x:collection1] o.a.s.u.p.UpdateRequestProcessorChain creating updateRequestProcessorChain "distrib-dup-test-chain-implicit"
   [junit4]   2> 523909 INFO  (coreLoadExecutor-1468-thread-1-processing-n:127.0.0.1:49213_) [n:127.0.0.1:49213_ c:control_collection s:shard1 r:core_node1 x:collection1] o.a.s.u.p.UpdateRequestProcessorChain inserting DistributedUpdateProcessorFactory into updateRequestProcessorChain "distrib-dup-test-chain-implicit"
   [junit4]   2> 523910 INFO  (coreLoadExecutor-1468-thread-1-processing-n:127.0.0.1:49213_) [n:127.0.0.1:49213_ c:control_collection s:shard1 r:core_node1 x:collection1] o.a.s.c.SolrCore no updateRequestProcessorChain defined as default, creating implicit default
   [junit4]   2> 523919 INFO  (coreLoadExecutor-1468-thread-1-processing-n:127.0.0.1:49213_) [n:127.0.0.1:49213_ c:control_collection s:shard1 r:core_node1 x:collection1] o.a.s.h.l.XMLLoader xsltCacheLifetimeSeconds=60
   [junit4]   2> 523921 INFO  (coreLoadExecutor-1468-thread-1-processing-n:127.0.0.1:49213_) [n:127.0.0.1:49213_ c:control_collection s:shard1 r:core_node1 x:collection1] o.a.s.h.l.XMLLoader xsltCacheLifetimeSeconds=60
   [junit4]   2> 523923 INFO  (coreLoadExecutor-1468-thread-1-processing-n:127.0.0.1:49213_) [n:127.0.0.1:49213_ c:control_collection s:shard1 r:core_node1 x:collection1] o.a.s.h.l.XMLLoader xsltCacheLifetimeSeconds=60
   [junit4]   2> 523925 INFO  (coreLoadExecutor-1468-thread-1-processing-n:127.0.0.1:49213_) [n:127.0.0.1:49213_ c:control_collection s:shard1 r:core_node1 x:collection1] o.a.s.h.l.XMLLoader xsltCacheLifetimeSeconds=60
   [junit4]   2> 523933 INFO  (coreLoadExecutor-1468-thread-1-processing-n:127.0.0.1:49213_) [n:127.0.0.1:49213_ c:control_collection s:shard1 r:core_node1 x:collection1] o.a.s.c.RequestHandlers Registered paths: /admin/mbeans,standard,/update/csv,/update/json/docs,/admin/luke,/admin/segments,/get,/admin/system,/replication,/admin/properties,/config,/schema,/admin/plugins,/admin/logging,/update/json,/admin/threads,/admin/ping,/update,/admin/file
   [junit4]   2> 523933 INFO  (coreLoadExecutor-1468-thread-1-processing-n:127.0.0.1:49213_) [n:127.0.0.1:49213_ c:control_collection s:shard1 r:core_node1 x:collection1] o.a.s.c.SolrCore Using default statsCache cache: org.apache.solr.search.stats.LocalStatsCache
   [junit4]   2> 523935 INFO  (coreLoadExecutor-1468-thread-1-processing-n:127.0.0.1:49213_) [n:127.0.0.1:49213_ c:control_collection s:shard1 r:core_node1 x:collection1] o.a.s.u.UpdateHandler Using UpdateLog implementation: org.apache.solr.update.UpdateLog
   [junit4]   2> 523935 INFO  (coreLoadExecutor-1468-thread-1-processing-n:127.0.0.1:49213_) [n:127.0.0.1:49213_ c:control_collection s:shard1 r:core_node1 x:collection1] o.a.s.u.UpdateLog Initializing UpdateLog: dataDir= defaultSyncLevel=FLUSH numRecordsToKeep=100 maxNumLogsToKeep=10 numVersionBuckets=65536
   [junit4]   2> 523937 INFO  (coreLoadExecutor-1468-thread-1-processing-n:127.0.0.1:49213_) [n:127.0.0.1:49213_ c:control_collection s:shard1 r:core_node1 x:collection1] o.a.s.c.SolrCore Hard AutoCommit: disabled
   [junit4]   2> 523937 INFO  (coreLoadExecutor-1468-thread-1-processing-n:127.0.0.1:49213_) [n:127.0.0.1:49213_ c:control_collection s:shard1 r:core_node1 x:collection1] o.a.s.c.SolrCore Soft AutoCommit: disabled
   [junit4]   2> 523937 INFO  (coreLoadExecutor-1468-thread-1-processing-n:127.0.0.1:49213_) [n:127.0.0.1:49213_ c:control_collection s:shard1 r:core_node1 x:collection1] o.a.s.u.RandomMergePolicy RandomMergePolicy wrapping class org.apache.lucene.index.LogByteSizeMergePolicy: [LogByteSizeMergePolicy: minMergeSize=1677721, mergeFactor=37, maxMergeSize=2147483648, maxMergeSizeForForcedMerge=9223372036854775807, calibrateSizeByDeletes=true, maxMergeDocs=2147483647, maxCFSSegmentSizeMB=8.796093022207999E12, noCFSRatio=0.0]
   [junit4]   2> 523938 INFO  (coreLoadExecutor-1468-thread-1-processing-n:127.0.0.1:49213_) [n:127.0.0.1:49213_ c:control_collection s:shard1 r:core_node1 x:collection1] o.a.s.c.SolrCore SolrDeletionPolicy.onInit: commits: num=1
   [junit4]   2> 	commit{dir=MockDirectoryWrapper(RAMDirectory@a900976 lockFactory=org.apache.lucene.store.SingleInstanceLockFactory@181c6712),segFN=segments_1,generation=1}
   [junit4]   2> 523938 INFO  (coreLoadExecutor-1468-thread-1-processing-n:127.0.0.1:49213_) [n:127.0.0.1:49213_ c:control_collection s:shard1 r:core_node1 x:collection1] o.a.s.c.SolrCore newest commit generation = 1
   [junit4]   2> 523938 INFO  (coreLoadExecutor-1468-thread-1-processing-n:127.0.0.1:49213_) [n:127.0.0.1:49213_ c:control_collection s:shard1 r:core_node1 x:collection1] o.a.s.s.SolrIndexSearcher Opening Searcher@4d6b65e8[collection1] main
   [junit4]   2> 523938 INFO  (coreLoadExecutor-1468-thread-1-processing-n:127.0.0.1:49213_) [n:127.0.0.1:49213_ c:control_collection s:shard1 r:core_node1 x:collection1] o.a.s.c.c.ZkStateReader Load collection config from:/collections/control_collection
   [junit4]   2> 523940 INFO  (coreLoadExecutor-1468-thread-1-processing-n:127.0.0.1:49213_) [n:127.0.0.1:49213_ c:control_collection s:shard1 r:core_node1 x:collection1] o.a.s.c.c.ZkStateReader path=/collections/control_collection configName=conf1 specified config exists in ZooKeeper
   [junit4]   2> 523941 INFO  (coreLoadExecutor-1468-thread-1-processing-n:127.0.0.1:49213_) [n:127.0.0.1:49213_ c:control_collection s:shard1 r:core_node1 x:collection1] o.a.s.r.ManagedResourceStorage Setting up ZooKeeper-based storage for the RestManager with znodeBase: /configs/conf1
   [junit4]   2> 523942 INFO  (coreLoadExecutor-1468-thread-1-processing-n:127.0.0.1:49213_) [n:127.0.0.1:49213_ c:control_collection s:shard1 r:core_node1 x:collection1] o.a.s.r.ManagedResourceStorage Configured ZooKeeperStorageIO with znodeBase: /configs/conf1
   [junit4]   2> 523942 INFO  (coreLoadExecutor-1468-thread-1-processing-n:127.0.0.1:49213_) [n:127.0.0.1:49213_ c:control_collection s:shard1 r:core_node1 x:collection1] o.a.s.r.RestManager Initializing RestManager with initArgs: {}
   [junit4]   2> 523942 INFO  (coreLoadExecutor-1468-thread-1-processing-n:127.0.0.1:49213_) [n:127.0.0.1:49213_ c:control_collection s:shard1 r:core_node1 x:collection1] o.a.s.r.ManagedResourceStorage Reading _rest_managed.json using ZooKeeperStorageIO:path=/configs/conf1
   [junit4]   2> 523943 INFO  (coreLoadExecutor-1468-thread-1-processing-n:127.0.0.1:49213_) [n:127.0.0.1:49213_ c:control_collection s:shard1 r:core_node1 x:collection1] o.a.s.r.ManagedResourceStorage No data found for znode /configs/conf1/_rest_managed.json
   [junit4]   2> 523943 INFO  (coreLoadExecutor-1468-thread-1-processing-n:127.0.0.1:49213_) [n:127.0.0.1:49213_ c:control_collection s:shard1 r:core_node1 x:collection1] o.a.s.r.ManagedResourceStorage Loaded null at path _rest_managed.json using ZooKeeperStorageIO:path=/configs/conf1
   [junit4]   2> 523943 INFO  (coreLoadExecutor-1468-thread-1-processing-n:127.0.0.1:49213_) [n:127.0.0.1:49213_ c:control_collection s:shard1 r:core_node1 x:collection1] o.a.s.r.RestManager Initializing 0 registered ManagedResources
   [junit4]   2> 523944 INFO  (coreLoadExecutor-1468-thread-1-processing-n:127.0.0.1:49213_) [n:127.0.0.1:49213_ c:control_collection s:shard1 r:core_node1 x:collection1] o.a.s.h.ReplicationHandler Commits will be reserved for  10000
   [junit4]   2> 523944 INFO  (searcherExecutor-1469-thread-1-processing-n:127.0.0.1:49213_ x:collection1 s:shard1 c:control_collection r:core_node1) [n:127.0.0.1:49213_ c:control_collection s:shard1 r:core_node1 x:collection1] o.a.s.c.SolrCore [collection1] Registered new searcher Searcher@4d6b65e8[collection1] main{ExitableDirectoryReader(UninvertingDirectoryReader())}
   [junit4]   2> 523944 INFO  (coreLoadExecutor-1468-thread-1-processing-n:127.0.0.1:49213_) [n:127.0.0.1:49213_ c:control_collection s:shard1 r:core_node1 x:collection1] o.a.s.u.UpdateLog Looking up max value of version field to seed version buckets
   [junit4]   2> 523945 INFO  (coreLoadExecutor-1468-thread-1-processing-n:127.0.0.1:49213_) [n:127.0.0.1:49213_ c:control_collection s:shard1 r:core_node1 x:collection1] o.a.s.u.VersionInfo Refreshing highest value of _version_ for 65536 version buckets from index
   [junit4]   2> 523945 INFO  (coreLoadExecutor-1468-thread-1-processing-n:127.0.0.1:49213_) [n:127.0.0.1:49213_ c:control_collection s:shard1 r:core_node1 x:collection1] o.a.s.u.VersionInfo No terms found for _version_, cannot seed version bucket highest value from index
   [junit4]   2> 523945 INFO  (coreLoadExecutor-1468-thread-1-processing-n:127.0.0.1:49213_) [n:127.0.0.1:49213_ c:control_collection s:shard1 r:core_node1 x:collection1] o.a.s.u.UpdateLog Could not find max version in index or recent updates, using new clock 1505480838200950784
   [junit4]   2> 523947 INFO  (coreLoadExecutor-1468-thread-1-processing-n:127.0.0.1:49213_) [n:127.0.0.1:49213_ c:control_collection s:shard1 r:core_node1 x:collection1] o.a.s.u.UpdateLog Took 2 ms to seed version buckets with highest version 1505480838200950784
   [junit4]   2> 523947 INFO  (coreLoadExecutor-1468-thread-1-processing-n:127.0.0.1:49213_) [n:127.0.0.1:49213_ c:control_collection s:shard1 r:core_node1 x:collection1] o.a.s.c.ZkController watch zkdir /configs/conf1
   [junit4]   2> 523949 INFO  (coreLoadExecutor-1468-thread-1-processing-n:127.0.0.1:49213_) [n:127.0.0.1:49213_ c:control_collection s:shard1 r:core_node1 x:collection1] o.a.s.c.CoreContainer registering core: collection1
   [junit4]   2> 523950 INFO  (coreZkRegister-1462-thread-1-processing-n:127.0.0.1:49213_ x:collection1 s:shard1 c:control_collection r:core_node1) [n:127.0.0.1:49213_ c:control_collection s:shard1 r:core_node1 x:collection1] o.a.s.c.ZkController Register replica - core:collection1 address:http://127.0.0.1:49213 collection:control_collection shard:shard1
   [junit4]   2> 523951 INFO  (coreZkRegister-1462-thread-1-processing-n:127.0.0.1:49213_ x:collection1 s:shard1 c:control_collection r:core_node1) [n:127.0.0.1:49213_ c:control_collection s:shard1 r:core_node1 x:collection1] o.a.s.c.c.SolrZkClient makePath: /collections/control_collection/leader_elect/shard1/election
   [junit4]   2> 523961 INFO  (coreZkRegister-1462-thread-1-processing-n:127.0.0.1:49213_ x:collection1 s:shard1 c:control_collection r:core_node1) [n:127.0.0.1:49213_ c:control_collection s:shard1 r:core_node1 x:collection1] o.a.s.c.LeaderElector Joined leadership election with path: /collections/control_collection/leader_elect/shard1/election/94092552254390275-core_node1-n_0000000000
   [junit4]   2> 523963 INFO  (coreZkRegister-1462-thread-1-processing-n:127.0.0.1:49213_ x:collection1 s:shard1 c:control_collection r:core_node1) [n:127.0.0.1:49213_ c:control_collection s:shard1 r:core_node1 x:collection1] o.a.s.c.ShardLeaderElectionContext Running the leader process for shard shard1
   [junit4]   2> 523967 INFO  (zkCallback-360-thread-1-processing-n:127.0.0.1:49213_) [n:127.0.0.1:49213_    ] o.a.s.c.DistributedQueue NodeChildrenChanged fired on path /overseer/queue state SyncConnected
   [junit4]   2> 523969 INFO  (coreZkRegister-1462-thread-1-processing-n:127.0.0.1:49213_ x:collection1 s:shard1 c:control_collection r:core_node1) [n:127.0.0.1:49213_ c:control_collection s:shard1 r:core_node1 x:collection1] o.a.s.c.ShardLeaderElectionContext Enough replicas found to continue.
   [junit4]   2> 523969 INFO  (coreZkRegister-1462-thread-1-processing-n:127.0.0.1:49213_ x:collection1 s:shard1 c:control_collection r:core_node1) [n:127.0.0.1:49213_ c:control_collection s:shard1 r:core_node1 x:collection1] o.a.s.c.ShardLeaderElectionContext I may be the new leader - try and sync
   [junit4]   2> 523969 INFO  (coreZkRegister-1462-thread-1-processing-n:127.0.0.1:49213_ x:collection1 s:shard1 c:control_collection r:core_node1) [n:127.0.0.1:49213_ c:control_collection s:shard1 r:core_node1 x:collection1] o.a.s.c.SyncStrategy Sync replicas to http://127.0.0.1:49213/collection1/
   [junit4]   2> 523969 INFO  (coreZkRegister-1462-thread-1-processing-n:127.0.0.1:49213_ x:collection1 s:shard1 c:control_collection r:core_node1) [n:127.0.0.1:49213_ c:control_collection s:shard1 r:core_node1 x:collection1] o.a.s.c.SyncStrategy Sync Success - now sync replicas to me
   [junit4]   2> 523970 INFO  (coreZkRegister-1462-thread-1-processing-n:127.0.0.1:49213_ x:collection1 s:shard1 c:control_collection r:core_node1) [n:127.0.0.1:49213_ c:control_collection s:shard1 r:core_node1 x:collection1] o.a.s.c.SyncStrategy http://127.0.0.1:49213/collection1/ has no replicas
   [junit4]   2> 523970 INFO  (coreZkRegister-1462-thread-1-processing-n:127.0.0.1:49213_ x:collection1 s:shard1 c:control_collection r:core_node1) [n:127.0.0.1:49213_ c:control_collection s:shard1 r:core_node1 x:collection1] o.a.s.c.ShardLeaderElectionContext I am the new leader: http://127.0.0.1:49213/collection1/ shard1
   [junit4]   2> 523970 INFO  (coreZkRegister-1462-thread-1-processing-n:127.0.0.1:49213_ x:collection1 s:shard1 c:control_collection r:core_node1) [n:127.0.0.1:49213_ c:control_collection s:shard1 r:core_node1 x:collection1] o.a.s.c.c.SolrZkClient makePath: /collections/control_collection/leaders/shard1
   [junit4]   2> 523971 INFO  (OverseerStateUpdate-94092552254390275-127.0.0.1:49213_-n_0000000000) [n:127.0.0.1:49213_    ] o.a.s.c.Overseer processMessage: queueSize: 1, message = {
   [junit4]   2>   "operation":"leader",
   [junit4]   2>   "shard":"shard1",
   [junit4]   2>   "collection":"control_collection"} current state version: 1
   [junit4]   2> 523983 INFO  (zkCallback-360-thread-1-processing-n:127.0.0.1:49213_) [n:127.0.0.1:49213_    ] o.a.s.c.DistributedQueue NodeChildrenChanged fired on path /overseer/queue state SyncConnected
   [junit4]   2> 523986 INFO  (OverseerStateUpdate-94092552254390275-127.0.0.1:49213_-n_0000000000) [n:127.0.0.1:49213_    ] o.a.s.c.Overseer processMessage: queueSize: 1, message = {
   [junit4]   2>   "operation":"leader",
   [junit4]   2>   "shard":"shard1",
   [junit4]   2>   "collection":"control_collection",
   [junit4]   2>   "base_url":"http://127.0.0.1:49213",
   [junit4]   2>   "core":"collection1",
   [junit4]   2>   "state":"active"} current state version: 1
   [junit4]   2> 524092 INFO  (zkCallback-360-thread-1-processing-n:127.0.0.1:49213_) [n:127.0.0.1:49213_    ] o.a.s.c.c.ZkStateReader A cluster state change: WatchedEvent state:SyncConnected type:NodeDataChanged path:/clusterstate.json, has occurred - updating... (live nodes size: 1)
   [junit4]   2> 524096 INFO  (zkCallback-360-thread-1-processing-n:127.0.0.1:49213_) [n:127.0.0.1:49213_    ] o.a.s.c.c.ZkStateReader Updated cluster state version to 2
   [junit4]   2> 524141 INFO  (coreZkRegister-1462-thread-1-processing-n:127.0.0.1:49213_ x:collection1 s:shard1 c:control_collection r:core_node1) [n:127.0.0.1:49213_ c:control_collection s:shard1 r:core_node1 x:collection1] o.a.s.c.ZkController We are http://127.0.0.1:49213/collection1/ and leader is http://127.0.0.1:49213/collection1/
   [junit4]   2> 524141 INFO  (coreZkRegister-1462-thread-1-processing-n:127.0.0.1:49213_ x:collection1 s:shard1 c:control_collection r:core_node1) [n:127.0.0.1:49213_ c:control_collection s:shard1 r:core_node1 x:collection1] o.a.s.c.ZkController No LogReplay needed for core=collection1 baseURL=http://127.0.0.1:49213
   [junit4]   2> 524141 INFO  (coreZkRegister-1462-thread-1-processing-n:127.0.0.1:49213_ x:collection1 s:shard1 c:control_collection r:core_node1) [n:127.0.0.1:49213_ c:control_collection s:shard1 r:core_node1 x:collection1] o.a.s.c.ZkController I am the leader, no recovery necessary
   [junit4]   2> 524141 INFO  (coreZkRegister-1462-thread-1-processing-n:127.0.0.1:49213_ x:collection1 s:shard1 c:control_collection r:core_node1) [n:127.0.0.1:49213_ c:control_collection s:shard1 r:core_node1 x:collection1] o.a.s.c.ZkController publishing state=active
   [junit4]   2> 524141 INFO  (coreZkRegister-1462-thread-1-processing-n:127.0.0.1:49213_ x:collection1 s:shard1 c:control_collection r:core_node1) [n:127.0.0.1:49213_ c:control_collection s:shard1 r:core_node1 x:collection1] o.a.s.c.ZkController numShards not found on descriptor - reading it from system property
   [junit4]   2> 524143 INFO  (zkCallback-360-thread-1-processing-n:127.0.0.1:49213_) [n:127.0.0.1:49213_    ] o.a.s.c.DistributedQueue NodeChildrenChanged fired on path /overseer/queue state SyncConnected
   [junit4]   2> 524146 INFO  (OverseerStateUpdate-94092552254390275-127.0.0.1:49213_-n_0000000000) [n:127.0.0.1:49213_    ] o.a.s.c.Overseer processMessage: queueSize: 1, message = {
   [junit4]   2>   "core":"collection1",
   [junit4]   2>   "core_node_name":"core_node1",
   [junit4]   2>   "roles":null,
   [junit4]   2>   "base_url":"http://127.0.0.1:49213",
   [junit4]   2>   "node_name":"127.0.0.1:49213_",
   [junit4]   2>   "numShards":"1",
   [junit4]   2>   "state":"active",
   [junit4]   2>   "shard":"shard1",
   [junit4]   2>   "collection":"control_collection",
   [junit4]   2>   "operation":"state"} current state version: 2
   [junit4]   2> 524148 INFO  (OverseerStateUpdate-94092552254390275-127.0.0.1:49213_-n_0000000000) [n:127.0.0.1:49213_    ] o.a.s.c.o.ReplicaMutator Update state numShards=1 message={
   [junit4]   2>   "core":"collection1",
   [junit4]   2>   "core_node_name":"core_node1",
   [junit4]   2>   "roles":null,
   [junit4]   2>   "base_url":"http://127.0.0.1:49213",
   [junit4]   2>   "node_name":"127.0.0.1:49213_",
   [junit4]   2>   "numShards":"1",
   [junit4]   2>   "state":"active",
   [junit4]   2>   "shard":"shard1",
   [junit4]   2>   "collection":"control_collection",
   [junit4]   2>   "operation":"state"}
   [junit4]   2> 524150 INFO  (TEST-TestRebalanceLeaders.test-seed#[D2D180EDCD1FAE30]) [    ] o.a.s.c.c.SolrZkClient Using default ZkCredentialsProvider
   [junit4]   2> 524151 INFO  (TEST-TestRebalanceLeaders.test-seed#[D2D180EDCD1FAE30]) [    ] o.a.s.c.c.ConnectionManager Waiting for client to connect to ZooKeeper
   [junit4]   2> 524154 INFO  (zkCallback-362-thread-1) [    ] o.a.s.c.c.ConnectionManager Watcher org.apache.solr.common.cloud.ConnectionManager@35295cdc name:ZooKeeperConnection Watcher:127.0.0.1:49208/solr got event WatchedEvent state:SyncConnected type:None path:null path:null type:None
   [junit4]   2> 524154 INFO  (TEST-TestRebalanceLeaders.test-seed#[D2D180EDCD1FAE30]) [    ] o.a.s.c.c.ConnectionManager Client is connected to ZooKeeper
   [junit4]   2> 524155 INFO  (TEST-TestRebalanceLeaders.test-seed#[D2D180EDCD1FAE30]) [    ] o.a.s.c.c.SolrZkClient Using default ZkACLProvider
   [junit4]   2> 524155 INFO  (TEST-TestRebalanceLeaders.test-seed#[D2D180EDCD1FAE30]) [    ] o.a.s.c.c.ZkStateReader Updating cluster state from ZooKeeper... 
   [junit4]   2> 524162 INFO  (TEST-TestRebalanceLeaders.test-seed#[D2D180EDCD1FAE30]) [    ] o.a.s.c.ChaosMonkey monkey: init - expire sessions:false cause connection loss:false
   [junit4]   2> 524259 INFO  (zkCallback-362-thread-1) [    ] o.a.s.c.c.ZkStateReader A cluster state change: WatchedEvent state:SyncConnected type:NodeDataChanged path:/clusterstate.json, has occurred - updating... (live nodes size: 1)
   [junit4]   2> 524259 INFO  (zkCallback-360-thread-1-processing-n:127.0.0.1:49213_) [n:127.0.0.1:49213_    ] o.a.s.c.c.ZkStateReader A cluster state change: WatchedEvent state:SyncConnected type:NodeDataChanged path:/clusterstate.json, has occurred - updating... (live nodes size: 1)
   [junit4]   2> 524263 INFO  (zkCallback-362-thread-1) [    ] o.a.s.c.c.ZkStateReader Updated cluster state version to 3
   [junit4]   2> 524264 INFO  (zkCallback-360-thread-1-processing-n:127.0.0.1:49213_) [n:127.0.0.1:49213_    ] o.a.s.c.c.ZkStateReader Updated cluster state version to 3
   [junit4]   2> 524591 INFO  (TEST-TestRebalanceLeaders.test-seed#[D2D180EDCD1FAE30]) [    ] o.a.s.SolrTestCaseJ4 Writing core.properties file to /Users/jenkins/workspace/Lucene-Solr-trunk-MacOSX/solr/build/solr-core/test/J1/temp/solr.cloud.TestRebalanceLeaders_D2D180EDCD1FAE30-001/shard-1-001/cores/collection1
   [junit4]   2> 524593 INFO  (TEST-TestRebalanceLeaders.test-seed#[D2D180EDCD1FAE30]) [    ] o.a.s.c.AbstractFullDistribZkTestBase create jetty 1 in directory /Users/jenkins/workspace/Lucene-Solr-trunk-MacOSX/solr/build/solr-core/test/J1/temp/solr.cloud.TestRebalanceLeaders_D2D180EDCD1FAE30-001/shard-1-001
   [junit4]   2> 524594 INFO  (TEST-TestRebalanceLeaders.test-seed#[D2D180EDCD1FAE30]) [    ] o.e.j.s.Server jetty-9.2.11.v20150529
   [junit4]   2> 524599 INFO  (TEST-TestRebalanceLeaders.test-seed#[D2D180EDCD1FAE30]) [    ] o.e.j.s.h.ContextHandler Started o.e.j.s.ServletContextHandler@7d583f9b{/,null,AVAILABLE}
   [junit4]   2> 524599 INFO  (TEST-TestRebalanceLeaders.test-seed#[D2D180EDCD1FAE30]) [    ] o.e.j.s.ServerConnector Started ServerConnector@20fb6e7f{HTTP/1.1}{127.0.0.1:49221}
   [junit4]   2> 524599 INFO  (TEST-TestRebalanceLeaders.test-seed#[D2D180EDCD1FAE30]) [    ] o.e.j.s.Server Started @530179ms
   [junit4]   2> 524600 INFO  (TEST-TestRebalanceLeaders.test-seed#[D2D180EDCD1FAE30]) [    ] o.a.s.c.s.e.JettySolrRunner Jetty properties: {solr.data.dir=/Users/jenkins/workspace/Lucene-Solr-trunk-MacOSX/solr/build/solr-core/test/J1/temp/solr.cloud.TestRebalanceLeaders_D2D180EDCD1FAE30-001/tempDir-001/jetty1, solrconfig=solrconfig.xml, hostContext=/, hostPort=49221, coreRootDirectory=/Users/jenkins/workspace/Lucene-Solr-trunk-MacOSX/solr/build/solr-core/test/J1/temp/solr.cloud.TestRebalanceLeaders_D2D180EDCD1FAE30-001/shard-1-001/cores}
   [junit4]   2> 524600 INFO  (TEST-TestRebalanceLeaders.test-seed#[D2D180EDCD1FAE30]) [    ] o.a.s.s.SolrDispatchFilter SolrDispatchFilter.init(): sun.misc.Launcher$AppClassLoader@74a14482
   [junit4]   2> 524600 INFO  (TEST-TestRebalanceLeaders.test-seed#[D2D180EDCD1FAE30]) [    ] o.a.s.c.SolrResourceLoader new SolrResourceLoader for directory: '/Users/jenkins/workspace/Lucene-Solr-trunk-MacOSX/solr/build/solr-core/test/J1/temp/solr.cloud.TestRebalanceLeaders_D2D180EDCD1FAE30-001/shard-1-001/'
   [junit4]   2> 524647 INFO  (TEST-TestRebalanceLeaders.test-seed#[D2D180EDCD1FAE30]) [    ] o.a.s.c.SolrXmlConfig Loading container configuration from /Users/jenkins/workspace/Lucene-Solr-trunk-MacOSX/solr/build/solr-core/test/J1/temp/solr.cloud.TestRebalanceLeaders_D2D180EDCD1FAE30-001/shard-1-001/solr.xml
   [junit4]   2> 524656 INFO  (TEST-TestRebalanceLeaders.test-seed#[D2D180EDCD1FAE30]) [    ] o.a.s.c.CoresLocator Config-defined core root directory: /Users/jenkins/workspace/Lucene-Solr-trunk-MacOSX/solr/build/solr-core/test/J1/temp/solr.cloud.TestRebalanceLeaders_D2D180EDCD1FAE30-001/shard-1-001/cores
   [junit4]   2> 524656 INFO  (TEST-TestRebalanceLeaders.test-seed#[D2D180EDCD1FAE30]) [    ] o.a.s.c.CoreContainer New CoreContainer 1421011104
   [junit4]   2> 524656 INFO  (TEST-TestRebalanceLeaders.test-seed#[D2D180EDCD1FAE30]) [    ] o.a.s.c.CoreContainer Loading cores into CoreContainer [instanceDir=/Users/jenkins/workspace/Lucene-Solr-trunk-MacOSX/solr/build/solr-core/test/J1/temp/solr.cloud.TestRebalanceLeaders_D2D180EDCD1FAE30-001/shard-1-001/]
   [junit4]   2> 524656 INFO  (TEST-TestRebalanceLeaders.test-seed#[D2D180EDCD1FAE30]) [    ] o.a.s.c.CoreContainer loading shared library: /Users/jenkins/workspace/Lucene-Solr-trunk-MacOSX/solr/build/solr-core/test/J1/temp/solr.cloud.TestRebalanceLeaders_D2D180EDCD1FAE30-001/shard-1-001/lib
   [junit4]   2> 524657 WARN  (TEST-TestRebalanceLeaders.test-seed#[D2D180EDCD1FAE30]) [    ] o.a.s.c.SolrResourceLoader Can't find (or read) directory to add to classloader: lib (resolved as: /Users/jenkins/workspace/Lucene-Solr-trunk-MacOSX/solr/build/solr-core/test/J1/temp/solr.cloud.TestRebalanceLeaders_D2D180EDCD1FAE30-001/shard-1-001/lib).
   [junit4]   2> 524665 INFO  (TEST-TestRebalanceLeaders.test-seed#[D2D180EDCD1FAE30]) [    ] o.a.s.h.c.HttpShardHandlerFactory created with socketTimeout : 90000,urlScheme : ,connTimeout : 15000,maxConnectionsPerHost : 20,maxConnections : 10000,corePoolSize : 0,maximumPoolSize : 2147483647,maxThreadIdleTime : 5,sizeOfQueue : -1,fairnessPolicy : false,useRetries : false,
   [junit4]   2> 524668 INFO  (TEST-TestRebalanceLeaders.test-seed#[D2D180EDCD1FAE30]) [    ] o.a.s.u.UpdateShardHandler Creating UpdateShardHandler HTTP client with params: socketTimeout=340000&connTimeout=45000&retry=true
   [junit4]   2> 524669 INFO  (TEST-TestRebalanceLeaders.test-seed#[D2D180EDCD1FAE30]) [    ] o.a.s.l.LogWatcher SLF4J impl is org.slf4j.impl.Log4jLoggerFactory
   [junit4]   2> 524669 INFO  (TEST-TestRebalanceLeaders.test-seed#[D2D180EDCD1FAE30]) [    ] o.a.s.l.LogWatcher Registering Log Listener [Log4j (org.slf4j.impl.Log4jLoggerFactory)]
   [junit4]   2> 524669 INFO  (TEST-TestRebalanceLeaders.test-seed#[D2D180EDCD1FAE30]) [    ] o.a.s.c.ZkContainer Zookeeper client=127.0.0.1:49208/solr
   [junit4]   2> 524669 INFO  (TEST-TestRebalanceLeaders.test-seed#[D2D180EDCD1FAE30]) [    ] o.a.s.c.ZkController zkHost includes chroot
   [junit4]   2> 524669 INFO  (TEST-TestRebalanceLeaders.test-seed#[D2D180EDCD1FAE30]) [    ] o.a.s.c.c.SolrZkClient Using default ZkCredentialsProvider
   [junit4]   2> 524670 INFO  (TEST-TestRebalanceLeaders.test-seed#[D2D180EDCD1FAE30]) [    ] o.a.s.c.c.ConnectionManager Waiting for client to connect to ZooKeeper
   [junit4]   2> 524673 INFO  (zkCallback-364-thread-1) [    ] o.a.s.c.c.ConnectionManager Watcher org.apache.solr.common.cloud.ConnectionManager@7e2ea19a name:ZooKeeperConnection Watcher:127.0.0.1:49208 got event WatchedEvent state:SyncConnected type:None path:null path:null type:None
   [junit4]   2> 524673 INFO  (TEST-TestRebalanceLeaders.test-seed#[D2D180EDCD1FAE30]) [    ] o.a.s.c.c.ConnectionManager Client is connected to ZooKeeper
   [junit4]   2> 524673 INFO  (TEST-TestRebalanceLeaders.test-seed#[D2D180EDCD1FAE30]) [    ] o.a.s.c.c.SolrZkClient Using default ZkACLProvider
   [junit4]   2> 524677 INFO  (TEST-TestRebalanceLeaders.test-seed#[D2D180EDCD1FAE30]) [n:127.0.0.1:49221_    ] o.a.s.c.c.ConnectionManager Waiting for client to connect to ZooKeeper
   [junit4]   2> 524693 INFO  (zkCallback-365-thread-1-processing-n:127.0.0.1:49221_) [n:127.0.0.1:49221_    ] o.a.s.c.c.ConnectionManager Watcher org.apache.solr.common.cloud.ConnectionManager@49fa4906 name:ZooKeeperConnection Watcher:127.0.0.1:49208/solr got event WatchedEvent state:SyncConnected type:None path:null path:null type:None
   [junit4]   2> 524693 INFO  (TEST-TestRebalanceLeaders.test-seed#[D2D180EDCD1FAE30]) [n:127.0.0.1:49221_    ] o.a.s.c.c.ConnectionManager Client is connected to ZooKeeper
   [junit4]   2> 524706 INFO  (TEST-TestRebalanceLeaders.test-seed#[D2D180EDCD1FAE30]) [n:127.0.0.1:49221_    ] o.a.s.c.c.ZkStateReader Updating cluster state from ZooKeeper... 
   [junit4]   2> 525723 INFO  (TEST-TestRebalanceLeaders.test-seed#[D2D180EDCD1FAE30]) [n:127.0.0.1:49221_    ] o.a.s.c.ZkController Register node as live in ZooKeeper:/live_nodes/127.0.0.1:49221_
   [junit4]   2> 525724 INFO  (TEST-TestRebalanceLeaders.test-seed#[D2D180EDCD1FAE30]) [n:127.0.0.1:49221_    ] o.a.s.c.c.SolrZkClient makePath: /live_nodes/127.0.0.1:49221_
   [junit4]   2> 525730 INFO  (TEST-TestRebalanceLeaders.test-seed#[D2D180EDCD1FAE30]) [n:127.0.0.1:49221_    ] o.a.s.c.Overseer Overseer (id=null) closing
   [junit4]   2> 525731 INFO  (TEST-TestRebalanceLeaders.test-seed#[D2D180EDCD1FAE30]) [n:127.0.0.1:49221_    ] o.a.s.c.LeaderElector Joined leadership election with path: /overseer_elect/election/94092552254390278-127.0.0.1:49221_-n_0000000001
   [junit4]   2> 525733 INFO  (TEST-TestRebalanceLeaders.test-seed#[D2D180EDCD1FAE30]) [n:127.0.0.1:49221_    ] o.a.s.c.LeaderElector Watching path /overseer_elect/election/94092552254390275-127.0.0.1:49213_-n_0000000000 to know if I could be the leader
   [junit4]   2> 525734 INFO  (TEST-TestRebalanceLeaders.test-seed#[D2D180EDCD1FAE30]) [n:127.0.0.1:49221_    ] o.a.s.c.CoreContainer No authentication plugin used.
   [junit4]   2> 525734 INFO  (TEST-TestRebalanceLeaders.test-seed#[D2D180EDCD1FAE30]) [n:127.0.0.1:49221_    ] o.a.s.c.CoreContainer Security conf doesn't exist. Skipping setup for authorization module.
   [junit4]   2> 525735 INFO  (TEST-TestRebalanceLeaders.test-seed#[D2D180EDCD1FAE30]) [n:127.0.0.1:49221_    ] o.a.s.c.CoresLocator Looking for core definitions underneath /Users/jenkins/workspace/Lucene-Solr-trunk-MacOSX/solr/build/solr-core/test/J1/temp/solr.cloud.TestRebalanceLeaders_D2D180EDCD1FAE30-001/shard-1-001/cores
   [junit4]   2> 525736 INFO  (TEST-TestRebalanceLeaders.test-seed#[D2D180EDCD1FAE30]) [n:127.0.0.1:49221_    ] o.a.s.c.SolrCore Created CoreDescriptor: {name=collection1, config=solrconfig.xml, transient=false, schema=schema.xml, loadOnStartup=true, instanceDir=/Users/jenkins/workspace/Lucene-Solr-trunk-MacOSX/solr/build/solr-core/test/J1/temp/solr.cloud.TestRebalanceLeaders_D2D180EDCD1FAE30-001/shard-1-001/cores/collection1, collection=collection1, absoluteInstDir=/Users/jenkins/workspace/Lucene-Solr-trunk-MacOSX/solr/build/solr-core/test/J1/temp/solr.cloud.TestRebalanceLeaders_D2D180EDCD1FAE30-001/shard-1-001/cores/collection1/, coreNodeName=, dataDir=data/, shard=}
   [junit4]   2> 525737 INFO  (TEST-TestRebalanceLeaders.test-seed#[D2D180EDCD1FAE30]) [n:127.0.0.1:49221_    ] o.a.s.c.CoresLocator Found core collection1 in /Users/jenkins/workspace/Lucene-Solr-trunk-MacOSX/solr/build/solr-core/test/J1/temp/solr.cloud.TestRebalanceLeaders_D2D180EDCD1FAE30-001/shard-1-001/cores/collection1/
   [junit4]   2> 525737 INFO  (TEST-TestRebalanceLeaders.test-seed#[D2D180EDCD1FAE30]) [n:127.0.0.1:49221_    ] o.a.s.c.CoresLocator Found 1 core definitions
   [junit4]   2> 525738 INFO  (coreLoadExecutor-1479-thread-1-processing-n:127.0.0.1:49221_) [n:127.0.0.1:49221_ c:collection1   x:collection1] o.a.s.c.ZkController publishing state=down
   [junit4]   2> 525738 INFO  (coreLoadExecutor-1479-thread-1-processing-n:127.0.0.1:49221_) [n:127.0.0.1:49221_ c:collection1   x:collection1] o.a.s.c.ZkController numShards not found on descriptor - reading it from system property
   [junit4]   2> 525739 INFO  (TEST-TestRebalanceLeaders.test-seed#[D2D180EDCD1FAE30]) [n:127.0.0.1:49221_    ] o.a.s.s.SolrDispatchFilter user.dir=/Users/jenkins/workspace/Lucene-Solr-trunk-MacOSX/solr/build/solr-core/test/J1
   [junit4]   2> 525739 INFO  (TEST-TestRebalanceLeaders.test-seed#[D2D180EDCD1FAE30]) [n:127.0.0.1:49221_    ] o.a.s.s.SolrDispatchFilter SolrDispatchFilter.init() done
   [junit4]   2> 525740 INFO  (zkCallback-360-thread-1-processing-n:127.0.0.1:49213_) [n:127.0.0.1:49213_    ] o.a.s.c.DistributedQueue NodeChildrenChanged fired on path /overseer/queue state SyncConnected
   [junit4]   2> 525740 INFO  (coreLoadExecutor-1479-thread-1-processing-n:127.0.0.1:49221_) [n:127.0.0.1:49221_ c:collection1   x:collection1] o.a.s.c.ZkController look for our core node name
   [junit4]   2> 525742 INFO  (OverseerStateUpdate-94092552254390275-127.0.0.1:49213_-n_0000000000) [n:127.0.0.1:49213_    ] o.a.s.c.Overseer processMessage: queueSize: 1, message = {
   [junit4]   2>   "core":"collection1",
   [junit4]   2>   "roles":null,
   [junit4]   2>   "base_url":"http://127.0.0.1:49221",
   [junit4]   2>   "node_name":"127.0.0.1:49221_",
   [junit4]   2>   "numShards":"4",
   [junit4]   2>   "state":"down",
   [junit4]   2>   "shard":null,
   [junit4]   2>   "collection":"collection1",
   [junit4]   2>   "operation":"state"} current state version: 3
   [junit4]   2> 525743 INFO  (OverseerStateUpdate-94092552254390275-127.0.0.1:49213_-n_0000000000) [n:127.0.0.1:49213_    ] o.a.s.c.o.ReplicaMutator Update state numShards=4 message={
   [junit4]   2>   "core":"collection1",
   [junit4]   2>   "roles":null,
   [junit4]   2>   "base_url":"http://127.0.0.1:49221",
   [junit4]   2>   "node_name":"127.0.0.1:49221_",
   [junit4]   2>   "numShards":"4",
   [junit4]   2>   "state":"down",
   [junit4]   2>   "shard":null,
   [junit4]   2>   "collection":"collection1",
   [junit4]   2>   "operation":"state"}
   [junit4]   2> 525744 INFO  (OverseerStateUpdate-94092552254390275-127.0.0.1:49213_-n_0000000000) [n:127.0.0.1:49213_    ] o.a.s.c.o.ClusterStateMutator building a new cName: collection1
   [junit4]   2> 525744 INFO  (OverseerStateUpdate-94092552254390275-127.0.0.1:49213_-n_0000000000) [n:127.0.0.1:49213_    ] o.a.s.c.o.ReplicaMutator Assigning new node to shard shard=shard2
   [junit4]   2> 525852 INFO  (zkCallback-360-thread-1-processing-n:127.0.0.1:49213_) [n:127.0.0.1:49213_    ] o.a.s.c.c.ZkStateReader A cluster state change: WatchedEvent state:SyncConnected type:NodeDataChanged path:/clusterstate.json, has occurred - updating... (live nodes size: 2)
   [junit4]   2> 525852 INFO  (zkCallback-365-thread-1-processing-n:127.0.0.1:49221_) [n:127.0.0.1:49221_    ] o.a.s.c.c.ZkStateReader A cluster state change: WatchedEvent state:SyncConnected type:NodeDataChanged path:/clusterstate.json, has occurred - updating... (live nodes size: 2)
   [junit4]   2> 525852 INFO  (zkCallback-362-thread-1) [    ] o.a.s.c.c.ZkStateReader A cluster state change: WatchedEvent state:SyncConnected type:NodeDataChanged path:/clusterstate.json, has occurred - updating... (live nodes size: 2)
   [junit4]   2> 525859 INFO  (zkCallback-360-thread-1-processing-n:127.0.0.1:49213_) [n:127.0.0.1:49213_    ] o.a.s.c.c.ZkStateReader Updated cluster state version to 4
   [junit4]   2> 525860 INFO  (zkCallback-362-thread-1) [    ] o.a.s.c.c.ZkStateReader Updated cluster state version to 4
   [junit4]   2> 525860 INFO  (zkCallback-365-thread-1-processing-n:127.0.0.1:49221_) [n:127.0.0.1:49221_    ] o.a.s.c.c.ZkStateReader Updated cluster state version to 4
   [junit4]   2> 526742 INFO  (coreLoadExecutor-1479-thread-1-processing-n:127.0.0.1:49221_) [n:127.0.0.1:49221_ c:collection1   x:collection1] o.a.s.c.ZkController waiting to find shard id in clusterstate for collection1
   [junit4]   2> 526742 INFO  (coreLoadExecutor-1479-thread-1-processing-n:127.0.0.1:49221_) [n:127.0.0.1:49221_ c:collection1   x:collection1] o.a.s.c.ZkController Check for collection zkNode:collection1
   [junit4]   2> 526744 INFO  (coreLoadExecutor-1479-thread-1-processing-n:127.0.0.1:49221_) [n:127.0.0.1:49221_ c:collection1   x:collection1] o.a.s.c.ZkController Collection zkNode exists
   [junit4]   2> 526744 INFO  (coreLoadExecutor-1479-thread-1-processing-n:127.0.0.1:49221_) [n:127.0.0.1:49221_ c:collection1   x:collection1] o.a.s.c.c.ZkStateReader Load collection config from:/collections/collection1
   [junit4]   2> 526745 INFO  (coreLoadExecutor-1479-thread-1-processing-n:127.0.0.1:49221_) [n:127.0.0.1:49221_ c:collection1   x:collection1] o.a.s.c.c.ZkStateReader path=/collections/collection1 configName=conf1 specified config exists in ZooKeeper
   [junit4]   2> 526745 INFO  (coreLoadExecutor-1479-thread-1-processing-n:127.0.0.1:49221_) [n:127.0.0.1:49221_ c:collection1   x:collection1] o.a.s.c.SolrResourceLoader new SolrResourceLoader for directory: '/Users/jenkins/workspace/Lucene-Solr-trunk-MacOSX/solr/build/solr-core/test/J1/temp/solr.cloud.TestRebalanceLeaders_D2D180EDCD1FAE30-001/shard-1-001/cores/collection1/'
   [junit4]   2> 526763 INFO  (coreLoadExecutor-1479-thread-1-processing-n:127.0.0.1:49221_) [n:127.0.0.1:49221_ c:collection1   x:collection1] o.a.s.c.Config loaded config solrconfig.xml with version 0 
   [junit4]   2> 526773 INFO  (coreLoadExecutor-1479-thread-1-processing-n:127.0.0.1:49221_) [n:127.0.0.1:49221_ c:collection1   x:collection1] o.a.s.c.SolrConfig current version of requestparams : -1
   [junit4]   2> 526776 INFO  (coreLoadExecutor-1479-thread-1-processing-n:127.0.0.1:49221_) [n:127.0.0.1:49221_ c:collection1   x:collection1] o.a.s.c.SolrConfig Using Lucene MatchVersion: 6.0.0
   [junit4]   2> 526785 INFO  (coreLoadExecutor-1479-thread-1-processing-n:127.0.0.1:49221_) [n:127.0.0.1:49221_ c:collection1   x:collection1] o.a.s.c.Config Loaded SolrConfig: solrconfig.xml
   [junit4]   2> 526787 INFO  (coreLoadExecutor-1479-thread-1-processing-n:127.0.0.1:49221_) [n:127.0.0.1:49221_ c:collection1   x:collection1] o.a.s.s.IndexSchema Reading Solr Schema from /configs/conf1/schema.xml
   [junit4]   2> 526794 INFO  (coreLoadExecutor-1479-thread-1-processing-n:127.0.0.1:49221_) [n:127.0.0.1:49221_ c:collection1   x:collection1] o.a.s.s.IndexSchema [collection1] Schema name=test
   [junit4]   2> 526895 INFO  (coreLoadExecutor-1479-thread-1-processing-n:127.0.0.1:49221_) [n:127.0.0.1:49221_ c:collection1   x:collection1] o.a.s.s.IndexSchema default search field in schema is text
   [junit4]   2> 526896 INFO  (coreLoadExecutor-1479-thread-1-processing-n:127.0.0.1:49221_) [n:127.0.0.1:49221_ c:collection1   x:collection1] o.a.s.s.IndexSchema unique key field: id
   [junit4]   2> 526897 INFO  (coreLoadExecutor-1479-thread-1-processing-n:127.0.0.1:49221_) [n:127.0.0.1:49221_ c:collection1   x:collection1] o.a.s.s.FileExchangeRateProvider Reloading exchange rates from file currency.xml
   [junit4]   2> 526901 INFO  (coreLoadExecutor-1479-thread-1-processing-n:127.0.0.1:49221_) [n:127.0.0.1:49221_ c:collection1   x:collection1] o.a.s.s.FileExchangeRateProvider Reloading exchange rates from file currency.xml
   [junit4]   2> 526945 INFO  (coreLoadExecutor-1479-thread-1-processing-n:127.0.0.1:49221_) [n:127.0.0.1:49221_ c:collection1   x:collection1] o.a.s.c.CoreContainer Creating SolrCore 'collection1' using configuration from collection collection1
   [junit4]   2> 526945 INFO  (coreLoadExecutor-1479-thread-1-processing-n:127.0.0.1:49221_) [n:127.0.0.1:49221_ c:collection1 s:shard2 r:core_node1 x:collection1] o.a.s.c.SolrCore org.apache.solr.core.MockDirectoryFactory
   [junit4]   2> 526946 INFO  (coreLoadExecutor-1479-thread-1-processing-n:127.0.0.1:49221_) [n:127.0.0.1:49221_ c:collection1 s:shard2 r:core_node1 x:collection1] o.a.s.c.SolrCore [[collection1] ] Opening new SolrCore at [/Users/jenkins/workspace/Lucene-Solr-trunk-MacOSX/solr/build/solr-core/test/J1/temp/solr.cloud.TestRebalanceLeaders_D2D180EDCD1FAE30-001/shard-1-001/cores/collection1/], dataDir=[null]
   [junit4]   2> 526946 INFO  (coreLoadExecutor-1479-thread-1-processing-n:127.0.0.1:49221_) [n:127.0.0.1:49221_ c:collection1 s:shard2 r:core_node1 x:collection1] o.a.s.c.JmxMonitoredMap JMX monitoring is enabled. Adding Solr mbeans to JMX Server: com.sun.jmx.mbeanserver.JmxMBeanServer@49bb834f
   [junit4]   2> 526946 INFO  (coreLoadExecutor-1479-thread-1-processing-n:127.0.0.1:49221_) [n:127.0.0.1:49221_ c:collection1 s:shard2 r:core_node1 x:collection1] o.a.s.c.CachingDirectoryFactory return new directory for /Users/jenkins/workspace/Lucene-Solr-trunk-MacOSX/solr/build/solr-core/test/J1/temp/solr.cloud.TestRebalanceLeaders_D2D180EDCD1FAE30-001/shard-1-001/cores/collection1/data
   [junit4]   2> 526947 INFO  (coreLoadExecutor-1479-thread-1-processing-n:127.0.0.1:49221_) [n:127.0.0.1:49221_ c:collection1 s:shard2 r:core_node1 x:collection1] o.a.s.c.SolrCore New index directory detected: old=null new=/Users/jenkins/workspace/Lucene-Solr-trunk-MacOSX/solr/build/solr-core/test/J1/temp/solr.cloud.TestRebalanceLeaders_D2D180EDCD1FAE30-001/shard-1-001/cores/collection1/data/index/
   [junit4]   2> 526947 WARN  (coreLoadExecutor-1479-thread-1-processing-n:127.0.0.1:49221_) [n:127.0.0.1:49221_ c:collection1 s:shard2 r:core_node1 x:collection1] o.a.s.c.SolrCore [collection1] Solr index directory '/Users/jenkins/workspace/Lucene-Solr-trunk-MacOSX/solr/build/solr-core/test/J1/temp/solr.cloud.TestRebalanceLeaders_D2D180EDCD1FAE30-001/shard-1-001/cores/collection1/data/index' doesn't exist. Creating new index...
   [junit4]   2> 526947 INFO  (coreLoadExecutor-1479-thread-1-processing-n:127.0.0.1:49221_) [n:127.0.0.1:49221_ c:collection1 s:shard2 r:core_node1 x:collection1] o.a.s.c.CachingDirectoryFactory return new directory for /Users/jenkins/workspace/Lucene-Solr-trunk-MacOSX/solr/build/solr-core/test/J1/temp/solr.cloud.TestRebalanceLeaders_D2D180EDCD1FAE30-001/shard-1-001/cores/collection1/data/index
   [junit4]   2> 526947 INFO  (coreLoadExecutor-1479-thread-1-processing-n:127.0.0.1:49221_) [n:127.0.0.1:49221_ c:collection1 s:shard2 r:core_node1 x:collection1] o.a.s.u.RandomMergePolicy RandomMergePolicy wrapping class org.apache.lucene.index.TieredMergePolicy: [TieredMergePolicy: maxMergeAtOnce=49, maxMergeAtOnceExplicit=44, maxMergedSegmentMB=61.53125, floorSegmentMB=1.90234375, forceMergeDeletesPctAllowed=11.812113112963683, segmentsPerTier=37.0, maxCFSSegmentSizeMB=8.796093022207999E12, noCFSRatio=0.6856146028559873
   [junit4]   2> 526948 INFO  (coreLoadExecutor-1479-thread-1-processing-n:127.0.0.1:49221_) [n:127.0.0.1:49221_ c:collection1 s:shard2 r:core_node1 x:collection1] o.a.s.c.SolrCore SolrDeletionPolicy.onCommit: commits: num=1
   [junit4]   2> 	commit{dir=MockDirectoryWrapper(RAMDirectory@67f2bbf lockFactory=org.apache.lucene.store.SingleInstanceLockFactory@68701f8d),segFN=segments_1,generation=1}
   [junit4]   2> 526948 INFO  (coreLoadExecutor-1479-thread-1-processing-n:127.0.0.1:49221_) [n:127.0.0.1:49221_ c:collection1 s:shard2 r:core_node1 x:collection1] o.a.s.c.SolrCore newest commit generation = 1
   [junit4]   2> 526949 INFO  (OldIndexDirectoryCleanupThreadForCore-collection1) [n:127.0.0.1:49221_ c:collection1 s:shard2 r:core_node1 x:collection1] o.a.s.c.SolrCore Looking for old index directories to cleanup for core collection1 in /Users/jenkins/workspace/Lucene-Solr-trunk-MacOSX/solr/build/solr-core/test/J1/temp/solr.cloud.TestRebalanceLeaders_D2D180EDCD1FAE30-001/shard-1-001/cores/collection1/data/
   [junit4]   2> 526949 WARN  (OldIndexDirectoryCleanupThreadForCore-collection1) [n:127.0.0.1:49221_ c:collection1 s:shard2 r:core_node1 x:collection1] o.a.s.c.DirectoryFactory /Users/jenkins/workspace/Lucene-Solr-trunk-MacOSX/solr/build/solr-core/test/J1/temp/solr.cloud.TestRebalanceLeaders_D2D180EDCD1FAE30-001/shard-1-001/cores/collection1/data/ does not point to a valid data directory; skipping clean-up of old index directories.
   [junit4]   2> 526955 INFO  (coreLoadExecutor-1479-thread-1-processing-n:127.0.0.1:49221_) [n:127.0.0.1:49221_ c:collection1 s:shard2 r:core_node1 x:collection1] o.a.s.u.p.UpdateRequestProcessorChain creating updateRequestProcessorChain "nodistrib"
   [junit4]   2> 526955 INFO  (coreLoadExecutor-1479-thread-1-processing-n:127.0.0.1:49221_) [n:127.0.0.1:49221_ c:collection1 s:shard2 r:core_node1 x:collection1] o.a.s.u.p.UpdateRequestProcessorChain creating updateRequestProcessorChain "dedupe"
   [junit4]   2> 526956 INFO  (coreLoadExecutor-1479-thread-1-processing-n:127.0.0.1:49221_) [n:127.0.0.1:49221_ c:collection1 s:shard2 r:core_node1 x:collection1] o.a.s.u.p.UpdateRequestProcessorChain inserting DistributedUpdateProcessorFactory into updateRequestProcessorChain "dedupe"
   [junit4]   2> 526956 INFO  (coreLoadExecutor-1479-thread-1-processing-n:127.0.0.1:49221_) [n:127.0.0.1:49221_ c:collection1 s:shard2 r:core_node1 x:collection1] o.a.s.u.p.UpdateRequestProcessorChain creating updateRequestProcessorChain "stored_sig"
   [junit4]   2> 526956 INFO  (coreLoadExecutor-1479-thread-1-processing-n:127.0.0.1:49221_) [n:127.0.0.1:49221_ c:collection1 s:shard2 r:core_node1 x:collection1] o.a.s.u.p.UpdateRequestProcessorChain inserting DistributedUpdateProcessorFactory into updateRequestProcessorChain "stored_sig"
   [junit4]   2> 526956 INFO  (coreLoadExecutor-1479-thread-1-processing-n:127.0.0.1:49221_) [n:127.0.0.1:49221_ c:collection1 s:shard2 r:core_node1 x:collection1] o.a.s.u.p.UpdateRequestProcessorChain creating updateRequestProcessorChain "distrib-dup-test-chain-explicit"
   [junit4]   2> 526956 INFO  (coreLoadExecutor-1479-thread-1-processing-n:127.0.0.1:49221_) [n:127.0.0.1:49221_ c:collection1 s:shard2 r:core_node1 x:collection1] o.a.s.u.p.UpdateRequestProcessorChain creating updateR

[...truncated too long message...]

ebalanceLeaders -Dtests.method=test -Dtests.seed=D2D180EDCD1FAE30 -Dtests.slow=true -Dtests.locale=ar_EG -Dtests.timezone=America/Recife -Dtests.asserts=true -Dtests.file.encoding=US-ASCII
   [junit4] ERROR    105s J1 | TestRebalanceLeaders.test <<<
   [junit4]    > Throwable #1: org.apache.solr.client.solrj.SolrServerException: No live SolrServers available to handle this request:[http://127.0.0.1:49233, http://127.0.0.1:49221, http://127.0.0.1:49227, http://127.0.0.1:49237, http://127.0.0.1:49213]
   [junit4]    > 	at __randomizedtesting.SeedInfo.seed([D2D180EDCD1FAE30:5A85BF3763E3C3C8]:0)
   [junit4]    > 	at org.apache.solr.client.solrj.impl.LBHttpSolrClient.request(LBHttpSolrClient.java:355)
   [junit4]    > 	at org.apache.solr.client.solrj.impl.CloudSolrClient.sendRequest(CloudSolrClient.java:1086)
   [junit4]    > 	at org.apache.solr.client.solrj.impl.CloudSolrClient.requestWithRetryOnStaleState(CloudSolrClient.java:856)
   [junit4]    > 	at org.apache.solr.client.solrj.impl.CloudSolrClient.request(CloudSolrClient.java:799)
   [junit4]    > 	at org.apache.solr.client.solrj.SolrClient.request(SolrClient.java:1220)
   [junit4]    > 	at org.apache.solr.cloud.TestRebalanceLeaders.issueCommands(TestRebalanceLeaders.java:280)
   [junit4]    > 	at org.apache.solr.cloud.TestRebalanceLeaders.rebalanceLeaderTest(TestRebalanceLeaders.java:107)
   [junit4]    > 	at org.apache.solr.cloud.TestRebalanceLeaders.test(TestRebalanceLeaders.java:73)
   [junit4]    > 	at org.apache.solr.BaseDistributedSearchTestCase$ShardsRepeatRule$ShardsFixedStatement.callStatement(BaseDistributedSearchTestCase.java:960)
   [junit4]    > 	at org.apache.solr.BaseDistributedSearchTestCase$ShardsRepeatRule$ShardsStatement.evaluate(BaseDistributedSearchTestCase.java:935)
   [junit4]    > 	at java.lang.Thread.run(Thread.java:745)
   [junit4]    > Caused by: org.apache.solr.client.solrj.impl.HttpSolrClient$RemoteSolrException: Error from server at http://127.0.0.1:49221: Expected mime type application/octet-stream but got text/html. <html>
   [junit4]    > <head>
   [junit4]    > <meta http-equiv="Content-Type" content="text/html;charset=ISO-8859-1"/>
   [junit4]    > <title>Error 500 </title>
   [junit4]    > </head>
   [junit4]    > <body>
   [junit4]    > <h2>HTTP ERROR: 500</h2>
   [junit4]    > <p>Problem accessing /admin/collections. Reason:
   [junit4]    > <pre>    {trace=java.lang.AssertionError
   [junit4]    > 	at org.apache.solr.common.util.ByteUtils.UTF8toUTF16(ByteUtils.java:36)
   [junit4]    > 	at org.apache.solr.common.util.ByteUtils.UTF8toUTF16(ByteUtils.java:64)
   [junit4]    > 	at org.apache.solr.common.cloud.ZkStateReader.fromJSON(ZkStateReader.java:151)
   [junit4]    > 	at org.apache.solr.common.cloud.ZkNodeProps.load(ZkNodeProps.java:92)
   [junit4]    > 	at org.apache.solr.cloud.DistributedQueue.containsTaskWithRequestId(DistributedQueue.java:127)
   [junit4]    > 	at org.apache.solr.handler.admin.CollectionsHandler.overseerCollectionQueueContains(CollectionsHandler.java:255)
   [junit4]    > 	at org.apache.solr.handler.admin.CollectionsHandler.handleResponse(CollectionsHandler.java:210)
   [junit4]    > 	at org.apache.solr.handler.admin.CollectionsHandler.handleResponse(CollectionsHandler.java:190)
   [junit4]    > 	at org.apache.solr.handler.admin.RebalanceLeaders.rejoinElection(RebalanceLeaders.java:269)
   [junit4]    > 	at org.apache.solr.handler.admin.RebalanceLeaders.insurePreferredIsLeader(RebalanceLeaders.java:184)
   [junit4]    > 	at org.apache.solr.handler.admin.RebalanceLeaders.execute(RebalanceLeaders.java:91)
   [junit4]    > 	at org.apache.solr.handler.admin.CollectionsHandler$CollectionOperation$23.call(CollectionsHandler.java:684)
   [junit4]    > 	at org.apache.solr.handler.admin.CollectionsHandler.handleRequestBody(CollectionsHandler.java:165)
   [junit4]    > 	at org.apache.solr.handler.RequestHandlerBase.handleRequest(RequestHandlerBase.java:143)
   [junit4]    > 	at org.apache.solr.servlet.HttpSolrCall.handleAdminRequest(HttpSolrCall.java:654)
   [junit4]    > 	at org.apache.solr.servlet.HttpSolrCall.call(HttpSolrCall.java:433)
   [junit4]    > 	at org.apache.solr.servlet.SolrDispatchFilter.doFilter(SolrDispatchFilter.java:227)
   [junit4]    > 	at org.apache.solr.servlet.SolrDispatchFilter.doFilter(SolrDispatchFilter.java:196)
   [junit4]    > 	at org.eclipse.jetty.servlet.ServletHandler$CachedChain.doFilter(ServletHandler.java:1652)
   [junit4]    > 	at org.apache.solr.client.solrj.embedded.JettySolrRunner$DebugFilter.doFilter(JettySolrRunner.java:106)
   [junit4]    > 	at org.eclipse.jetty.servlet.ServletHandler$CachedChain.doFilter(ServletHandler.java:1652)
   [junit4]    > 	at org.eclipse.jetty.servlets.UserAgentFilter.doFilter(UserAgentFilter.java:83)
   [junit4]    > 	at org.eclipse.jetty.servlets.GzipFilter.doFilter(GzipFilter.java:364)
   [junit4]    > 	at org.eclipse.jetty.servlet.ServletHandler$CachedChain.doFilter(ServletHandler.java:1652)
   [junit4]    > 	at org.eclipse.jetty.servlet.ServletHandler.doHandle(ServletHandler.java:585)
   [junit4]    > 	at org.eclipse.jetty.server.session.SessionHandler.doHandle(SessionHandler.java:221)
   [junit4]    > 	at org.eclipse.jetty.server.handler.ContextHandler.doHandle(ContextHandler.java:1127)
   [junit4]    > 	at org.eclipse.jetty.servlet.ServletHandler.doScope(ServletHandler.java:515)
   [junit4]    > 	at org.eclipse.jetty.server.session.SessionHandler.doScope(SessionHandler.java:185)
   [junit4]    > 	at org.eclipse.jetty.server.handler.ContextHandler.doScope(ContextHandler.java:1061)
   [junit4]    > 	at org.eclipse.jetty.server.handler.ScopedHandler.handle(ScopedHandler.java:141)
   [junit4]    > 	at org.eclipse.jetty.server.handler.HandlerWrapper.handle(HandlerWrapper.java:97)
   [junit4]    > 	at org.eclipse.jetty.server.Server.handle(Server.java:499)
   [junit4]    > 	at org.eclipse.jetty.server.HttpChannel.handle(HttpChannel.java:310)
   [junit4]    > 	at org.eclipse.jetty.server.HttpConnection.onFillable(HttpConnection.java:257)
   [junit4]    > 	at org.eclipse.jetty.io.AbstractConnection$2.run(AbstractConnection.java:540)
   [junit4]    > 	at org.eclipse.jetty.util.thread.QueuedThreadPool.runJob(QueuedThreadPool.java:635)
   [junit4]    > 	at org.eclipse.jetty.util.thread.QueuedThreadPool$3.run(QueuedThreadPool.java:555)
   [junit4]    > 	at java.lang.Thread.run(Thread.java:745)
   [junit4]    > ,code=500}</pre></p>
   [junit4]    > <hr /><i><small>Powered by Jetty://</small></i>
   [junit4]    > </body>
   [junit4]    > </html>
   [junit4]    > 	at org.apache.solr.client.solrj.impl.HttpSolrClient.executeMethod(HttpSolrClient.java:528)
   [junit4]    > 	at org.apache.solr.client.solrj.impl.HttpSolrClient.request(HttpSolrClient.java:234)
   [junit4]    > 	at org.apache.solr.client.solrj.impl.HttpSolrClient.request(HttpSolrClient.java:226)
   [junit4]    > 	at org.apache.solr.client.solrj.impl.LBHttpSolrClient.doRequest(LBHttpSolrClient.java:376)
   [junit4]    > 	at org.apache.solr.client.solrj.impl.LBHttpSolrClient.request(LBHttpSolrClient.java:344)
   [junit4]    > 	... 48 more
   [junit4]   2> 627387 INFO  (SUITE-TestRebalanceLeaders-seed#[D2D180EDCD1FAE30]-worker) [n:127.0.0.1:49237_ c:testcollection s:shard4 r:core_node6 x:testcollection_shard4_replica2] o.a.s.SolrTestCaseJ4 ###deleteCore
   [junit4]   2> NOTE: leaving temporary files on disk at: /Users/jenkins/workspace/Lucene-Solr-trunk-MacOSX/solr/build/solr-core/test/J1/temp/solr.cloud.TestRebalanceLeaders_D2D180EDCD1FAE30-001
   [junit4]   2> NOTE: test params are: codec=Asserting(Lucene53): {}, docValues:{}, sim=RandomSimilarityProvider(queryNorm=true,coord=crazy): {}, locale=ar_EG, timezone=America/Recife
   [junit4]   2> NOTE: Mac OS X 10.8.5 x86_64/Oracle Corporation 1.8.0_45 (64-bit)/cpus=3,threads=1,free=83306568,total=341987328
   [junit4]   2> NOTE: All tests run in this JVM: [TestPivotHelperCode, TestMaxScoreQueryParser, TestBadConfig, SolrCmdDistributorTest, LeaderFailoverAfterPartitionTest, SmileWriterTest, TestSolrCloudWithKerberosAlt, ExternalFileFieldSortTest, TestSolrCoreProperties, IgnoreCommitOptimizeUpdateProcessorFactoryTest, TestSolrXml, CachingDirectoryFactoryTest, ShardSplitTest, CSVRequestHandlerTest, TestEmbeddedSolrServerConstructors, DistribCursorPagingTest, BasicDistributedZk2Test, TestFieldResource, RollingRestartTest, TestManagedSchema, TestJsonFacets, TestPHPSerializedResponseWriter, TestCoreDiscovery, TestAuthenticationFramework, ShardRoutingCustomTest, AnalysisErrorHandlingTest, TestSuggestSpellingConverter, TestMissingGroups, TestSearchPerf, TestPseudoReturnFields, TestRebalanceLeaders]
   [junit4] Completed [62/514] on J1 in 105.52s, 1 test, 1 error <<< FAILURES!

[...truncated 1391 lines...]
BUILD FAILED
/Users/jenkins/workspace/Lucene-Solr-trunk-MacOSX/build.xml:526: The following error occurred while executing this line:
/Users/jenkins/workspace/Lucene-Solr-trunk-MacOSX/build.xml:474: The following error occurred while executing this line:
/Users/jenkins/workspace/Lucene-Solr-trunk-MacOSX/build.xml:61: The following error occurred while executing this line:
/Users/jenkins/workspace/Lucene-Solr-trunk-MacOSX/extra-targets.xml:39: The following error occurred while executing this line:
/Users/jenkins/workspace/Lucene-Solr-trunk-MacOSX/solr/build.xml:230: The following error occurred while executing this line:
/Users/jenkins/workspace/Lucene-Solr-trunk-MacOSX/solr/common-build.xml:513: The following error occurred while executing this line:
/Users/jenkins/workspace/Lucene-Solr-trunk-MacOSX/lucene/common-build.xml:1426: The following error occurred while executing this line:
/Users/jenkins/workspace/Lucene-Solr-trunk-MacOSX/lucene/common-build.xml:981: There were test failures: 514 suites, 2021 tests, 1 error, 64 ignored (24 assumptions)

Total time: 73 minutes 1 second
Build step 'Invoke Ant' marked build as failure
Archiving artifacts
Recording test results
Email was triggered for: Failure - Any
Sending email for trigger: Failure - Any



Mime
View raw message