lucene-dev mailing list archives

Site index · List index
Message view « Date » · « Thread »
Top « Date » · « Thread »
From Apache Jenkins Server <jenk...@builds.apache.org>
Subject [JENKINS] Lucene-Solr-NightlyTests-trunk - Build # 743 - Still Failing
Date Sat, 18 Jul 2015 11:27:40 GMT
Build: https://builds.apache.org/job/Lucene-Solr-NightlyTests-trunk/743/

3 tests failed.
REGRESSION:  org.apache.solr.cloud.ChaosMonkeySafeLeaderTest.test

Error Message:
Test abandoned because suite timeout was reached.

Stack Trace:
java.lang.Exception: Test abandoned because suite timeout was reached.
	at __randomizedtesting.SeedInfo.seed([ABB8E213C56C6A65]:0)


FAILED:  junit.framework.TestSuite.org.apache.solr.cloud.ChaosMonkeySafeLeaderTest

Error Message:
Suite timeout exceeded (>= 7200000 msec).

Stack Trace:
java.lang.Exception: Suite timeout exceeded (>= 7200000 msec).
	at __randomizedtesting.SeedInfo.seed([ABB8E213C56C6A65]:0)


FAILED:  org.apache.solr.cloud.CollectionsAPIDistributedZkTest.test

Error Message:
Captured an uncaught exception in thread: Thread[id=54499, name=collection5, state=RUNNABLE, group=TGRP-CollectionsAPIDistributedZkTest]

Stack Trace:
com.carrotsearch.randomizedtesting.UncaughtExceptionError: Captured an uncaught exception in thread: Thread[id=54499, name=collection5, state=RUNNABLE, group=TGRP-CollectionsAPIDistributedZkTest]
Caused by: org.apache.solr.client.solrj.impl.HttpSolrClient$RemoteSolrException: Error from server at http://127.0.0.1:57650: collection already exists: awholynewstresscollection_collection5_1
	at __randomizedtesting.SeedInfo.seed([ABB8E213C56C6A65]:0)
	at org.apache.solr.client.solrj.impl.HttpSolrClient.executeMethod(HttpSolrClient.java:560)
	at org.apache.solr.client.solrj.impl.HttpSolrClient.request(HttpSolrClient.java:234)
	at org.apache.solr.client.solrj.impl.HttpSolrClient.request(HttpSolrClient.java:226)
	at org.apache.solr.client.solrj.impl.LBHttpSolrClient.doRequest(LBHttpSolrClient.java:376)
	at org.apache.solr.client.solrj.impl.LBHttpSolrClient.request(LBHttpSolrClient.java:328)
	at org.apache.solr.client.solrj.impl.CloudSolrClient.sendRequest(CloudSolrClient.java:1086)
	at org.apache.solr.client.solrj.impl.CloudSolrClient.requestWithRetryOnStaleState(CloudSolrClient.java:856)
	at org.apache.solr.client.solrj.impl.CloudSolrClient.request(CloudSolrClient.java:799)
	at org.apache.solr.client.solrj.SolrClient.request(SolrClient.java:1220)
	at org.apache.solr.cloud.AbstractFullDistribZkTestBase.createCollection(AbstractFullDistribZkTestBase.java:1572)
	at org.apache.solr.cloud.AbstractFullDistribZkTestBase.createCollection(AbstractFullDistribZkTestBase.java:1593)
	at org.apache.solr.cloud.CollectionsAPIDistributedZkTest$1CollectionThread.run(CollectionsAPIDistributedZkTest.java:887)




Build Log:
[...truncated 10846 lines...]
   [junit4] Suite: org.apache.solr.cloud.CollectionsAPIDistributedZkTest
   [junit4]   2> Creating dataDir: /x1/jenkins/jenkins-slave/workspace/Lucene-Solr-NightlyTests-trunk/solr/build/solr-core/test/J2/temp/solr.cloud.CollectionsAPIDistributedZkTest_ABB8E213C56C6A65-001/init-core-data-001
   [junit4]   2> 1587179 INFO  (SUITE-CollectionsAPIDistributedZkTest-seed#[ABB8E213C56C6A65]-worker) [    ] o.a.s.SolrTestCaseJ4 Randomized ssl (false) and clientAuth (false)
   [junit4]   2> 1587179 INFO  (SUITE-CollectionsAPIDistributedZkTest-seed#[ABB8E213C56C6A65]-worker) [    ] o.a.s.BaseDistributedSearchTestCase Setting hostContext system property: /
   [junit4]   2> 1587185 INFO  (TEST-CollectionsAPIDistributedZkTest.test-seed#[ABB8E213C56C6A65]) [    ] o.a.s.c.ZkTestServer STARTING ZK TEST SERVER
   [junit4]   2> 1587205 INFO  (Thread-49192) [    ] o.a.s.c.ZkTestServer client port:0.0.0.0/0.0.0.0:0
   [junit4]   2> 1587205 INFO  (Thread-49192) [    ] o.a.s.c.ZkTestServer Starting server
   [junit4]   2> 1587305 INFO  (TEST-CollectionsAPIDistributedZkTest.test-seed#[ABB8E213C56C6A65]) [    ] o.a.s.c.ZkTestServer start zk server on port:36125
   [junit4]   2> 1587306 INFO  (TEST-CollectionsAPIDistributedZkTest.test-seed#[ABB8E213C56C6A65]) [    ] o.a.s.c.c.SolrZkClient Using default ZkCredentialsProvider
   [junit4]   2> 1587309 INFO  (TEST-CollectionsAPIDistributedZkTest.test-seed#[ABB8E213C56C6A65]) [    ] o.a.s.c.c.ConnectionManager Waiting for client to connect to ZooKeeper
   [junit4]   2> 1587312 INFO  (zkCallback-714-thread-1) [    ] o.a.s.c.c.ConnectionManager Watcher org.apache.solr.common.cloud.ConnectionManager@36ff82c6 name:ZooKeeperConnection Watcher:127.0.0.1:36125 got event WatchedEvent state:SyncConnected type:None path:null path:null type:None
   [junit4]   2> 1587312 INFO  (TEST-CollectionsAPIDistributedZkTest.test-seed#[ABB8E213C56C6A65]) [    ] o.a.s.c.c.ConnectionManager Client is connected to ZooKeeper
   [junit4]   2> 1587313 INFO  (TEST-CollectionsAPIDistributedZkTest.test-seed#[ABB8E213C56C6A65]) [    ] o.a.s.c.c.SolrZkClient Using default ZkACLProvider
   [junit4]   2> 1587313 INFO  (TEST-CollectionsAPIDistributedZkTest.test-seed#[ABB8E213C56C6A65]) [    ] o.a.s.c.c.SolrZkClient makePath: /solr
   [junit4]   2> 1587318 INFO  (TEST-CollectionsAPIDistributedZkTest.test-seed#[ABB8E213C56C6A65]) [    ] o.a.s.c.c.SolrZkClient Using default ZkCredentialsProvider
   [junit4]   2> 1587324 INFO  (TEST-CollectionsAPIDistributedZkTest.test-seed#[ABB8E213C56C6A65]) [    ] o.a.s.c.c.ConnectionManager Waiting for client to connect to ZooKeeper
   [junit4]   2> 1587326 INFO  (zkCallback-715-thread-1) [    ] o.a.s.c.c.ConnectionManager Watcher org.apache.solr.common.cloud.ConnectionManager@44ef3698 name:ZooKeeperConnection Watcher:127.0.0.1:36125/solr got event WatchedEvent state:SyncConnected type:None path:null path:null type:None
   [junit4]   2> 1587326 INFO  (TEST-CollectionsAPIDistributedZkTest.test-seed#[ABB8E213C56C6A65]) [    ] o.a.s.c.c.ConnectionManager Client is connected to ZooKeeper
   [junit4]   2> 1587327 INFO  (TEST-CollectionsAPIDistributedZkTest.test-seed#[ABB8E213C56C6A65]) [    ] o.a.s.c.c.SolrZkClient Using default ZkACLProvider
   [junit4]   2> 1587327 INFO  (TEST-CollectionsAPIDistributedZkTest.test-seed#[ABB8E213C56C6A65]) [    ] o.a.s.c.c.SolrZkClient makePath: /collections/collection1
   [junit4]   2> 1587328 INFO  (TEST-CollectionsAPIDistributedZkTest.test-seed#[ABB8E213C56C6A65]) [    ] o.a.s.c.c.SolrZkClient makePath: /collections/collection1/shards
   [junit4]   2> 1587330 INFO  (TEST-CollectionsAPIDistributedZkTest.test-seed#[ABB8E213C56C6A65]) [    ] o.a.s.c.c.SolrZkClient makePath: /collections/control_collection
   [junit4]   2> 1587332 INFO  (TEST-CollectionsAPIDistributedZkTest.test-seed#[ABB8E213C56C6A65]) [    ] o.a.s.c.c.SolrZkClient makePath: /collections/control_collection/shards
   [junit4]   2> 1587334 INFO  (TEST-CollectionsAPIDistributedZkTest.test-seed#[ABB8E213C56C6A65]) [    ] o.a.s.c.AbstractZkTestCase put /x1/jenkins/jenkins-slave/workspace/Lucene-Solr-NightlyTests-trunk/solr/core/src/test-files/solr/collection1/conf/solrconfig-tlog.xml to /configs/conf1/solrconfig.xml
   [junit4]   2> 1587334 INFO  (TEST-CollectionsAPIDistributedZkTest.test-seed#[ABB8E213C56C6A65]) [    ] o.a.s.c.c.SolrZkClient makePath: /configs/conf1/solrconfig.xml
   [junit4]   2> 1587337 INFO  (TEST-CollectionsAPIDistributedZkTest.test-seed#[ABB8E213C56C6A65]) [    ] o.a.s.c.AbstractZkTestCase put /x1/jenkins/jenkins-slave/workspace/Lucene-Solr-NightlyTests-trunk/solr/core/src/test-files/solr/collection1/conf/schema.xml to /configs/conf1/schema.xml
   [junit4]   2> 1587338 INFO  (TEST-CollectionsAPIDistributedZkTest.test-seed#[ABB8E213C56C6A65]) [    ] o.a.s.c.c.SolrZkClient makePath: /configs/conf1/schema.xml
   [junit4]   2> 1587340 INFO  (TEST-CollectionsAPIDistributedZkTest.test-seed#[ABB8E213C56C6A65]) [    ] o.a.s.c.AbstractZkTestCase put /x1/jenkins/jenkins-slave/workspace/Lucene-Solr-NightlyTests-trunk/solr/core/src/test-files/solr/collection1/conf/solrconfig.snippet.randomindexconfig.xml to /configs/conf1/solrconfig.snippet.randomindexconfig.xml
   [junit4]   2> 1587340 INFO  (TEST-CollectionsAPIDistributedZkTest.test-seed#[ABB8E213C56C6A65]) [    ] o.a.s.c.c.SolrZkClient makePath: /configs/conf1/solrconfig.snippet.randomindexconfig.xml
   [junit4]   2> 1587342 INFO  (TEST-CollectionsAPIDistributedZkTest.test-seed#[ABB8E213C56C6A65]) [    ] o.a.s.c.AbstractZkTestCase put /x1/jenkins/jenkins-slave/workspace/Lucene-Solr-NightlyTests-trunk/solr/core/src/test-files/solr/collection1/conf/stopwords.txt to /configs/conf1/stopwords.txt
   [junit4]   2> 1587342 INFO  (TEST-CollectionsAPIDistributedZkTest.test-seed#[ABB8E213C56C6A65]) [    ] o.a.s.c.c.SolrZkClient makePath: /configs/conf1/stopwords.txt
   [junit4]   2> 1587344 INFO  (TEST-CollectionsAPIDistributedZkTest.test-seed#[ABB8E213C56C6A65]) [    ] o.a.s.c.AbstractZkTestCase put /x1/jenkins/jenkins-slave/workspace/Lucene-Solr-NightlyTests-trunk/solr/core/src/test-files/solr/collection1/conf/protwords.txt to /configs/conf1/protwords.txt
   [junit4]   2> 1587344 INFO  (TEST-CollectionsAPIDistributedZkTest.test-seed#[ABB8E213C56C6A65]) [    ] o.a.s.c.c.SolrZkClient makePath: /configs/conf1/protwords.txt
   [junit4]   2> 1587346 INFO  (TEST-CollectionsAPIDistributedZkTest.test-seed#[ABB8E213C56C6A65]) [    ] o.a.s.c.AbstractZkTestCase put /x1/jenkins/jenkins-slave/workspace/Lucene-Solr-NightlyTests-trunk/solr/core/src/test-files/solr/collection1/conf/currency.xml to /configs/conf1/currency.xml
   [junit4]   2> 1587346 INFO  (TEST-CollectionsAPIDistributedZkTest.test-seed#[ABB8E213C56C6A65]) [    ] o.a.s.c.c.SolrZkClient makePath: /configs/conf1/currency.xml
   [junit4]   2> 1587348 INFO  (TEST-CollectionsAPIDistributedZkTest.test-seed#[ABB8E213C56C6A65]) [    ] o.a.s.c.AbstractZkTestCase put /x1/jenkins/jenkins-slave/workspace/Lucene-Solr-NightlyTests-trunk/solr/core/src/test-files/solr/collection1/conf/enumsConfig.xml to /configs/conf1/enumsConfig.xml
   [junit4]   2> 1587348 INFO  (TEST-CollectionsAPIDistributedZkTest.test-seed#[ABB8E213C56C6A65]) [    ] o.a.s.c.c.SolrZkClient makePath: /configs/conf1/enumsConfig.xml
   [junit4]   2> 1587351 INFO  (TEST-CollectionsAPIDistributedZkTest.test-seed#[ABB8E213C56C6A65]) [    ] o.a.s.c.AbstractZkTestCase put /x1/jenkins/jenkins-slave/workspace/Lucene-Solr-NightlyTests-trunk/solr/core/src/test-files/solr/collection1/conf/open-exchange-rates.json to /configs/conf1/open-exchange-rates.json
   [junit4]   2> 1587351 INFO  (TEST-CollectionsAPIDistributedZkTest.test-seed#[ABB8E213C56C6A65]) [    ] o.a.s.c.c.SolrZkClient makePath: /configs/conf1/open-exchange-rates.json
   [junit4]   2> 1587353 INFO  (TEST-CollectionsAPIDistributedZkTest.test-seed#[ABB8E213C56C6A65]) [    ] o.a.s.c.AbstractZkTestCase put /x1/jenkins/jenkins-slave/workspace/Lucene-Solr-NightlyTests-trunk/solr/core/src/test-files/solr/collection1/conf/mapping-ISOLatin1Accent.txt to /configs/conf1/mapping-ISOLatin1Accent.txt
   [junit4]   2> 1587354 INFO  (TEST-CollectionsAPIDistributedZkTest.test-seed#[ABB8E213C56C6A65]) [    ] o.a.s.c.c.SolrZkClient makePath: /configs/conf1/mapping-ISOLatin1Accent.txt
   [junit4]   2> 1587356 INFO  (TEST-CollectionsAPIDistributedZkTest.test-seed#[ABB8E213C56C6A65]) [    ] o.a.s.c.AbstractZkTestCase put /x1/jenkins/jenkins-slave/workspace/Lucene-Solr-NightlyTests-trunk/solr/core/src/test-files/solr/collection1/conf/old_synonyms.txt to /configs/conf1/old_synonyms.txt
   [junit4]   2> 1587356 INFO  (TEST-CollectionsAPIDistributedZkTest.test-seed#[ABB8E213C56C6A65]) [    ] o.a.s.c.c.SolrZkClient makePath: /configs/conf1/old_synonyms.txt
   [junit4]   2> 1587358 INFO  (TEST-CollectionsAPIDistributedZkTest.test-seed#[ABB8E213C56C6A65]) [    ] o.a.s.c.AbstractZkTestCase put /x1/jenkins/jenkins-slave/workspace/Lucene-Solr-NightlyTests-trunk/solr/core/src/test-files/solr/collection1/conf/synonyms.txt to /configs/conf1/synonyms.txt
   [junit4]   2> 1587358 INFO  (TEST-CollectionsAPIDistributedZkTest.test-seed#[ABB8E213C56C6A65]) [    ] o.a.s.c.c.SolrZkClient makePath: /configs/conf1/synonyms.txt
   [junit4]   2> 1587362 INFO  (TEST-CollectionsAPIDistributedZkTest.test-seed#[ABB8E213C56C6A65]) [    ] o.a.s.c.c.SolrZkClient Using default ZkCredentialsProvider
   [junit4]   2> 1587363 INFO  (TEST-CollectionsAPIDistributedZkTest.test-seed#[ABB8E213C56C6A65]) [    ] o.a.s.c.c.ConnectionManager Waiting for client to connect to ZooKeeper
   [junit4]   2> 1587363 INFO  (zkCallback-716-thread-1) [    ] o.a.s.c.c.ConnectionManager Watcher org.apache.solr.common.cloud.ConnectionManager@5840c577 name:ZooKeeperConnection Watcher:127.0.0.1:36125 got event WatchedEvent state:SyncConnected type:None path:null path:null type:None
   [junit4]   2> 1587364 INFO  (TEST-CollectionsAPIDistributedZkTest.test-seed#[ABB8E213C56C6A65]) [    ] o.a.s.c.c.ConnectionManager Client is connected to ZooKeeper
   [junit4]   2> 1587364 INFO  (TEST-CollectionsAPIDistributedZkTest.test-seed#[ABB8E213C56C6A65]) [    ] o.a.s.c.c.SolrZkClient Using default ZkACLProvider
   [junit4]   2> 1587364 INFO  (TEST-CollectionsAPIDistributedZkTest.test-seed#[ABB8E213C56C6A65]) [    ] o.a.s.c.c.SolrZkClient makePath: /solr
   [junit4]   2> 1587369 INFO  (TEST-CollectionsAPIDistributedZkTest.test-seed#[ABB8E213C56C6A65]) [    ] o.a.s.c.c.SolrZkClient Using default ZkCredentialsProvider
   [junit4]   2> 1587377 INFO  (TEST-CollectionsAPIDistributedZkTest.test-seed#[ABB8E213C56C6A65]) [    ] o.a.s.c.c.ConnectionManager Waiting for client to connect to ZooKeeper
   [junit4]   2> 1587378 INFO  (zkCallback-717-thread-1) [    ] o.a.s.c.c.ConnectionManager Watcher org.apache.solr.common.cloud.ConnectionManager@bba2b8f name:ZooKeeperConnection Watcher:127.0.0.1:36125/solr got event WatchedEvent state:SyncConnected type:None path:null path:null type:None
   [junit4]   2> 1587378 INFO  (TEST-CollectionsAPIDistributedZkTest.test-seed#[ABB8E213C56C6A65]) [    ] o.a.s.c.c.ConnectionManager Client is connected to ZooKeeper
   [junit4]   2> 1587378 INFO  (TEST-CollectionsAPIDistributedZkTest.test-seed#[ABB8E213C56C6A65]) [    ] o.a.s.c.c.SolrZkClient Using default ZkACLProvider
   [junit4]   2> 1587379 INFO  (TEST-CollectionsAPIDistributedZkTest.test-seed#[ABB8E213C56C6A65]) [    ] o.a.s.c.AbstractZkTestCase put /x1/jenkins/jenkins-slave/workspace/Lucene-Solr-NightlyTests-trunk/solr/core/src/test-files/solr/collection1/conf/solrconfig-tlog.xml to /configs/conf2/solrconfig.xml
   [junit4]   2> 1587379 INFO  (TEST-CollectionsAPIDistributedZkTest.test-seed#[ABB8E213C56C6A65]) [    ] o.a.s.c.c.SolrZkClient makePath: /configs/conf2/solrconfig.xml
   [junit4]   2> 1587382 INFO  (TEST-CollectionsAPIDistributedZkTest.test-seed#[ABB8E213C56C6A65]) [    ] o.a.s.c.AbstractZkTestCase put /x1/jenkins/jenkins-slave/workspace/Lucene-Solr-NightlyTests-trunk/solr/core/src/test-files/solr/collection1/conf/schema.xml to /configs/conf2/schema.xml
   [junit4]   2> 1587382 INFO  (TEST-CollectionsAPIDistributedZkTest.test-seed#[ABB8E213C56C6A65]) [    ] o.a.s.c.c.SolrZkClient makePath: /configs/conf2/schema.xml
   [junit4]   2> 1587384 INFO  (TEST-CollectionsAPIDistributedZkTest.test-seed#[ABB8E213C56C6A65]) [    ] o.a.s.c.AbstractZkTestCase put /x1/jenkins/jenkins-slave/workspace/Lucene-Solr-NightlyTests-trunk/solr/core/src/test-files/solr/collection1/conf/enumsConfig.xml to /configs/conf2/enumsConfig.xml
   [junit4]   2> 1587384 INFO  (TEST-CollectionsAPIDistributedZkTest.test-seed#[ABB8E213C56C6A65]) [    ] o.a.s.c.c.SolrZkClient makePath: /configs/conf2/enumsConfig.xml
   [junit4]   2> 1587386 INFO  (TEST-CollectionsAPIDistributedZkTest.test-seed#[ABB8E213C56C6A65]) [    ] o.a.s.c.AbstractZkTestCase put /x1/jenkins/jenkins-slave/workspace/Lucene-Solr-NightlyTests-trunk/solr/core/src/test-files/solr/collection1/conf/solrconfig.snippet.randomindexconfig.xml to /configs/conf2/solrconfig.snippet.randomindexconfig.xml
   [junit4]   2> 1587387 INFO  (TEST-CollectionsAPIDistributedZkTest.test-seed#[ABB8E213C56C6A65]) [    ] o.a.s.c.c.SolrZkClient makePath: /configs/conf2/solrconfig.snippet.randomindexconfig.xml
   [junit4]   2> 1587388 INFO  (TEST-CollectionsAPIDistributedZkTest.test-seed#[ABB8E213C56C6A65]) [    ] o.a.s.c.AbstractZkTestCase put /x1/jenkins/jenkins-slave/workspace/Lucene-Solr-NightlyTests-trunk/solr/core/src/test-files/solr/collection1/conf/stopwords.txt to /configs/conf2/stopwords.txt
   [junit4]   2> 1587388 INFO  (TEST-CollectionsAPIDistributedZkTest.test-seed#[ABB8E213C56C6A65]) [    ] o.a.s.c.c.SolrZkClient makePath: /configs/conf2/stopwords.txt
   [junit4]   2> 1587390 INFO  (TEST-CollectionsAPIDistributedZkTest.test-seed#[ABB8E213C56C6A65]) [    ] o.a.s.c.AbstractZkTestCase put /x1/jenkins/jenkins-slave/workspace/Lucene-Solr-NightlyTests-trunk/solr/core/src/test-files/solr/collection1/conf/protwords.txt to /configs/conf2/protwords.txt
   [junit4]   2> 1587391 INFO  (TEST-CollectionsAPIDistributedZkTest.test-seed#[ABB8E213C56C6A65]) [    ] o.a.s.c.c.SolrZkClient makePath: /configs/conf2/protwords.txt
   [junit4]   2> 1587394 INFO  (TEST-CollectionsAPIDistributedZkTest.test-seed#[ABB8E213C56C6A65]) [    ] o.a.s.c.AbstractZkTestCase put /x1/jenkins/jenkins-slave/workspace/Lucene-Solr-NightlyTests-trunk/solr/core/src/test-files/solr/collection1/conf/currency.xml to /configs/conf2/currency.xml
   [junit4]   2> 1587395 INFO  (TEST-CollectionsAPIDistributedZkTest.test-seed#[ABB8E213C56C6A65]) [    ] o.a.s.c.c.SolrZkClient makePath: /configs/conf2/currency.xml
   [junit4]   2> 1587400 INFO  (TEST-CollectionsAPIDistributedZkTest.test-seed#[ABB8E213C56C6A65]) [    ] o.a.s.c.AbstractZkTestCase put /x1/jenkins/jenkins-slave/workspace/Lucene-Solr-NightlyTests-trunk/solr/core/src/test-files/solr/collection1/conf/open-exchange-rates.json to /configs/conf2/open-exchange-rates.json
   [junit4]   2> 1587400 INFO  (TEST-CollectionsAPIDistributedZkTest.test-seed#[ABB8E213C56C6A65]) [    ] o.a.s.c.c.SolrZkClient makePath: /configs/conf2/open-exchange-rates.json
   [junit4]   2> 1587402 INFO  (TEST-CollectionsAPIDistributedZkTest.test-seed#[ABB8E213C56C6A65]) [    ] o.a.s.c.AbstractZkTestCase put /x1/jenkins/jenkins-slave/workspace/Lucene-Solr-NightlyTests-trunk/solr/core/src/test-files/solr/collection1/conf/mapping-ISOLatin1Accent.txt to /configs/conf2/mapping-ISOLatin1Accent.txt
   [junit4]   2> 1587403 INFO  (TEST-CollectionsAPIDistributedZkTest.test-seed#[ABB8E213C56C6A65]) [    ] o.a.s.c.c.SolrZkClient makePath: /configs/conf2/mapping-ISOLatin1Accent.txt
   [junit4]   2> 1587405 INFO  (TEST-CollectionsAPIDistributedZkTest.test-seed#[ABB8E213C56C6A65]) [    ] o.a.s.c.AbstractZkTestCase put /x1/jenkins/jenkins-slave/workspace/Lucene-Solr-NightlyTests-trunk/solr/core/src/test-files/solr/collection1/conf/old_synonyms.txt to /configs/conf2/old_synonyms.txt
   [junit4]   2> 1587405 INFO  (TEST-CollectionsAPIDistributedZkTest.test-seed#[ABB8E213C56C6A65]) [    ] o.a.s.c.c.SolrZkClient makePath: /configs/conf2/old_synonyms.txt
   [junit4]   2> 1587407 INFO  (TEST-CollectionsAPIDistributedZkTest.test-seed#[ABB8E213C56C6A65]) [    ] o.a.s.c.AbstractZkTestCase put /x1/jenkins/jenkins-slave/workspace/Lucene-Solr-NightlyTests-trunk/solr/core/src/test-files/solr/collection1/conf/synonyms.txt to /configs/conf2/synonyms.txt
   [junit4]   2> 1587408 INFO  (TEST-CollectionsAPIDistributedZkTest.test-seed#[ABB8E213C56C6A65]) [    ] o.a.s.c.c.SolrZkClient makePath: /configs/conf2/synonyms.txt
   [junit4]   2> 1587410 INFO  (TEST-CollectionsAPIDistributedZkTest.test-seed#[ABB8E213C56C6A65]) [    ] o.a.s.c.AbstractZkTestCase put /x1/jenkins/jenkins-slave/workspace/Lucene-Solr-NightlyTests-trunk/solr/core/src/test-files/solr/collection1/conf/elevate.xml to /configs/conf2/elevate.xml
   [junit4]   2> 1587410 INFO  (TEST-CollectionsAPIDistributedZkTest.test-seed#[ABB8E213C56C6A65]) [    ] o.a.s.c.c.SolrZkClient makePath: /configs/conf2/elevate.xml
   [junit4]   2> 1587832 INFO  (TEST-CollectionsAPIDistributedZkTest.test-seed#[ABB8E213C56C6A65]) [    ] o.a.s.SolrTestCaseJ4 Writing core.properties file to /x1/jenkins/jenkins-slave/workspace/Lucene-Solr-NightlyTests-trunk/solr/build/solr-core/test/J2/temp/solr.cloud.CollectionsAPIDistributedZkTest_ABB8E213C56C6A65-001/control-001/cores/collection1
   [junit4]   2> 1587836 INFO  (TEST-CollectionsAPIDistributedZkTest.test-seed#[ABB8E213C56C6A65]) [    ] o.e.j.s.Server jetty-9.2.11.v20150529
   [junit4]   2> 1587857 INFO  (TEST-CollectionsAPIDistributedZkTest.test-seed#[ABB8E213C56C6A65]) [    ] o.e.j.s.h.ContextHandler Started o.e.j.s.ServletContextHandler@35eeeff0{/,null,AVAILABLE}
   [junit4]   2> 1587859 INFO  (TEST-CollectionsAPIDistributedZkTest.test-seed#[ABB8E213C56C6A65]) [    ] o.e.j.s.ServerConnector Started ServerConnector@590a0d36{HTTP/1.1}{127.0.0.1:59154}
   [junit4]   2> 1587859 INFO  (TEST-CollectionsAPIDistributedZkTest.test-seed#[ABB8E213C56C6A65]) [    ] o.e.j.s.Server Started @1591092ms
   [junit4]   2> 1587859 INFO  (TEST-CollectionsAPIDistributedZkTest.test-seed#[ABB8E213C56C6A65]) [    ] o.a.s.c.s.e.JettySolrRunner Jetty properties: {solr.data.dir=/x1/jenkins/jenkins-slave/workspace/Lucene-Solr-NightlyTests-trunk/solr/build/solr-core/test/J2/temp/solr.cloud.CollectionsAPIDistributedZkTest_ABB8E213C56C6A65-001/tempDir-001/control/data, hostContext=/, hostPort=59154, coreRootDirectory=/x1/jenkins/jenkins-slave/workspace/Lucene-Solr-NightlyTests-trunk/solr/build/solr-core/test/J2/temp/solr.cloud.CollectionsAPIDistributedZkTest_ABB8E213C56C6A65-001/control-001/cores}
   [junit4]   2> 1587859 INFO  (TEST-CollectionsAPIDistributedZkTest.test-seed#[ABB8E213C56C6A65]) [    ] o.a.s.s.SolrDispatchFilter SolrDispatchFilter.init(): sun.misc.Launcher$AppClassLoader@4e0e2f2a
   [junit4]   2> 1587860 INFO  (TEST-CollectionsAPIDistributedZkTest.test-seed#[ABB8E213C56C6A65]) [    ] o.a.s.c.SolrResourceLoader new SolrResourceLoader for directory: '/x1/jenkins/jenkins-slave/workspace/Lucene-Solr-NightlyTests-trunk/solr/build/solr-core/test/J2/temp/solr.cloud.CollectionsAPIDistributedZkTest_ABB8E213C56C6A65-001/control-001/'
   [junit4]   2> 1587878 INFO  (TEST-CollectionsAPIDistributedZkTest.test-seed#[ABB8E213C56C6A65]) [    ] o.a.s.c.SolrXmlConfig Loading container configuration from /x1/jenkins/jenkins-slave/workspace/Lucene-Solr-NightlyTests-trunk/solr/build/solr-core/test/J2/temp/solr.cloud.CollectionsAPIDistributedZkTest_ABB8E213C56C6A65-001/control-001/solr.xml
   [junit4]   2> 1587885 INFO  (TEST-CollectionsAPIDistributedZkTest.test-seed#[ABB8E213C56C6A65]) [    ] o.a.s.c.CoresLocator Config-defined core root directory: /x1/jenkins/jenkins-slave/workspace/Lucene-Solr-NightlyTests-trunk/solr/build/solr-core/test/J2/temp/solr.cloud.CollectionsAPIDistributedZkTest_ABB8E213C56C6A65-001/control-001/cores
   [junit4]   2> 1587885 INFO  (TEST-CollectionsAPIDistributedZkTest.test-seed#[ABB8E213C56C6A65]) [    ] o.a.s.c.CoreContainer New CoreContainer 1791339571
   [junit4]   2> 1587886 INFO  (TEST-CollectionsAPIDistributedZkTest.test-seed#[ABB8E213C56C6A65]) [    ] o.a.s.c.CoreContainer Loading cores into CoreContainer [instanceDir=/x1/jenkins/jenkins-slave/workspace/Lucene-Solr-NightlyTests-trunk/solr/build/solr-core/test/J2/temp/solr.cloud.CollectionsAPIDistributedZkTest_ABB8E213C56C6A65-001/control-001/]
   [junit4]   2> 1587886 INFO  (TEST-CollectionsAPIDistributedZkTest.test-seed#[ABB8E213C56C6A65]) [    ] o.a.s.c.CoreContainer loading shared library: /x1/jenkins/jenkins-slave/workspace/Lucene-Solr-NightlyTests-trunk/solr/build/solr-core/test/J2/temp/solr.cloud.CollectionsAPIDistributedZkTest_ABB8E213C56C6A65-001/control-001/lib
   [junit4]   2> 1587886 WARN  (TEST-CollectionsAPIDistributedZkTest.test-seed#[ABB8E213C56C6A65]) [    ] o.a.s.c.SolrResourceLoader Can't find (or read) directory to add to classloader: lib (resolved as: /x1/jenkins/jenkins-slave/workspace/Lucene-Solr-NightlyTests-trunk/solr/build/solr-core/test/J2/temp/solr.cloud.CollectionsAPIDistributedZkTest_ABB8E213C56C6A65-001/control-001/lib).
   [junit4]   2> 1587894 INFO  (TEST-CollectionsAPIDistributedZkTest.test-seed#[ABB8E213C56C6A65]) [    ] o.a.s.h.c.HttpShardHandlerFactory created with socketTimeout : 90000,urlScheme : ,connTimeout : 15000,maxConnectionsPerHost : 20,maxConnections : 10000,corePoolSize : 0,maximumPoolSize : 2147483647,maxThreadIdleTime : 5,sizeOfQueue : -1,fairnessPolicy : false,useRetries : false,
   [junit4]   2> 1587895 INFO  (TEST-CollectionsAPIDistributedZkTest.test-seed#[ABB8E213C56C6A65]) [    ] o.a.s.u.UpdateShardHandler Creating UpdateShardHandler HTTP client with params: socketTimeout=340000&connTimeout=45000&retry=true
   [junit4]   2> 1587896 INFO  (TEST-CollectionsAPIDistributedZkTest.test-seed#[ABB8E213C56C6A65]) [    ] o.a.s.l.LogWatcher SLF4J impl is org.slf4j.impl.Log4jLoggerFactory
   [junit4]   2> 1587896 INFO  (TEST-CollectionsAPIDistributedZkTest.test-seed#[ABB8E213C56C6A65]) [    ] o.a.s.l.LogWatcher Registering Log Listener [Log4j (org.slf4j.impl.Log4jLoggerFactory)]
   [junit4]   2> 1587896 INFO  (TEST-CollectionsAPIDistributedZkTest.test-seed#[ABB8E213C56C6A65]) [    ] o.a.s.c.ZkContainer Zookeeper client=127.0.0.1:36125/solr
   [junit4]   2> 1587896 INFO  (TEST-CollectionsAPIDistributedZkTest.test-seed#[ABB8E213C56C6A65]) [    ] o.a.s.c.ZkController zkHost includes chroot
   [junit4]   2> 1587896 INFO  (TEST-CollectionsAPIDistributedZkTest.test-seed#[ABB8E213C56C6A65]) [    ] o.a.s.c.c.SolrZkClient Using default ZkCredentialsProvider
   [junit4]   2> 1587898 INFO  (TEST-CollectionsAPIDistributedZkTest.test-seed#[ABB8E213C56C6A65]) [    ] o.a.s.c.c.ConnectionManager Waiting for client to connect to ZooKeeper
   [junit4]   2> 1587898 INFO  (zkCallback-719-thread-1) [    ] o.a.s.c.c.ConnectionManager Watcher org.apache.solr.common.cloud.ConnectionManager@55dd4d3 name:ZooKeeperConnection Watcher:127.0.0.1:36125 got event WatchedEvent state:SyncConnected type:None path:null path:null type:None
   [junit4]   2> 1587899 INFO  (TEST-CollectionsAPIDistributedZkTest.test-seed#[ABB8E213C56C6A65]) [    ] o.a.s.c.c.ConnectionManager Client is connected to ZooKeeper
   [junit4]   2> 1587900 INFO  (TEST-CollectionsAPIDistributedZkTest.test-seed#[ABB8E213C56C6A65]) [    ] o.a.s.c.c.SolrZkClient Using default ZkACLProvider
   [junit4]   2> 1587904 INFO  (TEST-CollectionsAPIDistributedZkTest.test-seed#[ABB8E213C56C6A65]) [n:127.0.0.1:59154_    ] o.a.s.c.c.ConnectionManager Waiting for client to connect to ZooKeeper
   [junit4]   2> 1587906 INFO  (zkCallback-720-thread-1-processing-n:127.0.0.1:59154_) [n:127.0.0.1:59154_    ] o.a.s.c.c.ConnectionManager Watcher org.apache.solr.common.cloud.ConnectionManager@26c0b1bc name:ZooKeeperConnection Watcher:127.0.0.1:36125/solr got event WatchedEvent state:SyncConnected type:None path:null path:null type:None
   [junit4]   2> 1587906 INFO  (TEST-CollectionsAPIDistributedZkTest.test-seed#[ABB8E213C56C6A65]) [n:127.0.0.1:59154_    ] o.a.s.c.c.ConnectionManager Client is connected to ZooKeeper
   [junit4]   2> 1587909 INFO  (TEST-CollectionsAPIDistributedZkTest.test-seed#[ABB8E213C56C6A65]) [n:127.0.0.1:59154_    ] o.a.s.c.c.SolrZkClient makePath: /overseer/queue
   [junit4]   2> 1587911 INFO  (TEST-CollectionsAPIDistributedZkTest.test-seed#[ABB8E213C56C6A65]) [n:127.0.0.1:59154_    ] o.a.s.c.c.SolrZkClient makePath: /overseer/collection-queue-work
   [junit4]   2> 1587913 INFO  (TEST-CollectionsAPIDistributedZkTest.test-seed#[ABB8E213C56C6A65]) [n:127.0.0.1:59154_    ] o.a.s.c.c.SolrZkClient makePath: /overseer/collection-map-running
   [junit4]   2> 1587916 INFO  (TEST-CollectionsAPIDistributedZkTest.test-seed#[ABB8E213C56C6A65]) [n:127.0.0.1:59154_    ] o.a.s.c.c.SolrZkClient makePath: /overseer/collection-map-completed
   [junit4]   2> 1587918 INFO  (TEST-CollectionsAPIDistributedZkTest.test-seed#[ABB8E213C56C6A65]) [n:127.0.0.1:59154_    ] o.a.s.c.c.SolrZkClient makePath: /overseer/collection-map-failure
   [junit4]   2> 1587921 INFO  (TEST-CollectionsAPIDistributedZkTest.test-seed#[ABB8E213C56C6A65]) [n:127.0.0.1:59154_    ] o.a.s.c.c.SolrZkClient makePath: /live_nodes
   [junit4]   2> 1587922 INFO  (TEST-CollectionsAPIDistributedZkTest.test-seed#[ABB8E213C56C6A65]) [n:127.0.0.1:59154_    ] o.a.s.c.c.SolrZkClient makePath: /aliases.json
   [junit4]   2> 1587925 INFO  (TEST-CollectionsAPIDistributedZkTest.test-seed#[ABB8E213C56C6A65]) [n:127.0.0.1:59154_    ] o.a.s.c.c.SolrZkClient makePath: /clusterstate.json
   [junit4]   2> 1587926 INFO  (TEST-CollectionsAPIDistributedZkTest.test-seed#[ABB8E213C56C6A65]) [n:127.0.0.1:59154_    ] o.a.s.c.ZkController Register node as live in ZooKeeper:/live_nodes/127.0.0.1:59154_
   [junit4]   2> 1587927 INFO  (TEST-CollectionsAPIDistributedZkTest.test-seed#[ABB8E213C56C6A65]) [n:127.0.0.1:59154_    ] o.a.s.c.c.SolrZkClient makePath: /live_nodes/127.0.0.1:59154_
   [junit4]   2> 1587928 INFO  (TEST-CollectionsAPIDistributedZkTest.test-seed#[ABB8E213C56C6A65]) [n:127.0.0.1:59154_    ] o.a.s.c.c.SolrZkClient makePath: /overseer_elect
   [junit4]   2> 1587930 INFO  (TEST-CollectionsAPIDistributedZkTest.test-seed#[ABB8E213C56C6A65]) [n:127.0.0.1:59154_    ] o.a.s.c.c.SolrZkClient makePath: /overseer_elect/election
   [junit4]   2> 1587932 INFO  (TEST-CollectionsAPIDistributedZkTest.test-seed#[ABB8E213C56C6A65]) [n:127.0.0.1:59154_    ] o.a.s.c.Overseer Overseer (id=null) closing
   [junit4]   2> 1587933 INFO  (TEST-CollectionsAPIDistributedZkTest.test-seed#[ABB8E213C56C6A65]) [n:127.0.0.1:59154_    ] o.a.s.c.LeaderElector Joined leadership election with path: /overseer_elect/election/94188369055776773-127.0.0.1:59154_-n_0000000000
   [junit4]   2> 1587935 INFO  (TEST-CollectionsAPIDistributedZkTest.test-seed#[ABB8E213C56C6A65]) [n:127.0.0.1:59154_    ] o.a.s.c.OverseerElectionContext I am going to be the leader 127.0.0.1:59154_
   [junit4]   2> 1587935 INFO  (TEST-CollectionsAPIDistributedZkTest.test-seed#[ABB8E213C56C6A65]) [n:127.0.0.1:59154_    ] o.a.s.c.c.SolrZkClient makePath: /overseer_elect/leader
   [junit4]   2> 1587937 INFO  (TEST-CollectionsAPIDistributedZkTest.test-seed#[ABB8E213C56C6A65]) [n:127.0.0.1:59154_    ] o.a.s.c.Overseer Overseer (id=94188369055776773-127.0.0.1:59154_-n_0000000000) starting
   [junit4]   2> 1587939 INFO  (TEST-CollectionsAPIDistributedZkTest.test-seed#[ABB8E213C56C6A65]) [n:127.0.0.1:59154_    ] o.a.s.c.c.SolrZkClient makePath: /overseer/queue-work
   [junit4]   2> 1587946 INFO  (TEST-CollectionsAPIDistributedZkTest.test-seed#[ABB8E213C56C6A65]) [n:127.0.0.1:59154_    ] o.a.s.c.OverseerAutoReplicaFailoverThread Starting OverseerAutoReplicaFailoverThread autoReplicaFailoverWorkLoopDelay=10000 autoReplicaFailoverWaitAfterExpiration=10000 autoReplicaFailoverBadNodeExpiration=60000
   [junit4]   2> 1587947 INFO  (OverseerCollectionProcessor-94188369055776773-127.0.0.1:59154_-n_0000000000) [n:127.0.0.1:59154_    ] o.a.s.c.OverseerCollectionProcessor Process current queue of collection creations
   [junit4]   2> 1587948 INFO  (OverseerStateUpdate-94188369055776773-127.0.0.1:59154_-n_0000000000) [n:127.0.0.1:59154_    ] o.a.s.c.Overseer Starting to work on the main queue
   [junit4]   2> 1587956 INFO  (TEST-CollectionsAPIDistributedZkTest.test-seed#[ABB8E213C56C6A65]) [n:127.0.0.1:59154_    ] o.a.s.c.c.ZkStateReader Updating cluster state from ZooKeeper... 
   [junit4]   2> 1587960 INFO  (TEST-CollectionsAPIDistributedZkTest.test-seed#[ABB8E213C56C6A65]) [n:127.0.0.1:59154_    ] o.a.s.c.CoreContainer No authentication plugin used.
   [junit4]   2> 1587961 INFO  (TEST-CollectionsAPIDistributedZkTest.test-seed#[ABB8E213C56C6A65]) [n:127.0.0.1:59154_    ] o.a.s.c.CoreContainer Security conf doesn't exist. Skipping setup for authorization module.
   [junit4]   2> 1587961 INFO  (TEST-CollectionsAPIDistributedZkTest.test-seed#[ABB8E213C56C6A65]) [n:127.0.0.1:59154_    ] o.a.s.c.CoresLocator Looking for core definitions underneath /x1/jenkins/jenkins-slave/workspace/Lucene-Solr-NightlyTests-trunk/solr/build/solr-core/test/J2/temp/solr.cloud.CollectionsAPIDistributedZkTest_ABB8E213C56C6A65-001/control-001/cores
   [junit4]   2> 1587962 INFO  (TEST-CollectionsAPIDistributedZkTest.test-seed#[ABB8E213C56C6A65]) [n:127.0.0.1:59154_    ] o.a.s.c.SolrCore Created CoreDescriptor: {name=collection1, config=solrconfig.xml, transient=false, schema=schema.xml, loadOnStartup=true, configSetProperties=configsetprops.json, instanceDir=/x1/jenkins/jenkins-slave/workspace/Lucene-Solr-NightlyTests-trunk/solr/build/solr-core/test/J2/temp/solr.cloud.CollectionsAPIDistributedZkTest_ABB8E213C56C6A65-001/control-001/cores/collection1, collection=control_collection, absoluteInstDir=/x1/jenkins/jenkins-slave/workspace/Lucene-Solr-NightlyTests-trunk/solr/build/solr-core/test/J2/temp/solr.cloud.CollectionsAPIDistributedZkTest_ABB8E213C56C6A65-001/control-001/cores/collection1/, coreNodeName=, dataDir=data/, shard=}
   [junit4]   2> 1587962 INFO  (TEST-CollectionsAPIDistributedZkTest.test-seed#[ABB8E213C56C6A65]) [n:127.0.0.1:59154_    ] o.a.s.c.CoresLocator Found core collection1 in /x1/jenkins/jenkins-slave/workspace/Lucene-Solr-NightlyTests-trunk/solr/build/solr-core/test/J2/temp/solr.cloud.CollectionsAPIDistributedZkTest_ABB8E213C56C6A65-001/control-001/cores/collection1/
   [junit4]   2> 1587963 INFO  (TEST-CollectionsAPIDistributedZkTest.test-seed#[ABB8E213C56C6A65]) [n:127.0.0.1:59154_    ] o.a.s.c.CoresLocator Found 1 core definitions
   [junit4]   2> 1587964 INFO  (coreLoadExecutor-3736-thread-1-processing-n:127.0.0.1:59154_) [n:127.0.0.1:59154_ c:control_collection   x:collection1] o.a.s.c.ZkController publishing state=down
   [junit4]   2> 1587964 INFO  (TEST-CollectionsAPIDistributedZkTest.test-seed#[ABB8E213C56C6A65]) [n:127.0.0.1:59154_    ] o.a.s.s.SolrDispatchFilter user.dir=/x1/jenkins/jenkins-slave/workspace/Lucene-Solr-NightlyTests-trunk/solr/build/solr-core/test/J2
   [junit4]   2> 1587964 INFO  (TEST-CollectionsAPIDistributedZkTest.test-seed#[ABB8E213C56C6A65]) [n:127.0.0.1:59154_    ] o.a.s.s.SolrDispatchFilter SolrDispatchFilter.init() done
   [junit4]   2> 1587964 INFO  (coreLoadExecutor-3736-thread-1-processing-n:127.0.0.1:59154_) [n:127.0.0.1:59154_ c:control_collection   x:collection1] o.a.s.c.ZkController numShards not found on descriptor - reading it from system property
   [junit4]   2> 1587966 INFO  (zkCallback-720-thread-1-processing-n:127.0.0.1:59154_) [n:127.0.0.1:59154_    ] o.a.s.c.DistributedQueue NodeChildrenChanged fired on path /overseer/queue state SyncConnected
   [junit4]   2> 1587966 INFO  (coreLoadExecutor-3736-thread-1-processing-n:127.0.0.1:59154_) [n:127.0.0.1:59154_ c:control_collection   x:collection1] o.a.s.c.ZkController look for our core node name
   [junit4]   2> 1587966 INFO  (OverseerStateUpdate-94188369055776773-127.0.0.1:59154_-n_0000000000) [n:127.0.0.1:59154_    ] o.a.s.c.Overseer processMessage: queueSize: 1, message = {
   [junit4]   2>   "core":"collection1",
   [junit4]   2>   "roles":null,
   [junit4]   2>   "base_url":"http://127.0.0.1:59154",
   [junit4]   2>   "node_name":"127.0.0.1:59154_",
   [junit4]   2>   "numShards":"1",
   [junit4]   2>   "state":"down",
   [junit4]   2>   "shard":null,
   [junit4]   2>   "collection":"control_collection",
   [junit4]   2>   "operation":"state"} current state version: 0
   [junit4]   2> 1587967 INFO  (OverseerStateUpdate-94188369055776773-127.0.0.1:59154_-n_0000000000) [n:127.0.0.1:59154_    ] o.a.s.c.o.ReplicaMutator Update state numShards=1 message={
   [junit4]   2>   "core":"collection1",
   [junit4]   2>   "roles":null,
   [junit4]   2>   "base_url":"http://127.0.0.1:59154",
   [junit4]   2>   "node_name":"127.0.0.1:59154_",
   [junit4]   2>   "numShards":"1",
   [junit4]   2>   "state":"down",
   [junit4]   2>   "shard":null,
   [junit4]   2>   "collection":"control_collection",
   [junit4]   2>   "operation":"state"}
   [junit4]   2> 1587967 INFO  (OverseerStateUpdate-94188369055776773-127.0.0.1:59154_-n_0000000000) [n:127.0.0.1:59154_    ] o.a.s.c.o.ClusterStateMutator building a new cName: control_collection
   [junit4]   2> 1587967 INFO  (OverseerStateUpdate-94188369055776773-127.0.0.1:59154_-n_0000000000) [n:127.0.0.1:59154_    ] o.a.s.c.o.ReplicaMutator Assigning new node to shard shard=shard1
   [junit4]   2> 1587974 INFO  (zkCallback-720-thread-1-processing-n:127.0.0.1:59154_) [n:127.0.0.1:59154_    ] o.a.s.c.c.ZkStateReader A cluster state change: WatchedEvent state:SyncConnected type:NodeDataChanged path:/clusterstate.json, has occurred - updating... (live nodes size: 1)
   [junit4]   2> 1587976 INFO  (zkCallback-720-thread-1-processing-n:127.0.0.1:59154_) [n:127.0.0.1:59154_    ] o.a.s.c.c.ZkStateReader Updated cluster state version to 1
   [junit4]   2> 1588966 INFO  (coreLoadExecutor-3736-thread-1-processing-n:127.0.0.1:59154_) [n:127.0.0.1:59154_ c:control_collection   x:collection1] o.a.s.c.ZkController waiting to find shard id in clusterstate for collection1
   [junit4]   2> 1588966 INFO  (coreLoadExecutor-3736-thread-1-processing-n:127.0.0.1:59154_) [n:127.0.0.1:59154_ c:control_collection   x:collection1] o.a.s.c.ZkController Check for collection zkNode:control_collection
   [junit4]   2> 1588967 INFO  (coreLoadExecutor-3736-thread-1-processing-n:127.0.0.1:59154_) [n:127.0.0.1:59154_ c:control_collection   x:collection1] o.a.s.c.ZkController Collection zkNode exists
   [junit4]   2> 1588967 INFO  (coreLoadExecutor-3736-thread-1-processing-n:127.0.0.1:59154_) [n:127.0.0.1:59154_ c:control_collection   x:collection1] o.a.s.c.c.ZkStateReader Load collection config from:/collections/control_collection
   [junit4]   2> 1588968 INFO  (coreLoadExecutor-3736-thread-1-processing-n:127.0.0.1:59154_) [n:127.0.0.1:59154_ c:control_collection   x:collection1] o.a.s.c.c.ZkStateReader path=/collections/control_collection configName=conf1 specified config exists in ZooKeeper
   [junit4]   2> 1588968 INFO  (coreLoadExecutor-3736-thread-1-processing-n:127.0.0.1:59154_) [n:127.0.0.1:59154_ c:control_collection   x:collection1] o.a.s.c.SolrResourceLoader new SolrResourceLoader for directory: '/x1/jenkins/jenkins-slave/workspace/Lucene-Solr-NightlyTests-trunk/solr/build/solr-core/test/J2/temp/solr.cloud.CollectionsAPIDistributedZkTest_ABB8E213C56C6A65-001/control-001/cores/collection1/'
   [junit4]   2> 1588986 INFO  (coreLoadExecutor-3736-thread-1-processing-n:127.0.0.1:59154_) [n:127.0.0.1:59154_ c:control_collection   x:collection1] o.a.s.c.Config loaded config solrconfig.xml with version 0 
   [junit4]   2> 1588992 INFO  (coreLoadExecutor-3736-thread-1-processing-n:127.0.0.1:59154_) [n:127.0.0.1:59154_ c:control_collection   x:collection1] o.a.s.c.SolrConfig current version of requestparams : -1
   [junit4]   2> 1589011 INFO  (coreLoadExecutor-3736-thread-1-processing-n:127.0.0.1:59154_) [n:127.0.0.1:59154_ c:control_collection   x:collection1] o.a.s.c.SolrConfig Using Lucene MatchVersion: 6.0.0
   [junit4]   2> 1589019 INFO  (coreLoadExecutor-3736-thread-1-processing-n:127.0.0.1:59154_) [n:127.0.0.1:59154_ c:control_collection   x:collection1] o.a.s.c.Config Loaded SolrConfig: solrconfig.xml
   [junit4]   2> 1589020 INFO  (coreLoadExecutor-3736-thread-1-processing-n:127.0.0.1:59154_) [n:127.0.0.1:59154_ c:control_collection   x:collection1] o.a.s.s.IndexSchema Reading Solr Schema from /configs/conf1/schema.xml
   [junit4]   2> 1589025 INFO  (coreLoadExecutor-3736-thread-1-processing-n:127.0.0.1:59154_) [n:127.0.0.1:59154_ c:control_collection   x:collection1] o.a.s.s.IndexSchema [collection1] Schema name=test
   [junit4]   2> 1589133 INFO  (coreLoadExecutor-3736-thread-1-processing-n:127.0.0.1:59154_) [n:127.0.0.1:59154_ c:control_collection   x:collection1] o.a.s.s.OpenExchangeRatesOrgProvider Initialized with rates=open-exchange-rates.json, refreshInterval=1440.
   [junit4]   2> 1589139 INFO  (coreLoadExecutor-3736-thread-1-processing-n:127.0.0.1:59154_) [n:127.0.0.1:59154_ c:control_collection   x:collection1] o.a.s.s.IndexSchema default search field in schema is text
   [junit4]   2> 1589140 INFO  (coreLoadExecutor-3736-thread-1-processing-n:127.0.0.1:59154_) [n:127.0.0.1:59154_ c:control_collection   x:collection1] o.a.s.s.IndexSchema unique key field: id
   [junit4]   2> 1589151 INFO  (coreLoadExecutor-3736-thread-1-processing-n:127.0.0.1:59154_) [n:127.0.0.1:59154_ c:control_collection   x:collection1] o.a.s.s.FileExchangeRateProvider Reloading exchange rates from file currency.xml
   [junit4]   2> 1589153 INFO  (coreLoadExecutor-3736-thread-1-processing-n:127.0.0.1:59154_) [n:127.0.0.1:59154_ c:control_collection   x:collection1] o.a.s.s.FileExchangeRateProvider Reloading exchange rates from file currency.xml
   [junit4]   2> 1589156 INFO  (coreLoadExecutor-3736-thread-1-processing-n:127.0.0.1:59154_) [n:127.0.0.1:59154_ c:control_collection   x:collection1] o.a.s.s.OpenExchangeRatesOrgProvider Reloading exchange rates from open-exchange-rates.json
   [junit4]   2> 1589157 WARN  (coreLoadExecutor-3736-thread-1-processing-n:127.0.0.1:59154_) [n:127.0.0.1:59154_ c:control_collection   x:collection1] o.a.s.s.OpenExchangeRatesOrgProvider Unknown key IMPORTANT NOTE
   [junit4]   2> 1589157 WARN  (coreLoadExecutor-3736-thread-1-processing-n:127.0.0.1:59154_) [n:127.0.0.1:59154_ c:control_collection   x:collection1] o.a.s.s.OpenExchangeRatesOrgProvider Expected key, got STRING
   [junit4]   2> 1589157 INFO  (coreLoadExecutor-3736-thread-1-processing-n:127.0.0.1:59154_) [n:127.0.0.1:59154_ c:control_collection   x:collection1] o.a.s.s.OpenExchangeRatesOrgProvider Reloading exchange rates from open-exchange-rates.json
   [junit4]   2> 1589158 WARN  (coreLoadExecutor-3736-thread-1-processing-n:127.0.0.1:59154_) [n:127.0.0.1:59154_ c:control_collection   x:collection1] o.a.s.s.OpenExchangeRatesOrgProvider Unknown key IMPORTANT NOTE
   [junit4]   2> 1589158 WARN  (coreLoadExecutor-3736-thread-1-processing-n:127.0.0.1:59154_) [n:127.0.0.1:59154_ c:control_collection   x:collection1] o.a.s.s.OpenExchangeRatesOrgProvider Expected key, got STRING
   [junit4]   2> 1589159 INFO  (coreLoadExecutor-3736-thread-1-processing-n:127.0.0.1:59154_) [n:127.0.0.1:59154_ c:control_collection   x:collection1] o.a.s.c.ConfigSetProperties Did not find ConfigSet properties
   [junit4]   2> org.apache.solr.core.SolrResourceNotFoundException: Can't find resource 'configsetprops.json' in classpath or '/configs/conf1', cwd=/x1/jenkins/jenkins-slave/workspace/Lucene-Solr-NightlyTests-trunk/solr/build/solr-core/test/J2
   [junit4]   2> 	at org.apache.solr.cloud.ZkSolrResourceLoader.openResource(ZkSolrResourceLoader.java:99)
   [junit4]   2> 	at org.apache.solr.core.ConfigSetProperties.readFromResourceLoader(ConfigSetProperties.java:49)
   [junit4]   2> 	at org.apache.solr.core.ConfigSetService.createConfigSetProperties(ConfigSetService.java:114)
   [junit4]   2> 	at org.apache.solr.core.ConfigSetService.getConfig(ConfigSetService.java:76)
   [junit4]   2> 	at org.apache.solr.core.CoreContainer.create(CoreContainer.java:668)
   [junit4]   2> 	at org.apache.solr.core.CoreContainer$1.call(CoreContainer.java:397)
   [junit4]   2> 	at org.apache.solr.core.CoreContainer$1.call(CoreContainer.java:388)
   [junit4]   2> 	at java.util.concurrent.FutureTask.run(FutureTask.java:266)
   [junit4]   2> 	at org.apache.solr.common.util.ExecutorUtil$MDCAwareThreadPoolExecutor$1.run(ExecutorUtil.java:156)
   [junit4]   2> 	at java.util.concurrent.ThreadPoolExecutor.runWorker(ThreadPoolExecutor.java:1142)
   [junit4]   2> 	at java.util.concurrent.ThreadPoolExecutor$Worker.run(ThreadPoolExecutor.java:617)
   [junit4]   2> 	at java.lang.Thread.run(Thread.java:745)
   [junit4]   2> 1589160 INFO  (coreLoadExecutor-3736-thread-1-processing-n:127.0.0.1:59154_) [n:127.0.0.1:59154_ c:control_collection   x:collection1] o.a.s.c.CoreContainer Creating SolrCore 'collection1' using configuration from collection control_collection
   [junit4]   2> 1589160 INFO  (coreLoadExecutor-3736-thread-1-processing-n:127.0.0.1:59154_) [n:127.0.0.1:59154_ c:control_collection s:shard1 r:core_node1 x:collection1] o.a.s.c.SolrCore org.apache.solr.core.MockDirectoryFactory
   [junit4]   2> 1589160 INFO  (coreLoadExecutor-3736-thread-1-processing-n:127.0.0.1:59154_) [n:127.0.0.1:59154_ c:control_collection s:shard1 r:core_node1 x:collection1] o.a.s.c.SolrCore [[collection1] ] Opening new SolrCore at [/x1/jenkins/jenkins-slave/workspace/Lucene-Solr-NightlyTests-trunk/solr/build/solr-core/test/J2/temp/solr.cloud.CollectionsAPIDistributedZkTest_ABB8E213C56C6A65-001/control-001/cores/collection1/], dataDir=[null]
   [junit4]   2> 1589160 INFO  (coreLoadExecutor-3736-thread-1-processing-n:127.0.0.1:59154_) [n:127.0.0.1:59154_ c:control_collection s:shard1 r:core_node1 x:collection1] o.a.s.c.JmxMonitoredMap JMX monitoring is enabled. Adding Solr mbeans to JMX Server: com.sun.jmx.mbeanserver.JmxMBeanServer@5a1adc91
   [junit4]   2> 1589161 INFO  (coreLoadExecutor-3736-thread-1-processing-n:127.0.0.1:59154_) [n:127.0.0.1:59154_ c:control_collection s:shard1 r:core_node1 x:collection1] o.a.s.c.CachingDirectoryFactory return new directory for /x1/jenkins/jenkins-slave/workspace/Lucene-Solr-NightlyTests-trunk/solr/build/solr-core/test/J2/temp/solr.cloud.CollectionsAPIDistributedZkTest_ABB8E213C56C6A65-001/control-001/cores/collection1/data
   [junit4]   2> 1589161 INFO  (coreLoadExecutor-3736-thread-1-processing-n:127.0.0.1:59154_) [n:127.0.0.1:59154_ c:control_collection s:shard1 r:core_node1 x:collection1] o.a.s.c.SolrCore New index directory detected: old=null new=/x1/jenkins/jenkins-slave/workspace/Lucene-Solr-NightlyTests-trunk/solr/build/solr-core/test/J2/temp/solr.cloud.CollectionsAPIDistributedZkTest_ABB8E213C56C6A65-001/control-001/cores/collection1/data/index/
   [junit4]   2> 1589161 WARN  (coreLoadExecutor-3736-thread-1-processing-n:127.0.0.1:59154_) [n:127.0.0.1:59154_ c:control_collection s:shard1 r:core_node1 x:collection1] o.a.s.c.SolrCore [collection1] Solr index directory '/x1/jenkins/jenkins-slave/workspace/Lucene-Solr-NightlyTests-trunk/solr/build/solr-core/test/J2/temp/solr.cloud.CollectionsAPIDistributedZkTest_ABB8E213C56C6A65-001/control-001/cores/collection1/data/index' doesn't exist. Creating new index...
   [junit4]   2> 1589161 INFO  (coreLoadExecutor-3736-thread-1-processing-n:127.0.0.1:59154_) [n:127.0.0.1:59154_ c:control_collection s:shard1 r:core_node1 x:collection1] o.a.s.c.CachingDirectoryFactory return new directory for /x1/jenkins/jenkins-slave/workspace/Lucene-Solr-NightlyTests-trunk/solr/build/solr-core/test/J2/temp/solr.cloud.CollectionsAPIDistributedZkTest_ABB8E213C56C6A65-001/control-001/cores/collection1/data/index
   [junit4]   2> 1589162 INFO  (coreLoadExecutor-3736-thread-1-processing-n:127.0.0.1:59154_) [n:127.0.0.1:59154_ c:control_collection s:shard1 r:core_node1 x:collection1] o.a.s.u.RandomMergePolicy RandomMergePolicy wrapping class org.apache.lucene.index.AlcoholicMergePolicy: [AlcoholicMergePolicy: minMergeSize=0, mergeFactor=10, maxMergeSize=2037095973, maxMergeSizeForForcedMerge=9223372036854775807, calibrateSizeByDeletes=true, maxMergeDocs=2147483647, maxCFSSegmentSizeMB=8.796093022207999E12, noCFSRatio=0.1]
   [junit4]   2> 1589162 INFO  (coreLoadExecutor-3736-thread-1-processing-n:127.0.0.1:59154_) [n:127.0.0.1:59154_ c:control_collection s:shard1 r:core_node1 x:collection1] o.a.s.c.SolrCore SolrDeletionPolicy.onCommit: commits: num=1
   [junit4]   2> 	commit{dir=RawDirectoryWrapper(RAMDirectory@400dd32b lockFactory=org.apache.lucene.store.SingleInstanceLockFactory@2048d07c),segFN=segments_1,generation=1}
   [junit4]   2> 1589163 INFO  (coreLoadExecutor-3736-thread-1-processing-n:127.0.0.1:59154_) [n:127.0.0.1:59154_ c:control_collection s:shard1 r:core_node1 x:collection1] o.a.s.c.SolrCore newest commit generation = 1
   [junit4]   2> 1589163 INFO  (OldIndexDirectoryCleanupThreadForCore-collection1) [n:127.0.0.1:59154_ c:control_collection s:shard1 r:core_node1 x:collection1] o.a.s.c.SolrCore Looking for old index directories to cleanup for core collection1 in /x1/jenkins/jenkins-slave/workspace/Lucene-Solr-NightlyTests-trunk/solr/build/solr-core/test/J2/temp/solr.cloud.CollectionsAPIDistributedZkTest_ABB8E213C56C6A65-001/control-001/cores/collection1/data/
   [junit4]   2> 1589169 WARN  (OldIndexDirectoryCleanupThreadForCore-collection1) [n:127.0.0.1:59154_ c:control_collection s:shard1 r:core_node1 x:collection1] o.a.s.c.DirectoryFactory /x1/jenkins/jenkins-slave/workspace/Lucene-Solr-NightlyTests-trunk/solr/build/solr-core/test/J2/temp/solr.cloud.CollectionsAPIDistributedZkTest_ABB8E213C56C6A65-001/control-001/cores/collection1/data/ does not point to a valid data directory; skipping clean-up of old index directories.
   [junit4]   2> 1589166 INFO  (coreLoadExecutor-3736-thread-1-processing-n:127.0.0.1:59154_) [n:127.0.0.1:59154_ c:control_collection s:shard1 r:core_node1 x:collection1] o.a.s.u.p.UpdateRequestProcessorChain creating updateRequestProcessorChain "nodistrib"
   [junit4]   2> 1589172 INFO  (coreLoadExecutor-3736-thread-1-processing-n:127.0.0.1:59154_) [n:127.0.0.1:59154_ c:control_collection s:shard1 r:core_node1 x:collection1] o.a.s.u.p.UpdateRequestProcessorChain creating updateRequestProcessorChain "dedupe"
   [junit4]   2> 1589172 INFO  (coreLoadExecutor-3736-thread-1-processing-n:127.0.0.1:59154_) [n:127.0.0.1:59154_ c:control_collection s:shard1 r:core_node1 x:collection1] o.a.s.u.p.UpdateRequestProcessorChain inserting DistributedUpdateProcessorFactory into updateRequestProcessorChain "dedupe"
   [junit4]   2> 1589172 INFO  (coreLoadExecutor-3736-thread-1-processing-n:127.0.0.1:59154_) [n:127.0.0.1:59154_ c:control_collection s:shard1 r:core_node1 x:collection1] o.a.s.u.p.UpdateRequestProcessorChain creating updateRequestProcessorChain "stored_sig"
   [junit4]   2> 1589172 INFO  (coreLoadExecutor-3736-thread-1-processing-n:127.0.0.1:59154_) [n:127.0.0.1:59154_ c:control_collection s:shard1 r:core_node1 x:collection1] o.a.s.u.p.UpdateRequestProcessorChain inserting DistributedUpdateProcessorFactory into updateRequestProcessorChain "stored_sig"
   [junit4]   2> 1589172 INFO  (coreLoadExecutor-3736-thread-1-processing-n:127.0.0.1:59154_) [n:127.0.0.1:59154_ c:control_collection s:shard1 r:core_node1 x:collection1] o.a.s.u.p.UpdateRequestProcessorChain creating updateRequestProcessorChain "distrib-dup-test-chain-explicit"
   [junit4]   2> 1589173 INFO  (coreLoadExecutor-3736-thread-1-processing-n:127.0.0.1:59154_) [n:127.0.0.1:59154_ c:control_collection s:shard1 r:core_node1 x:collection1] o.a.s.u.p.UpdateRequestProcessorChain creating updateRequestProcessorChain "distrib-dup-test-chain-implicit"
   [junit4]   2> 1589173 INFO  (coreLoadExecutor-3736-thread-1-processing-n:127.0.0.1:59154_) [n:127.0.0.1:59154_ c:control_collection s:shard1 r:core_node1 x:collection1] o.a.s.u.p.UpdateRequestProcessorChain inserting DistributedUpdateProcessorFactory into updateRequestProcessorChain "distrib-dup-test-chain-implicit"
   [junit4]   2> 1589173 INFO  (coreLoadExecutor-3736-thread-1-processing-n:127.0.0.1:59154_) [n:127.0.0.1:59154_ c:control_collection s:shard1 r:core_node1 x:collection1] o.a.s.c.SolrCore no updateRequestProcessorChain defined as default, creating implicit default
   [junit4]   2> 1589175 INFO  (coreLoadExecutor-3736-thread-1-processing-n:127.0.0.1:59154_) [n:127.0.0.1:59154_ c:control_collection s:shard1 r:core_node1 x:collection1] o.a.s.h.l.XMLLoader xsltCacheLifetimeSeconds=60
   [junit4]   2> 1589176 INFO  (coreLoadExecutor-3736-thread-1-processing-n:127.0.0.1:59154_) [n:127.0.0.1:59154_ c:control_collection s:shard1 r:core_node1 x:collection1] o.a.s.h.l.XMLLoader xsltCacheLifetimeSeconds=60
   [junit4]   2> 1589177 INFO  (coreLoadExecutor-3736-thread-1-processing-n:127.0.0.1:59154_) [n:127.0.0.1:59154_ c:control_collection s:shard1 r:core_node1 x:collection1] o.a.s.h.l.XMLLoader xsltCacheLifetimeSeconds=60
   [junit4]   2> 1589178 INFO  (coreLoadExecutor-3736-thread-1-processing-n:127.0.0.1:59154_) [n:127.0.0.1:59154_ c:control_collection s:shard1 r:core_node1 x:collection1] o.a.s.h.l.XMLLoader xsltCacheLifetimeSeconds=60
   [junit4]   2> 1589186 INFO  (coreLoadExecutor-3736-thread-1-processing-n:127.0.0.1:59154_) [n:127.0.0.1:59154_ c:control_collection s:shard1 r:core_node1 x:collection1] o.a.s.c.RequestHandlers Registered paths: /admin/mbeans,standard,/update/csv,/update/json/docs,/admin/luke,/admin/segments,/get,/admin/system,/replication,/admin/properties,/config,/schema,/admin/plugins,/admin/logging,/update/json,/admin/threads,/admin/ping,/update,/admin/file
   [junit4]   2> 1589187 INFO  (coreLoadExecutor-3736-thread-1-processing-n:127.0.0.1:59154_) [n:127.0.0.1:59154_ c:control_collection s:shard1 r:core_node1 x:collection1] o.a.s.c.SolrCore Using default statsCache cache: org.apache.solr.search.stats.LocalStatsCache
   [junit4]   2> 1589188 INFO  (coreLoadExecutor-3736-thread-1-processing-n:127.0.0.1:59154_) [n:127.0.0.1:59154_ c:control_collection s:shard1 r:core_node1 x:collection1] o.a.s.u.UpdateHandler Using UpdateLog implementation: org.apache.solr.update.UpdateLog
   [junit4]   2> 1589189 INFO  (coreLoadExecutor-3736-thread-1-processing-n:127.0.0.1:59154_) [n:127.0.0.1:59154_ c:control_collection s:shard1 r:core_node1 x:collection1] o.a.s.u.UpdateLog Initializing UpdateLog: dataDir= defaultSyncLevel=FLUSH numRecordsToKeep=100 maxNumLogsToKeep=10 numVersionBuckets=65536
   [junit4]   2> 1589190 INFO  (coreLoadExecutor-3736-thread-1-processing-n:127.0.0.1:59154_) [n:127.0.0.1:59154_ c:control_collection s:shard1 r:core_node1 x:collection1] o.a.s.c.SolrCore Hard AutoCommit: disabled
   [junit4]   2> 1589190 INFO  (coreLoadExecutor-3736-thread-1-processing-n:127.0.0.1:59154_) [n:127.0.0.1:59154_ c:control_collection s:shard1 r:core_node1 x:collection1] o.a.s.c.SolrCore Soft AutoCommit: disabled
   [junit4]   2> 1589190 INFO  (coreLoadExecutor-3736-thread-1-processing-n:127.0.0.1:59154_) [n:127.0.0.1:59154_ c:control_collection s:shard1 r:core_node1 x:collection1] o.a.s.u.RandomMergePolicy RandomMergePolicy wrapping class org.apache.lucene.index.TieredMergePolicy: [TieredMergePolicy: maxMergeAtOnce=11, maxMergeAtOnceExplicit=43, maxMergedSegmentMB=30.46484375, floorSegmentMB=0.7255859375, forceMergeDeletesPctAllowed=12.953108642077433, segmentsPerTier=47.0, maxCFSSegmentSizeMB=8.796093022207999E12, noCFSRatio=1.0
   [junit4]   2> 1589191 INFO  (coreLoadExecutor-3736-thread-1-processing-n:127.0.0.1:59154_) [n:127.0.0.1:59154_ c:control_collection s:shard1 r:core_node1 x:collection1] o.a.s.c.SolrCore SolrDeletionPolicy.onInit: commits: num=1
   [junit4]   2> 	commit{dir=RawDirectoryWrapper(RAMDirectory@400dd32b lockFactory=org.apache.lucene.store.SingleInstanceLockFactory@2048d07c),segFN=segments_1,generation=1}
   [junit4]   2> 1589191 INFO  (coreLoadExecutor-3736-thread-1-processing-n:127.0.0.1:59154_) [n:127.0.0.1:59154_ c:control_collection s:shard1 r:core_node1 x:collection1] o.a.s.c.SolrCore newest commit generation = 1
   [junit4]   2> 1589191 INFO  (coreLoadExecutor-3736-thread-1-processing-n:127.0.0.1:59154_) [n:127.0.0.1:59154_ c:control_collection s:shard1 r:core_node1 x:collection1] o.a.s.s.SolrIndexSearcher Opening Searcher@4c75aac4[collection1] main
   [junit4]   2> 1589191 INFO  (coreLoadExecutor-3736-thread-1-processing-n:127.0.0.1:59154_) [n:127.0.0.1:59154_ c:control_collection s:shard1 r:core_node1 x:collection1] o.a.s.c.c.ZkStateReader Load collection config from:/collections/control_collection
   [junit4]   2> 1589192 INFO  (coreLoadExecutor-3736-thread-1-processing-n:127.0.0.1:59154_) [n:127.0.0.1:59154_ c:control_collection s:shard1 r:core_node1 x:collection1] o.a.s.c.c.ZkStateReader path=/collections/control_collection configName=conf1 specified config exists in ZooKeeper
   [junit4]   2> 1589192 INFO  (coreLoadExecutor-3736-thread-1-processing-n:127.0.0.1:59154_) [n:127.0.0.1:59154_ c:control_collection s:shard1 r:core_node1 x:collection1] o.a.s.r.ManagedResourceStorage Setting up ZooKeeper-based storage for the RestManager with znodeBase: /configs/conf1
   [junit4]   2> 1589193 INFO  (coreLoadExecutor-3736-thread-1-processing-n:127.0.0.1:59154_) [n:127.0.0.1:59154_ c:control_collection s:shard1 r:core_node1 x:collection1] o.a.s.r.ManagedResourceStorage Configured ZooKeeperStorageIO with znodeBase: /configs/conf1
   [junit4]   2> 1589193 INFO  (coreLoadExecutor-3736-thread-1-processing-n:127.0.0.1:59154_) [n:127.0.0.1:59154_ c:control_collection s:shard1 r:core_node1 x:collection1] o.a.s.r.RestManager Initializing RestManager with initArgs: {}
   [junit4]   2> 1589193 INFO  (coreLoadExecutor-3736-thread-1-processing-n:127.0.0.1:59154_) [n:127.0.0.1:59154_ c:control_collection s:shard1 r:core_node1 x:collection1] o.a.s.r.ManagedResourceStorage Reading _rest_managed.json using ZooKeeperStorageIO:path=/configs/conf1
   [junit4]   2> 1589193 INFO  (coreLoadExecutor-3736-thread-1-processing-n:127.0.0.1:59154_) [n:127.0.0.1:59154_ c:control_collection s:shard1 r:core_node1 x:collection1] o.a.s.r.ManagedResourceStorage No data found for znode /configs/conf1/_rest_managed.json
   [junit4]   2> 1589194 INFO  (coreLoadExecutor-3736-thread-1-processing-n:127.0.0.1:59154_) [n:127.0.0.1:59154_ c:control_collection s:shard1 r:core_node1 x:collection1] o.a.s.r.ManagedResourceStorage Loaded null at path _rest_managed.json using ZooKeeperStorageIO:path=/configs/conf1
   [junit4]   2> 1589194 INFO  (coreLoadExecutor-3736-thread-1-processing-n:127.0.0.1:59154_) [n:127.0.0.1:59154_ c:control_collection s:shard1 r:core_node1 x:collection1] o.a.s.r.RestManager Initializing 0 registered ManagedResources
   [junit4]   2> 1589194 INFO  (coreLoadExecutor-3736-thread-1-processing-n:127.0.0.1:59154_) [n:127.0.0.1:59154_ c:control_collection s:shard1 r:core_node1 x:collection1] o.a.s.h.ReplicationHandler Commits will be reserved for  10000
   [junit4]   2> 1589195 INFO  (searcherExecutor-3737-thread-1-processing-n:127.0.0.1:59154_ x:collection1 s:shard1 c:control_collection r:core_node1) [n:127.0.0.1:59154_ c:control_collection s:shard1 r:core_node1 x:collection1] o.a.s.c.SolrCore [collection1] Registered new searcher Searcher@4c75aac4[collection1] main{ExitableDirectoryReader(UninvertingDirectoryReader())}
   [junit4]   2> 1589195 INFO  (coreLoadExecutor-3736-thread-1-processing-n:127.0.0.1:59154_) [n:127.0.0.1:59154_ c:control_collection s:shard1 r:core_node1 x:collection1] o.a.s.u.UpdateLog Looking up max value of version field to seed version buckets
   [junit4]   2> 1589195 INFO  (coreLoadExecutor-3736-thread-1-processing-n:127.0.0.1:59154_) [n:127.0.0.1:59154_ c:control_collection s:shard1 r:core_node1 x:collection1] o.a.s.u.VersionInfo Refreshing highest value of _version_ for 65536 version buckets from index
   [junit4]   2> 1589195 INFO  (coreLoadExecutor-3736-thread-1-processing-n:127.0.0.1:59154_) [n:127.0.0.1:59154_ c:control_collection s:shard1 r:core_node1 x:collection1] o.a.s.u.VersionInfo No terms found for _version_, cannot seed version bucket highest value from index
   [junit4]   2> 1589195 INFO  (coreLoadExecutor-3736-thread-1-processing-n:127.0.0.1:59154_) [n:127.0.0.1:59154_ c:control_collection s:shard1 r:core_node1 x:collection1] o.a.s.u.UpdateLog Could not find max version in index or recent updates, using new clock 1507013906972803072
   [junit4]   2> 1589197 INFO  (coreLoadExecutor-3736-thread-1-processing-n:127.0.0.1:59154_) [n:127.0.0.1:59154_ c:control_collection s:shard1 r:core_node1 x:collection1] o.a.s.u.UpdateLog Took 2 ms to seed version buckets with highest version 1507013906972803072
   [junit4]   2> 1589198 INFO  (coreLoadExecutor-3736-thread-1-processing-n:127.0.0.1:59154_) [n:127.0.0.1:59154_ c:control_collection s:shard1 r:core_node1 x:collection1] o.a.s.c.ZkController watch zkdir /configs/conf1
   [junit4]   2> 1589198 INFO  (coreLoadExecutor-3736-thread-1-processing-n:127.0.0.1:59154_) [n:127.0.0.1:59154_ c:control_collection s:shard1 r:core_node1 x:collection1] o.a.s.c.CoreContainer registering core: collection1
   [junit4]   2> 1589199 INFO  (coreZkRegister-3730-thread-1-processing-n:127.0.0.1:59154_ x:collection1 s:shard1 c:control_collection r:core_node1) [n:127.0.0.1:59154_ c:control_collection s:shard1 r:core_node1 x:collection1] o.a.s.c.ZkController Register replica - core:collection1 address:http://127.0.0.1:59154 collection:control_collection shard:shard1
   [junit4]   2> 1589200 INFO  (coreZkRegister-3730-thread-1-processing-n:127.0.0.1:59154_ x:collection1 s:shard1 c:control_collection r:core_node1) [n:127.0.0.1:59154_ c:control_collection s:shard1 r:core_node1 x:collection1] o.a.s.c.c.SolrZkClient makePath: /collections/control_collection/leader_elect/shard1/election
   [junit4]   2> 1589207 INFO  (coreZkRegister-3730-thread-1-processing-n:127.0.0.1:59154_ x:collection1 s:shard1 c:control_collection r:core_node1) [n:127.0.0.1:59154_ c:control_collection s:shard1 r:core_node1 x:collection1] o.a.s.c.LeaderElector Joined leadership election with path: /collections/control_collection/leader_elect/shard1/election/94188369055776773-core_node1-n_0000000000
   [junit4]   2> 1589208 INFO  (coreZkRegister-3730-thread-1-processing-n:127.0.0.1:59154_ x:collection1 s:shard1 c:control_collection r:core_node1) [n:127.0.0.1:59154_ c:control_collection s:shard1 r:core_node1 x:collection1] o.a.s.c.ShardLeaderElectionContext Running the leader process for shard shard1
   [junit4]   2> 1589209 INFO  (zkCallback-720-thread-1-processing-n:127.0.0.1:59154_) [n:127.0.0.1:59154_    ] o.a.s.c.DistributedQueue NodeChildrenChanged fired on path /overseer/queue state SyncConnected
   [junit4]   2> 1589209 INFO  (OverseerStateUpdate-94188369055776773-127.0.0.1:59154_-n_0000000000) [n:127.0.0.1:59154_    ] o.a.s.c.Overseer processMessage: queueSize: 1, message = {
   [junit4]   2>   "operation":"leader",
   [junit4]   2>   "shard":"shard1",
   [junit4]   2>   "collection":"control_collection"} current state version: 1
   [junit4]   2> 1589211 INFO  (coreZkRegister-3730-thread-1-processing-n:127.0.0.1:59154_ x:collection1 s:shard1 c:control_collection r:core_node1) [n:127.0.0.1:59154_ c:control_collection s:shard1 r:core_node1 x:collection1] o.a.s.c.ShardLeaderElectionContext Enough replicas found to continue.
   [junit4]   2> 1589211 INFO  (coreZkRegister-3730-thread-1-processing-n:127.0.0.1:59154_ x:collection1 s:shard1 c:control_collection r:core_node1) [n:127.0.0.1:59154_ c:control_collection s:shard1 r:core_node1 x:collection1] o.a.s.c.ShardLeaderElectionContext I may be the new leader - try and sync
   [junit4]   2> 1589211 INFO  (coreZkRegister-3730-thread-1-processing-n:127.0.0.1:59154_ x:collection1 s:shard1 c:control_collection r:core_node1) [n:127.0.0.1:59154_ c:control_collection s:shard1 r:core_node1 x:collection1] o.a.s.c.SyncStrategy Sync replicas to http://127.0.0.1:59154/collection1/
   [junit4]   2> 1589211 INFO  (coreZkRegister-3730-thread-1-processing-n:127.0.0.1:59154_ x:collection1 s:shard1 c:control_collection r:core_node1) [n:127.0.0.1:59154_ c:control_collection s:shard1 r:core_node1 x:collection1] o.a.s.c.SyncStrategy Sync Success - now sync replicas to me
   [junit4]   2> 1589212 INFO  (coreZkRegister-3730-thread-1-processing-n:127.0.0.1:59154_ x:collection1 s:shard1 c:control_collection r:core_node1) [n:127.0.0.1:59154_ c:control_collection s:shard1 r:core_node1 x:collection1] o.a.s.c.SyncStrategy http://127.0.0.1:59154/collection1/ has no replicas
   [junit4]   2> 1589212 INFO  (coreZkRegister-3730-thread-1-processing-n:127.0.0.1:59154_ x:collection1 s:shard1 c:control_collection r:core_node1) [n:127.0.0.1:59154_ c:control_collection s:shard1 r:core_node1 x:collection1] o.a.s.c.ShardLeaderElectionContext I am the new leader: http://127.0.0.1:59154/collection1/ shard1
   [junit4]   2> 1589212 INFO  (coreZkRegister-3730-thread-1-processing-n:127.0.0.1:59154_ x:collection1 s:shard1 c:control_collection r:core_node1) [n:127.0.0.1:59154_ c:control_collection s:shard1 r:core_node1 x:collection1] o.a.s.c.c.SolrZkClient makePath: /collections/control_collection/leaders/shard1
   [junit4]   2> 1589215 INFO  (zkCallback-720-thread-1-processing-n:127.0.0.1:59154_) [n:127.0.0.1:59154_    ] o.a.s.c.DistributedQueue NodeChildrenChanged fired on path /overseer/queue state SyncConnected
   [junit4]   2> 1589215 INFO  (OverseerStateUpdate-94188369055776773-127.0.0.1:59154_-n_0000000000) [n:127.0.0.1:59154_    ] o.a.s.c.Overseer processMessage: queueSize: 1, message = {
   [junit4]   2>   "operation":"leader",
   [junit4]   2>   "shard":"shard1",
   [junit4]   2>   "collection":"control_collection",
   [junit4]   2>   "base_url":"http://127.0.0.1:59154",
   [junit4]   2>   "core":"collection1",
   [junit4]   2>   "state":"active"} current state version: 1
   [junit4]   2> 1589318 INFO  (zkCallback-720-thread-1-processing-n:127.0.0.1:59154_) [n:127.0.0.1:59154_    ] o.a.s.c.c.ZkStateReader A cluster state change: WatchedEvent state:SyncConnected type:NodeDataChanged path:/clusterstate.json, has occurred - updating... (live nodes size: 1)
   [junit4]   2> 1589319 INFO  (zkCallback-720-thread-1-processing-n:127.0.0.1:59154_) [n:127.0.0.1:59154_    ] o.a.s.c.c.ZkStateReader Updated cluster state version to 2
   [junit4]   2> 1589368 INFO  (coreZkRegister-3730-thread-1-processing-n:127.0.0.1:59154_ x:collection1 s:shard1 c:control_collection r:core_node1) [n:127.0.0.1:59154_ c:control_collection s:shard1 r:core_node1 x:collection1] o.a.s.c.ZkController We are http://127.0.0.1:59154/collection1/ and leader is http://127.0.0.1:59154/collection1/
   [junit4]   2> 1589368 INFO  (coreZkRegister-3730-thread-1-processing-n:127.0.0.1:59154_ x:collection1 s:shard1 c:control_collection r:core_node1) [n:127.0.0.1:59154_ c:control_collection s:shard1 r:core_node1 x:collection1] o.a.s.c.ZkController No LogReplay needed for core=collection1 baseURL=http://127.0.0.1:59154
   [junit4]   2> 1589368 INFO  (coreZkRegister-3730-thread-1-processing-n:127.0.0.1:59154_ x:collection1 s:shard1 c:control_collection r:core_node1) [n:127.0.0.1:59154_ c:control_collection s:shard1 r:core_node1 x:collection1] o.a.s.c.ZkController I am the leader, no recovery necessary
   [junit4]   2> 1589368 INFO  (coreZkRegister-3730-thread-1-processing-n:127.0.0.1:59154_ x:collection1 s:shard1 c:control_collection r:core_node1) [n:127.0.0.1:59154_ c:control_collection s:shard1 r:core_node1 x:collection1] o.a.s.c.ZkController publishing state=active
   [junit4]   2> 1589369 INFO  (coreZkRegister-3730-thread-1-processing-n:127.0.0.1:59154_ x:collection1 s:shard1 c:control_collection r:core_node1) [n:127.0.0.1:59154_ c:control_collection s:shard1 r:core_node1 x:collection1] o.a.s.c.ZkController numShards not found on descriptor - reading it from system property
   [junit4]   2> 1589370 INFO  (zkCallback-720-thread-1-processing-n:127.0.0.1:59154_) [n:127.0.0.1:59154_    ] o.a.s.c.DistributedQueue NodeChildrenChanged fired on path /overseer/queue state SyncConnected
   [junit4]   2> 1589370 INFO  (OverseerStateUpdate-94188369055776773-127.0.0.1:59154_-n_0000000000) [n:127.0.0.1:59154_    ] o.a.s.c.Overseer processMessage: queueSize: 1, message = {
   [junit4]   2>   "core":"collection1",
   [junit4]   2>   "core_node_name":"core_node1",
   [junit4]   2>   "roles":null,
   [junit4]   2>   "base_url":"http://127.0.0.1:59154",
   [junit4]   2>   "node_name":"127.0.0.1:59154_",
   [junit4]   2>   "numShards":"1",
   [junit4]   2>   "state":"active",
   [junit4]   2>   "shard":"shard1",
   [junit4]   2>   "collection":"control_collection",
   [junit4]   2>   "operation":"state"} current state version: 2
   [junit4]   2> 1589371 INFO  (OverseerStateUpdate-94188369055776773-127.0.0.1:59154_-n_0000000000) [n:127.0.0.1:59154_    ] o.a.s.c.o.ReplicaMutator Update state numShards=1 message={
   [junit4]   2>   "core":"collection1",
   [junit4]   2>   "core_node_name":"core_node1",
   [junit4]   2>   "roles":null,
   [junit4]   2>   "base_url":"http://127.0.0.1:59154",
   [junit4]   2>   "node_name":"127.0.0.1:59154_",
   [junit4]   2>   "numShards":"1",
   [junit4]   2>   "state":"active",
   [junit4]   2>   "shard":"shard1",
   [junit4]   2>   "collection":"control_collection",
   [junit4]   2>   "operation":"state"}
   [junit4]   2> 1589466 INFO  (TEST-CollectionsAPIDistributedZkTest.test-seed#[ABB8E213C56C6A65]) [    ] o.a.s.c.c.SolrZkClient Using default ZkCredentialsProvider
   [junit4]   2> 1589469 INFO  (TEST-CollectionsAPIDistributedZkTest.test-seed#[ABB8E213C56C6A65]) [    ] o.a.s.c.c.ConnectionManager Waiting for client to connect to ZooKeeper
   [junit4]   2> 1589470 INFO  (zkCallback-722-thread-1) [    ] o.a.s.c.c.ConnectionManager Watcher org.apache.solr.common.cloud.ConnectionManager@9b2b172 name:ZooKeeperConnection Watcher:127.0.0.1:36125/solr got event WatchedEvent state:SyncConnected type:None path:null path:null type:None
   [junit4]   2> 1589470 INFO  (TEST-CollectionsAPIDistributedZkTest.test-seed#[ABB8E213C56C6A65]) [    ] o.a.s.c.c.ConnectionManager Client is connected to ZooKeeper
   [junit4]   2> 1589470 INFO  (TEST-CollectionsAPIDistributedZkTest.test-seed#[ABB8E213C56C6A65]) [    ] o.a.s.c.c.SolrZkClient Using default ZkACLProvider
   [junit4]   2> 1589470 INFO  (TEST-CollectionsAPIDistributedZkTest.test-seed#[ABB8E213C56C6A65]) [    ] o.a.s.c.c.ZkStateReader Updating cluster state from ZooKeeper... 
   [junit4]   2> 1589473 INFO  (TEST-CollectionsAPIDistributedZkTest.test-seed#[ABB8E213C56C6A65]) [    ] o.a.s.c.ChaosMonkey monkey: init - expire sessions:false cause connection loss:false
   [junit4]   2> 1589478 INFO  (zkCallback-720-thread-1-processing-n:127.0.0.1:59154_) [n:127.0.0.1:59154_    ] o.a.s.c.c.ZkStateReader A cluster state change: WatchedEvent state:SyncConnected type:NodeDataChanged path:/clusterstate.json, has occurred - updating... (live nodes size: 1)
   [junit4]   2> 1589480 INFO  (zkCallback-720-thread-1-processing-n:127.0.0.1:59154_) [n:127.0.0.1:59154_    ] o.a.s.c.c.ZkStateReader Updated cluster state version to 3
   [junit4]   2> 1589480 INFO  (zkCallback-722-thread-1) [    ] o.a.s.c.c.ZkStateReader A cluster state change: WatchedEvent state:SyncConnected type:NodeDataChanged path:/clusterstate.json, has occurred - updating... (live nodes size: 1)
   [junit4]   2> 1589485 INFO  (zkCallback-722-thread-1) [    ] o.a.s.c.c.ZkStateReader Updated cluster state version to 3
   [junit4]   2> 1589910 INFO  (TEST-CollectionsAPIDistributedZkTest.test-seed#[ABB8E213C56C6A65]) [    ] o.a.s.SolrTestCaseJ4 Writing core.properties file to /x1/jenkins/jenkins-slave/workspace/Lucene-Solr-NightlyTests-trunk/solr/build/solr-core/test/J2/temp/solr.cloud.CollectionsAPIDistributedZkTest_ABB8E213C56C6A65-001/shard-1-001/cores/collection1
   [junit4]   2> 1589912 INFO  (TEST-CollectionsAPIDistributedZkTest.test-seed#[ABB8E213C56C6A65]) [    ] o.a.s.c.AbstractFullDistribZkTestBase create jetty 1 in directory /x1/jenkins/jenkins-slave/workspace/Lucene-Solr-NightlyTests-trunk/solr/build/solr-core/test/J2/temp/solr.cloud.CollectionsAPIDistributedZkTest_ABB8E213C56C6A65-001/shard-1-001
   [junit4]   2> 1589913 INFO  (TEST-CollectionsAPIDistributedZkTest.test-seed#[ABB8E213C56C6A65]) [    ] o.e.j.s.Server jetty-9.2.11.v20150529
   [junit4]   2> 1589919 INFO  (TEST-CollectionsAPIDistributedZkTest.test-seed#[ABB8E213C56C6A65]) [    ] o.e.j.s.h.ContextHandler Started o.e.j.s.ServletContextHandler@69d7dae{/,null,AVAILABLE}
   [junit4]   2> 1589919 INFO  (TEST-CollectionsAPIDistributedZkTest.test-seed#[ABB8E213C56C6A65]) [    ] o.e.j.s.ServerConnector Started ServerConnector@3d53adba{HTTP/1.1}{127.0.0.1:52301}
   [junit4]   2> 1589919 INFO  (TEST-CollectionsAPIDistributedZkTest.test-seed#[ABB8E213C56C6A65]) [    ] o.e.j.s.Server Started @1593152ms
   [junit4]   2> 1589919 INFO  (TEST-CollectionsAPIDistributedZkTest.test-seed#[ABB8E213C56C6A65]) [    ] o.a.s.c.s.e.JettySolrRunner Jetty properties: {solr.data.dir=/x1/jenkins/jenkins-slave/workspace/Lucene-Solr-NightlyTests-trunk/solr/build/solr-core/test/J2/temp/solr.cloud.CollectionsAPIDistributedZkTest_ABB8E213C56C6A65-001/tempDir-001/jetty1, solrconfig=solrconfig.xml, hostContext=/, hostPort=52301, coreRootDirectory=/x1/jenkins/jenkins-slave/workspace/Lucene-Solr-NightlyTests-trunk/solr/build/solr-core/test/J2/temp/solr.cloud.CollectionsAPIDistributedZkTest_ABB8E213C56C6A65-001/shard-1-001/cores}
   [junit4]   2> 1589920 INFO  (TEST-CollectionsAPIDistributedZkTest.test-seed#[ABB8E213C56C6A65]) [    ] o.a.s.s.SolrDispatchFilter SolrDispatchFilter.init(): sun.misc.Launcher$AppClassLoader@4e0e2f2a
   [junit4]   2> 1589920 INFO  (TEST-CollectionsAPIDistributedZkTest.test-seed#[ABB8E213C56C6A65]) [    ] o.a.s.c.SolrResourceLoader new SolrResourceLoader for directory: '/x1/jenkins/jenkins-slave/workspace/Lucene-Solr-NightlyTests-trunk/solr/build/solr-core/test/J2/temp/solr.cloud.CollectionsAPIDistributedZkTest_ABB8E213C56C6A65-001/shard-1-001/'
   [junit4]   2> 1589936 INFO  (TEST-CollectionsAPIDistributedZkTest.test-seed#[ABB8E213C56C6A65]) [    ] o.a.s.c.SolrXmlConfig Loading container configuration from /x1/jenkins/jenkins-slave/workspace/Lucene-Solr-NightlyTests-trunk/solr/build/solr-core/test/J2/temp/solr.cloud.CollectionsAPIDistributedZkTest_ABB8E213C56C6A65-001/shard-1-001/solr.xml
   [junit4]   2> 1589942 INFO  (TEST-CollectionsAPIDistributedZkTest.test-seed#[ABB8E213C56C6A65]) [    ] o.a.s.c.CoresLocator Config-defined core root directory: /x1/jenkins/jenkins-slave/workspace/Lucene-Solr-NightlyTests-trunk/solr/build/solr-core/test/J2/temp/solr.cloud.CollectionsAPIDistributedZkTest_ABB8E213C56C6A65-001/shard-1-001/cores
   [junit4]   2> 1589943 INFO  (TEST-CollectionsAPIDistributedZkTest.test-seed#[ABB8E213C56C6A65]) [    ] o.a.s.c.CoreContainer New CoreContainer 568788228
   [junit4]   2> 1589943 INFO  (TEST-CollectionsAPIDistributedZkTest.test-seed#[ABB8E213C56C6A65]) [    ] o.a.s.c.CoreContainer Loading cores into CoreContainer [instanceDir=/x1/jenkins/jenkins-slave/workspace/Lucene-Solr-NightlyTests-trunk/solr/build/solr-core/test/J2/temp/solr.cloud.CollectionsAPIDistributedZkTest_ABB8E213C56C6A65-001/shard-1-001/]
   [junit4]   2> 1589943 INFO  (TEST-CollectionsAPIDistributedZkTest.test-seed#[ABB8E213C56C6A65]) [    ] o.a.s.c.CoreContainer loading shared library: /x1/jenkins/jenkins-slave/workspace/Lucene-Solr-NightlyTests-trunk/solr/build/solr-core/test/J2/temp/solr.cloud.CollectionsAPIDistributedZkTest_ABB8E213C56C6A65-001/shard-1-001/lib
   [junit4]   2> 1589943 WARN  (TEST-CollectionsAPIDistributedZkTest.test-seed#[ABB8E213C56C6A65]) [    ] o.a.s.c.SolrResourceLoader Can't find (or read) directory to add to classloader: lib (resolved as: /x1/jenkins/jenkins-slave/workspace/Lucene-Solr-NightlyTests-trunk/solr/build/solr-core/test/J2/temp/solr.cloud.CollectionsAPIDistributedZkTest_ABB8E213C56C6A65-001/shard-1-001/lib).
   [junit4]   2> 1589953 INFO  (TEST-CollectionsAPIDistributedZkTest.test-seed#[ABB8E213C56C6A65]) [    ] o.a.s.h.c.HttpShardHandlerFactory created with socketTimeout : 90000,urlScheme : ,connTimeout : 15000,maxConnectionsPerHost : 20,maxConnections : 10000,corePoolSize : 0,maximumPoolSize : 2147483647,maxThreadIdleTime : 5,sizeOfQueue : -1,fairnessPolicy : false,useRetries : false,
   [junit4]   2> 1589954 INFO  (TEST-CollectionsAPIDistributedZkTest.test-seed#[ABB8E213C56C6A65]) [    ] o.a.s.u.UpdateShardHandler Creating UpdateShardHandler HTTP client with params: socketTimeout=340000&connTimeout=45000&retry=true
   [junit4]   2> 1589955 INFO  (TEST-CollectionsAPIDistributedZkTest.test-seed#[ABB8E213C56C6A65]) [    ] o.a.s.l.LogWatcher SLF4J impl is org.slf4j.impl.Log4jLoggerFactory
   [junit4]   2> 1589955 INFO  (TEST-CollectionsAPIDistributedZkTest.test-seed#[ABB8E213C56C6A65]) [    ] o.a.s.l.LogWatcher Registering Log Listener [Log4j (org.slf4j.impl.Log4jLoggerFactory)]
   [junit4]   2> 1589955 INFO  (TEST-CollectionsAPIDistributedZkTest.test-seed#[ABB8E213C56C6A65]) [    ] o.a.s.c.ZkContainer Zookeeper client=127.0.0.1:36125/solr
   [junit4]   2> 1589955 INFO  (TEST-CollectionsAPIDistributedZkTest.test-seed#[ABB8E213C56C6A65]) [    ] o.a.s.c.ZkController zkHost includes chroot
   [junit4]   2> 1589955 INFO  (TEST-CollectionsAPIDistributedZkTest.test-seed#[ABB8E213C56C6A65]) [    ] o.a.s.c.c.SolrZkClient Using default ZkCredentialsProvider
   [junit4]   2> 1589965 INFO  (TEST-CollectionsAPIDistributedZkTest.test-seed#[ABB8E213C56C6A65]) [    ] o.a.s.c.c.ConnectionManager Waiting for client to connect to ZooKeeper
   [junit4]   2> 1589966 INFO  (zkCallback-724-thread-1) [    ] o.a.s.c.c.ConnectionManager Watcher org.apache.solr.common.cloud.ConnectionManager@5139775 name:ZooKeeperConnection Watcher:127.0.0.1:36125 got event WatchedEvent state:SyncConnected type:None path:null path:null type:None
   [junit4]   2> 1589967 INFO  (TEST-CollectionsAPIDistributedZkTest.test-seed#[ABB8E213C56C6A65]) [    ] o.a.s.c.c.ConnectionManager Client is connected to ZooKeeper
   [junit4]   2> 1589967 INFO  (TEST-CollectionsAPIDistributedZkTest.test-seed#[ABB8E213C56C6A65]) [    ] o.a.s.c.c.SolrZkClient Using default ZkACLProvider
   [junit4]   2> 1589989 INFO  (TEST-CollectionsAPIDistributedZkTest.test-seed#[ABB8E213C56C6A65]) [n:127.0.0.1:52301_    ] o.a.s.c.c.ConnectionManager Waiting for client to connect to ZooKeeper
   [junit4]   2> 1589993 INFO  (zkCallback-725-thread-1-processing-n:127.0.0.1:52301_) [n:127.0.0.1:52301_    ] o.a.s.c.c.ConnectionManager Watcher org.apache.solr.common.cloud.ConnectionManager@39ce7944 name:ZooKeeperConnection Watcher:127.0.0.1:36125/solr got event WatchedEvent state:SyncConnected type:None path:null path:null type:None
   [junit4]   2> 1589994 INFO  (TEST-CollectionsAPIDistributedZkTest.test-seed#[ABB8E213C56C6A65]) [n:127.0.0.1:52301_    ] o.a.s.c.c.ConnectionManager Client is connected to ZooKeeper
   [junit4]   2> 1590000 INFO  (TEST-CollectionsAPIDistributedZkTest.test-seed#[ABB8E213C56C6A65]) [n:127.0.0.1:52301_    ] o.a.s.c.c.ZkStateReader Updating cluster state from ZooKeeper... 
   [junit4]   2> 1591006 INFO  (TEST-CollectionsAPIDistributedZkTest.test-seed#[ABB8E213C56C6A65]) [n:127.0.0.1:52301_    ] o.a.s.c.ZkController Register node as live in ZooKeeper:/live_nodes/127.0.0.1:52301_
   [junit4]   2> 1591007 INFO  (TEST-CollectionsAPIDistributedZkTest.test-seed#[ABB8E213C56C6A65]) [n:127.0.0.1:52301_    ] o.a.s.c.c.SolrZkClient makePath: /live_nodes/127.0.0.1:52301_
   [junit4]   2> 1591011 INFO  (TEST-CollectionsAPIDistributedZkTest.test-seed#[ABB8E213C56C6A65]) [n:127.0.0.1:52301_    ] o.a.s.c.Overseer Overseer (id=null) closing
   [junit4]   2> 1591014 INFO  (TEST-CollectionsAPIDistributedZkTest.test-seed#[ABB8E213C56C6A65]) [n:127.0.0.1:52301_    ] o.a.s.c.LeaderElector Joined leadership election with path: /overseer_elect/election/94188369055776776-127.0.0.1:52301_-n_0000000001
   [junit4]   2> 1591015 INFO  (TEST-CollectionsAPIDistributedZkTest.test-seed#[ABB8E213C56C6A65]) [n:127.0.0.1:52301_    ] o.a.s.c.LeaderElector Watching path /overseer_elect/election/94188369055776773-127.0.0.1:59154_-n_0000000000 to know if I could be the leader
   [junit4]   2> 1591015 INFO  (TEST-CollectionsAPIDistributedZkTest.test-seed#[ABB8E213C56C6A65]) [n:127.0.0.1:52301_    ] o.a.s.c.CoreContainer No authentication plugin used.
   [junit4]   2> 1591016 INFO  (TEST-CollectionsAPIDistributedZkTest.test-seed#[ABB8E213C56C6A65]) [n:127.0.0.1:52301_    ] o.a.s.c.CoreContainer Security conf doesn't exist. Skipping setup for authorization module.
   [junit4]   2> 1591017 INFO  (TEST-CollectionsAPIDistributedZkTest.test-seed#[ABB8E213C56C6A65]) [n:127.0.0.1:52301_    ] o.a.s.c.CoresLocator Looking for core definitions underneath /x1/jenkins/jenkins-slave/workspace/Lucene-Solr-NightlyTests-trunk/solr/build/solr-core/test/J2/temp/solr.cloud.CollectionsAPIDistributedZkTest_ABB8E213C56C6A65-001/shard-1-001/cores
   [junit4]   2> 1591019 INFO  (TEST-CollectionsAPIDistributedZkTest.test-seed#[ABB8E213C56C6A65]) [n:127.0.0.1:52301_    ] o.a.s.c.SolrCore Created CoreDescriptor: {name=collection1, config=solrconfig.xml, transient=false, schema=schema.xml, loadOnStartup=true, configSetProperties=configsetprops.json, instanceDir=/x1/jenkins/jenkins-slave/workspace/Lucene-Solr-NightlyTests-trunk/solr/build/solr-core/test/J2/temp/solr.cloud.CollectionsAPIDistributedZkTest_ABB8E213C56C6A65-001/shard-1-001/cores/collection1, collection=collection1, absoluteInstDir=/x1/jenkins/jenkins-slave/workspace/Lucene-Solr-NightlyTests-trunk/solr/build/solr-core/test/J2/temp/solr.cloud.CollectionsAPIDistributedZkTest_ABB8E213C56C6A65-001/shard-1-001/cores/collection1/, coreNodeName=, dataDir=data/, shard=}
   [junit4]   2> 1591019 INFO  (TEST-CollectionsAPIDistributedZkTest.test-seed#[ABB8E213C56C6A65]) [n:127.0.0.1:52301_    ] o.a.s.c.CoresLocator Found core collection1 in /x1/jenkins/jenkins-slave/workspace/Lucene-Solr-NightlyTests-trunk/solr/build/solr-core/test/J2/temp/solr.cloud.CollectionsAPIDistributedZkTest_ABB8E213C56C6A65-001/shard-1-001/cores/collection1/
   [junit4]   2> 1591019 INFO  (TEST-CollectionsAPIDistributedZkTest.test-seed#[ABB8E213C56C6A65]) [n:127.0.0.1:52301_    ] o.a.s.c.CoresLocator Found 1 core definitions
   [junit4]   2> 1591035 INFO  (coreLoadExecutor-3747-thread-1-processing-n:127.0.0.1:52301_) [n:127.0.0.1:52301_ c:collection1   x:collection1] o.a.s.c.ZkController publishing state=down
   [junit4]   2> 1591035 INFO  (coreLoadExecutor-3747-thread-1-processing-n:127.0.0.1:52301_) [n:127.0.0.1:52301_ c:collection1   x:collection1] o.a.s.c.ZkController numShards not found on descriptor - reading it from system property
   [junit4]   2> 1591036 INFO  (zkCallback-720-thread-1-processing-n:127.0.0.1:59154_) [n:127.0.0.1:59154_    ] o.a.s.c.DistributedQueue NodeChildrenChanged fired on path /overseer/queue state SyncConnected
   [junit4]   2> 1591036 INFO  (coreLoadExecutor-3747-thread-1-processing-n:127.0.0.1:52301_) [n:127.0.0.1:52301_ c:collection1   x:collection1] o.a.s.c.ZkController look for our core node name
   [junit4]   2> 1591037 INFO  (TEST-CollectionsAPIDistributedZkTest.test-seed#[ABB8E213C56C6A65]) [n:127.0.0.1:52301_    ] o.a.s.s.SolrDispatchFilter user.dir=/x1/jenkins/jenkins-slave/workspace/Lucene-Solr-NightlyTests-trunk/solr/build/solr-core/test/J2
   [junit4]   2> 1591038 INFO  (TEST-CollectionsAPIDistributedZkTest.test-seed#[ABB8E213C56C6A65]) [n:127.0.0.1:52301_    ] o.a.s.s.SolrDispatchFilter SolrDispatchFilter.init() done
   [junit4]   2> 1591038 INFO  (OverseerStateUpdate-94188369055776773-127.0.0.1:59154_-n_0000000000) [n:127.0.0.1:59154_    ] o.a.s.c.Overseer processMessage: queueSize: 1, message = {
   [junit4]   2>   "core":"collection1",
   [junit4]   2>   "roles":null,
   [junit4]   2>   "base_url":"http://127.0.0.1:52301",
   [junit4]   2>   "node_name":"127.0.0.1:52301_",
   [junit4]   2>   "numShards":"2",
   [junit4]   2>   "state":"down",
   [junit4]   2>   "shard":null,
   [junit4]   2>   "collection":"collection1",
   [junit4]   2>   "operation":"state"} current state version: 3
   [junit4]   2> 1591038 INFO  (OverseerStateUpdate-94188369055776773-127.0.0.1:59154_-n_0000000000) [n:127.0.0.1:59154_    ] o.a.s.c.o.ReplicaMutator Update state numShards=2 message={
   [junit4]   2>   "core":"collection1",
   [junit4]   2>   "roles":null,
   [junit4]   2>   "base_url":"http://127.0.0.1:52301",
   [junit4]   2>   "node_name":"127.0.0.1:52301_",
   [junit4]   2>   "numShards":"2",
   [junit4]   2>   "state":"down",
   [junit4]   2>   "shard":null,
   [junit4]   2>   "collection":"collection1",
   [junit4]   2>   "operation":"state"}
   [junit4]   2> 1591039 INFO  (OverseerStateUpdate-94188369055776773-127.0.0.1:59154_-n_0000000000) [n:127.0.0.1:59154_    ] o.a.s.c.o.ClusterStateMutator building a new cName: collection1
   [junit4]   2> 1591039 INFO  (OverseerStateUpdate-94188369055776773-127.0.0.1:59154_-n_0000000000) [n:127.0.0.1:59154_    ] o.a.s.c.o.ReplicaMutator Assigning new node to shard shard=shard2
   [junit4]   2> 1591040 INFO  (zkCallback-720-thread-1-processing-n:127.0.0.1:59154_) [n:127.0.0.1:59154_    ] o.a.s.c.c.ZkStateReader A cluster state change: WatchedEvent state:SyncConnected type:NodeDataChanged path:/clusterstate.json, has occurred - updating... (live nodes size: 2)
   [junit4]   2> 1591040 INFO  (zkCallback-725-thread-1-processing-n:127.0.0.1:52301_) [n:127.0.0.1:52301_    ] o.a.s.c.c.ZkStateReader A cluster state change: WatchedEvent state:SyncConnected type:NodeDataChanged path:/clusterstate.json, has occurred - updating... (live nodes size: 2)
   [junit4]   2> 1591040 INFO  (zkCallback-722-thread-1) [    ] o.a.s.c.c.ZkStateReader A cluster state change: WatchedEvent state:SyncConnected type:NodeDataChanged path:/clusterstate.json, has occurred - updating... (live nodes size: 2)
   [junit4]   2> 1591042 INFO  (zkCallback-722-thread-1) [    ] o.a.s.c.c.ZkStateReader Updated cluster state version to 4
   [junit4]   2> 1591042 INFO  (zkCallback-720-thread-1-processing-n:127.0.0.1:59154_) [n:127.0.0.1:59154_    ] o.a.s.c.c.ZkStateReader Updated cluster state version to 4
   [junit4]   2> 1591042 INFO  (zkCallback-725-thread-1-processing-n:127.0.0.1:52301_) [n:127.0.0.1:52301_    ] o.a.s.c.c.ZkStateReader Updated cluster state version to 4
   [junit4]   2> 1592037 INFO  (coreLoadExecutor-3747-thread-1-processing-n:127.0.0.1:52301_) [n:127.0.0.1:52301_ c:collection1   x:collection1] o.a.s.c.ZkController waiting to find shard id in clusterstate for collection1
   [junit4]   2> 1592037 INFO  (coreLoadExecutor-3747-thread-1-processing-n:127.0.0.1:52301_) [n:127.0.0.1:52301_ c:collection1   x:collection1] o.a.s.c.ZkController Check for collection zkNode:collection1
   [junit4]   2> 1592038 INFO  (coreLoadExecutor-3747-thread-1-processing-n:127.0.0.1:52301_) [n:127.0.0.1:52301_ c:collection1   x:collection1] o.a.s.c.ZkController Collection zkNode exists
   [junit4]   2> 1592038 INFO  (coreLoadExecutor-3747-thread-1-processing-n:127.0.0.1:52301_) [n:127.0.0.1:52301_ c:collection1   x:collection1] o.a.s.c.c.ZkStateReader Load collection config from:/collections/collection1
   [junit4]   2> 1592039 INFO  (coreLoadExecutor-3747-thread-1-processing-n:127.0.0.1:52301_) [n:127.0.0.1:52301_ c:collection1   x:collection1] o.a.s.c.c.ZkStateReader path=/collections/collection1 configName=conf1 specified config exists in ZooKeeper
   [junit4]   2> 1592039 INFO  (coreLoadExecutor-3747-thread-1-processing-n:127.0.0.1:52301_) [n:127.0.0.1:52301_ c:collection1   x:collection1] o.a.s.c.SolrResourceLoader new SolrResourceLoader for directory: '/x1/jenkins/jenkins-slave/workspace/Lucene-Solr-NightlyTests-trunk/solr/build/solr-core/test/J2/temp/solr.cloud.CollectionsAPIDistributedZkTest_ABB8E213C56C6A65-001/shard-1-001/cores/collection1/'
   [junit4]   2> 1592053 INFO  (coreLoadExecutor-3747-thread-1-processing-n:127.0.0.1:52301_) [n:127.0.0.1:52301_ c:collection1   x:collection1] o.a.s.c.Config loaded config solrconfig.xml with version 0 
   [junit4]   2> 1592060 INFO  (coreLoadExecutor-3747-thread-1-processing-n:127.0.0.1:52301_) [n:127.0.0.1:52301_ c:collection1   x:collection1] o.a.s.c.SolrConfig current version of requestparams : -1
   [junit4]   2> 1592063 INFO  (coreLoadExecutor-3747-thread-1-processing-n:127.0.0.1:52301_) [n:127.0.0.1:52301_ c:collection1   x:collection1] o.a.s.c.SolrConfig Using Lucene MatchVersion: 6.0.0
   [junit4]   2> 1592075 INFO  (coreLoadExecutor-3747-thread-1-processing-n:127.0.0.1:52301_) [n:127.0.0.1:52301_ c:collection1   x:collection1] o.a.s.c.Config Loaded SolrConfig: solrconfig.xml
   [junit4]   2> 1592075 INFO  (coreLoadExecutor-3747-thread-1-processing-n:127.0.0.1:52301_) [n:127.0.0.1:52301_ c:collection1   x:collection1] o.a.s.s.IndexSchema Reading Solr Schema from /configs/conf1/schema.xml
   [junit4]   2> 1592080 INFO  (coreLoadExecutor-3747-thread-1-processing-n:127.0.0.1:52301_) [n:127.0.0.1:52301_ c:collection1   x:collection1] o.a.s.s.IndexSchema [collection1] Schema name=test
   [junit4]   2> 1592191 INFO  (coreLoadExecutor-3747-thread-1-processing-n:127.0.0.1:52301_) [n:127.0.0.1:52301_ c:collection1   x:collection1] o.a.s.s.OpenExchangeRatesOrgProvider Initialized with rates=open-exchange-rates.json, refreshInterval=1440.
   [junit4]   2> 1592211 INFO  (coreLoadExecutor-3747-thread-1-processing-n:127.0.0.1:52301_) [n:127.0.0.1:52301_ c:collection1   x:collection1] o.a.s.s.IndexSchema default search field in schema is text
   [junit4]   2> 1592212 INFO  (coreLoadExecutor-3747-thread-1-processing-n:127.0.0.1:52301_) [n:127.0.0.1:52301_ c:collection1   x:collection1] o.a.s.s.IndexSchema unique key field: id
   [junit4]   2> 1592220 INFO  (coreLoadExecutor-3747-thread-1-processing-n:127.0.0.1:52301_) [n:127.0.0.1:52301_ c:collection1   x:collection1] o.a.s.s.FileExchangeRateProvider Reloading exchange rates from file currency.xml
   [junit4]   2> 1592222 INFO  (coreLoadExecutor-3747-thread-1-processing-n:127.0.0.1:52301_) [n:127.0.0.1:52301_ c:collection1   x:collection1] o.a.s.s.FileExchangeRateProvider Reloading exchange rates from file currency.xml
   [junit4]   2> 1592224 INFO  (coreLoadExecutor-3747-thread-1-processing-n:127.0.0.1:52301_) [n:127.0.0.1:52301_ c:collection1   x:collection1] o.a.s.s.OpenExchangeRatesOrgProvider Reloading exchange rates from open-exchange-rates.json
   [junit4]   2> 1592225 WARN  (coreLoadExecutor-3747-thread-1-processing-n:127.0.0.1:52301_) [n:127.0.0.1:52301_ c:collection1   x:collection1] o.a.s.s.OpenExchangeRatesOrgProvider Unknown key IMPORTANT NOTE
   [junit4]   2> 1592225 WARN  (coreLoadExecutor-3747-thread-1-processing-n:127.0.0.1:52301_) [n:127.0.0.1:52301_ c:collection1   x:collection1] o.a.s.s.OpenExchangeRatesOrgProvider Expected key, got STRING
   [junit4]   2> 1592226 INFO  (coreLoadExecutor-3747-thread-1-processing-n:127.0.0.1:52301_) [n:127.0.0.1:52301_ c:collection1   x:collection1] o.a.s.s.OpenExchangeRatesOrgProvider Reloading exchange rates from open-exchange-rates.json
   [junit4]   2> 1592226 WARN  (coreLoadExecutor-3747-thread-1-processing-n:127.0.0.1:52301_) [n:127.0.0.1:52301_ c:collection1   x:collection1] o.a.s.s.OpenExchangeRatesOrgProvider Unknown key IMPORTANT NOTE
   [junit4]   2> 1592226 WARN  (coreLoadExecutor-3747-thread-1-processing-n:127.0.0.1:52301_) [n:127.0.0.1:52301_ c:collection1   x:collection1] o.a.s.s.OpenExchangeRatesOrgProvider Expected key, got STRING
   [junit4]   2> 1592227 INFO  (coreLoadExecutor-3747-thread-1-processing-n:127.0.0.1:52301_) [n:127.0.0.1:52301_ c:collection1   x:collection1] o.a

[...truncated too long message...]

s-slave/workspace/Lucene-Solr-NightlyTests-trunk/solr/core/test-lib/easymock-3.0.jar:/x1/jenkins/jenkins-slave/workspace/Lucene-Solr-NightlyTests-trunk/solr/core/test-lib/ehcache-core-2.4.4.jar:/x1/jenkins/jenkins-slave/workspace/Lucene-Solr-NightlyTests-trunk/solr/core/test-lib/hadoop-common-2.6.0-tests.jar:/x1/jenkins/jenkins-slave/workspace/Lucene-Solr-NightlyTests-trunk/solr/core/test-lib/hadoop-hdfs-2.6.0-tests.jar:/x1/jenkins/jenkins-slave/workspace/Lucene-Solr-NightlyTests-trunk/solr/core/test-lib/hadoop-minikdc-2.6.0.jar:/x1/jenkins/jenkins-slave/workspace/Lucene-Solr-NightlyTests-trunk/solr/core/test-lib/jackson-annotations-2.5.4.jar:/x1/jenkins/jenkins-slave/workspace/Lucene-Solr-NightlyTests-trunk/solr/core/test-lib/jackson-databind-2.5.4.jar:/x1/jenkins/jenkins-slave/workspace/Lucene-Solr-NightlyTests-trunk/solr/core/test-lib/jcl-over-slf4j-1.7.7.jar:/x1/jenkins/jenkins-slave/workspace/Lucene-Solr-NightlyTests-trunk/solr/core/test-lib/jersey-core-1.9.jar:/x1/jenkins/jenkins-slave/workspace/Lucene-Solr-NightlyTests-trunk/solr/core/test-lib/jersey-server-1.9.jar:/x1/jenkins/jenkins-slave/workspace/Lucene-Solr-NightlyTests-trunk/solr/core/test-lib/jetty-6.1.26.jar:/x1/jenkins/jenkins-slave/workspace/Lucene-Solr-NightlyTests-trunk/solr/core/test-lib/jetty-util-6.1.26.jar:/x1/jenkins/jenkins-slave/workspace/Lucene-Solr-NightlyTests-trunk/solr/core/test-lib/mina-core-2.0.0-M5.jar:/x1/jenkins/jenkins-slave/workspace/Lucene-Solr-NightlyTests-trunk/solr/core/test-lib/objenesis-1.2.jar:/x1/jenkins/jenkins-slave/workspace/Lucene-Solr-NightlyTests-trunk/solr/core/test-lib/presto-parser-0.108.jar:/x1/jenkins/jenkins-slave/workspace/Lucene-Solr-NightlyTests-trunk/solr/core/test-lib/slice-0.10.jar:/x1/jenkins/jenkins-slave/workspace/Lucene-Solr-NightlyTests-trunk/lucene/build/analysis/icu/lucene-analyzers-icu-6.0.0-SNAPSHOT.jar:/x1/jenkins/jenkins-slave/workspace/Lucene-Solr-NightlyTests-trunk/solr/build/contrib/solr-analysis-extras/classes/java:/x1/jenkins/jenkins-slave/workspace/Lucene-Solr-NightlyTests-trunk/solr/contrib/analysis-extras/lib/icu4j-54.1.jar:/home/jenkins/jenkins-slave/tools/hudson.tasks.Ant_AntInstallation/ant-1.8.2/lib/ant-launcher.jar:/x1/jenkins/.ant/lib/ivy-2.3.0.jar:/home/jenkins/jenkins-slave/tools/hudson.tasks.Ant_AntInstallation/ant-1.8.2/lib/ant-antlr.jar:/home/jenkins/jenkins-slave/tools/hudson.tasks.Ant_AntInstallation/ant-1.8.2/lib/ant-apache-regexp.jar:/home/jenkins/jenkins-slave/tools/hudson.tasks.Ant_AntInstallation/ant-1.8.2/lib/ant-apache-resolver.jar:/home/jenkins/jenkins-slave/tools/hudson.tasks.Ant_AntInstallation/ant-1.8.2/lib/ant-commons-net.jar:/home/jenkins/jenkins-slave/tools/hudson.tasks.Ant_AntInstallation/ant-1.8.2/lib/ant-jmf.jar:/home/jenkins/jenkins-slave/tools/hudson.tasks.Ant_AntInstallation/ant-1.8.2/lib/ant-apache-oro.jar:/home/jenkins/jenkins-slave/tools/hudson.tasks.Ant_AntInstallation/ant-1.8.2/lib/ant-apache-xalan2.jar:/home/jenkins/jenkins-slave/tools/hudson.tasks.Ant_AntInstallation/ant-1.8.2/lib/ant-commons-logging.jar:/home/jenkins/jenkins-slave/tools/hudson.tasks.Ant_AntInstallation/ant-1.8.2/lib/ant-jsch.jar:/home/jenkins/jenkins-slave/tools/hudson.tasks.Ant_AntInstallation/ant-1.8.2/lib/ant-junit4.jar:/home/jenkins/jenkins-slave/tools/hudson.tasks.Ant_AntInstallation/ant-1.8.2/lib/ant-javamail.jar:/home/jenkins/jenkins-slave/tools/hudson.tasks.Ant_AntInstallation/ant-1.8.2/lib/ant-jai.jar:/home/jenkins/jenkins-slave/tools/hudson.tasks.Ant_AntInstallation/ant-1.8.2/lib/ant-jdepend.jar:/home/jenkins/jenkins-slave/tools/hudson.tasks.Ant_AntInstallation/ant-1.8.2/lib/ant-junit.jar:/home/jenkins/jenkins-slave/tools/hudson.tasks.Ant_AntInstallation/ant-1.8.2/lib/ant-apache-bsf.jar:/home/jenkins/jenkins-slave/tools/hudson.tasks.Ant_AntInstallation/ant-1.8.2/lib/ant-swing.jar:/home/jenkins/jenkins-slave/tools/hudson.tasks.Ant_AntInstallation/ant-1.8.2/lib/ant.jar:/home/jenkins/jenkins-slave/tools/hudson.tasks.Ant_AntInstallation/ant-1.8.2/lib/ant-netrexx.jar:/home/jenkins/jenkins-slave/tools/hudson.tasks.Ant_AntInstallation/ant-1.8.2/lib/ant-apache-bcel.jar:/home/jenkins/jenkins-slave/tools/hudson.tasks.Ant_AntInstallation/ant-1.8.2/lib/ant-testutil.jar:/home/jenkins/jenkins-slave/tools/hudson.tasks.Ant_AntInstallation/ant-1.8.2/lib/ant-apache-log4j.jar:/x1/jenkins/jenkins-slave/tools/hudson.model.JDK/latest1.8/lib/tools.jar:/x1/jenkins/.ivy2/cache/com.carrotsearch.randomizedtesting/junit4-ant/jars/junit4-ant-2.1.13.jar com.carrotsearch.ant.tasks.junit4.slave.SlaveMainSafe -eventsfile /x1/jenkins/jenkins-slave/workspace/Lucene-Solr-NightlyTests-trunk/solr/build/solr-core/test/temp/junit4-J2-20150718_015425_057.events @/x1/jenkins/jenkins-slave/workspace/Lucene-Solr-NightlyTests-trunk/solr/build/solr-core/test/temp/junit4-J2-20150718_015425_057.suites
   [junit4] ERROR: JVM J2 ended with an exception: Quit event not received from the forked process? This may indicate JVM crash or runner bugs.
   [junit4] 	at com.carrotsearch.ant.tasks.junit4.JUnit4.executeSlave(JUnit4.java:1504)
   [junit4] 	at com.carrotsearch.ant.tasks.junit4.JUnit4.access$000(JUnit4.java:133)
   [junit4] 	at com.carrotsearch.ant.tasks.junit4.JUnit4$2.call(JUnit4.java:964)
   [junit4] 	at com.carrotsearch.ant.tasks.junit4.JUnit4$2.call(JUnit4.java:961)
   [junit4] 	at java.util.concurrent.FutureTask.run(FutureTask.java:266)
   [junit4] 	at java.util.concurrent.ThreadPoolExecutor.runWorker(ThreadPoolExecutor.java:1142)
   [junit4] 	at java.util.concurrent.ThreadPoolExecutor$Worker.run(ThreadPoolExecutor.java:617)
   [junit4] 	at java.lang.Thread.run(Thread.java:745)

BUILD FAILED
/x1/jenkins/jenkins-slave/workspace/Lucene-Solr-NightlyTests-trunk/build.xml:533: The following error occurred while executing this line:
/x1/jenkins/jenkins-slave/workspace/Lucene-Solr-NightlyTests-trunk/build.xml:474: The following error occurred while executing this line:
/x1/jenkins/jenkins-slave/workspace/Lucene-Solr-NightlyTests-trunk/build.xml:61: The following error occurred while executing this line:
/x1/jenkins/jenkins-slave/workspace/Lucene-Solr-NightlyTests-trunk/extra-targets.xml:39: The following error occurred while executing this line:
/x1/jenkins/jenkins-slave/workspace/Lucene-Solr-NightlyTests-trunk/solr/build.xml:230: The following error occurred while executing this line:
/x1/jenkins/jenkins-slave/workspace/Lucene-Solr-NightlyTests-trunk/solr/common-build.xml:513: The following error occurred while executing this line:
/x1/jenkins/jenkins-slave/workspace/Lucene-Solr-NightlyTests-trunk/lucene/common-build.xml:1426: The following error occurred while executing this line:
/x1/jenkins/jenkins-slave/workspace/Lucene-Solr-NightlyTests-trunk/lucene/common-build.xml:981: At least one slave process threw an exception, first: Quit event not received from the forked process? This may indicate JVM crash or runner bugs.

Total time: 444 minutes 37 seconds
Build step 'Invoke Ant' marked build as failure
Archiving artifacts
No prior successful build to compare, so performing full copy of artifacts
ERROR: Failed to archive {README.txt=README.txt, solr/build/solr-core/test/temp/junit4-J0-20150718_015425_055.events=solr/build/solr-core/test/temp/junit4-J0-20150718_015425_055.events, solr/build/solr-core/test/temp/junit4-J1-20150718_015425_055.events=solr/build/solr-core/test/temp/junit4-J1-20150718_015425_055.events, solr/build/solr-core/test/temp/junit4-J2-20150718_015425_057.events=solr/build/solr-core/test/temp/junit4-J2-20150718_015425_057.events} due to internal error; falling back to full archiving
java.lang.IllegalArgumentException: Negative time
	at java.io.File.setLastModified(File.java:1421)
	at hudson.FilePath.readFromTar(FilePath.java:2093)
	at hudson.FilePath.copyRecursiveTo(FilePath.java:2013)
	at jenkins.model.StandardArtifactManager.archive(StandardArtifactManager.java:61)
	at com.cloudbees.jenkins.plugins.jsync.archiver.JSyncArtifactManager.remoteSync(JSyncArtifactManager.java:107)
	at com.cloudbees.jenkins.plugins.jsync.archiver.JSyncArtifactManager.archive(JSyncArtifactManager.java:68)
	at hudson.tasks.ArtifactArchiver.perform(ArtifactArchiver.java:140)
	at hudson.tasks.BuildStepMonitor$1.perform(BuildStepMonitor.java:20)
	at hudson.model.AbstractBuild$AbstractBuildExecution.perform(AbstractBuild.java:756)
	at hudson.model.AbstractBuild$AbstractBuildExecution.performAllBuildSteps(AbstractBuild.java:720)
	at hudson.model.Build$BuildExecution.post2(Build.java:182)
	at hudson.model.AbstractBuild$AbstractBuildExecution.post(AbstractBuild.java:669)
	at hudson.model.Run.execute(Run.java:1731)
	at hudson.model.FreeStyleBuild.run(FreeStyleBuild.java:43)
	at hudson.model.ResourceController.execute(ResourceController.java:88)
	at hudson.model.Executor.run(Executor.java:232)
ERROR: Publisher hudson.tasks.ArtifactArchiver aborted due to exception
java.lang.IllegalArgumentException: Negative time
	at java.io.File.setLastModified(File.java:1421)
	at hudson.FilePath.readFromTar(FilePath.java:2093)
	at hudson.FilePath.copyRecursiveTo(FilePath.java:2013)
	at jenkins.model.StandardArtifactManager.archive(StandardArtifactManager.java:61)
	at com.cloudbees.jenkins.plugins.jsync.archiver.JSyncArtifactManager.archive(JSyncArtifactManager.java:72)
	at hudson.tasks.ArtifactArchiver.perform(ArtifactArchiver.java:140)
	at hudson.tasks.BuildStepMonitor$1.perform(BuildStepMonitor.java:20)
	at hudson.model.AbstractBuild$AbstractBuildExecution.perform(AbstractBuild.java:756)
	at hudson.model.AbstractBuild$AbstractBuildExecution.performAllBuildSteps(AbstractBuild.java:720)
	at hudson.model.Build$BuildExecution.post2(Build.java:182)
	at hudson.model.AbstractBuild$AbstractBuildExecution.post(AbstractBuild.java:669)
	at hudson.model.Run.execute(Run.java:1731)
	at hudson.model.FreeStyleBuild.run(FreeStyleBuild.java:43)
	at hudson.model.ResourceController.execute(ResourceController.java:88)
	at hudson.model.Executor.run(Executor.java:232)
Recording test results
Email was triggered for: Failure
Sending email for trigger: Failure



Mime
View raw message