lucene-dev mailing list archives

Site index · List index
Message view « Date » · « Thread »
Top « Date » · « Thread »
From Apache Jenkins Server <jenk...@builds.apache.org>
Subject [JENKINS] Lucene-Solr-NightlyTests-trunk - Build # 748 - Still Failing
Date Mon, 27 Jul 2015 11:02:28 GMT
Build: https://builds.apache.org/job/Lucene-Solr-NightlyTests-trunk/748/

1 tests failed.
REGRESSION:  org.apache.solr.cloud.CollectionsAPIDistributedZkTest.test

Error Message:
Error from server at http://127.0.0.1:43373: Error CREATEing SolrCore 'halfcollection_shard1_replica1': Error reading cluster properties Caused by: KeeperErrorCode = Session expired for /clusterprops.json

Stack Trace:
org.apache.solr.client.solrj.impl.HttpSolrClient$RemoteSolrException: Error from server at http://127.0.0.1:43373: Error CREATEing SolrCore 'halfcollection_shard1_replica1': Error reading cluster properties Caused by: KeeperErrorCode = Session expired for /clusterprops.json
	at org.apache.solr.client.solrj.impl.HttpSolrClient.executeMethod(HttpSolrClient.java:560)
	at org.apache.solr.client.solrj.impl.HttpSolrClient.request(HttpSolrClient.java:234)
	at org.apache.solr.client.solrj.impl.HttpSolrClient.request(HttpSolrClient.java:226)
	at org.apache.solr.client.solrj.SolrClient.request(SolrClient.java:1220)
	at org.apache.solr.cloud.CollectionsAPIDistributedZkTest.makeRequest(CollectionsAPIDistributedZkTest.java:301)
	at org.apache.solr.cloud.CollectionsAPIDistributedZkTest.testErrorHandling(CollectionsAPIDistributedZkTest.java:418)
	at org.apache.solr.cloud.CollectionsAPIDistributedZkTest.test(CollectionsAPIDistributedZkTest.java:168)
	at sun.reflect.NativeMethodAccessorImpl.invoke0(Native Method)
	at sun.reflect.NativeMethodAccessorImpl.invoke(NativeMethodAccessorImpl.java:62)
	at sun.reflect.DelegatingMethodAccessorImpl.invoke(DelegatingMethodAccessorImpl.java:43)
	at java.lang.reflect.Method.invoke(Method.java:497)
	at com.carrotsearch.randomizedtesting.RandomizedRunner.invoke(RandomizedRunner.java:1627)
	at com.carrotsearch.randomizedtesting.RandomizedRunner$6.evaluate(RandomizedRunner.java:836)
	at com.carrotsearch.randomizedtesting.RandomizedRunner$7.evaluate(RandomizedRunner.java:872)
	at com.carrotsearch.randomizedtesting.RandomizedRunner$8.evaluate(RandomizedRunner.java:886)
	at org.apache.solr.BaseDistributedSearchTestCase$ShardsRepeatRule$ShardsFixedStatement.callStatement(BaseDistributedSearchTestCase.java:963)
	at org.apache.solr.BaseDistributedSearchTestCase$ShardsRepeatRule$ShardsStatement.evaluate(BaseDistributedSearchTestCase.java:938)
	at com.carrotsearch.randomizedtesting.rules.SystemPropertiesRestoreRule$1.evaluate(SystemPropertiesRestoreRule.java:57)
	at org.apache.lucene.util.TestRuleSetupTeardownChained$1.evaluate(TestRuleSetupTeardownChained.java:50)
	at org.apache.lucene.util.AbstractBeforeAfterRule$1.evaluate(AbstractBeforeAfterRule.java:46)
	at org.apache.lucene.util.TestRuleThreadAndTestName$1.evaluate(TestRuleThreadAndTestName.java:49)
	at org.apache.lucene.util.TestRuleIgnoreAfterMaxFailures$1.evaluate(TestRuleIgnoreAfterMaxFailures.java:65)
	at org.apache.lucene.util.TestRuleMarkFailure$1.evaluate(TestRuleMarkFailure.java:48)
	at com.carrotsearch.randomizedtesting.rules.StatementAdapter.evaluate(StatementAdapter.java:36)
	at com.carrotsearch.randomizedtesting.ThreadLeakControl$StatementRunner.run(ThreadLeakControl.java:365)
	at com.carrotsearch.randomizedtesting.ThreadLeakControl.forkTimeoutingTask(ThreadLeakControl.java:798)
	at com.carrotsearch.randomizedtesting.ThreadLeakControl$3.evaluate(ThreadLeakControl.java:458)
	at com.carrotsearch.randomizedtesting.RandomizedRunner.runSingleTest(RandomizedRunner.java:845)
	at com.carrotsearch.randomizedtesting.RandomizedRunner$3.evaluate(RandomizedRunner.java:747)
	at com.carrotsearch.randomizedtesting.RandomizedRunner$4.evaluate(RandomizedRunner.java:781)
	at com.carrotsearch.randomizedtesting.RandomizedRunner$5.evaluate(RandomizedRunner.java:792)
	at com.carrotsearch.randomizedtesting.rules.StatementAdapter.evaluate(StatementAdapter.java:36)
	at com.carrotsearch.randomizedtesting.rules.SystemPropertiesRestoreRule$1.evaluate(SystemPropertiesRestoreRule.java:57)
	at org.apache.lucene.util.AbstractBeforeAfterRule$1.evaluate(AbstractBeforeAfterRule.java:46)
	at com.carrotsearch.randomizedtesting.rules.StatementAdapter.evaluate(StatementAdapter.java:36)
	at org.apache.lucene.util.TestRuleStoreClassName$1.evaluate(TestRuleStoreClassName.java:42)
	at com.carrotsearch.randomizedtesting.rules.NoShadowingOrOverridesOnMethodsRule$1.evaluate(NoShadowingOrOverridesOnMethodsRule.java:39)
	at com.carrotsearch.randomizedtesting.rules.NoShadowingOrOverridesOnMethodsRule$1.evaluate(NoShadowingOrOverridesOnMethodsRule.java:39)
	at com.carrotsearch.randomizedtesting.rules.StatementAdapter.evaluate(StatementAdapter.java:36)
	at com.carrotsearch.randomizedtesting.rules.StatementAdapter.evaluate(StatementAdapter.java:36)
	at com.carrotsearch.randomizedtesting.rules.StatementAdapter.evaluate(StatementAdapter.java:36)
	at org.apache.lucene.util.TestRuleAssertionsRequired$1.evaluate(TestRuleAssertionsRequired.java:54)
	at org.apache.lucene.util.TestRuleMarkFailure$1.evaluate(TestRuleMarkFailure.java:48)
	at org.apache.lucene.util.TestRuleIgnoreAfterMaxFailures$1.evaluate(TestRuleIgnoreAfterMaxFailures.java:65)
	at org.apache.lucene.util.TestRuleIgnoreTestSuites$1.evaluate(TestRuleIgnoreTestSuites.java:55)
	at com.carrotsearch.randomizedtesting.rules.StatementAdapter.evaluate(StatementAdapter.java:36)
	at com.carrotsearch.randomizedtesting.ThreadLeakControl$StatementRunner.run(ThreadLeakControl.java:365)
	at java.lang.Thread.run(Thread.java:745)




Build Log:
[...truncated 11259 lines...]
   [junit4] Suite: org.apache.solr.cloud.CollectionsAPIDistributedZkTest
   [junit4]   2> Creating dataDir: /x1/jenkins/jenkins-slave/workspace/Lucene-Solr-NightlyTests-trunk/solr/build/solr-core/test/J1/temp/solr.cloud.CollectionsAPIDistributedZkTest_7B9D114E4CC14E06-001/init-core-data-001
   [junit4]   2> 1549435 INFO  (SUITE-CollectionsAPIDistributedZkTest-seed#[7B9D114E4CC14E06]-worker) [    ] o.a.s.SolrTestCaseJ4 Randomized ssl (false) and clientAuth (false)
   [junit4]   2> 1549436 INFO  (SUITE-CollectionsAPIDistributedZkTest-seed#[7B9D114E4CC14E06]-worker) [    ] o.a.s.BaseDistributedSearchTestCase Setting hostContext system property: /
   [junit4]   2> 1549438 INFO  (TEST-CollectionsAPIDistributedZkTest.test-seed#[7B9D114E4CC14E06]) [    ] o.a.s.c.ZkTestServer STARTING ZK TEST SERVER
   [junit4]   2> 1549438 INFO  (Thread-2672) [    ] o.a.s.c.ZkTestServer client port:0.0.0.0/0.0.0.0:0
   [junit4]   2> 1549439 INFO  (Thread-2672) [    ] o.a.s.c.ZkTestServer Starting server
   [junit4]   2> 1549538 INFO  (TEST-CollectionsAPIDistributedZkTest.test-seed#[7B9D114E4CC14E06]) [    ] o.a.s.c.ZkTestServer start zk server on port:36981
   [junit4]   2> 1549539 INFO  (TEST-CollectionsAPIDistributedZkTest.test-seed#[7B9D114E4CC14E06]) [    ] o.a.s.c.c.SolrZkClient Using default ZkCredentialsProvider
   [junit4]   2> 1549540 INFO  (TEST-CollectionsAPIDistributedZkTest.test-seed#[7B9D114E4CC14E06]) [    ] o.a.s.c.c.ConnectionManager Waiting for client to connect to ZooKeeper
   [junit4]   2> 1549542 INFO  (zkCallback-550-thread-1) [    ] o.a.s.c.c.ConnectionManager Watcher org.apache.solr.common.cloud.ConnectionManager@165006ab name:ZooKeeperConnection Watcher:127.0.0.1:36981 got event WatchedEvent state:SyncConnected type:None path:null path:null type:None
   [junit4]   2> 1549543 INFO  (TEST-CollectionsAPIDistributedZkTest.test-seed#[7B9D114E4CC14E06]) [    ] o.a.s.c.c.ConnectionManager Client is connected to ZooKeeper
   [junit4]   2> 1549543 INFO  (TEST-CollectionsAPIDistributedZkTest.test-seed#[7B9D114E4CC14E06]) [    ] o.a.s.c.c.SolrZkClient Using default ZkACLProvider
   [junit4]   2> 1549543 INFO  (TEST-CollectionsAPIDistributedZkTest.test-seed#[7B9D114E4CC14E06]) [    ] o.a.s.c.c.SolrZkClient makePath: /solr
   [junit4]   2> 1549545 INFO  (TEST-CollectionsAPIDistributedZkTest.test-seed#[7B9D114E4CC14E06]) [    ] o.a.s.c.c.SolrZkClient Using default ZkCredentialsProvider
   [junit4]   2> 1549546 INFO  (TEST-CollectionsAPIDistributedZkTest.test-seed#[7B9D114E4CC14E06]) [    ] o.a.s.c.c.ConnectionManager Waiting for client to connect to ZooKeeper
   [junit4]   2> 1549548 INFO  (zkCallback-551-thread-1) [    ] o.a.s.c.c.ConnectionManager Watcher org.apache.solr.common.cloud.ConnectionManager@9f98e87 name:ZooKeeperConnection Watcher:127.0.0.1:36981/solr got event WatchedEvent state:SyncConnected type:None path:null path:null type:None
   [junit4]   2> 1549548 INFO  (TEST-CollectionsAPIDistributedZkTest.test-seed#[7B9D114E4CC14E06]) [    ] o.a.s.c.c.ConnectionManager Client is connected to ZooKeeper
   [junit4]   2> 1549549 INFO  (TEST-CollectionsAPIDistributedZkTest.test-seed#[7B9D114E4CC14E06]) [    ] o.a.s.c.c.SolrZkClient Using default ZkACLProvider
   [junit4]   2> 1549549 INFO  (TEST-CollectionsAPIDistributedZkTest.test-seed#[7B9D114E4CC14E06]) [    ] o.a.s.c.c.SolrZkClient makePath: /collections/collection1
   [junit4]   2> 1549550 INFO  (TEST-CollectionsAPIDistributedZkTest.test-seed#[7B9D114E4CC14E06]) [    ] o.a.s.c.c.SolrZkClient makePath: /collections/collection1/shards
   [junit4]   2> 1549552 INFO  (TEST-CollectionsAPIDistributedZkTest.test-seed#[7B9D114E4CC14E06]) [    ] o.a.s.c.c.SolrZkClient makePath: /collections/control_collection
   [junit4]   2> 1549553 INFO  (TEST-CollectionsAPIDistributedZkTest.test-seed#[7B9D114E4CC14E06]) [    ] o.a.s.c.c.SolrZkClient makePath: /collections/control_collection/shards
   [junit4]   2> 1549555 INFO  (TEST-CollectionsAPIDistributedZkTest.test-seed#[7B9D114E4CC14E06]) [    ] o.a.s.c.AbstractZkTestCase put /x1/jenkins/jenkins-slave/workspace/Lucene-Solr-NightlyTests-trunk/solr/core/src/test-files/solr/collection1/conf/solrconfig-tlog.xml to /configs/conf1/solrconfig.xml
   [junit4]   2> 1549555 INFO  (TEST-CollectionsAPIDistributedZkTest.test-seed#[7B9D114E4CC14E06]) [    ] o.a.s.c.c.SolrZkClient makePath: /configs/conf1/solrconfig.xml
   [junit4]   2> 1549558 INFO  (TEST-CollectionsAPIDistributedZkTest.test-seed#[7B9D114E4CC14E06]) [    ] o.a.s.c.AbstractZkTestCase put /x1/jenkins/jenkins-slave/workspace/Lucene-Solr-NightlyTests-trunk/solr/core/src/test-files/solr/collection1/conf/schema.xml to /configs/conf1/schema.xml
   [junit4]   2> 1549558 INFO  (TEST-CollectionsAPIDistributedZkTest.test-seed#[7B9D114E4CC14E06]) [    ] o.a.s.c.c.SolrZkClient makePath: /configs/conf1/schema.xml
   [junit4]   2> 1549560 INFO  (TEST-CollectionsAPIDistributedZkTest.test-seed#[7B9D114E4CC14E06]) [    ] o.a.s.c.AbstractZkTestCase put /x1/jenkins/jenkins-slave/workspace/Lucene-Solr-NightlyTests-trunk/solr/core/src/test-files/solr/collection1/conf/solrconfig.snippet.randomindexconfig.xml to /configs/conf1/solrconfig.snippet.randomindexconfig.xml
   [junit4]   2> 1549560 INFO  (TEST-CollectionsAPIDistributedZkTest.test-seed#[7B9D114E4CC14E06]) [    ] o.a.s.c.c.SolrZkClient makePath: /configs/conf1/solrconfig.snippet.randomindexconfig.xml
   [junit4]   2> 1549562 INFO  (TEST-CollectionsAPIDistributedZkTest.test-seed#[7B9D114E4CC14E06]) [    ] o.a.s.c.AbstractZkTestCase put /x1/jenkins/jenkins-slave/workspace/Lucene-Solr-NightlyTests-trunk/solr/core/src/test-files/solr/collection1/conf/stopwords.txt to /configs/conf1/stopwords.txt
   [junit4]   2> 1549562 INFO  (TEST-CollectionsAPIDistributedZkTest.test-seed#[7B9D114E4CC14E06]) [    ] o.a.s.c.c.SolrZkClient makePath: /configs/conf1/stopwords.txt
   [junit4]   2> 1549564 INFO  (TEST-CollectionsAPIDistributedZkTest.test-seed#[7B9D114E4CC14E06]) [    ] o.a.s.c.AbstractZkTestCase put /x1/jenkins/jenkins-slave/workspace/Lucene-Solr-NightlyTests-trunk/solr/core/src/test-files/solr/collection1/conf/protwords.txt to /configs/conf1/protwords.txt
   [junit4]   2> 1549564 INFO  (TEST-CollectionsAPIDistributedZkTest.test-seed#[7B9D114E4CC14E06]) [    ] o.a.s.c.c.SolrZkClient makePath: /configs/conf1/protwords.txt
   [junit4]   2> 1549566 INFO  (TEST-CollectionsAPIDistributedZkTest.test-seed#[7B9D114E4CC14E06]) [    ] o.a.s.c.AbstractZkTestCase put /x1/jenkins/jenkins-slave/workspace/Lucene-Solr-NightlyTests-trunk/solr/core/src/test-files/solr/collection1/conf/currency.xml to /configs/conf1/currency.xml
   [junit4]   2> 1549566 INFO  (TEST-CollectionsAPIDistributedZkTest.test-seed#[7B9D114E4CC14E06]) [    ] o.a.s.c.c.SolrZkClient makePath: /configs/conf1/currency.xml
   [junit4]   2> 1549568 INFO  (TEST-CollectionsAPIDistributedZkTest.test-seed#[7B9D114E4CC14E06]) [    ] o.a.s.c.AbstractZkTestCase put /x1/jenkins/jenkins-slave/workspace/Lucene-Solr-NightlyTests-trunk/solr/core/src/test-files/solr/collection1/conf/enumsConfig.xml to /configs/conf1/enumsConfig.xml
   [junit4]   2> 1549568 INFO  (TEST-CollectionsAPIDistributedZkTest.test-seed#[7B9D114E4CC14E06]) [    ] o.a.s.c.c.SolrZkClient makePath: /configs/conf1/enumsConfig.xml
   [junit4]   2> 1549570 INFO  (TEST-CollectionsAPIDistributedZkTest.test-seed#[7B9D114E4CC14E06]) [    ] o.a.s.c.AbstractZkTestCase put /x1/jenkins/jenkins-slave/workspace/Lucene-Solr-NightlyTests-trunk/solr/core/src/test-files/solr/collection1/conf/open-exchange-rates.json to /configs/conf1/open-exchange-rates.json
   [junit4]   2> 1549570 INFO  (TEST-CollectionsAPIDistributedZkTest.test-seed#[7B9D114E4CC14E06]) [    ] o.a.s.c.c.SolrZkClient makePath: /configs/conf1/open-exchange-rates.json
   [junit4]   2> 1549572 INFO  (TEST-CollectionsAPIDistributedZkTest.test-seed#[7B9D114E4CC14E06]) [    ] o.a.s.c.AbstractZkTestCase put /x1/jenkins/jenkins-slave/workspace/Lucene-Solr-NightlyTests-trunk/solr/core/src/test-files/solr/collection1/conf/mapping-ISOLatin1Accent.txt to /configs/conf1/mapping-ISOLatin1Accent.txt
   [junit4]   2> 1549573 INFO  (TEST-CollectionsAPIDistributedZkTest.test-seed#[7B9D114E4CC14E06]) [    ] o.a.s.c.c.SolrZkClient makePath: /configs/conf1/mapping-ISOLatin1Accent.txt
   [junit4]   2> 1549574 INFO  (TEST-CollectionsAPIDistributedZkTest.test-seed#[7B9D114E4CC14E06]) [    ] o.a.s.c.AbstractZkTestCase put /x1/jenkins/jenkins-slave/workspace/Lucene-Solr-NightlyTests-trunk/solr/core/src/test-files/solr/collection1/conf/old_synonyms.txt to /configs/conf1/old_synonyms.txt
   [junit4]   2> 1549575 INFO  (TEST-CollectionsAPIDistributedZkTest.test-seed#[7B9D114E4CC14E06]) [    ] o.a.s.c.c.SolrZkClient makePath: /configs/conf1/old_synonyms.txt
   [junit4]   2> 1549576 INFO  (TEST-CollectionsAPIDistributedZkTest.test-seed#[7B9D114E4CC14E06]) [    ] o.a.s.c.AbstractZkTestCase put /x1/jenkins/jenkins-slave/workspace/Lucene-Solr-NightlyTests-trunk/solr/core/src/test-files/solr/collection1/conf/synonyms.txt to /configs/conf1/synonyms.txt
   [junit4]   2> 1549577 INFO  (TEST-CollectionsAPIDistributedZkTest.test-seed#[7B9D114E4CC14E06]) [    ] o.a.s.c.c.SolrZkClient makePath: /configs/conf1/synonyms.txt
   [junit4]   2> 1549925 INFO  (TEST-CollectionsAPIDistributedZkTest.test-seed#[7B9D114E4CC14E06]) [    ] o.a.s.SolrTestCaseJ4 Writing core.properties file to /x1/jenkins/jenkins-slave/workspace/Lucene-Solr-NightlyTests-trunk/solr/build/solr-core/test/J1/temp/solr.cloud.CollectionsAPIDistributedZkTest_7B9D114E4CC14E06-001/control-001/cores/collection1
   [junit4]   2> 1549927 INFO  (TEST-CollectionsAPIDistributedZkTest.test-seed#[7B9D114E4CC14E06]) [    ] o.e.j.s.Server jetty-9.2.11.v20150529
   [junit4]   2> 1549929 INFO  (TEST-CollectionsAPIDistributedZkTest.test-seed#[7B9D114E4CC14E06]) [    ] o.e.j.s.h.ContextHandler Started o.e.j.s.ServletContextHandler@60a5632b{/,null,AVAILABLE}
   [junit4]   2> 1549938 INFO  (TEST-CollectionsAPIDistributedZkTest.test-seed#[7B9D114E4CC14E06]) [    ] o.e.j.s.ServerConnector Started ServerConnector@4b809595{HTTP/1.1}{127.0.0.1:?????}
   [junit4]   2> 1549938 INFO  (TEST-CollectionsAPIDistributedZkTest.test-seed#[7B9D114E4CC14E06]) [    ] o.e.j.s.Server Started @???????ms
   [junit4]   2> 1549938 INFO  (TEST-CollectionsAPIDistributedZkTest.test-seed#[7B9D114E4CC14E06]) [    ] o.a.s.c.s.e.JettySolrRunner Jetty properties: {solr.data.dir=/x1/jenkins/jenkins-slave/workspace/Lucene-Solr-NightlyTests-trunk/solr/build/solr-core/test/J1/temp/solr.cloud.CollectionsAPIDistributedZkTest_7B9D114E4CC14E06-001/tempDir-001/control/data, hostContext=/, hostPort=40631, coreRootDirectory=/x1/jenkins/jenkins-slave/workspace/Lucene-Solr-NightlyTests-trunk/solr/build/solr-core/test/J1/temp/solr.cloud.CollectionsAPIDistributedZkTest_7B9D114E4CC14E06-001/control-001/cores}
   [junit4]   2> 1549939 INFO  (TEST-CollectionsAPIDistributedZkTest.test-seed#[7B9D114E4CC14E06]) [    ] o.a.s.s.SolrDispatchFilter SolrDispatchFilter.init(): sun.misc.Launcher$AppClassLoader@4e0e2f2a
   [junit4]   2> 1549939 INFO  (TEST-CollectionsAPIDistributedZkTest.test-seed#[7B9D114E4CC14E06]) [    ] o.a.s.c.SolrResourceLoader new SolrResourceLoader for directory: '/x1/jenkins/jenkins-slave/workspace/Lucene-Solr-NightlyTests-trunk/solr/build/solr-core/test/J1/temp/solr.cloud.CollectionsAPIDistributedZkTest_7B9D114E4CC14E06-001/control-001/'
   [junit4]   2> 1549955 INFO  (TEST-CollectionsAPIDistributedZkTest.test-seed#[7B9D114E4CC14E06]) [    ] o.a.s.c.c.SolrZkClient Using default ZkCredentialsProvider
   [junit4]   2> 1549956 INFO  (TEST-CollectionsAPIDistributedZkTest.test-seed#[7B9D114E4CC14E06]) [    ] o.a.s.c.c.ConnectionManager Waiting for client to connect to ZooKeeper
   [junit4]   2> 1549958 INFO  (zkCallback-552-thread-1) [    ] o.a.s.c.c.ConnectionManager Watcher org.apache.solr.common.cloud.ConnectionManager@70ee7ee3 name:ZooKeeperConnection Watcher:127.0.0.1:36981/solr got event WatchedEvent state:SyncConnected type:None path:null path:null type:None
   [junit4]   2> 1549958 INFO  (TEST-CollectionsAPIDistributedZkTest.test-seed#[7B9D114E4CC14E06]) [    ] o.a.s.c.c.ConnectionManager Client is connected to ZooKeeper
   [junit4]   2> 1549958 INFO  (TEST-CollectionsAPIDistributedZkTest.test-seed#[7B9D114E4CC14E06]) [    ] o.a.s.c.c.SolrZkClient Using default ZkACLProvider
   [junit4]   2> 1549960 INFO  (TEST-CollectionsAPIDistributedZkTest.test-seed#[7B9D114E4CC14E06]) [    ] o.a.s.s.SolrDispatchFilter Loading solr.xml from SolrHome (not found in ZooKeeper)
   [junit4]   2> 1549960 INFO  (TEST-CollectionsAPIDistributedZkTest.test-seed#[7B9D114E4CC14E06]) [    ] o.a.s.c.SolrXmlConfig Loading container configuration from /x1/jenkins/jenkins-slave/workspace/Lucene-Solr-NightlyTests-trunk/solr/build/solr-core/test/J1/temp/solr.cloud.CollectionsAPIDistributedZkTest_7B9D114E4CC14E06-001/control-001/solr.xml
   [junit4]   2> 1549966 INFO  (TEST-CollectionsAPIDistributedZkTest.test-seed#[7B9D114E4CC14E06]) [    ] o.a.s.c.CoresLocator Config-defined core root directory: /x1/jenkins/jenkins-slave/workspace/Lucene-Solr-NightlyTests-trunk/solr/build/solr-core/test/J1/temp/solr.cloud.CollectionsAPIDistributedZkTest_7B9D114E4CC14E06-001/control-001/cores
   [junit4]   2> 1549966 INFO  (TEST-CollectionsAPIDistributedZkTest.test-seed#[7B9D114E4CC14E06]) [    ] o.a.s.c.CoreContainer New CoreContainer 1560753052
   [junit4]   2> 1549966 INFO  (TEST-CollectionsAPIDistributedZkTest.test-seed#[7B9D114E4CC14E06]) [    ] o.a.s.c.CoreContainer Loading cores into CoreContainer [instanceDir=/x1/jenkins/jenkins-slave/workspace/Lucene-Solr-NightlyTests-trunk/solr/build/solr-core/test/J1/temp/solr.cloud.CollectionsAPIDistributedZkTest_7B9D114E4CC14E06-001/control-001/]
   [junit4]   2> 1549966 INFO  (TEST-CollectionsAPIDistributedZkTest.test-seed#[7B9D114E4CC14E06]) [    ] o.a.s.c.CoreContainer loading shared library: /x1/jenkins/jenkins-slave/workspace/Lucene-Solr-NightlyTests-trunk/solr/build/solr-core/test/J1/temp/solr.cloud.CollectionsAPIDistributedZkTest_7B9D114E4CC14E06-001/control-001/lib
   [junit4]   2> 1549966 WARN  (TEST-CollectionsAPIDistributedZkTest.test-seed#[7B9D114E4CC14E06]) [    ] o.a.s.c.SolrResourceLoader Can't find (or read) directory to add to classloader: lib (resolved as: /x1/jenkins/jenkins-slave/workspace/Lucene-Solr-NightlyTests-trunk/solr/build/solr-core/test/J1/temp/solr.cloud.CollectionsAPIDistributedZkTest_7B9D114E4CC14E06-001/control-001/lib).
   [junit4]   2> 1549974 INFO  (TEST-CollectionsAPIDistributedZkTest.test-seed#[7B9D114E4CC14E06]) [    ] o.a.s.h.c.HttpShardHandlerFactory created with socketTimeout : 90000,urlScheme : ,connTimeout : 15000,maxConnectionsPerHost : 20,maxConnections : 10000,corePoolSize : 0,maximumPoolSize : 2147483647,maxThreadIdleTime : 5,sizeOfQueue : -1,fairnessPolicy : false,useRetries : false,
   [junit4]   2> 1549975 INFO  (TEST-CollectionsAPIDistributedZkTest.test-seed#[7B9D114E4CC14E06]) [    ] o.a.s.u.UpdateShardHandler Creating UpdateShardHandler HTTP client with params: socketTimeout=340000&connTimeout=45000&retry=true
   [junit4]   2> 1549976 INFO  (TEST-CollectionsAPIDistributedZkTest.test-seed#[7B9D114E4CC14E06]) [    ] o.a.s.l.LogWatcher SLF4J impl is org.slf4j.impl.Log4jLoggerFactory
   [junit4]   2> 1549976 INFO  (TEST-CollectionsAPIDistributedZkTest.test-seed#[7B9D114E4CC14E06]) [    ] o.a.s.l.LogWatcher Registering Log Listener [Log4j (org.slf4j.impl.Log4jLoggerFactory)]
   [junit4]   2> 1549976 INFO  (TEST-CollectionsAPIDistributedZkTest.test-seed#[7B9D114E4CC14E06]) [    ] o.a.s.c.ZkContainer Zookeeper client=127.0.0.1:36981/solr
   [junit4]   2> 1549976 INFO  (TEST-CollectionsAPIDistributedZkTest.test-seed#[7B9D114E4CC14E06]) [    ] o.a.s.c.ZkController zkHost includes chroot
   [junit4]   2> 1549977 INFO  (TEST-CollectionsAPIDistributedZkTest.test-seed#[7B9D114E4CC14E06]) [    ] o.a.s.c.c.SolrZkClient Using default ZkCredentialsProvider
   [junit4]   2> 1549977 INFO  (TEST-CollectionsAPIDistributedZkTest.test-seed#[7B9D114E4CC14E06]) [    ] o.a.s.c.c.ConnectionManager Waiting for client to connect to ZooKeeper
   [junit4]   2> 1549981 INFO  (zkCallback-554-thread-1) [    ] o.a.s.c.c.ConnectionManager Watcher org.apache.solr.common.cloud.ConnectionManager@5f46a537 name:ZooKeeperConnection Watcher:127.0.0.1:36981 got event WatchedEvent state:SyncConnected type:None path:null path:null type:None
   [junit4]   2> 1549982 INFO  (TEST-CollectionsAPIDistributedZkTest.test-seed#[7B9D114E4CC14E06]) [    ] o.a.s.c.c.ConnectionManager Client is connected to ZooKeeper
   [junit4]   2> 1549983 INFO  (TEST-CollectionsAPIDistributedZkTest.test-seed#[7B9D114E4CC14E06]) [    ] o.a.s.c.c.SolrZkClient Using default ZkACLProvider
   [junit4]   2> 1549985 INFO  (TEST-CollectionsAPIDistributedZkTest.test-seed#[7B9D114E4CC14E06]) [n:127.0.0.1:40631_    ] o.a.s.c.c.ConnectionManager Waiting for client to connect to ZooKeeper
   [junit4]   2> 1549986 INFO  (zkCallback-555-thread-1-processing-n:127.0.0.1:40631_) [n:127.0.0.1:40631_    ] o.a.s.c.c.ConnectionManager Watcher org.apache.solr.common.cloud.ConnectionManager@3f3d4787 name:ZooKeeperConnection Watcher:127.0.0.1:36981/solr got event WatchedEvent state:SyncConnected type:None path:null path:null type:None
   [junit4]   2> 1549986 INFO  (TEST-CollectionsAPIDistributedZkTest.test-seed#[7B9D114E4CC14E06]) [n:127.0.0.1:40631_    ] o.a.s.c.c.ConnectionManager Client is connected to ZooKeeper
   [junit4]   2> 1549992 INFO  (TEST-CollectionsAPIDistributedZkTest.test-seed#[7B9D114E4CC14E06]) [n:127.0.0.1:40631_    ] o.a.s.c.c.SolrZkClient makePath: /overseer/queue
   [junit4]   2> 1549994 INFO  (TEST-CollectionsAPIDistributedZkTest.test-seed#[7B9D114E4CC14E06]) [n:127.0.0.1:40631_    ] o.a.s.c.c.SolrZkClient makePath: /overseer/collection-queue-work
   [junit4]   2> 1549996 INFO  (TEST-CollectionsAPIDistributedZkTest.test-seed#[7B9D114E4CC14E06]) [n:127.0.0.1:40631_    ] o.a.s.c.c.SolrZkClient makePath: /overseer/collection-map-running
   [junit4]   2> 1549998 INFO  (TEST-CollectionsAPIDistributedZkTest.test-seed#[7B9D114E4CC14E06]) [n:127.0.0.1:40631_    ] o.a.s.c.c.SolrZkClient makePath: /overseer/collection-map-completed
   [junit4]   2> 1550000 INFO  (TEST-CollectionsAPIDistributedZkTest.test-seed#[7B9D114E4CC14E06]) [n:127.0.0.1:40631_    ] o.a.s.c.c.SolrZkClient makePath: /overseer/collection-map-failure
   [junit4]   2> 1550002 INFO  (TEST-CollectionsAPIDistributedZkTest.test-seed#[7B9D114E4CC14E06]) [n:127.0.0.1:40631_    ] o.a.s.c.c.SolrZkClient makePath: /live_nodes
   [junit4]   2> 1550003 INFO  (TEST-CollectionsAPIDistributedZkTest.test-seed#[7B9D114E4CC14E06]) [n:127.0.0.1:40631_    ] o.a.s.c.c.SolrZkClient makePath: /aliases.json
   [junit4]   2> 1550005 INFO  (TEST-CollectionsAPIDistributedZkTest.test-seed#[7B9D114E4CC14E06]) [n:127.0.0.1:40631_    ] o.a.s.c.c.SolrZkClient makePath: /clusterstate.json
   [junit4]   2> 1550006 INFO  (TEST-CollectionsAPIDistributedZkTest.test-seed#[7B9D114E4CC14E06]) [n:127.0.0.1:40631_    ] o.a.s.c.ZkController Register node as live in ZooKeeper:/live_nodes/127.0.0.1:40631_
   [junit4]   2> 1550006 INFO  (TEST-CollectionsAPIDistributedZkTest.test-seed#[7B9D114E4CC14E06]) [n:127.0.0.1:40631_    ] o.a.s.c.c.SolrZkClient makePath: /live_nodes/127.0.0.1:40631_
   [junit4]   2> 1550008 INFO  (TEST-CollectionsAPIDistributedZkTest.test-seed#[7B9D114E4CC14E06]) [n:127.0.0.1:40631_    ] o.a.s.c.c.SolrZkClient makePath: /overseer_elect
   [junit4]   2> 1550013 INFO  (TEST-CollectionsAPIDistributedZkTest.test-seed#[7B9D114E4CC14E06]) [n:127.0.0.1:40631_    ] o.a.s.c.c.SolrZkClient makePath: /overseer_elect/election
   [junit4]   2> 1550020 INFO  (TEST-CollectionsAPIDistributedZkTest.test-seed#[7B9D114E4CC14E06]) [n:127.0.0.1:40631_    ] o.a.s.c.Overseer Overseer (id=null) closing
   [junit4]   2> 1550021 INFO  (TEST-CollectionsAPIDistributedZkTest.test-seed#[7B9D114E4CC14E06]) [n:127.0.0.1:40631_    ] o.a.s.c.LeaderElector Joined leadership election with path: /overseer_elect/election/94239362304180228-127.0.0.1:40631_-n_0000000000
   [junit4]   2> 1550022 INFO  (TEST-CollectionsAPIDistributedZkTest.test-seed#[7B9D114E4CC14E06]) [n:127.0.0.1:40631_    ] o.a.s.c.OverseerElectionContext I am going to be the leader 127.0.0.1:40631_
   [junit4]   2> 1550022 INFO  (TEST-CollectionsAPIDistributedZkTest.test-seed#[7B9D114E4CC14E06]) [n:127.0.0.1:40631_    ] o.a.s.c.c.SolrZkClient makePath: /overseer_elect/leader
   [junit4]   2> 1550023 INFO  (TEST-CollectionsAPIDistributedZkTest.test-seed#[7B9D114E4CC14E06]) [n:127.0.0.1:40631_    ] o.a.s.c.Overseer Overseer (id=94239362304180228-127.0.0.1:40631_-n_0000000000) starting
   [junit4]   2> 1550025 INFO  (TEST-CollectionsAPIDistributedZkTest.test-seed#[7B9D114E4CC14E06]) [n:127.0.0.1:40631_    ] o.a.s.c.c.SolrZkClient makePath: /overseer/queue-work
   [junit4]   2> 1550030 INFO  (TEST-CollectionsAPIDistributedZkTest.test-seed#[7B9D114E4CC14E06]) [n:127.0.0.1:40631_    ] o.a.s.c.OverseerAutoReplicaFailoverThread Starting OverseerAutoReplicaFailoverThread autoReplicaFailoverWorkLoopDelay=10000 autoReplicaFailoverWaitAfterExpiration=10000 autoReplicaFailoverBadNodeExpiration=60000
   [junit4]   2> 1550031 INFO  (OverseerCollectionProcessor-94239362304180228-127.0.0.1:40631_-n_0000000000) [n:127.0.0.1:40631_    ] o.a.s.c.OverseerCollectionProcessor Process current queue of collection creations
   [junit4]   2> 1550031 INFO  (OverseerStateUpdate-94239362304180228-127.0.0.1:40631_-n_0000000000) [n:127.0.0.1:40631_    ] o.a.s.c.Overseer Starting to work on the main queue
   [junit4]   2> 1550037 INFO  (TEST-CollectionsAPIDistributedZkTest.test-seed#[7B9D114E4CC14E06]) [n:127.0.0.1:40631_    ] o.a.s.c.c.ZkStateReader Updating cluster state from ZooKeeper... 
   [junit4]   2> 1550039 INFO  (TEST-CollectionsAPIDistributedZkTest.test-seed#[7B9D114E4CC14E06]) [n:127.0.0.1:40631_    ] o.a.s.c.CoreContainer No authentication plugin used.
   [junit4]   2> 1550040 INFO  (TEST-CollectionsAPIDistributedZkTest.test-seed#[7B9D114E4CC14E06]) [n:127.0.0.1:40631_    ] o.a.s.c.CoreContainer Security conf doesn't exist. Skipping setup for authorization module.
   [junit4]   2> 1550041 INFO  (TEST-CollectionsAPIDistributedZkTest.test-seed#[7B9D114E4CC14E06]) [n:127.0.0.1:40631_    ] o.a.s.c.CoresLocator Looking for core definitions underneath /x1/jenkins/jenkins-slave/workspace/Lucene-Solr-NightlyTests-trunk/solr/build/solr-core/test/J1/temp/solr.cloud.CollectionsAPIDistributedZkTest_7B9D114E4CC14E06-001/control-001/cores
   [junit4]   2> 1550042 INFO  (TEST-CollectionsAPIDistributedZkTest.test-seed#[7B9D114E4CC14E06]) [n:127.0.0.1:40631_    ] o.a.s.c.SolrCore Created CoreDescriptor: {name=collection1, config=solrconfig.xml, transient=false, schema=schema.xml, loadOnStartup=true, configSetProperties=configsetprops.json, instanceDir=/x1/jenkins/jenkins-slave/workspace/Lucene-Solr-NightlyTests-trunk/solr/build/solr-core/test/J1/temp/solr.cloud.CollectionsAPIDistributedZkTest_7B9D114E4CC14E06-001/control-001/cores/collection1, collection=control_collection, absoluteInstDir=/x1/jenkins/jenkins-slave/workspace/Lucene-Solr-NightlyTests-trunk/solr/build/solr-core/test/J1/temp/solr.cloud.CollectionsAPIDistributedZkTest_7B9D114E4CC14E06-001/control-001/cores/collection1/, coreNodeName=, dataDir=data/, shard=}
   [junit4]   2> 1550042 INFO  (TEST-CollectionsAPIDistributedZkTest.test-seed#[7B9D114E4CC14E06]) [n:127.0.0.1:40631_    ] o.a.s.c.CoresLocator Found core collection1 in /x1/jenkins/jenkins-slave/workspace/Lucene-Solr-NightlyTests-trunk/solr/build/solr-core/test/J1/temp/solr.cloud.CollectionsAPIDistributedZkTest_7B9D114E4CC14E06-001/control-001/cores/collection1/
   [junit4]   2> 1550042 INFO  (TEST-CollectionsAPIDistributedZkTest.test-seed#[7B9D114E4CC14E06]) [n:127.0.0.1:40631_    ] o.a.s.c.CoresLocator Found 1 core definitions
   [junit4]   2> 1550043 INFO  (coreLoadExecutor-2140-thread-1-processing-n:127.0.0.1:40631_) [n:127.0.0.1:40631_ c:control_collection   x:collection1] o.a.s.c.ZkController publishing state=down
   [junit4]   2> 1550043 INFO  (TEST-CollectionsAPIDistributedZkTest.test-seed#[7B9D114E4CC14E06]) [n:127.0.0.1:40631_    ] o.a.s.s.SolrDispatchFilter user.dir=/x1/jenkins/jenkins-slave/workspace/Lucene-Solr-NightlyTests-trunk/solr/build/solr-core/test/J1
   [junit4]   2> 1550043 INFO  (TEST-CollectionsAPIDistributedZkTest.test-seed#[7B9D114E4CC14E06]) [n:127.0.0.1:40631_    ] o.a.s.s.SolrDispatchFilter SolrDispatchFilter.init() done
   [junit4]   2> 1550043 INFO  (coreLoadExecutor-2140-thread-1-processing-n:127.0.0.1:40631_) [n:127.0.0.1:40631_ c:control_collection   x:collection1] o.a.s.c.ZkController numShards not found on descriptor - reading it from system property
   [junit4]   2> 1550044 INFO  (zkCallback-555-thread-1-processing-n:127.0.0.1:40631_) [n:127.0.0.1:40631_    ] o.a.s.c.DistributedQueue NodeChildrenChanged fired on path /overseer/queue state SyncConnected
   [junit4]   2> 1550044 INFO  (coreLoadExecutor-2140-thread-1-processing-n:127.0.0.1:40631_) [n:127.0.0.1:40631_ c:control_collection   x:collection1] o.a.s.c.ZkController look for our core node name
   [junit4]   2> 1550045 INFO  (OverseerStateUpdate-94239362304180228-127.0.0.1:40631_-n_0000000000) [n:127.0.0.1:40631_    ] o.a.s.c.Overseer processMessage: queueSize: 1, message = {
   [junit4]   2>   "core":"collection1",
   [junit4]   2>   "roles":null,
   [junit4]   2>   "base_url":"http://127.0.0.1:40631",
   [junit4]   2>   "node_name":"127.0.0.1:40631_",
   [junit4]   2>   "numShards":"1",
   [junit4]   2>   "state":"down",
   [junit4]   2>   "shard":null,
   [junit4]   2>   "collection":"control_collection",
   [junit4]   2>   "operation":"state"} current state version: 0
   [junit4]   2> 1550046 INFO  (OverseerStateUpdate-94239362304180228-127.0.0.1:40631_-n_0000000000) [n:127.0.0.1:40631_    ] o.a.s.c.o.ReplicaMutator Update state numShards=1 message={
   [junit4]   2>   "core":"collection1",
   [junit4]   2>   "roles":null,
   [junit4]   2>   "base_url":"http://127.0.0.1:40631",
   [junit4]   2>   "node_name":"127.0.0.1:40631_",
   [junit4]   2>   "numShards":"1",
   [junit4]   2>   "state":"down",
   [junit4]   2>   "shard":null,
   [junit4]   2>   "collection":"control_collection",
   [junit4]   2>   "operation":"state"}
   [junit4]   2> 1550046 INFO  (OverseerStateUpdate-94239362304180228-127.0.0.1:40631_-n_0000000000) [n:127.0.0.1:40631_    ] o.a.s.c.o.ClusterStateMutator building a new cName: control_collection
   [junit4]   2> 1550046 INFO  (OverseerStateUpdate-94239362304180228-127.0.0.1:40631_-n_0000000000) [n:127.0.0.1:40631_    ] o.a.s.c.o.ReplicaMutator Assigning new node to shard shard=shard1
   [junit4]   2> 1550047 INFO  (zkCallback-555-thread-1-processing-n:127.0.0.1:40631_) [n:127.0.0.1:40631_    ] o.a.s.c.c.ZkStateReader A cluster state change: WatchedEvent state:SyncConnected type:NodeDataChanged path:/clusterstate.json, has occurred - updating... (live nodes size: 1)
   [junit4]   2> 1550049 INFO  (zkCallback-555-thread-1-processing-n:127.0.0.1:40631_) [n:127.0.0.1:40631_    ] o.a.s.c.c.ZkStateReader Updated cluster state version to 1
   [junit4]   2> 1551045 INFO  (coreLoadExecutor-2140-thread-1-processing-n:127.0.0.1:40631_) [n:127.0.0.1:40631_ c:control_collection   x:collection1] o.a.s.c.ZkController waiting to find shard id in clusterstate for collection1
   [junit4]   2> 1551045 INFO  (coreLoadExecutor-2140-thread-1-processing-n:127.0.0.1:40631_) [n:127.0.0.1:40631_ c:control_collection   x:collection1] o.a.s.c.ZkController Check for collection zkNode:control_collection
   [junit4]   2> 1551046 INFO  (coreLoadExecutor-2140-thread-1-processing-n:127.0.0.1:40631_) [n:127.0.0.1:40631_ c:control_collection   x:collection1] o.a.s.c.ZkController Collection zkNode exists
   [junit4]   2> 1551046 INFO  (coreLoadExecutor-2140-thread-1-processing-n:127.0.0.1:40631_) [n:127.0.0.1:40631_ c:control_collection   x:collection1] o.a.s.c.c.ZkStateReader Load collection config from:/collections/control_collection
   [junit4]   2> 1551047 INFO  (coreLoadExecutor-2140-thread-1-processing-n:127.0.0.1:40631_) [n:127.0.0.1:40631_ c:control_collection   x:collection1] o.a.s.c.c.ZkStateReader path=/collections/control_collection configName=conf1 specified config exists in ZooKeeper
   [junit4]   2> 1551047 INFO  (coreLoadExecutor-2140-thread-1-processing-n:127.0.0.1:40631_) [n:127.0.0.1:40631_ c:control_collection   x:collection1] o.a.s.c.SolrResourceLoader new SolrResourceLoader for directory: '/x1/jenkins/jenkins-slave/workspace/Lucene-Solr-NightlyTests-trunk/solr/build/solr-core/test/J1/temp/solr.cloud.CollectionsAPIDistributedZkTest_7B9D114E4CC14E06-001/control-001/cores/collection1/'
   [junit4]   2> 1551067 INFO  (coreLoadExecutor-2140-thread-1-processing-n:127.0.0.1:40631_) [n:127.0.0.1:40631_ c:control_collection   x:collection1] o.a.s.c.Config loaded config solrconfig.xml with version 0 
   [junit4]   2> 1551085 INFO  (coreLoadExecutor-2140-thread-1-processing-n:127.0.0.1:40631_) [n:127.0.0.1:40631_ c:control_collection   x:collection1] o.a.s.c.SolrConfig current version of requestparams : -1
   [junit4]   2> 1551089 INFO  (coreLoadExecutor-2140-thread-1-processing-n:127.0.0.1:40631_) [n:127.0.0.1:40631_ c:control_collection   x:collection1] o.a.s.c.SolrConfig Using Lucene MatchVersion: 6.0.0
   [junit4]   2> 1551098 INFO  (coreLoadExecutor-2140-thread-1-processing-n:127.0.0.1:40631_) [n:127.0.0.1:40631_ c:control_collection   x:collection1] o.a.s.c.Config Loaded SolrConfig: solrconfig.xml
   [junit4]   2> 1551100 INFO  (coreLoadExecutor-2140-thread-1-processing-n:127.0.0.1:40631_) [n:127.0.0.1:40631_ c:control_collection   x:collection1] o.a.s.s.IndexSchema Reading Solr Schema from /configs/conf1/schema.xml
   [junit4]   2> 1551105 INFO  (coreLoadExecutor-2140-thread-1-processing-n:127.0.0.1:40631_) [n:127.0.0.1:40631_ c:control_collection   x:collection1] o.a.s.s.IndexSchema [collection1] Schema name=test
   [junit4]   2> 1551200 INFO  (coreLoadExecutor-2140-thread-1-processing-n:127.0.0.1:40631_) [n:127.0.0.1:40631_ c:control_collection   x:collection1] o.a.s.s.OpenExchangeRatesOrgProvider Initialized with rates=open-exchange-rates.json, refreshInterval=1440.
   [junit4]   2> 1551207 INFO  (coreLoadExecutor-2140-thread-1-processing-n:127.0.0.1:40631_) [n:127.0.0.1:40631_ c:control_collection   x:collection1] o.a.s.s.IndexSchema default search field in schema is text
   [junit4]   2> 1551208 INFO  (coreLoadExecutor-2140-thread-1-processing-n:127.0.0.1:40631_) [n:127.0.0.1:40631_ c:control_collection   x:collection1] o.a.s.s.IndexSchema unique key field: id
   [junit4]   2> 1551222 INFO  (coreLoadExecutor-2140-thread-1-processing-n:127.0.0.1:40631_) [n:127.0.0.1:40631_ c:control_collection   x:collection1] o.a.s.s.FileExchangeRateProvider Reloading exchange rates from file currency.xml
   [junit4]   2> 1551238 INFO  (coreLoadExecutor-2140-thread-1-processing-n:127.0.0.1:40631_) [n:127.0.0.1:40631_ c:control_collection   x:collection1] o.a.s.s.FileExchangeRateProvider Reloading exchange rates from file currency.xml
   [junit4]   2> 1551241 INFO  (coreLoadExecutor-2140-thread-1-processing-n:127.0.0.1:40631_) [n:127.0.0.1:40631_ c:control_collection   x:collection1] o.a.s.s.OpenExchangeRatesOrgProvider Reloading exchange rates from open-exchange-rates.json
   [junit4]   2> 1551242 WARN  (coreLoadExecutor-2140-thread-1-processing-n:127.0.0.1:40631_) [n:127.0.0.1:40631_ c:control_collection   x:collection1] o.a.s.s.OpenExchangeRatesOrgProvider Unknown key IMPORTANT NOTE
   [junit4]   2> 1551242 WARN  (coreLoadExecutor-2140-thread-1-processing-n:127.0.0.1:40631_) [n:127.0.0.1:40631_ c:control_collection   x:collection1] o.a.s.s.OpenExchangeRatesOrgProvider Expected key, got STRING
   [junit4]   2> 1551242 INFO  (coreLoadExecutor-2140-thread-1-processing-n:127.0.0.1:40631_) [n:127.0.0.1:40631_ c:control_collection   x:collection1] o.a.s.s.OpenExchangeRatesOrgProvider Reloading exchange rates from open-exchange-rates.json
   [junit4]   2> 1551243 WARN  (coreLoadExecutor-2140-thread-1-processing-n:127.0.0.1:40631_) [n:127.0.0.1:40631_ c:control_collection   x:collection1] o.a.s.s.OpenExchangeRatesOrgProvider Unknown key IMPORTANT NOTE
   [junit4]   2> 1551243 WARN  (coreLoadExecutor-2140-thread-1-processing-n:127.0.0.1:40631_) [n:127.0.0.1:40631_ c:control_collection   x:collection1] o.a.s.s.OpenExchangeRatesOrgProvider Expected key, got STRING
   [junit4]   2> 1551244 INFO  (coreLoadExecutor-2140-thread-1-processing-n:127.0.0.1:40631_) [n:127.0.0.1:40631_ c:control_collection   x:collection1] o.a.s.c.ConfigSetProperties Did not find ConfigSet properties, assuming default properties: Can't find resource 'configsetprops.json' in classpath or '/configs/conf1', cwd=/x1/jenkins/jenkins-slave/workspace/Lucene-Solr-NightlyTests-trunk/solr/build/solr-core/test/J1
   [junit4]   2> 1551245 INFO  (coreLoadExecutor-2140-thread-1-processing-n:127.0.0.1:40631_) [n:127.0.0.1:40631_ c:control_collection   x:collection1] o.a.s.c.CoreContainer Creating SolrCore 'collection1' using configuration from collection control_collection
   [junit4]   2> 1551245 INFO  (coreLoadExecutor-2140-thread-1-processing-n:127.0.0.1:40631_) [n:127.0.0.1:40631_ c:control_collection s:shard1 r:core_node1 x:collection1] o.a.s.c.SolrCore org.apache.solr.core.MockDirectoryFactory
   [junit4]   2> 1551245 INFO  (coreLoadExecutor-2140-thread-1-processing-n:127.0.0.1:40631_) [n:127.0.0.1:40631_ c:control_collection s:shard1 r:core_node1 x:collection1] o.a.s.c.SolrCore [[collection1] ] Opening new SolrCore at [/x1/jenkins/jenkins-slave/workspace/Lucene-Solr-NightlyTests-trunk/solr/build/solr-core/test/J1/temp/solr.cloud.CollectionsAPIDistributedZkTest_7B9D114E4CC14E06-001/control-001/cores/collection1/], dataDir=[null]
   [junit4]   2> 1551245 INFO  (coreLoadExecutor-2140-thread-1-processing-n:127.0.0.1:40631_) [n:127.0.0.1:40631_ c:control_collection s:shard1 r:core_node1 x:collection1] o.a.s.c.JmxMonitoredMap JMX monitoring is enabled. Adding Solr mbeans to JMX Server: com.sun.jmx.mbeanserver.JmxMBeanServer@699fe850
   [junit4]   2> 1551246 INFO  (coreLoadExecutor-2140-thread-1-processing-n:127.0.0.1:40631_) [n:127.0.0.1:40631_ c:control_collection s:shard1 r:core_node1 x:collection1] o.a.s.c.CachingDirectoryFactory return new directory for /x1/jenkins/jenkins-slave/workspace/Lucene-Solr-NightlyTests-trunk/solr/build/solr-core/test/J1/temp/solr.cloud.CollectionsAPIDistributedZkTest_7B9D114E4CC14E06-001/control-001/cores/collection1/data
   [junit4]   2> 1551246 INFO  (coreLoadExecutor-2140-thread-1-processing-n:127.0.0.1:40631_) [n:127.0.0.1:40631_ c:control_collection s:shard1 r:core_node1 x:collection1] o.a.s.c.SolrCore New index directory detected: old=null new=/x1/jenkins/jenkins-slave/workspace/Lucene-Solr-NightlyTests-trunk/solr/build/solr-core/test/J1/temp/solr.cloud.CollectionsAPIDistributedZkTest_7B9D114E4CC14E06-001/control-001/cores/collection1/data/index/
   [junit4]   2> 1551246 WARN  (coreLoadExecutor-2140-thread-1-processing-n:127.0.0.1:40631_) [n:127.0.0.1:40631_ c:control_collection s:shard1 r:core_node1 x:collection1] o.a.s.c.SolrCore [collection1] Solr index directory '/x1/jenkins/jenkins-slave/workspace/Lucene-Solr-NightlyTests-trunk/solr/build/solr-core/test/J1/temp/solr.cloud.CollectionsAPIDistributedZkTest_7B9D114E4CC14E06-001/control-001/cores/collection1/data/index' doesn't exist. Creating new index...
   [junit4]   2> 1551247 INFO  (coreLoadExecutor-2140-thread-1-processing-n:127.0.0.1:40631_) [n:127.0.0.1:40631_ c:control_collection s:shard1 r:core_node1 x:collection1] o.a.s.c.CachingDirectoryFactory return new directory for /x1/jenkins/jenkins-slave/workspace/Lucene-Solr-NightlyTests-trunk/solr/build/solr-core/test/J1/temp/solr.cloud.CollectionsAPIDistributedZkTest_7B9D114E4CC14E06-001/control-001/cores/collection1/data/index
   [junit4]   2> 1551247 INFO  (coreLoadExecutor-2140-thread-1-processing-n:127.0.0.1:40631_) [n:127.0.0.1:40631_ c:control_collection s:shard1 r:core_node1 x:collection1] o.a.s.u.RandomMergePolicy RandomMergePolicy wrapping class org.apache.lucene.index.LogByteSizeMergePolicy: [LogByteSizeMergePolicy: minMergeSize=1677721, mergeFactor=32, maxMergeSize=2147483648, maxMergeSizeForForcedMerge=9223372036854775807, calibrateSizeByDeletes=false, maxMergeDocs=2147483647, maxCFSSegmentSizeMB=8.796093022207999E12, noCFSRatio=0.5004314197358152]
   [junit4]   2> 1551248 INFO  (coreLoadExecutor-2140-thread-1-processing-n:127.0.0.1:40631_) [n:127.0.0.1:40631_ c:control_collection s:shard1 r:core_node1 x:collection1] o.a.s.c.SolrCore SolrDeletionPolicy.onCommit: commits: num=1
   [junit4]   2> 	commit{dir=MockDirectoryWrapper(RAMDirectory@1b15f6e4 lockFactory=org.apache.lucene.store.SingleInstanceLockFactory@c5c1d1e),segFN=segments_1,generation=1}
   [junit4]   2> 1551248 INFO  (coreLoadExecutor-2140-thread-1-processing-n:127.0.0.1:40631_) [n:127.0.0.1:40631_ c:control_collection s:shard1 r:core_node1 x:collection1] o.a.s.c.SolrCore newest commit generation = 1
   [junit4]   2> 1551248 INFO  (OldIndexDirectoryCleanupThreadForCore-collection1) [n:127.0.0.1:40631_ c:control_collection s:shard1 r:core_node1 x:collection1] o.a.s.c.SolrCore Looking for old index directories to cleanup for core collection1 in /x1/jenkins/jenkins-slave/workspace/Lucene-Solr-NightlyTests-trunk/solr/build/solr-core/test/J1/temp/solr.cloud.CollectionsAPIDistributedZkTest_7B9D114E4CC14E06-001/control-001/cores/collection1/data/
   [junit4]   2> 1551249 WARN  (OldIndexDirectoryCleanupThreadForCore-collection1) [n:127.0.0.1:40631_ c:control_collection s:shard1 r:core_node1 x:collection1] o.a.s.c.DirectoryFactory /x1/jenkins/jenkins-slave/workspace/Lucene-Solr-NightlyTests-trunk/solr/build/solr-core/test/J1/temp/solr.cloud.CollectionsAPIDistributedZkTest_7B9D114E4CC14E06-001/control-001/cores/collection1/data/ does not point to a valid data directory; skipping clean-up of old index directories.
   [junit4]   2> 1551253 INFO  (coreLoadExecutor-2140-thread-1-processing-n:127.0.0.1:40631_) [n:127.0.0.1:40631_ c:control_collection s:shard1 r:core_node1 x:collection1] o.a.s.u.p.UpdateRequestProcessorChain creating updateRequestProcessorChain "nodistrib"
   [junit4]   2> 1551253 INFO  (coreLoadExecutor-2140-thread-1-processing-n:127.0.0.1:40631_) [n:127.0.0.1:40631_ c:control_collection s:shard1 r:core_node1 x:collection1] o.a.s.u.p.UpdateRequestProcessorChain creating updateRequestProcessorChain "dedupe"
   [junit4]   2> 1551254 INFO  (coreLoadExecutor-2140-thread-1-processing-n:127.0.0.1:40631_) [n:127.0.0.1:40631_ c:control_collection s:shard1 r:core_node1 x:collection1] o.a.s.u.p.UpdateRequestProcessorChain inserting DistributedUpdateProcessorFactory into updateRequestProcessorChain "dedupe"
   [junit4]   2> 1551254 INFO  (coreLoadExecutor-2140-thread-1-processing-n:127.0.0.1:40631_) [n:127.0.0.1:40631_ c:control_collection s:shard1 r:core_node1 x:collection1] o.a.s.u.p.UpdateRequestProcessorChain creating updateRequestProcessorChain "stored_sig"
   [junit4]   2> 1551254 INFO  (coreLoadExecutor-2140-thread-1-processing-n:127.0.0.1:40631_) [n:127.0.0.1:40631_ c:control_collection s:shard1 r:core_node1 x:collection1] o.a.s.u.p.UpdateRequestProcessorChain inserting DistributedUpdateProcessorFactory into updateRequestProcessorChain "stored_sig"
   [junit4]   2> 1551254 INFO  (coreLoadExecutor-2140-thread-1-processing-n:127.0.0.1:40631_) [n:127.0.0.1:40631_ c:control_collection s:shard1 r:core_node1 x:collection1] o.a.s.u.p.UpdateRequestProcessorChain creating updateRequestProcessorChain "distrib-dup-test-chain-explicit"
   [junit4]   2> 1551254 INFO  (coreLoadExecutor-2140-thread-1-processing-n:127.0.0.1:40631_) [n:127.0.0.1:40631_ c:control_collection s:shard1 r:core_node1 x:collection1] o.a.s.u.p.UpdateRequestProcessorChain creating updateRequestProcessorChain "distrib-dup-test-chain-implicit"
   [junit4]   2> 1551255 INFO  (coreLoadExecutor-2140-thread-1-processing-n:127.0.0.1:40631_) [n:127.0.0.1:40631_ c:control_collection s:shard1 r:core_node1 x:collection1] o.a.s.u.p.UpdateRequestProcessorChain inserting DistributedUpdateProcessorFactory into updateRequestProcessorChain "distrib-dup-test-chain-implicit"
   [junit4]   2> 1551255 INFO  (coreLoadExecutor-2140-thread-1-processing-n:127.0.0.1:40631_) [n:127.0.0.1:40631_ c:control_collection s:shard1 r:core_node1 x:collection1] o.a.s.c.SolrCore no updateRequestProcessorChain defined as default, creating implicit default
   [junit4]   2> 1551257 INFO  (coreLoadExecutor-2140-thread-1-processing-n:127.0.0.1:40631_) [n:127.0.0.1:40631_ c:control_collection s:shard1 r:core_node1 x:collection1] o.a.s.h.l.XMLLoader xsltCacheLifetimeSeconds=60
   [junit4]   2> 1551258 INFO  (coreLoadExecutor-2140-thread-1-processing-n:127.0.0.1:40631_) [n:127.0.0.1:40631_ c:control_collection s:shard1 r:core_node1 x:collection1] o.a.s.h.l.XMLLoader xsltCacheLifetimeSeconds=60
   [junit4]   2> 1551259 INFO  (coreLoadExecutor-2140-thread-1-processing-n:127.0.0.1:40631_) [n:127.0.0.1:40631_ c:control_collection s:shard1 r:core_node1 x:collection1] o.a.s.h.l.XMLLoader xsltCacheLifetimeSeconds=60
   [junit4]   2> 1551260 INFO  (coreLoadExecutor-2140-thread-1-processing-n:127.0.0.1:40631_) [n:127.0.0.1:40631_ c:control_collection s:shard1 r:core_node1 x:collection1] o.a.s.h.l.XMLLoader xsltCacheLifetimeSeconds=60
   [junit4]   2> 1551263 INFO  (coreLoadExecutor-2140-thread-1-processing-n:127.0.0.1:40631_) [n:127.0.0.1:40631_ c:control_collection s:shard1 r:core_node1 x:collection1] o.a.s.c.RequestHandlers Registered paths: /admin/mbeans,standard,/update/csv,/update/json/docs,/admin/luke,/admin/segments,/get,/admin/system,/replication,/admin/properties,/config,/schema,/admin/plugins,/admin/logging,/update/json,/admin/threads,/admin/ping,/update,/admin/file
   [junit4]   2> 1551264 INFO  (coreLoadExecutor-2140-thread-1-processing-n:127.0.0.1:40631_) [n:127.0.0.1:40631_ c:control_collection s:shard1 r:core_node1 x:collection1] o.a.s.c.SolrCore Using default statsCache cache: org.apache.solr.search.stats.LocalStatsCache
   [junit4]   2> 1551264 INFO  (coreLoadExecutor-2140-thread-1-processing-n:127.0.0.1:40631_) [n:127.0.0.1:40631_ c:control_collection s:shard1 r:core_node1 x:collection1] o.a.s.u.UpdateHandler Using UpdateLog implementation: org.apache.solr.update.UpdateLog
   [junit4]   2> 1551265 INFO  (coreLoadExecutor-2140-thread-1-processing-n:127.0.0.1:40631_) [n:127.0.0.1:40631_ c:control_collection s:shard1 r:core_node1 x:collection1] o.a.s.u.UpdateLog Initializing UpdateLog: dataDir= defaultSyncLevel=FLUSH numRecordsToKeep=100 maxNumLogsToKeep=10 numVersionBuckets=65536
   [junit4]   2> 1551266 INFO  (coreLoadExecutor-2140-thread-1-processing-n:127.0.0.1:40631_) [n:127.0.0.1:40631_ c:control_collection s:shard1 r:core_node1 x:collection1] o.a.s.c.SolrCore Hard AutoCommit: disabled
   [junit4]   2> 1551266 INFO  (coreLoadExecutor-2140-thread-1-processing-n:127.0.0.1:40631_) [n:127.0.0.1:40631_ c:control_collection s:shard1 r:core_node1 x:collection1] o.a.s.c.SolrCore Soft AutoCommit: disabled
   [junit4]   2> 1551266 INFO  (coreLoadExecutor-2140-thread-1-processing-n:127.0.0.1:40631_) [n:127.0.0.1:40631_ c:control_collection s:shard1 r:core_node1 x:collection1] o.a.s.u.RandomMergePolicy RandomMergePolicy wrapping class org.apache.lucene.index.TieredMergePolicy: [TieredMergePolicy: maxMergeAtOnce=41, maxMergeAtOnceExplicit=21, maxMergedSegmentMB=47.0556640625, floorSegmentMB=0.26171875, forceMergeDeletesPctAllowed=24.89848619289661, segmentsPerTier=10.0, maxCFSSegmentSizeMB=8.796093022207999E12, noCFSRatio=1.0
   [junit4]   2> 1551267 INFO  (coreLoadExecutor-2140-thread-1-processing-n:127.0.0.1:40631_) [n:127.0.0.1:40631_ c:control_collection s:shard1 r:core_node1 x:collection1] o.a.s.c.SolrCore SolrDeletionPolicy.onInit: commits: num=1
   [junit4]   2> 	commit{dir=MockDirectoryWrapper(RAMDirectory@1b15f6e4 lockFactory=org.apache.lucene.store.SingleInstanceLockFactory@c5c1d1e),segFN=segments_1,generation=1}
   [junit4]   2> 1551267 INFO  (coreLoadExecutor-2140-thread-1-processing-n:127.0.0.1:40631_) [n:127.0.0.1:40631_ c:control_collection s:shard1 r:core_node1 x:collection1] o.a.s.c.SolrCore newest commit generation = 1
   [junit4]   2> 1551267 INFO  (coreLoadExecutor-2140-thread-1-processing-n:127.0.0.1:40631_) [n:127.0.0.1:40631_ c:control_collection s:shard1 r:core_node1 x:collection1] o.a.s.s.SolrIndexSearcher Opening Searcher@74224ae1[collection1] main
   [junit4]   2> 1551267 INFO  (coreLoadExecutor-2140-thread-1-processing-n:127.0.0.1:40631_) [n:127.0.0.1:40631_ c:control_collection s:shard1 r:core_node1 x:collection1] o.a.s.c.c.ZkStateReader Load collection config from:/collections/control_collection
   [junit4]   2> 1551269 INFO  (coreLoadExecutor-2140-thread-1-processing-n:127.0.0.1:40631_) [n:127.0.0.1:40631_ c:control_collection s:shard1 r:core_node1 x:collection1] o.a.s.c.c.ZkStateReader path=/collections/control_collection configName=conf1 specified config exists in ZooKeeper
   [junit4]   2> 1551269 INFO  (coreLoadExecutor-2140-thread-1-processing-n:127.0.0.1:40631_) [n:127.0.0.1:40631_ c:control_collection s:shard1 r:core_node1 x:collection1] o.a.s.r.ManagedResourceStorage Setting up ZooKeeper-based storage for the RestManager with znodeBase: /configs/conf1
   [junit4]   2> 1551270 INFO  (coreLoadExecutor-2140-thread-1-processing-n:127.0.0.1:40631_) [n:127.0.0.1:40631_ c:control_collection s:shard1 r:core_node1 x:collection1] o.a.s.r.ManagedResourceStorage Configured ZooKeeperStorageIO with znodeBase: /configs/conf1
   [junit4]   2> 1551270 INFO  (coreLoadExecutor-2140-thread-1-processing-n:127.0.0.1:40631_) [n:127.0.0.1:40631_ c:control_collection s:shard1 r:core_node1 x:collection1] o.a.s.r.RestManager Initializing RestManager with initArgs: {}
   [junit4]   2> 1551270 INFO  (coreLoadExecutor-2140-thread-1-processing-n:127.0.0.1:40631_) [n:127.0.0.1:40631_ c:control_collection s:shard1 r:core_node1 x:collection1] o.a.s.r.ManagedResourceStorage Reading _rest_managed.json using ZooKeeperStorageIO:path=/configs/conf1
   [junit4]   2> 1551270 INFO  (coreLoadExecutor-2140-thread-1-processing-n:127.0.0.1:40631_) [n:127.0.0.1:40631_ c:control_collection s:shard1 r:core_node1 x:collection1] o.a.s.r.ManagedResourceStorage No data found for znode /configs/conf1/_rest_managed.json
   [junit4]   2> 1551271 INFO  (coreLoadExecutor-2140-thread-1-processing-n:127.0.0.1:40631_) [n:127.0.0.1:40631_ c:control_collection s:shard1 r:core_node1 x:collection1] o.a.s.r.ManagedResourceStorage Loaded null at path _rest_managed.json using ZooKeeperStorageIO:path=/configs/conf1
   [junit4]   2> 1551271 INFO  (coreLoadExecutor-2140-thread-1-processing-n:127.0.0.1:40631_) [n:127.0.0.1:40631_ c:control_collection s:shard1 r:core_node1 x:collection1] o.a.s.r.RestManager Initializing 0 registered ManagedResources
   [junit4]   2> 1551271 INFO  (coreLoadExecutor-2140-thread-1-processing-n:127.0.0.1:40631_) [n:127.0.0.1:40631_ c:control_collection s:shard1 r:core_node1 x:collection1] o.a.s.h.ReplicationHandler Commits will be reserved for  10000
   [junit4]   2> 1551271 INFO  (searcherExecutor-2141-thread-1-processing-n:127.0.0.1:40631_ x:collection1 s:shard1 c:control_collection r:core_node1) [n:127.0.0.1:40631_ c:control_collection s:shard1 r:core_node1 x:collection1] o.a.s.c.SolrCore [collection1] Registered new searcher Searcher@74224ae1[collection1] main{ExitableDirectoryReader(UninvertingDirectoryReader())}
   [junit4]   2> 1551274 INFO  (coreLoadExecutor-2140-thread-1-processing-n:127.0.0.1:40631_) [n:127.0.0.1:40631_ c:control_collection s:shard1 r:core_node1 x:collection1] o.a.s.u.UpdateLog Looking up max value of version field to seed version buckets
   [junit4]   2> 1551274 INFO  (coreLoadExecutor-2140-thread-1-processing-n:127.0.0.1:40631_) [n:127.0.0.1:40631_ c:control_collection s:shard1 r:core_node1 x:collection1] o.a.s.u.VersionInfo Refreshing highest value of _version_ for 65536 version buckets from index
   [junit4]   2> 1551274 INFO  (coreLoadExecutor-2140-thread-1-processing-n:127.0.0.1:40631_) [n:127.0.0.1:40631_ c:control_collection s:shard1 r:core_node1 x:collection1] o.a.s.u.VersionInfo No terms found for _version_, cannot seed version bucket highest value from index
   [junit4]   2> 1551274 INFO  (coreLoadExecutor-2140-thread-1-processing-n:127.0.0.1:40631_) [n:127.0.0.1:40631_ c:control_collection s:shard1 r:core_node1 x:collection1] o.a.s.u.UpdateLog Could not find max version in index or recent updates, using new clock 1507829798789971968
   [junit4]   2> 1551276 INFO  (coreLoadExecutor-2140-thread-1-processing-n:127.0.0.1:40631_) [n:127.0.0.1:40631_ c:control_collection s:shard1 r:core_node1 x:collection1] o.a.s.u.UpdateLog Took 2 ms to seed version buckets with highest version 1507829798789971968
   [junit4]   2> 1551277 INFO  (coreLoadExecutor-2140-thread-1-processing-n:127.0.0.1:40631_) [n:127.0.0.1:40631_ c:control_collection s:shard1 r:core_node1 x:collection1] o.a.s.c.ZkController watch zkdir /configs/conf1
   [junit4]   2> 1551277 INFO  (coreLoadExecutor-2140-thread-1-processing-n:127.0.0.1:40631_) [n:127.0.0.1:40631_ c:control_collection s:shard1 r:core_node1 x:collection1] o.a.s.c.CoreContainer registering core: collection1
   [junit4]   2> 1551278 INFO  (coreZkRegister-2134-thread-1-processing-n:127.0.0.1:40631_ x:collection1 s:shard1 c:control_collection r:core_node1) [n:127.0.0.1:40631_ c:control_collection s:shard1 r:core_node1 x:collection1] o.a.s.c.ZkController Register replica - core:collection1 address:http://127.0.0.1:40631 collection:control_collection shard:shard1
   [junit4]   2> 1551279 INFO  (coreZkRegister-2134-thread-1-processing-n:127.0.0.1:40631_ x:collection1 s:shard1 c:control_collection r:core_node1) [n:127.0.0.1:40631_ c:control_collection s:shard1 r:core_node1 x:collection1] o.a.s.c.c.SolrZkClient makePath: /collections/control_collection/leader_elect/shard1/election
   [junit4]   2> 1551283 INFO  (coreZkRegister-2134-thread-1-processing-n:127.0.0.1:40631_ x:collection1 s:shard1 c:control_collection r:core_node1) [n:127.0.0.1:40631_ c:control_collection s:shard1 r:core_node1 x:collection1] o.a.s.c.LeaderElector Joined leadership election with path: /collections/control_collection/leader_elect/shard1/election/94239362304180228-core_node1-n_0000000000
   [junit4]   2> 1551285 INFO  (coreZkRegister-2134-thread-1-processing-n:127.0.0.1:40631_ x:collection1 s:shard1 c:control_collection r:core_node1) [n:127.0.0.1:40631_ c:control_collection s:shard1 r:core_node1 x:collection1] o.a.s.c.ShardLeaderElectionContext Running the leader process for shard shard1
   [junit4]   2> 1551287 INFO  (zkCallback-555-thread-1-processing-n:127.0.0.1:40631_) [n:127.0.0.1:40631_    ] o.a.s.c.DistributedQueue NodeChildrenChanged fired on path /overseer/queue state SyncConnected
   [junit4]   2> 1551287 INFO  (coreZkRegister-2134-thread-1-processing-n:127.0.0.1:40631_ x:collection1 s:shard1 c:control_collection r:core_node1) [n:127.0.0.1:40631_ c:control_collection s:shard1 r:core_node1 x:collection1] o.a.s.c.ShardLeaderElectionContext Enough replicas found to continue.
   [junit4]   2> 1551288 INFO  (coreZkRegister-2134-thread-1-processing-n:127.0.0.1:40631_ x:collection1 s:shard1 c:control_collection r:core_node1) [n:127.0.0.1:40631_ c:control_collection s:shard1 r:core_node1 x:collection1] o.a.s.c.ShardLeaderElectionContext I may be the new leader - try and sync
   [junit4]   2> 1551288 INFO  (coreZkRegister-2134-thread-1-processing-n:127.0.0.1:40631_ x:collection1 s:shard1 c:control_collection r:core_node1) [n:127.0.0.1:40631_ c:control_collection s:shard1 r:core_node1 x:collection1] o.a.s.c.SyncStrategy Sync replicas to http://127.0.0.1:40631/collection1/
   [junit4]   2> 1551288 INFO  (coreZkRegister-2134-thread-1-processing-n:127.0.0.1:40631_ x:collection1 s:shard1 c:control_collection r:core_node1) [n:127.0.0.1:40631_ c:control_collection s:shard1 r:core_node1 x:collection1] o.a.s.c.SyncStrategy Sync Success - now sync replicas to me
   [junit4]   2> 1551288 INFO  (coreZkRegister-2134-thread-1-processing-n:127.0.0.1:40631_ x:collection1 s:shard1 c:control_collection r:core_node1) [n:127.0.0.1:40631_ c:control_collection s:shard1 r:core_node1 x:collection1] o.a.s.c.SyncStrategy http://127.0.0.1:40631/collection1/ has no replicas
   [junit4]   2> 1551289 INFO  (coreZkRegister-2134-thread-1-processing-n:127.0.0.1:40631_ x:collection1 s:shard1 c:control_collection r:core_node1) [n:127.0.0.1:40631_ c:control_collection s:shard1 r:core_node1 x:collection1] o.a.s.c.ShardLeaderElectionContext I am the new leader: http://127.0.0.1:40631/collection1/ shard1
   [junit4]   2> 1551289 INFO  (OverseerStateUpdate-94239362304180228-127.0.0.1:40631_-n_0000000000) [n:127.0.0.1:40631_    ] o.a.s.c.Overseer processMessage: queueSize: 1, message = {
   [junit4]   2>   "operation":"leader",
   [junit4]   2>   "shard":"shard1",
   [junit4]   2>   "collection":"control_collection"} current state version: 1
   [junit4]   2> 1551289 INFO  (coreZkRegister-2134-thread-1-processing-n:127.0.0.1:40631_ x:collection1 s:shard1 c:control_collection r:core_node1) [n:127.0.0.1:40631_ c:control_collection s:shard1 r:core_node1 x:collection1] o.a.s.c.c.SolrZkClient makePath: /collections/control_collection/leaders/shard1
   [junit4]   2> 1551293 INFO  (zkCallback-555-thread-1-processing-n:127.0.0.1:40631_) [n:127.0.0.1:40631_    ] o.a.s.c.DistributedQueue NodeChildrenChanged fired on path /overseer/queue state SyncConnected
   [junit4]   2> 1551294 INFO  (OverseerStateUpdate-94239362304180228-127.0.0.1:40631_-n_0000000000) [n:127.0.0.1:40631_    ] o.a.s.c.Overseer processMessage: queueSize: 1, message = {
   [junit4]   2>   "operation":"leader",
   [junit4]   2>   "shard":"shard1",
   [junit4]   2>   "collection":"control_collection",
   [junit4]   2>   "base_url":"http://127.0.0.1:40631",
   [junit4]   2>   "core":"collection1",
   [junit4]   2>   "state":"active"} current state version: 1
   [junit4]   2> 1551397 INFO  (zkCallback-555-thread-1-processing-n:127.0.0.1:40631_) [n:127.0.0.1:40631_    ] o.a.s.c.c.ZkStateReader A cluster state change: WatchedEvent state:SyncConnected type:NodeDataChanged path:/clusterstate.json, has occurred - updating... (live nodes size: 1)
   [junit4]   2> 1551401 INFO  (zkCallback-555-thread-1-processing-n:127.0.0.1:40631_) [n:127.0.0.1:40631_    ] o.a.s.c.c.ZkStateReader Updated cluster state version to 2
   [junit4]   2> 1551444 INFO  (coreZkRegister-2134-thread-1-processing-n:127.0.0.1:40631_ x:collection1 s:shard1 c:control_collection r:core_node1) [n:127.0.0.1:40631_ c:control_collection s:shard1 r:core_node1 x:collection1] o.a.s.c.ZkController We are http://127.0.0.1:40631/collection1/ and leader is http://127.0.0.1:40631/collection1/
   [junit4]   2> 1551444 INFO  (coreZkRegister-2134-thread-1-processing-n:127.0.0.1:40631_ x:collection1 s:shard1 c:control_collection r:core_node1) [n:127.0.0.1:40631_ c:control_collection s:shard1 r:core_node1 x:collection1] o.a.s.c.ZkController No LogReplay needed for core=collection1 baseURL=http://127.0.0.1:40631
   [junit4]   2> 1551444 INFO  (coreZkRegister-2134-thread-1-processing-n:127.0.0.1:40631_ x:collection1 s:shard1 c:control_collection r:core_node1) [n:127.0.0.1:40631_ c:control_collection s:shard1 r:core_node1 x:collection1] o.a.s.c.ZkController I am the leader, no recovery necessary
   [junit4]   2> 1551445 INFO  (coreZkRegister-2134-thread-1-processing-n:127.0.0.1:40631_ x:collection1 s:shard1 c:control_collection r:core_node1) [n:127.0.0.1:40631_ c:control_collection s:shard1 r:core_node1 x:collection1] o.a.s.c.ZkController publishing state=active
   [junit4]   2> 1551445 INFO  (coreZkRegister-2134-thread-1-processing-n:127.0.0.1:40631_ x:collection1 s:shard1 c:control_collection r:core_node1) [n:127.0.0.1:40631_ c:control_collection s:shard1 r:core_node1 x:collection1] o.a.s.c.ZkController numShards not found on descriptor - reading it from system property
   [junit4]   2> 1551446 INFO  (zkCallback-555-thread-1-processing-n:127.0.0.1:40631_) [n:127.0.0.1:40631_    ] o.a.s.c.DistributedQueue NodeChildrenChanged fired on path /overseer/queue state SyncConnected
   [junit4]   2> 1551447 INFO  (OverseerStateUpdate-94239362304180228-127.0.0.1:40631_-n_0000000000) [n:127.0.0.1:40631_    ] o.a.s.c.Overseer processMessage: queueSize: 1, message = {
   [junit4]   2>   "core":"collection1",
   [junit4]   2>   "core_node_name":"core_node1",
   [junit4]   2>   "roles":null,
   [junit4]   2>   "base_url":"http://127.0.0.1:40631",
   [junit4]   2>   "node_name":"127.0.0.1:40631_",
   [junit4]   2>   "numShards":"1",
   [junit4]   2>   "state":"active",
   [junit4]   2>   "shard":"shard1",
   [junit4]   2>   "collection":"control_collection",
   [junit4]   2>   "operation":"state"} current state version: 2
   [junit4]   2> 1551448 INFO  (OverseerStateUpdate-94239362304180228-127.0.0.1:40631_-n_0000000000) [n:127.0.0.1:40631_    ] o.a.s.c.o.ReplicaMutator Update state numShards=1 message={
   [junit4]   2>   "core":"collection1",
   [junit4]   2>   "core_node_name":"core_node1",
   [junit4]   2>   "roles":null,
   [junit4]   2>   "base_url":"http://127.0.0.1:40631",
   [junit4]   2>   "node_name":"127.0.0.1:40631_",
   [junit4]   2>   "numShards":"1",
   [junit4]   2>   "state":"active",
   [junit4]   2>   "shard":"shard1",
   [junit4]   2>   "collection":"control_collection",
   [junit4]   2>   "operation":"state"}
   [junit4]   2> 1551545 INFO  (TEST-CollectionsAPIDistributedZkTest.test-seed#[7B9D114E4CC14E06]) [    ] o.a.s.c.c.SolrZkClient Using default ZkCredentialsProvider
   [junit4]   2> 1551547 INFO  (TEST-CollectionsAPIDistributedZkTest.test-seed#[7B9D114E4CC14E06]) [    ] o.a.s.c.c.ConnectionManager Waiting for client to connect to ZooKeeper
   [junit4]   2> 1551548 INFO  (zkCallback-557-thread-1) [    ] o.a.s.c.c.ConnectionManager Watcher org.apache.solr.common.cloud.ConnectionManager@448ab6ba name:ZooKeeperConnection Watcher:127.0.0.1:36981/solr got event WatchedEvent state:SyncConnected type:None path:null path:null type:None
   [junit4]   2> 1551548 INFO  (TEST-CollectionsAPIDistributedZkTest.test-seed#[7B9D114E4CC14E06]) [    ] o.a.s.c.c.ConnectionManager Client is connected to ZooKeeper
   [junit4]   2> 1551548 INFO  (TEST-CollectionsAPIDistributedZkTest.test-seed#[7B9D114E4CC14E06]) [    ] o.a.s.c.c.SolrZkClient Using default ZkACLProvider
   [junit4]   2> 1551549 INFO  (TEST-CollectionsAPIDistributedZkTest.test-seed#[7B9D114E4CC14E06]) [    ] o.a.s.c.c.ZkStateReader Updating cluster state from ZooKeeper... 
   [junit4]   2> 1551552 INFO  (zkCallback-557-thread-1) [    ] o.a.s.c.c.ZkStateReader A cluster state change: WatchedEvent state:SyncConnected type:NodeDataChanged path:/clusterstate.json, has occurred - updating... (live nodes size: 1)
   [junit4]   2> 1551553 INFO  (zkCallback-555-thread-1-processing-n:127.0.0.1:40631_) [n:127.0.0.1:40631_    ] o.a.s.c.c.ZkStateReader A cluster state change: WatchedEvent state:SyncConnected type:NodeDataChanged path:/clusterstate.json, has occurred - updating... (live nodes size: 1)
   [junit4]   2> 1551553 INFO  (TEST-CollectionsAPIDistributedZkTest.test-seed#[7B9D114E4CC14E06]) [    ] o.a.s.c.ChaosMonkey monkey: init - expire sessions:false cause connection loss:false
   [junit4]   2> 1551562 INFO  (zkCallback-557-thread-1) [    ] o.a.s.c.c.ZkStateReader Updated cluster state version to 3
   [junit4]   2> 1551562 INFO  (zkCallback-555-thread-1-processing-n:127.0.0.1:40631_) [n:127.0.0.1:40631_    ] o.a.s.c.c.ZkStateReader Updated cluster state version to 3
   [junit4]   2> 1551937 INFO  (TEST-CollectionsAPIDistributedZkTest.test-seed#[7B9D114E4CC14E06]) [    ] o.a.s.SolrTestCaseJ4 Writing core.properties file to /x1/jenkins/jenkins-slave/workspace/Lucene-Solr-NightlyTests-trunk/solr/build/solr-core/test/J1/temp/solr.cloud.CollectionsAPIDistributedZkTest_7B9D114E4CC14E06-001/shard-1-001/cores/collection1
   [junit4]   2> 1551939 INFO  (TEST-CollectionsAPIDistributedZkTest.test-seed#[7B9D114E4CC14E06]) [    ] o.a.s.c.AbstractFullDistribZkTestBase create jetty 1 in directory /x1/jenkins/jenkins-slave/workspace/Lucene-Solr-NightlyTests-trunk/solr/build/solr-core/test/J1/temp/solr.cloud.CollectionsAPIDistributedZkTest_7B9D114E4CC14E06-001/shard-1-001
   [junit4]   2> 1551940 INFO  (TEST-CollectionsAPIDistributedZkTest.test-seed#[7B9D114E4CC14E06]) [    ] o.e.j.s.Server jetty-9.2.11.v20150529
   [junit4]   2> 1551943 INFO  (TEST-CollectionsAPIDistributedZkTest.test-seed#[7B9D114E4CC14E06]) [    ] o.e.j.s.h.ContextHandler Started o.e.j.s.ServletContextHandler@691a0e94{/,null,AVAILABLE}
   [junit4]   2> 1551943 INFO  (TEST-CollectionsAPIDistributedZkTest.test-seed#[7B9D114E4CC14E06]) [    ] o.e.j.s.ServerConnector Started ServerConnector@62168aca{HTTP/1.1}{127.0.0.1:?????}
   [junit4]   2> 1551943 INFO  (TEST-CollectionsAPIDistributedZkTest.test-seed#[7B9D114E4CC14E06]) [    ] o.e.j.s.Server Started @???????ms
   [junit4]   2> 1551944 INFO  (TEST-CollectionsAPIDistributedZkTest.test-seed#[7B9D114E4CC14E06]) [    ] o.a.s.c.s.e.JettySolrRunner Jetty properties: {solr.data.dir=/x1/jenkins/jenkins-slave/workspace/Lucene-Solr-NightlyTests-trunk/solr/build/solr-core/test/J1/temp/solr.cloud.CollectionsAPIDistributedZkTest_7B9D114E4CC14E06-001/tempDir-001/jetty1, solrconfig=solrconfig.xml, hostContext=/, hostPort=43373, coreRootDirectory=/x1/jenkins/jenkins-slave/workspace/Lucene-Solr-NightlyTests-trunk/solr/build/solr-core/test/J1/temp/solr.cloud.CollectionsAPIDistributedZkTest_7B9D114E4CC14E06-001/shard-1-001/cores}
   [junit4]   2> 1551944 INFO  (TEST-CollectionsAPIDistributedZkTest.test-seed#[7B9D114E4CC14E06]) [    ] o.a.s.s.SolrDispatchFilter SolrDispatchFilter.init(): sun.misc.Launcher$AppClassLoader@4e0e2f2a
   [junit4]   2> 1551944 INFO  (TEST-CollectionsAPIDistributedZkTest.test-seed#[7B9D114E4CC14E06]) [    ] o.a.s.c.SolrResourceLoader new SolrResourceLoader for directory: '/x1/jenkins/jenkins-slave/workspace/Lucene-Solr-NightlyTests-trunk/solr/build/solr-core/test/J1/temp/solr.cloud.CollectionsAPIDistributedZkTest_7B9D114E4CC14E06-001/shard-1-001/'
   [junit4]   2> 1551967 INFO  (TEST-CollectionsAPIDistributedZkTest.test-seed#[7B9D114E4CC14E06]) [    ] o.a.s.c.c.SolrZkClient Using default ZkCredentialsProvider
   [junit4]   2> 1551976 INFO  (TEST-CollectionsAPIDistributedZkTest.test-seed#[7B9D114E4CC14E06]) [    ] o.a.s.c.c.ConnectionManager Waiting for client to connect to ZooKeeper
   [junit4]   2> 1551977 INFO  (zkCallback-558-thread-1) [    ] o.a.s.c.c.ConnectionManager Watcher org.apache.solr.common.cloud.ConnectionManager@524b5324 name:ZooKeeperConnection Watcher:127.0.0.1:36981/solr got event WatchedEvent state:SyncConnected type:None path:null path:null type:None
   [junit4]   2> 1551977 INFO  (TEST-CollectionsAPIDistributedZkTest.test-seed#[7B9D114E4CC14E06]) [    ] o.a.s.c.c.ConnectionManager Client is connected to ZooKeeper
   [junit4]   2> 1551978 INFO  (TEST-CollectionsAPIDistributedZkTest.test-seed#[7B9D114E4CC14E06]) [    ] o.a.s.c.c.SolrZkClient Using default ZkACLProvider
   [junit4]   2> 1551979 INFO  (TEST-CollectionsAPIDistributedZkTest.test-seed#[7B9D114E4CC14E06]) [    ] o.a.s.s.SolrDispatchFilter Loading solr.xml from SolrHome (not found in ZooKeeper)
   [junit4]   2> 1551979 INFO  (TEST-CollectionsAPIDistributedZkTest.test-seed#[7B9D114E4CC14E06]) [    ] o.a.s.c.SolrXmlConfig Loading container configuration from /x1/jenkins/jenkins-slave/workspace/Lucene-Solr-NightlyTests-trunk/solr/build/solr-core/test/J1/temp/solr.cloud.CollectionsAPIDistributedZkTest_7B9D114E4CC14E06-001/shard-1-001/solr.xml
   [junit4]   2> 1551986 INFO  (TEST-CollectionsAPIDistributedZkTest.test-seed#[7B9D114E4CC14E06]) [    ] o.a.s.c.CoresLocator Config-defined core root directory: /x1/jenkins/jenkins-slave/workspace/Lucene-Solr-NightlyTests-trunk/solr/build/solr-core/test/J1/temp/solr.cloud.CollectionsAPIDistributedZkTest_7B9D114E4CC14E06-001/shard-1-001/cores
   [junit4]   2> 1551987 INFO  (TEST-CollectionsAPIDistributedZkTest.test-seed#[7B9D114E4CC14E06]) [    ] o.a.s.c.CoreContainer New CoreContainer 1430251618
   [junit4]   2> 1551987 INFO  (TEST-CollectionsAPIDistributedZkTest.test-seed#[7B9D114E4CC14E06]) [    ] o.a.s.c.CoreContainer Loading cores into CoreContainer [instanceDir=/x1/jenkins/jenkins-slave/workspace/Lucene-Solr-NightlyTests-trunk/solr/build/solr-core/test/J1/temp/solr.cloud.CollectionsAPIDistributedZkTest_7B9D114E4CC14E06-001/shard-1-001/]
   [junit4]   2> 1551987 INFO  (TEST-CollectionsAPIDistributedZkTest.test-seed#[7B9D114E4CC14E06]) [    ] o.a.s.c.CoreContainer loading shared library: /x1/jenkins/jenkins-slave/workspace/Lucene-Solr-NightlyTests-trunk/solr/build/solr-core/test/J1/temp/solr.cloud.CollectionsAPIDistributedZkTest_7B9D114E4CC14E06-001/shard-1-001/lib
   [junit4]   2> 1551987 WARN  (TEST-CollectionsAPIDistributedZkTest.test-seed#[7B9D114E4CC14E06]) [    ] o.a.s.c.SolrResourceLoader Can't find (or read) directory to add to classloader: lib (resolved as: /x1/jenkins/jenkins-slave/workspace/Lucene-Solr-NightlyTests-trunk/solr/build/solr-core/test/J1/temp/solr.cloud.CollectionsAPIDistributedZkTest_7B9D114E4CC14E06-001/shard-1-001/lib).
   [junit4]   2> 1551997 INFO  (TEST-CollectionsAPIDistributedZkTest.test-seed#[7B9D114E4CC14E06]) [    ] o.a.s.h.c.HttpShardHandlerFactory created with socketTimeout : 90000,urlScheme : ,connTimeout : 15000,maxConnectionsPerHost : 20,maxConnections : 10000,corePoolSize : 0,maximumPoolSize : 2147483647,maxThreadIdleTime : 5,sizeOfQueue : -1,fairnessPolicy : false,useRetries : false,
   [junit4]   2> 1551998 INFO  (TEST-CollectionsAPIDistributedZkTest.test-seed#[7B9D114E4CC14E06]) [    ] o.a.s.u.UpdateShardHandler Creating UpdateShardHandler HTTP client with params: socketTimeout=340000&connTimeout=45000&retry=true
   [junit4]   2> 1551999 INFO  (TEST-CollectionsAPIDistributedZkTest.test-seed#[7B9D114E4CC14E06]) [    ] o.a.s.l.LogWatcher SLF4J impl is org.slf4j.impl.Log4jLoggerFactory
   [junit4]   2> 1551999 INFO  (TEST-CollectionsAPIDistributedZkTest.test-seed#[7B9D114E4CC14E06]) [    ] o.a.s.l.LogWatcher Registering Log Listener [Log4j (org.slf4j.impl.Log4jLoggerFactory)]
   [junit4]   2> 1551999 INFO  (TEST-CollectionsAPIDistributedZkTest.test-seed#[7B9D114E4CC14E06]) [    ] o.a.s.c.ZkContainer Zookeeper client=127.0.0.1:36981/solr
   [junit4]   2> 1551999 INFO  (TEST-CollectionsAPIDistributedZkTest.test-seed#[7B9D114E4CC14E06]) [    ] o.a.s.c.ZkController zkHost includes chroot
   [junit4]   2> 1551999 INFO  (TEST-CollectionsAPIDistributedZkTest.test-seed#[7B9D114E4CC14E06]) [    ] o.a.s.c.c.SolrZkClient Using default ZkCredentialsProvider
   [junit4]   2> 1552002 INFO  (TEST-CollectionsAPIDistributedZkTest.test-seed#[7B9D114E4CC14E06]) [    ] o.a.s.c.c.ConnectionManager Waiting for client to connect to ZooKeeper
   [junit4]   2> 1552003 INFO  (zkCallback-560-thread-1) [    ] o.a.s.c.c.ConnectionManager Watcher org.apache.solr.common.cloud.ConnectionManager@6b9da0fd name:ZooKeeperConnection Watcher:127.0.0.1:36981 got event WatchedEvent state:SyncConnected type:None path:null path:null type:None
   [junit4]   2> 1552003 INFO  (TEST-CollectionsAPIDistributedZkTest.test-seed#[7B9D114E4CC14E06]) [    ] o.a.s.c.c.ConnectionManager Client is connected to ZooKeeper
   [junit4]   2> 1552004 INFO  (TEST-CollectionsAPIDistributedZkTest.test-seed#[7B9D114E4CC14E06]) [    ] o.a.s.c.c.SolrZkClient Using default ZkACLProvider
   [junit4]   2> 1552007 INFO  (TEST-CollectionsAPIDistributedZkTest.test-seed#[7B9D114E4CC14E06]) [n:127.0.0.1:43373_    ] o.a.s.c.c.ConnectionManager Waiting for client to connect to ZooKeeper
   [junit4]   2> 1552009 INFO  (zkCallback-561-thread-1-processing-n:127.0.0.1:43373_) [n:127.0.0.1:43373_    ] o.a.s.c.c.ConnectionManager Watcher org.apache.solr.common.cloud.ConnectionManager@74b71a29 name:ZooKeeperConnection Watcher:127.0.0.1:36981/solr got event WatchedEvent state:SyncConnected type:None path:null path:null type:None
   [junit4]   2> 1552009 INFO  (TEST-CollectionsAPIDistributedZkTest.test-seed#[7B9D114E4CC14E06]) [n:127.0.0.1:43373_    ] o.a.s.c.c.ConnectionManager Client is connected to ZooKeeper
   [junit4]   2> 1552016 INFO  (TEST-CollectionsAPIDistributedZkTest.test-seed#[7B9D114E4CC14E06]) [n:127.0.0.1:43373_    ] o.a.s.c.c.ZkStateReader Updating cluster state from ZooKeeper... 
   [junit4]   2> 1553019 INFO  (TEST-CollectionsAPIDistributedZkTest.test-seed#[7B9D114E4CC14E06]) [n:127.0.0.1:43373_    ] o.a.s.c.ZkController Register node as live in ZooKeeper:/live_nodes/127.0.0.1:43373_
   [junit4]   2> 1553020 INFO  (TEST-CollectionsAPIDistributedZkTest.test-seed#[7B9D114E4CC14E06]) [n:127.0.0.1:43373_    ] o.a.s.c.c.SolrZkClient makePath: /live_nodes/127.0.0.1:43373_
   [junit4]   2> 1553027 INFO  (TEST-CollectionsAPIDistributedZkTest.test-seed#[7B9D114E4CC14E06]) [n:127.0.0.1:43373_    ] o.a.s.c.Overseer Overseer (id=null) closing
   [junit4]   2> 1553028 INFO  (TEST-CollectionsAPIDistributedZkTest.test-seed#[7B9D114E4CC14E06]) [n:127.0.0.1:43373_    ] o.a.s.c.LeaderElector Joined leadership election with path: /overseer_elect/election/94239362304180232-127.0.0.1:43373_-n_0000000001
   [junit4]   2> 1553029 INFO  (TEST-CollectionsAPIDistributedZkTest.test-seed#[7B9D114E4CC14E06]) [n:127.0.0.1:43373_    ] o.a.s.c.LeaderElector Watching path /overseer_elect/election/94239362304180228-127.0.0.1:40631_-n_0000000000 to know if I could be the leader
   [junit4]   2> 1553029 INFO  (TEST-CollectionsAPIDistributedZkTest.test-seed#[7B9D114E4CC14E06]) [n:127.0.0.1:43373_    ] o.a.s.c.CoreContainer No authentication plugin used.
   [junit4]   2> 1553030 INFO  (TEST-CollectionsAPIDistributedZkTest.test-seed#[7B9D114E4CC14E06]) [n:127.0.0.1:43373_    ] o.a.s.c.CoreContainer Security conf doesn't exist. Skipping setup for authorization module.
   [junit4]   2> 1553031 INFO  (TEST-CollectionsAPIDistributedZkTest.test-seed#[7B9D114E4CC14E06]) [n:127.0.0.1:43373_    ] o.a.s.c.CoresLocator Looking for core definitions underneath /x1/jenkins/jenkins-slave/workspace/Lucene-Solr-NightlyTests-trunk/solr/build/solr-core/test/J1/temp/solr.cloud.CollectionsAPIDistributedZkTest_7B9D114E4CC14E06-001/shard-1-001/cores
   [junit4]   2> 1553031 INFO  (TEST-CollectionsAPIDistributedZkTest.test-seed#[7B9D114E4CC14E06]) [n:127.0.0.1:43373_    ] o.a.s.c.SolrCore Created CoreDescriptor: {name=collection1, config=solrconfig.xml, transient=false, schema=schema.xml, loadOnStartup=true, configSetProperties=configsetprops.json, instanceDir=/x1/jenkins/jenkins-slave/workspace/Lucene-Solr-NightlyTests-trunk/solr/build/solr-core/test/J1/temp/solr.cloud.CollectionsAPIDistributedZkTest_7B9D114E4CC14E06-001/shard-1-001/cores/collection1, collection=collection1, absoluteInstDir=/x1/jenkins/jenkins-slave/workspace/Lucene-Solr-NightlyTests-trunk/solr/build/solr-core/test/J1/temp/solr.cloud.CollectionsAPIDistributedZkTest_7B9D114E4CC14E06-001/shard-1-001/cores/collection1/, coreNodeName=, dataDir=data/, shard=}
   [junit4]   2> 1553032 INFO  (TEST-CollectionsAPIDistributedZkTest.test-seed#[7B9D114E4CC14E06]) [n:127.0.0.1:43373_    ] o.a.s.c.CoresLocator Found core collection1 in /x1/jenkins/jenkins-slave/workspace/Lucene-Solr-NightlyTests-trunk/solr/build/solr-core/test/J1/temp/solr.cloud.CollectionsAPIDistributedZkTest_7B9D114E4CC14E06-001/shard-1-001/cores/collection1/
   [junit4]   2> 1553032 INFO  (TEST-CollectionsAPIDistributedZkTest.test-seed#[7B9D114E4CC14E06]) [n:127.0.0.1:43373_    ] o.a.s.c.CoresLocator Found 1 core definitions
   [junit4]   2> 1553037 INFO  (coreLoadExecutor-2151-thread-1-processing-n:127.0.0.1:43373_) [n:127.0.0.1:43373_ c:collection1   x:collection1] o.a.s.c.ZkController publishing state=down
   [junit4]   2> 1553037 INFO  (coreLoadExecutor-2151-thread-1-processing-n:127.0.0.1:43373_) [n:127.0.0.1:43373_ c:collection1   x:collection1] o.a.s.c.ZkController numShards not found on descriptor - reading it from system property
   [junit4]   2> 1553038 INFO  (coreLoadExecutor-2151-thread-1-processing-n:127.0.0.1:43373_) [n:127.0.0.1:43373_ c:collection1   x:collection1] o.a.s.c.ZkController look for our core node name
   [junit4]   2> 1553038 INFO  (zkCallback-555-thread-1-processing-n:127.0.0.1:40631_) [n:127.0.0.1:40631_    ] o.a.s.c.DistributedQueue NodeChildrenChanged fired on path /overseer/queue state SyncConnected
   [junit4]   2> 1553039 INFO  (OverseerStateUpdate-94239362304180228-127.0.0.1:40631_-n_0000000000) [n:127.0.0.1:40631_    ] o.a.s.c.Overseer processMessage: queueSize: 1, message = {
   [junit4]   2>   "core":"collection1",
   [junit4]   2>   "roles":null,
   [junit4]   2>   "base_url":"http://127.0.0.1:43373",
   [junit4]   2>   "node_name":"127.0.0.1:43373_",
   [junit4]   2>   "numShards":"2",
   [junit4]   2>   "state":"down",
   [junit4]   2>   "shard":null,
   [junit4]   2>   "collection":"collection1",
   [junit4]   2>   "operation":"state"} current state version: 3
   [junit4]   2> 1553039 INFO  (OverseerStateUpdate-94239362304180228-127.0.0.1:40631_-n_0000000000) [n:127.0.0.1:40631_    ] o.a.s.c.o.ReplicaMutator Update state numShards=2 message={
   [junit4]   2>   "core":"collection1",
   [junit4]   2>   "roles":null,
   [junit4]   2>   "base_url":"http://127.0.0.1:43373",
   [junit4]   2>   "node_name":"127.0.0.1:43373_",
   [junit4]   2>   "numShards":"2",
   [junit4]   2>   "state":"down",
   [junit4]   2>   "shard":null,
   [junit4]   2>   "collection":"collection1",
   [junit4]   2>   "operation":"state"}
   [junit4]   2> 1553039 INFO  (OverseerStateUpdate-94239362304180228-127.0.0.1:40631_-n_0000000000) [n:127.0.0.1:40631_    ] o.a.s.c.o.ClusterStateMutator building a new cName: collection1
   [junit4]   2> 1553039 INFO  (OverseerStateUpdate-94239362304180228-127.0.0.1:40631_-n_0000000000) [n:127.0.0.1:40631_    ] o.a.s.c.o.ReplicaMutator Assigning new node to shard shard=shard2
   [junit4]   2> 1553049 INFO  (TEST-CollectionsAPIDistributedZkTest.test-seed#[7B9D114E4CC14E06]) [n:127.0.0.1:43373_    ] o.a.s.s.SolrDispatchFilter user.dir=/x1/jenkins/jenkins-slave/workspace/Lucene-Solr-NightlyTests-trunk/solr/build/solr-core/test/J1
   [junit4]   2> 1553050 INFO  (TEST-CollectionsAPIDistributedZkTest.test-seed#[7B9D114E4CC14E06]) [n:127.0.0.1:43373_    ] o.a.s.s.SolrDispatchFilter SolrDispatchFilter.init() done
   [junit4]   2> 1553142 INFO  (zkCallback-561-thread-1-processing-n:127.0.0.1:43373_) [n:127.0.0.1:43373_    ] o.a.s.c.c.ZkStateReader A cluster state change: WatchedEvent state:SyncConnected type:NodeDataChanged path:/clusterstate.json, has occurred - updating... (live nodes size: 2)
   [junit4]   2> 1553142 INFO  (zkCallback-557-thread-1) [    ] o.a.s.c.c.ZkStateReader A cluster state change: WatchedEvent state:SyncConnected type:NodeDataChanged path:/clusterstate.json, has occurred - updating... (live nodes size: 2)
   [junit4]   2> 1553143 INFO  (zkCallback-555-thread-1-processing-n:127.0.0.1:40631_) [n:127.0.0.1:40631_    ] o.a.s.c.c.ZkStateReader A cluster state change: WatchedEvent state:SyncConnected type:NodeDataChanged path:/clusterstate.json, has occurred - updating... (live nodes size: 2)
   [junit4]   2> 1553145 INFO  (zkCallback-557-thread-1) [    ] o.a.s.c.c.ZkStateReader Updated cluster state version to 4
   [junit4]   2> 1553145 INFO  (zkCallback-561-thread-1-processing-n:127.0.0.1:43373_) [n:127.0.0.1:43373_    ] o.a.s.c.c.ZkStateReader Updated cluster state version to 4
   [junit4]   2> 1553146 INFO  (zkCallback-555-thread-1-processing-n:127.0.0.1:40631_) [n:127.0.0.1:40631_    ] o.a.s.c.c.ZkStateReader Updated cluster state version to 4
   [junit4]   2> 1554038 INFO  (coreLoadExecutor-2151-thread-1-processing-n:127.0.0.1:43373_) [n:127.0.0.1:43373_ c:collection1   x:collection1] o.a.s.c.ZkController waiting to find shard id in clusterstate for collection1
   [junit4]   2> 1554038 INFO  (coreLoadExecutor-2151-thread-1-processing-n:127.0.0.1:43373_) [n:127.0.0.1:43373_ c:collection1   x:collection1] o.a.s.c.ZkController Check for collection zkNode:collection1
   [junit4]   2> 1554039 INFO  (coreLoadExecutor-2151-thread-1-processing-n:127.0.0.1:43373_) [n:127.0.0.1:43373_ c:collection1   x:collection1] o.a.s.c.ZkController Collection zkNode exists
   [junit4]   2> 1554039 INFO  (coreLoadExecutor-2151-thread-1-processing-n:127.0.0.1:43373_) [n:127.0.0.1:43373_ c:collection1   x:collection1] o.a.s.c.c.ZkStateReader Load collection config from:/collections/collection1
   [junit4]   2> 1554039 INFO  (coreLoadExecutor-2151-thread-1-processing-n:127.0.0.1:43373_) [n:127.0.0.1:43373_ c:collection1   x:collection1] o.a.s.c.c.ZkStateReader path=/collections/collection1 configName=conf1 specified config exists in ZooKeeper
   [junit4]   2> 1554039 INFO  (coreLoadExecutor-2151-thread-1-processing-n:127.0.0.1:43373_) [n:127.0.0.1:43373_ c:collection1   x:collection1] o.a.s.c.SolrResourceLoader new SolrResourceLoader for directory: '/x1/jenkins/jenkins-slave/workspace/Lucene-Solr-NightlyTests-trunk/solr/build/solr-core/test/J1/temp/solr.cloud.CollectionsAPIDistributedZkTest_7B9D114E4CC14E06-001/shard-1-001/cores/collection1/'
   [junit4]   2> 1554054 INFO  (coreLoadExecutor-2151-thread-1-processing-n:127.0.0.1:43373_) [n:127.0.0.1:43373_ c:collection1   x:collection1] o.a.s.c.Config loaded config solrconfig.xml with version 0 
   [junit4]   2> 1554059 INFO  (coreLoadExecutor-2151-thread-1-processing-n:127.0.0.1:43373_) [n:127.0.0.1:43373_ c:collection1   x:collection1] o.a.s.c.SolrConfig current version of requestparams : -1
   [junit4]   2> 1554063 INFO  (coreLoadExecutor-2151-thread-1-processing-n:127.0.0.1:43373_) [n:127.0.0.1:43373_ c:collection1   x:collection1] o.a.s.c.SolrConfig Using Lucene MatchVersion: 6.0.0
   [junit4]   2> 1554070 INFO  (coreLoadExecutor-2151-thread-1-processing-n:127.0.0.1:43373_) [n:127.0.0.1:43373_ c:collection1   x:collection1] o.a.s.c.Config Loaded SolrConfig: solrconfig.xml
   [junit4]   2> 1554071 INFO  (coreLoadExecutor-2151-thread-1-processing-n:127.0.0.1:43373_) [n:127.0.0.1:43373_ c:collection1   x:collection1] o.a.s.s.IndexSchema Reading Solr Schema from /configs/conf1/schema.xml
   [junit4]   2> 1554076 INFO  (coreLoadExecutor-2151-thread-1-processing-n:127.0.0.1:43373_) [n:127.0.0.1:43373_ c:collection1   x:collection1] o.a.s.s.IndexSchema [collection1] Schema name=test
   [junit4]   2> 1554186 INFO  (coreLoadExecutor-2151-thread-1-processing-n:127.0.0.1:43373_) [n:127.0.0.1:43373_ c:collection1   x:collection1] o.a.s.s.OpenExchangeRatesOrgProvider Initialized with rates=open-exchange-rates.json, refreshInterval=1440.
   [junit4]   2> 1554193 INFO  (coreLoadExecutor-2151-thread-1-processing-n:127.0.0.1:43373_) [n:127.0.0.1:43373_ c:collection1   x:collection1] o.a.s.s.IndexSchema default search field in schema is text
   [junit4]   2> 1554194 INFO  (coreLoadExecutor-2151-thread-1-processing-n:127.0.0.1:43373_) [n:127.0.0.1:43373_ c:collection1   x:collection1] o.a.s.s.IndexSchema unique key field: id
   [junit4]   2> 1554202 INFO  (coreLoadExecutor-2151-thread-1-processing-n:127.0.0.1:43373_) [n:127.0.0.1:43373_ c:collection1   x:collection1] o.a.s.s.FileExchangeRateProvider Reloading exchange rates from file currency.xml
   [junit4]   2> 1554204 INFO  (coreLoadExecutor-2151-thread-1-processing-n:127.0.0.1:43373_) [n:127.0.0.1:43373_ c:collection1   x:collection1] o.a.s.s.FileExchangeRateProvider Reloading exchange rates from file currency.xml
   [junit4]   2> 1554206 INFO  (coreLoadExecutor-2151-thread-1-processing-n:127.0.0.1:43373_) [n:127.0.0.1:43373_ c:collection1   x:collection1] o.a.s.s.OpenExchangeRatesOrgProvider Reloading exchange rates from open-exchange-rates.json
   [junit4]   2> 1554207 WARN  (coreLoadExecutor-2151-thread-1-processing-n:127.0.0.1:43373_) [n:127.0.0.1:43373_ c:collection1   x:collection1] o.a.s.s.OpenExchangeRatesOrgProvider Unknown key IMPORTANT NOTE
   [junit4]   2> 1554207 WARN  (coreLoadExecutor-2151-thread-1-processing-n:127.0.0.1:43373_) [n:127.0.0.1:43373_ c:collection1   x:collection1] o.a.s.s.OpenExchangeRatesOrgProvider Expected key, got STRING
   [junit4]   2> 1554207 INFO  (coreLoadExecutor-2151-thread-1-processing-n:127.0.0.1:43373_) [n:127.0.0.1:43373_ c:collection1   x:collection1] o.a.s.s.OpenExchangeRatesOrgProvider Reloading exchange rates from open-exchange-rates.json
   [junit4]   2> 1554208 WARN  (coreLoadExecutor-2151-thread-1-processing-n:127.0.0.1:43373_) [n:127.0.0.1:43373_ c:collection1   x:collection1] o.a.s.s.OpenExchangeRatesOrgProvider Unknown key IMPORTANT NOTE
   [junit4]   2> 1554208 WARN  (coreLoadExecutor-2151-thread-1-processing-n:127.0.0.1:43373_) [n:127.0.0.1:43373_ c:collection1   x:collection1] o.a.s.s.OpenExchangeRatesOrgProvider Expected key, got STRING
   [junit4]   2> 1554209 INFO  (coreLoadExecutor-2151-thread-1-processing-n:127.0.0.1:43373_) [n:127.0.0.1:43373_ c:collection1   x:collection1] o.a.s.c.ConfigSetProperties Did not find ConfigSet properties, assuming default properties: Can't find resource 'configsetprops.json' in classpath or '/configs/conf1', cwd=/x1/jenkins/jenkins-slave/workspace/Lucene-Solr-NightlyTests-trunk/solr/build/solr-core/test/J1
   [junit4]   2> 1554209 INFO  (coreLoadExecutor-2151-thread-1-processing-n:127.0.0.1:43373_) [n:127.0.0.1:43373_ c:collection1   x:collection1] o.a.s.c.CoreContainer Creating SolrCore 'collection1' using configuration from collection collection1
   [junit4]   2> 1554209 INFO  (coreLoadExecutor-2151-thread-1-processing-n:127.0.0.1:43373_) [n:127.0.0.1:43373_ c:collection1 s:shard2 r:core_node1 x:collection1] o.a.s.c.SolrCore org.apache.solr.core.MockDirectoryFactory
   [junit4]   2> 1554209 INFO  (coreLoadExecutor-2151-thread-1-processing-n:127.0.0.1:43373_) [n:127.0.0.1:43373_ c:collection1 s:shard2 r:core_node1 x:collection1] o.a.s.c.SolrCore [[collection1] ] Opening new SolrCore at [/x1/jenkins/jenkins-slave/workspace/Lucene-Solr-NightlyTests-trunk/solr/build/solr-core/test/J1/temp/solr.cloud.CollectionsAPIDistributedZkTest_7B9D114E4CC14E06-001/shard-1-001/cores/collection1/], dataDir=[null]
   [junit4]   2> 1554210 INFO  (coreLoadExecutor-2151-thread-1-processing-n:127.0.0.1:43373_) [n:127.0.0.1:43373_ c:collection1 s:shard2 r:core_node1 x:collection1] o.a.s.c.JmxMonitoredMap JMX monitoring is enabled. Adding Solr mbeans to JMX Server: com.sun.jmx.mbeanserver.JmxMBeanServer@699fe850
   [junit4]   2> 1554210 INFO  (coreLoadExecutor-2151-thread-1-processing-n:127.0.0.1:43373_) [n:127.0.0.1:43373_ c:collection1 s:shard2 r:core_node1 x:collection1] o.a.s.c.CachingDirectoryFactory return new directory for /x1/jenkins/jenkins-slave/workspace/Lucene-Solr-NightlyTests-trunk/solr/build/solr-core/test/J1/temp/solr.cloud.CollectionsAPIDistributedZkTest_7B9D114E4CC14E06-001/shard-1-001/cores/collection1/data
   [junit4]   2> 1554210 INFO  (coreLoadExecutor-2151-thread-1-processing-n:127.0.0.1:43373_) [n:127.0.0.1:43373_ c:collection1 s:shard2 r:core_node1 x:collection1] o.a.s.c.SolrCore New index directory detected: old=null new=/x1/jenkins/jenkins-slave/workspace/Lucene-Solr-NightlyTests-trunk/solr/build/solr-core/test/J1/temp/solr.cloud.CollectionsAPIDistributedZkTest_7B9D114E4CC14E06-001/shard-1-001/cores/collection1/data/index/
   [junit4]   2> 1554210 WARN  (coreLoadExecutor-2151-thread-1-processing-n:127.0.0.1:43373_) [n:127.0.0.1:43373_ c:collection1 s:shard2 r:core_node1 x:collection1] o.a.s.c.SolrCore [collection1] Solr index directory '/x1/jenkins/jenkins-slave/workspace/Lucene-Solr-NightlyTests-trunk/solr/build/solr-core/test/J1/temp/solr.cloud.CollectionsAPIDistributedZkTest_7B9D114E4CC14E06-001/shard-1-001/cores/collection1/data/index' doesn't exist. Creating new index...
   [junit4]   2> 1554211 INFO  (coreLoadExecutor-2151-thread-1-processing-n:127.0.0.1:43373_) [n:127.0.0.1:43373_ c:collection1 s:shard2 r:core_node1 x:collection1] o.a.s.c.CachingDirectoryFactory return new directory for /x1/jenkins/jenkins-slave/workspace/Lucene-Solr-NightlyTests-trunk/solr/build/solr-core/test/J1/temp/solr.cloud.CollectionsAPIDistributedZkTest_7B9D114E4CC14E06-001/shard-1-001/cores/collection1/data/index
   [junit4]   2> 1554211 INFO  (coreLoadExecutor-2151-thread-1-processing-n:127.0.0.1:43373_) [n:127.0.0.1:43373_ c:collection1 s:shard2 r:core_node1 x:collection1] o.a.s.u.RandomMergePolicy RandomMergePolicy wrapping class org.apache.lucene.index.LogByteSizeMergePolicy: [LogByteSizeMergePolicy: minMergeSize=1677721, mergeFactor=32, maxMergeSize=2147483648, maxMergeSizeForForcedMerge=9223372036854775807, calibrateSizeByDeletes=false, maxMergeDocs=2147483647, maxCFSSegmentSizeMB=8.796093022207999E12, noCFSRatio=0.5004314197358152]
   [junit4]   2

[...truncated too long message...]

M15.jar:/x1/jenkins/jenkins-slave/workspace/Lucene-Solr-NightlyTests-trunk/solr/core/test-lib/apacheds-mavibot-partition-2.0.0-M15.jar:/x1/jenkins/jenkins-slave/workspace/Lucene-Solr-NightlyTests-trunk/solr/core/test-lib/apacheds-protocol-kerberos-2.0.0-M15.jar:/x1/jenkins/jenkins-slave/workspace/Lucene-Solr-NightlyTests-trunk/solr/core/test-lib/apacheds-protocol-ldap-2.0.0-M15.jar:/x1/jenkins/jenkins-slave/workspace/Lucene-Solr-NightlyTests-trunk/solr/core/test-lib/apacheds-protocol-shared-2.0.0-M15.jar:/x1/jenkins/jenkins-slave/workspace/Lucene-Solr-NightlyTests-trunk/solr/core/test-lib/apacheds-xdbm-partition-2.0.0-M15.jar:/x1/jenkins/jenkins-slave/workspace/Lucene-Solr-NightlyTests-trunk/solr/core/test-lib/api-all-1.0.0-M20.jar:/x1/jenkins/jenkins-slave/workspace/Lucene-Solr-NightlyTests-trunk/solr/core/test-lib/bcprov-jdk15-1.45.jar:/x1/jenkins/jenkins-slave/workspace/Lucene-Solr-NightlyTests-trunk/solr/core/test-lib/cglib-nodep-2.2.jar:/x1/jenkins/jenkins-slave/workspace/Lucene-Solr-NightlyTests-trunk/solr/core/test-lib/commons-collections-3.2.1.jar:/x1/jenkins/jenkins-slave/workspace/Lucene-Solr-NightlyTests-trunk/solr/core/test-lib/commons-math3-3.4.1.jar:/x1/jenkins/jenkins-slave/workspace/Lucene-Solr-NightlyTests-trunk/solr/core/test-lib/easymock-3.0.jar:/x1/jenkins/jenkins-slave/workspace/Lucene-Solr-NightlyTests-trunk/solr/core/test-lib/ehcache-core-2.4.4.jar:/x1/jenkins/jenkins-slave/workspace/Lucene-Solr-NightlyTests-trunk/solr/core/test-lib/hadoop-common-2.6.0-tests.jar:/x1/jenkins/jenkins-slave/workspace/Lucene-Solr-NightlyTests-trunk/solr/core/test-lib/hadoop-hdfs-2.6.0-tests.jar:/x1/jenkins/jenkins-slave/workspace/Lucene-Solr-NightlyTests-trunk/solr/core/test-lib/hadoop-minikdc-2.6.0.jar:/x1/jenkins/jenkins-slave/workspace/Lucene-Solr-NightlyTests-trunk/solr/core/test-lib/jackson-annotations-2.5.4.jar:/x1/jenkins/jenkins-slave/workspace/Lucene-Solr-NightlyTests-trunk/solr/core/test-lib/jackson-databind-2.5.4.jar:/x1/jenkins/jenkins-slave/workspace/Lucene-Solr-NightlyTests-trunk/solr/core/test-lib/jcl-over-slf4j-1.7.7.jar:/x1/jenkins/jenkins-slave/workspace/Lucene-Solr-NightlyTests-trunk/solr/core/test-lib/jersey-core-1.9.jar:/x1/jenkins/jenkins-slave/workspace/Lucene-Solr-NightlyTests-trunk/solr/core/test-lib/jersey-server-1.9.jar:/x1/jenkins/jenkins-slave/workspace/Lucene-Solr-NightlyTests-trunk/solr/core/test-lib/jetty-6.1.26.jar:/x1/jenkins/jenkins-slave/workspace/Lucene-Solr-NightlyTests-trunk/solr/core/test-lib/jetty-util-6.1.26.jar:/x1/jenkins/jenkins-slave/workspace/Lucene-Solr-NightlyTests-trunk/solr/core/test-lib/mina-core-2.0.0-M5.jar:/x1/jenkins/jenkins-slave/workspace/Lucene-Solr-NightlyTests-trunk/solr/core/test-lib/objenesis-1.2.jar:/x1/jenkins/jenkins-slave/workspace/Lucene-Solr-NightlyTests-trunk/solr/core/test-lib/presto-parser-0.108.jar:/x1/jenkins/jenkins-slave/workspace/Lucene-Solr-NightlyTests-trunk/solr/core/test-lib/slice-0.10.jar:/x1/jenkins/jenkins-slave/workspace/Lucene-Solr-NightlyTests-trunk/lucene/build/analysis/icu/lucene-analyzers-icu-6.0.0-SNAPSHOT.jar:/x1/jenkins/jenkins-slave/workspace/Lucene-Solr-NightlyTests-trunk/solr/build/contrib/solr-analysis-extras/classes/java:/x1/jenkins/jenkins-slave/workspace/Lucene-Solr-NightlyTests-trunk/solr/contrib/analysis-extras/lib/icu4j-54.1.jar:/home/jenkins/jenkins-slave/tools/hudson.tasks.Ant_AntInstallation/ant-1.8.2/lib/ant-launcher.jar:/x1/jenkins/.ant/lib/ivy-2.3.0.jar:/home/jenkins/jenkins-slave/tools/hudson.tasks.Ant_AntInstallation/ant-1.8.2/lib/ant-antlr.jar:/home/jenkins/jenkins-slave/tools/hudson.tasks.Ant_AntInstallation/ant-1.8.2/lib/ant-apache-regexp.jar:/home/jenkins/jenkins-slave/tools/hudson.tasks.Ant_AntInstallation/ant-1.8.2/lib/ant-apache-resolver.jar:/home/jenkins/jenkins-slave/tools/hudson.tasks.Ant_AntInstallation/ant-1.8.2/lib/ant-commons-net.jar:/home/jenkins/jenkins-slave/tools/hudson.tasks.Ant_AntInstallation/ant-1.8.2/lib/ant-jmf.jar:/home/jenkins/jenkins-slave/tools/hudson.tasks.Ant_AntInstallation/ant-1.8.2/lib/ant-apache-oro.jar:/home/jenkins/jenkins-slave/tools/hudson.tasks.Ant_AntInstallation/ant-1.8.2/lib/ant-apache-xalan2.jar:/home/jenkins/jenkins-slave/tools/hudson.tasks.Ant_AntInstallation/ant-1.8.2/lib/ant-commons-logging.jar:/home/jenkins/jenkins-slave/tools/hudson.tasks.Ant_AntInstallation/ant-1.8.2/lib/ant-jsch.jar:/home/jenkins/jenkins-slave/tools/hudson.tasks.Ant_AntInstallation/ant-1.8.2/lib/ant-junit4.jar:/home/jenkins/jenkins-slave/tools/hudson.tasks.Ant_AntInstallation/ant-1.8.2/lib/ant-javamail.jar:/home/jenkins/jenkins-slave/tools/hudson.tasks.Ant_AntInstallation/ant-1.8.2/lib/ant-jai.jar:/home/jenkins/jenkins-slave/tools/hudson.tasks.Ant_AntInstallation/ant-1.8.2/lib/ant-jdepend.jar:/home/jenkins/jenkins-slave/tools/hudson.tasks.Ant_AntInstallation/ant-1.8.2/lib/ant-junit.jar:/home/jenkins/jenkins-slave/tools/hudson.tasks.Ant_AntInstallation/ant-1.8.2/lib/ant-apache-bsf.jar:/home/jenkins/jenkins-slave/tools/hudson.tasks.Ant_AntInstallation/ant-1.8.2/lib/ant-swing.jar:/home/jenkins/jenkins-slave/tools/hudson.tasks.Ant_AntInstallation/ant-1.8.2/lib/ant.jar:/home/jenkins/jenkins-slave/tools/hudson.tasks.Ant_AntInstallation/ant-1.8.2/lib/ant-netrexx.jar:/home/jenkins/jenkins-slave/tools/hudson.tasks.Ant_AntInstallation/ant-1.8.2/lib/ant-apache-bcel.jar:/home/jenkins/jenkins-slave/tools/hudson.tasks.Ant_AntInstallation/ant-1.8.2/lib/ant-testutil.jar:/home/jenkins/jenkins-slave/tools/hudson.tasks.Ant_AntInstallation/ant-1.8.2/lib/ant-apache-log4j.jar:/x1/jenkins/jenkins-slave/tools/hudson.model.JDK/latest1.8/lib/tools.jar:/x1/jenkins/.ivy2/cache/com.carrotsearch.randomizedtesting/junit4-ant/jars/junit4-ant-2.1.13.jar com.carrotsearch.ant.tasks.junit4.slave.SlaveMainSafe -eventsfile /x1/jenkins/jenkins-slave/workspace/Lucene-Solr-NightlyTests-trunk/solr/build/solr-core/test/temp/junit4-J2-20150727_020318_007.events @/x1/jenkins/jenkins-slave/workspace/Lucene-Solr-NightlyTests-trunk/solr/build/solr-core/test/temp/junit4-J2-20150727_020318_007.suites
   [junit4] ERROR: JVM J2 ended with an exception: Quit event not received from the forked process? This may indicate JVM crash or runner bugs.
   [junit4] 	at com.carrotsearch.ant.tasks.junit4.JUnit4.executeSlave(JUnit4.java:1504)
   [junit4] 	at com.carrotsearch.ant.tasks.junit4.JUnit4.access$000(JUnit4.java:133)
   [junit4] 	at com.carrotsearch.ant.tasks.junit4.JUnit4$2.call(JUnit4.java:964)
   [junit4] 	at com.carrotsearch.ant.tasks.junit4.JUnit4$2.call(JUnit4.java:961)
   [junit4] 	at java.util.concurrent.FutureTask.run(FutureTask.java:266)
   [junit4] 	at java.util.concurrent.ThreadPoolExecutor.runWorker(ThreadPoolExecutor.java:1142)
   [junit4] 	at java.util.concurrent.ThreadPoolExecutor$Worker.run(ThreadPoolExecutor.java:617)
   [junit4] 	at java.lang.Thread.run(Thread.java:745)

BUILD FAILED
/x1/jenkins/jenkins-slave/workspace/Lucene-Solr-NightlyTests-trunk/build.xml:724: The following error occurred while executing this line:
/x1/jenkins/jenkins-slave/workspace/Lucene-Solr-NightlyTests-trunk/build.xml:661: The following error occurred while executing this line:
/x1/jenkins/jenkins-slave/workspace/Lucene-Solr-NightlyTests-trunk/build.xml:59: The following error occurred while executing this line:
/x1/jenkins/jenkins-slave/workspace/Lucene-Solr-NightlyTests-trunk/solr/build.xml:230: The following error occurred while executing this line:
/x1/jenkins/jenkins-slave/workspace/Lucene-Solr-NightlyTests-trunk/solr/common-build.xml:517: The following error occurred while executing this line:
/x1/jenkins/jenkins-slave/workspace/Lucene-Solr-NightlyTests-trunk/lucene/common-build.xml:1429: The following error occurred while executing this line:
/x1/jenkins/jenkins-slave/workspace/Lucene-Solr-NightlyTests-trunk/lucene/common-build.xml:984: At least one slave process threw an exception, first: Quit event not received from the forked process? This may indicate JVM crash or runner bugs.

Total time: 393 minutes 59 seconds
Build step 'Invoke Ant' marked build as failure
Archiving artifacts
No prior successful build to compare, so performing full copy of artifacts
ERROR: Failed to archive artifacts: **/*.events,heapdumps/**,**/hs_err_pid*,README.txt
java.io.IOException: Failed to extract /home/jenkins/jenkins-slave/workspace/Lucene-Solr-NightlyTests-trunk/transfer of 4 files
	at hudson.FilePath.readFromTar(FilePath.java:2101)
	at hudson.FilePath.copyRecursiveTo(FilePath.java:2013)
	at jenkins.model.StandardArtifactManager.archive(StandardArtifactManager.java:61)
	at com.cloudbees.jenkins.plugins.jsync.archiver.JSyncArtifactManager.remoteSync(JSyncArtifactManager.java:107)
	at com.cloudbees.jenkins.plugins.jsync.archiver.JSyncArtifactManager.archive(JSyncArtifactManager.java:68)
	at hudson.tasks.ArtifactArchiver.perform(ArtifactArchiver.java:140)
	at hudson.tasks.BuildStepMonitor$1.perform(BuildStepMonitor.java:20)
	at hudson.model.AbstractBuild$AbstractBuildExecution.perform(AbstractBuild.java:756)
	at hudson.model.AbstractBuild$AbstractBuildExecution.performAllBuildSteps(AbstractBuild.java:720)
	at hudson.model.Build$BuildExecution.post2(Build.java:182)
	at hudson.model.AbstractBuild$AbstractBuildExecution.post(AbstractBuild.java:669)
	at hudson.model.Run.execute(Run.java:1731)
	at hudson.model.FreeStyleBuild.run(FreeStyleBuild.java:43)
	at hudson.model.ResourceController.execute(ResourceController.java:88)
	at hudson.model.Executor.run(Executor.java:232)
Caused by: java.io.IOException: unexpected EOF with 1536 bytes unread
	at hudson.org.apache.tools.tar.TarInputStream.read(TarInputStream.java:349)
	at java.io.FilterInputStream.read(FilterInputStream.java:107)
	at org.apache.commons.io.IOUtils.copyLarge(IOUtils.java:1792)
	at org.apache.commons.io.IOUtils.copyLarge(IOUtils.java:1769)
	at org.apache.commons.io.IOUtils.copy(IOUtils.java:1744)
	at hudson.util.IOUtils.copy(IOUtils.java:40)
	at hudson.FilePath.readFromTar(FilePath.java:2091)
	... 14 more
Recording test results
Email was triggered for: Failure
Sending email for trigger: Failure



Mime
View raw message