lucene-dev mailing list archives

Site index · List index
Message view « Date » · « Thread »
Top « Date » · « Thread »
From Apache Jenkins Server <jenk...@builds.apache.org>
Subject [JENKINS] Lucene-Solr-NightlyTests-5.x - Build # 899 - Still Failing
Date Sat, 11 Jul 2015 22:40:21 GMT
Build: https://builds.apache.org/job/Lucene-Solr-NightlyTests-5.x/899/

1 tests failed.
FAILED:  org.apache.solr.cloud.CollectionsAPIDistributedZkTest.test

Error Message:
Captured an uncaught exception in thread: Thread[id=55150, name=collection1, state=RUNNABLE, group=TGRP-CollectionsAPIDistributedZkTest]

Stack Trace:
com.carrotsearch.randomizedtesting.UncaughtExceptionError: Captured an uncaught exception in thread: Thread[id=55150, name=collection1, state=RUNNABLE, group=TGRP-CollectionsAPIDistributedZkTest]
Caused by: org.apache.solr.client.solrj.impl.HttpSolrClient$RemoteSolrException: Error from server at http://127.0.0.1:34293: collection already exists: awholynewstresscollection_collection1_3
	at __randomizedtesting.SeedInfo.seed([A0846DB02E8884FF]:0)
	at org.apache.solr.client.solrj.impl.HttpSolrClient.executeMethod(HttpSolrClient.java:560)
	at org.apache.solr.client.solrj.impl.HttpSolrClient.request(HttpSolrClient.java:234)
	at org.apache.solr.client.solrj.impl.HttpSolrClient.request(HttpSolrClient.java:226)
	at org.apache.solr.client.solrj.impl.LBHttpSolrClient.doRequest(LBHttpSolrClient.java:376)
	at org.apache.solr.client.solrj.impl.LBHttpSolrClient.request(LBHttpSolrClient.java:328)
	at org.apache.solr.client.solrj.impl.CloudSolrClient.sendRequest(CloudSolrClient.java:1086)
	at org.apache.solr.client.solrj.impl.CloudSolrClient.requestWithRetryOnStaleState(CloudSolrClient.java:856)
	at org.apache.solr.client.solrj.impl.CloudSolrClient.request(CloudSolrClient.java:799)
	at org.apache.solr.client.solrj.SolrClient.request(SolrClient.java:1220)
	at org.apache.solr.cloud.AbstractFullDistribZkTestBase.createCollection(AbstractFullDistribZkTestBase.java:1572)
	at org.apache.solr.cloud.AbstractFullDistribZkTestBase.createCollection(AbstractFullDistribZkTestBase.java:1593)
	at org.apache.solr.cloud.CollectionsAPIDistributedZkTest$1CollectionThread.run(CollectionsAPIDistributedZkTest.java:887)




Build Log:
[...truncated 11151 lines...]
   [junit4] Suite: org.apache.solr.cloud.CollectionsAPIDistributedZkTest
   [junit4]   2> Creating dataDir: /x1/jenkins/jenkins-slave/workspace/Lucene-Solr-NightlyTests-5.x/solr/build/solr-core/test/J0/temp/solr.cloud.CollectionsAPIDistributedZkTest_A0846DB02E8884FF-001/init-core-data-001
   [junit4]   2> 1742357 INFO  (SUITE-CollectionsAPIDistributedZkTest-seed#[A0846DB02E8884FF]-worker) [    ] o.a.s.SolrTestCaseJ4 Randomized ssl (false) and clientAuth (false)
   [junit4]   2> 1742357 INFO  (SUITE-CollectionsAPIDistributedZkTest-seed#[A0846DB02E8884FF]-worker) [    ] o.a.s.BaseDistributedSearchTestCase Setting hostContext system property: /
   [junit4]   2> 1742362 INFO  (TEST-CollectionsAPIDistributedZkTest.test-seed#[A0846DB02E8884FF]) [    ] o.a.s.c.ZkTestServer STARTING ZK TEST SERVER
   [junit4]   2> 1742362 INFO  (Thread-50914) [    ] o.a.s.c.ZkTestServer client port:0.0.0.0/0.0.0.0:0
   [junit4]   2> 1742362 INFO  (Thread-50914) [    ] o.a.s.c.ZkTestServer Starting server
   [junit4]   2> 1742462 INFO  (TEST-CollectionsAPIDistributedZkTest.test-seed#[A0846DB02E8884FF]) [    ] o.a.s.c.ZkTestServer start zk server on port:37101
   [junit4]   2> 1742462 INFO  (TEST-CollectionsAPIDistributedZkTest.test-seed#[A0846DB02E8884FF]) [    ] o.a.s.c.c.SolrZkClient Using default ZkCredentialsProvider
   [junit4]   2> 1742463 INFO  (TEST-CollectionsAPIDistributedZkTest.test-seed#[A0846DB02E8884FF]) [    ] o.a.s.c.c.ConnectionManager Waiting for client to connect to ZooKeeper
   [junit4]   2> 1742466 INFO  (zkCallback-819-thread-1) [    ] o.a.s.c.c.ConnectionManager Watcher org.apache.solr.common.cloud.ConnectionManager@194d4dc0 name:ZooKeeperConnection Watcher:127.0.0.1:37101 got event WatchedEvent state:SyncConnected type:None path:null path:null type:None
   [junit4]   2> 1742466 INFO  (TEST-CollectionsAPIDistributedZkTest.test-seed#[A0846DB02E8884FF]) [    ] o.a.s.c.c.ConnectionManager Client is connected to ZooKeeper
   [junit4]   2> 1742466 INFO  (TEST-CollectionsAPIDistributedZkTest.test-seed#[A0846DB02E8884FF]) [    ] o.a.s.c.c.SolrZkClient Using default ZkACLProvider
   [junit4]   2> 1742466 INFO  (TEST-CollectionsAPIDistributedZkTest.test-seed#[A0846DB02E8884FF]) [    ] o.a.s.c.c.SolrZkClient makePath: /solr
   [junit4]   2> 1742473 INFO  (TEST-CollectionsAPIDistributedZkTest.test-seed#[A0846DB02E8884FF]) [    ] o.a.s.c.c.SolrZkClient Using default ZkCredentialsProvider
   [junit4]   2> 1742474 INFO  (TEST-CollectionsAPIDistributedZkTest.test-seed#[A0846DB02E8884FF]) [    ] o.a.s.c.c.ConnectionManager Waiting for client to connect to ZooKeeper
   [junit4]   2> 1742478 INFO  (zkCallback-820-thread-1) [    ] o.a.s.c.c.ConnectionManager Watcher org.apache.solr.common.cloud.ConnectionManager@7712e9e6 name:ZooKeeperConnection Watcher:127.0.0.1:37101/solr got event WatchedEvent state:SyncConnected type:None path:null path:null type:None
   [junit4]   2> 1742478 INFO  (TEST-CollectionsAPIDistributedZkTest.test-seed#[A0846DB02E8884FF]) [    ] o.a.s.c.c.ConnectionManager Client is connected to ZooKeeper
   [junit4]   2> 1742479 INFO  (TEST-CollectionsAPIDistributedZkTest.test-seed#[A0846DB02E8884FF]) [    ] o.a.s.c.c.SolrZkClient Using default ZkACLProvider
   [junit4]   2> 1742479 INFO  (TEST-CollectionsAPIDistributedZkTest.test-seed#[A0846DB02E8884FF]) [    ] o.a.s.c.c.SolrZkClient makePath: /collections/collection1
   [junit4]   2> 1742481 INFO  (TEST-CollectionsAPIDistributedZkTest.test-seed#[A0846DB02E8884FF]) [    ] o.a.s.c.c.SolrZkClient makePath: /collections/collection1/shards
   [junit4]   2> 1742483 INFO  (TEST-CollectionsAPIDistributedZkTest.test-seed#[A0846DB02E8884FF]) [    ] o.a.s.c.c.SolrZkClient makePath: /collections/control_collection
   [junit4]   2> 1742484 INFO  (TEST-CollectionsAPIDistributedZkTest.test-seed#[A0846DB02E8884FF]) [    ] o.a.s.c.c.SolrZkClient makePath: /collections/control_collection/shards
   [junit4]   2> 1742486 INFO  (TEST-CollectionsAPIDistributedZkTest.test-seed#[A0846DB02E8884FF]) [    ] o.a.s.c.AbstractZkTestCase put /x1/jenkins/jenkins-slave/workspace/Lucene-Solr-NightlyTests-5.x/solr/core/src/test-files/solr/collection1/conf/solrconfig-tlog.xml to /configs/conf1/solrconfig.xml
   [junit4]   2> 1742486 INFO  (TEST-CollectionsAPIDistributedZkTest.test-seed#[A0846DB02E8884FF]) [    ] o.a.s.c.c.SolrZkClient makePath: /configs/conf1/solrconfig.xml
   [junit4]   2> 1742488 INFO  (TEST-CollectionsAPIDistributedZkTest.test-seed#[A0846DB02E8884FF]) [    ] o.a.s.c.AbstractZkTestCase put /x1/jenkins/jenkins-slave/workspace/Lucene-Solr-NightlyTests-5.x/solr/core/src/test-files/solr/collection1/conf/schema.xml to /configs/conf1/schema.xml
   [junit4]   2> 1742489 INFO  (TEST-CollectionsAPIDistributedZkTest.test-seed#[A0846DB02E8884FF]) [    ] o.a.s.c.c.SolrZkClient makePath: /configs/conf1/schema.xml
   [junit4]   2> 1742490 INFO  (TEST-CollectionsAPIDistributedZkTest.test-seed#[A0846DB02E8884FF]) [    ] o.a.s.c.AbstractZkTestCase put /x1/jenkins/jenkins-slave/workspace/Lucene-Solr-NightlyTests-5.x/solr/core/src/test-files/solr/collection1/conf/solrconfig.snippet.randomindexconfig.xml to /configs/conf1/solrconfig.snippet.randomindexconfig.xml
   [junit4]   2> 1742491 INFO  (TEST-CollectionsAPIDistributedZkTest.test-seed#[A0846DB02E8884FF]) [    ] o.a.s.c.c.SolrZkClient makePath: /configs/conf1/solrconfig.snippet.randomindexconfig.xml
   [junit4]   2> 1742492 INFO  (TEST-CollectionsAPIDistributedZkTest.test-seed#[A0846DB02E8884FF]) [    ] o.a.s.c.AbstractZkTestCase put /x1/jenkins/jenkins-slave/workspace/Lucene-Solr-NightlyTests-5.x/solr/core/src/test-files/solr/collection1/conf/stopwords.txt to /configs/conf1/stopwords.txt
   [junit4]   2> 1742492 INFO  (TEST-CollectionsAPIDistributedZkTest.test-seed#[A0846DB02E8884FF]) [    ] o.a.s.c.c.SolrZkClient makePath: /configs/conf1/stopwords.txt
   [junit4]   2> 1742494 INFO  (TEST-CollectionsAPIDistributedZkTest.test-seed#[A0846DB02E8884FF]) [    ] o.a.s.c.AbstractZkTestCase put /x1/jenkins/jenkins-slave/workspace/Lucene-Solr-NightlyTests-5.x/solr/core/src/test-files/solr/collection1/conf/protwords.txt to /configs/conf1/protwords.txt
   [junit4]   2> 1742494 INFO  (TEST-CollectionsAPIDistributedZkTest.test-seed#[A0846DB02E8884FF]) [    ] o.a.s.c.c.SolrZkClient makePath: /configs/conf1/protwords.txt
   [junit4]   2> 1742496 INFO  (TEST-CollectionsAPIDistributedZkTest.test-seed#[A0846DB02E8884FF]) [    ] o.a.s.c.AbstractZkTestCase put /x1/jenkins/jenkins-slave/workspace/Lucene-Solr-NightlyTests-5.x/solr/core/src/test-files/solr/collection1/conf/currency.xml to /configs/conf1/currency.xml
   [junit4]   2> 1742496 INFO  (TEST-CollectionsAPIDistributedZkTest.test-seed#[A0846DB02E8884FF]) [    ] o.a.s.c.c.SolrZkClient makePath: /configs/conf1/currency.xml
   [junit4]   2> 1742498 INFO  (TEST-CollectionsAPIDistributedZkTest.test-seed#[A0846DB02E8884FF]) [    ] o.a.s.c.AbstractZkTestCase put /x1/jenkins/jenkins-slave/workspace/Lucene-Solr-NightlyTests-5.x/solr/core/src/test-files/solr/collection1/conf/enumsConfig.xml to /configs/conf1/enumsConfig.xml
   [junit4]   2> 1742498 INFO  (TEST-CollectionsAPIDistributedZkTest.test-seed#[A0846DB02E8884FF]) [    ] o.a.s.c.c.SolrZkClient makePath: /configs/conf1/enumsConfig.xml
   [junit4]   2> 1742500 INFO  (TEST-CollectionsAPIDistributedZkTest.test-seed#[A0846DB02E8884FF]) [    ] o.a.s.c.AbstractZkTestCase put /x1/jenkins/jenkins-slave/workspace/Lucene-Solr-NightlyTests-5.x/solr/core/src/test-files/solr/collection1/conf/open-exchange-rates.json to /configs/conf1/open-exchange-rates.json
   [junit4]   2> 1742500 INFO  (TEST-CollectionsAPIDistributedZkTest.test-seed#[A0846DB02E8884FF]) [    ] o.a.s.c.c.SolrZkClient makePath: /configs/conf1/open-exchange-rates.json
   [junit4]   2> 1742502 INFO  (TEST-CollectionsAPIDistributedZkTest.test-seed#[A0846DB02E8884FF]) [    ] o.a.s.c.AbstractZkTestCase put /x1/jenkins/jenkins-slave/workspace/Lucene-Solr-NightlyTests-5.x/solr/core/src/test-files/solr/collection1/conf/mapping-ISOLatin1Accent.txt to /configs/conf1/mapping-ISOLatin1Accent.txt
   [junit4]   2> 1742502 INFO  (TEST-CollectionsAPIDistributedZkTest.test-seed#[A0846DB02E8884FF]) [    ] o.a.s.c.c.SolrZkClient makePath: /configs/conf1/mapping-ISOLatin1Accent.txt
   [junit4]   2> 1742503 INFO  (TEST-CollectionsAPIDistributedZkTest.test-seed#[A0846DB02E8884FF]) [    ] o.a.s.c.AbstractZkTestCase put /x1/jenkins/jenkins-slave/workspace/Lucene-Solr-NightlyTests-5.x/solr/core/src/test-files/solr/collection1/conf/old_synonyms.txt to /configs/conf1/old_synonyms.txt
   [junit4]   2> 1742504 INFO  (TEST-CollectionsAPIDistributedZkTest.test-seed#[A0846DB02E8884FF]) [    ] o.a.s.c.c.SolrZkClient makePath: /configs/conf1/old_synonyms.txt
   [junit4]   2> 1742505 INFO  (TEST-CollectionsAPIDistributedZkTest.test-seed#[A0846DB02E8884FF]) [    ] o.a.s.c.AbstractZkTestCase put /x1/jenkins/jenkins-slave/workspace/Lucene-Solr-NightlyTests-5.x/solr/core/src/test-files/solr/collection1/conf/synonyms.txt to /configs/conf1/synonyms.txt
   [junit4]   2> 1742506 INFO  (TEST-CollectionsAPIDistributedZkTest.test-seed#[A0846DB02E8884FF]) [    ] o.a.s.c.c.SolrZkClient makePath: /configs/conf1/synonyms.txt
   [junit4]   2> 1742784 INFO  (TEST-CollectionsAPIDistributedZkTest.test-seed#[A0846DB02E8884FF]) [    ] o.a.s.SolrTestCaseJ4 Writing core.properties file to /x1/jenkins/jenkins-slave/workspace/Lucene-Solr-NightlyTests-5.x/solr/build/solr-core/test/J0/temp/solr.cloud.CollectionsAPIDistributedZkTest_A0846DB02E8884FF-001/control-001/cores/collection1
   [junit4]   2> 1742786 INFO  (TEST-CollectionsAPIDistributedZkTest.test-seed#[A0846DB02E8884FF]) [    ] o.e.j.s.Server jetty-9.2.11.v20150529
   [junit4]   2> 1742802 INFO  (TEST-CollectionsAPIDistributedZkTest.test-seed#[A0846DB02E8884FF]) [    ] o.e.j.s.h.ContextHandler Started o.e.j.s.ServletContextHandler@ef0ef37{/,null,AVAILABLE}
   [junit4]   2> 1742803 INFO  (TEST-CollectionsAPIDistributedZkTest.test-seed#[A0846DB02E8884FF]) [    ] o.e.j.s.ServerConnector Started ServerConnector@10f4c85f{HTTP/1.1}{127.0.0.1:59264}
   [junit4]   2> 1742803 INFO  (TEST-CollectionsAPIDistributedZkTest.test-seed#[A0846DB02E8884FF]) [    ] o.e.j.s.Server Started @1745750ms
   [junit4]   2> 1742803 INFO  (TEST-CollectionsAPIDistributedZkTest.test-seed#[A0846DB02E8884FF]) [    ] o.a.s.c.s.e.JettySolrRunner Jetty properties: {solr.data.dir=/x1/jenkins/jenkins-slave/workspace/Lucene-Solr-NightlyTests-5.x/solr/build/solr-core/test/J0/temp/solr.cloud.CollectionsAPIDistributedZkTest_A0846DB02E8884FF-001/tempDir-001/control/data, hostPort=59264, hostContext=/, coreRootDirectory=/x1/jenkins/jenkins-slave/workspace/Lucene-Solr-NightlyTests-5.x/solr/build/solr-core/test/J0/../../../../../../../../../../x1/jenkins/jenkins-slave/workspace/Lucene-Solr-NightlyTests-5.x/solr/build/solr-core/test/J0/temp/solr.cloud.CollectionsAPIDistributedZkTest_A0846DB02E8884FF-001/control-001/cores}
   [junit4]   2> 1742804 INFO  (TEST-CollectionsAPIDistributedZkTest.test-seed#[A0846DB02E8884FF]) [    ] o.a.s.s.SolrDispatchFilter SolrDispatchFilter.init(): sun.misc.Launcher$AppClassLoader@1fe91485
   [junit4]   2> 1742804 INFO  (TEST-CollectionsAPIDistributedZkTest.test-seed#[A0846DB02E8884FF]) [    ] o.a.s.c.SolrResourceLoader new SolrResourceLoader for directory: '/x1/jenkins/jenkins-slave/workspace/Lucene-Solr-NightlyTests-5.x/solr/build/solr-core/test/J0/../../../../../../../../../../x1/jenkins/jenkins-slave/workspace/Lucene-Solr-NightlyTests-5.x/solr/build/solr-core/test/J0/temp/solr.cloud.CollectionsAPIDistributedZkTest_A0846DB02E8884FF-001/control-001/'
   [junit4]   2> 1742821 INFO  (TEST-CollectionsAPIDistributedZkTest.test-seed#[A0846DB02E8884FF]) [    ] o.a.s.c.SolrXmlConfig Loading container configuration from /x1/jenkins/jenkins-slave/workspace/Lucene-Solr-NightlyTests-5.x/solr/build/solr-core/test/J0/../../../../../../../../../../x1/jenkins/jenkins-slave/workspace/Lucene-Solr-NightlyTests-5.x/solr/build/solr-core/test/J0/temp/solr.cloud.CollectionsAPIDistributedZkTest_A0846DB02E8884FF-001/control-001/solr.xml
   [junit4]   2> 1742836 INFO  (TEST-CollectionsAPIDistributedZkTest.test-seed#[A0846DB02E8884FF]) [    ] o.a.s.c.CoresLocator Config-defined core root directory: /x1/jenkins/jenkins-slave/workspace/Lucene-Solr-NightlyTests-5.x/solr/build/solr-core/test/J0/../../../../../../../../../../x1/jenkins/jenkins-slave/workspace/Lucene-Solr-NightlyTests-5.x/solr/build/solr-core/test/J0/temp/solr.cloud.CollectionsAPIDistributedZkTest_A0846DB02E8884FF-001/control-001/cores
   [junit4]   2> 1742836 INFO  (TEST-CollectionsAPIDistributedZkTest.test-seed#[A0846DB02E8884FF]) [    ] o.a.s.c.CoreContainer New CoreContainer 610209500
   [junit4]   2> 1742836 INFO  (TEST-CollectionsAPIDistributedZkTest.test-seed#[A0846DB02E8884FF]) [    ] o.a.s.c.CoreContainer Loading cores into CoreContainer [instanceDir=/x1/jenkins/jenkins-slave/workspace/Lucene-Solr-NightlyTests-5.x/solr/build/solr-core/test/J0/../../../../../../../../../../x1/jenkins/jenkins-slave/workspace/Lucene-Solr-NightlyTests-5.x/solr/build/solr-core/test/J0/temp/solr.cloud.CollectionsAPIDistributedZkTest_A0846DB02E8884FF-001/control-001/]
   [junit4]   2> 1742836 INFO  (TEST-CollectionsAPIDistributedZkTest.test-seed#[A0846DB02E8884FF]) [    ] o.a.s.c.CoreContainer loading shared library: /x1/jenkins/jenkins-slave/workspace/Lucene-Solr-NightlyTests-5.x/solr/build/solr-core/test/J0/../../../../../../../../../../x1/jenkins/jenkins-slave/workspace/Lucene-Solr-NightlyTests-5.x/solr/build/solr-core/test/J0/temp/solr.cloud.CollectionsAPIDistributedZkTest_A0846DB02E8884FF-001/control-001/lib
   [junit4]   2> 1742836 WARN  (TEST-CollectionsAPIDistributedZkTest.test-seed#[A0846DB02E8884FF]) [    ] o.a.s.c.SolrResourceLoader Can't find (or read) directory to add to classloader: lib (resolved as: /x1/jenkins/jenkins-slave/workspace/Lucene-Solr-NightlyTests-5.x/solr/build/solr-core/test/J0/../../../../../../../../../../x1/jenkins/jenkins-slave/workspace/Lucene-Solr-NightlyTests-5.x/solr/build/solr-core/test/J0/temp/solr.cloud.CollectionsAPIDistributedZkTest_A0846DB02E8884FF-001/control-001/lib).
   [junit4]   2> 1742845 INFO  (TEST-CollectionsAPIDistributedZkTest.test-seed#[A0846DB02E8884FF]) [    ] o.a.s.h.c.HttpShardHandlerFactory created with socketTimeout : 90000,urlScheme : ,connTimeout : 15000,maxConnectionsPerHost : 20,maxConnections : 10000,corePoolSize : 0,maximumPoolSize : 2147483647,maxThreadIdleTime : 5,sizeOfQueue : -1,fairnessPolicy : false,useRetries : false,
   [junit4]   2> 1742847 INFO  (TEST-CollectionsAPIDistributedZkTest.test-seed#[A0846DB02E8884FF]) [    ] o.a.s.u.UpdateShardHandler Creating UpdateShardHandler HTTP client with params: socketTimeout=340000&connTimeout=45000&retry=true
   [junit4]   2> 1742847 INFO  (TEST-CollectionsAPIDistributedZkTest.test-seed#[A0846DB02E8884FF]) [    ] o.a.s.l.LogWatcher SLF4J impl is org.slf4j.impl.Log4jLoggerFactory
   [junit4]   2> 1742847 INFO  (TEST-CollectionsAPIDistributedZkTest.test-seed#[A0846DB02E8884FF]) [    ] o.a.s.l.LogWatcher Registering Log Listener [Log4j (org.slf4j.impl.Log4jLoggerFactory)]
   [junit4]   2> 1742847 INFO  (TEST-CollectionsAPIDistributedZkTest.test-seed#[A0846DB02E8884FF]) [    ] o.a.s.c.ZkContainer Zookeeper client=127.0.0.1:37101/solr
   [junit4]   2> 1742848 INFO  (TEST-CollectionsAPIDistributedZkTest.test-seed#[A0846DB02E8884FF]) [    ] o.a.s.c.ZkController zkHost includes chroot
   [junit4]   2> 1742848 INFO  (TEST-CollectionsAPIDistributedZkTest.test-seed#[A0846DB02E8884FF]) [    ] o.a.s.c.c.SolrZkClient Using default ZkCredentialsProvider
   [junit4]   2> 1742848 INFO  (TEST-CollectionsAPIDistributedZkTest.test-seed#[A0846DB02E8884FF]) [    ] o.a.s.c.c.ConnectionManager Waiting for client to connect to ZooKeeper
   [junit4]   2> 1742850 INFO  (zkCallback-822-thread-1) [    ] o.a.s.c.c.ConnectionManager Watcher org.apache.solr.common.cloud.ConnectionManager@4186f6eb name:ZooKeeperConnection Watcher:127.0.0.1:37101 got event WatchedEvent state:SyncConnected type:None path:null path:null type:None
   [junit4]   2> 1742850 INFO  (TEST-CollectionsAPIDistributedZkTest.test-seed#[A0846DB02E8884FF]) [    ] o.a.s.c.c.ConnectionManager Client is connected to ZooKeeper
   [junit4]   2> 1742851 INFO  (TEST-CollectionsAPIDistributedZkTest.test-seed#[A0846DB02E8884FF]) [    ] o.a.s.c.c.SolrZkClient Using default ZkACLProvider
   [junit4]   2> 1742852 INFO  (TEST-CollectionsAPIDistributedZkTest.test-seed#[A0846DB02E8884FF]) [n:127.0.0.1:59264_    ] o.a.s.c.c.ConnectionManager Waiting for client to connect to ZooKeeper
   [junit4]   2> 1742853 INFO  (zkCallback-823-thread-1-processing-n:127.0.0.1:59264_) [n:127.0.0.1:59264_    ] o.a.s.c.c.ConnectionManager Watcher org.apache.solr.common.cloud.ConnectionManager@7ab71379 name:ZooKeeperConnection Watcher:127.0.0.1:37101/solr got event WatchedEvent state:SyncConnected type:None path:null path:null type:None
   [junit4]   2> 1742854 INFO  (TEST-CollectionsAPIDistributedZkTest.test-seed#[A0846DB02E8884FF]) [n:127.0.0.1:59264_    ] o.a.s.c.c.ConnectionManager Client is connected to ZooKeeper
   [junit4]   2> 1742855 INFO  (TEST-CollectionsAPIDistributedZkTest.test-seed#[A0846DB02E8884FF]) [n:127.0.0.1:59264_    ] o.a.s.c.c.SolrZkClient makePath: /overseer/queue
   [junit4]   2> 1742857 INFO  (TEST-CollectionsAPIDistributedZkTest.test-seed#[A0846DB02E8884FF]) [n:127.0.0.1:59264_    ] o.a.s.c.c.SolrZkClient makePath: /overseer/collection-queue-work
   [junit4]   2> 1742859 INFO  (TEST-CollectionsAPIDistributedZkTest.test-seed#[A0846DB02E8884FF]) [n:127.0.0.1:59264_    ] o.a.s.c.c.SolrZkClient makePath: /overseer/collection-map-running
   [junit4]   2> 1742861 INFO  (TEST-CollectionsAPIDistributedZkTest.test-seed#[A0846DB02E8884FF]) [n:127.0.0.1:59264_    ] o.a.s.c.c.SolrZkClient makePath: /overseer/collection-map-completed
   [junit4]   2> 1742863 INFO  (TEST-CollectionsAPIDistributedZkTest.test-seed#[A0846DB02E8884FF]) [n:127.0.0.1:59264_    ] o.a.s.c.c.SolrZkClient makePath: /overseer/collection-map-failure
   [junit4]   2> 1742865 INFO  (TEST-CollectionsAPIDistributedZkTest.test-seed#[A0846DB02E8884FF]) [n:127.0.0.1:59264_    ] o.a.s.c.c.SolrZkClient makePath: /live_nodes
   [junit4]   2> 1742867 INFO  (TEST-CollectionsAPIDistributedZkTest.test-seed#[A0846DB02E8884FF]) [n:127.0.0.1:59264_    ] o.a.s.c.c.SolrZkClient makePath: /aliases.json
   [junit4]   2> 1742868 INFO  (TEST-CollectionsAPIDistributedZkTest.test-seed#[A0846DB02E8884FF]) [n:127.0.0.1:59264_    ] o.a.s.c.c.SolrZkClient makePath: /clusterstate.json
   [junit4]   2> 1742869 INFO  (TEST-CollectionsAPIDistributedZkTest.test-seed#[A0846DB02E8884FF]) [n:127.0.0.1:59264_    ] o.a.s.c.ZkController Register node as live in ZooKeeper:/live_nodes/127.0.0.1:59264_
   [junit4]   2> 1742870 INFO  (TEST-CollectionsAPIDistributedZkTest.test-seed#[A0846DB02E8884FF]) [n:127.0.0.1:59264_    ] o.a.s.c.c.SolrZkClient makePath: /live_nodes/127.0.0.1:59264_
   [junit4]   2> 1742871 INFO  (TEST-CollectionsAPIDistributedZkTest.test-seed#[A0846DB02E8884FF]) [n:127.0.0.1:59264_    ] o.a.s.c.c.SolrZkClient makePath: /overseer_elect
   [junit4]   2> 1742873 INFO  (TEST-CollectionsAPIDistributedZkTest.test-seed#[A0846DB02E8884FF]) [n:127.0.0.1:59264_    ] o.a.s.c.c.SolrZkClient makePath: /overseer_elect/election
   [junit4]   2> 1742874 INFO  (TEST-CollectionsAPIDistributedZkTest.test-seed#[A0846DB02E8884FF]) [n:127.0.0.1:59264_    ] o.a.s.c.Overseer Overseer (id=null) closing
   [junit4]   2> 1742875 INFO  (TEST-CollectionsAPIDistributedZkTest.test-seed#[A0846DB02E8884FF]) [n:127.0.0.1:59264_    ] o.a.s.c.LeaderElector Joined leadership election with path: /overseer_elect/election/94152474781614083-127.0.0.1:59264_-n_0000000000
   [junit4]   2> 1742876 INFO  (TEST-CollectionsAPIDistributedZkTest.test-seed#[A0846DB02E8884FF]) [n:127.0.0.1:59264_    ] o.a.s.c.OverseerElectionContext I am going to be the leader 127.0.0.1:59264_
   [junit4]   2> 1742876 INFO  (TEST-CollectionsAPIDistributedZkTest.test-seed#[A0846DB02E8884FF]) [n:127.0.0.1:59264_    ] o.a.s.c.c.SolrZkClient makePath: /overseer_elect/leader
   [junit4]   2> 1742877 INFO  (TEST-CollectionsAPIDistributedZkTest.test-seed#[A0846DB02E8884FF]) [n:127.0.0.1:59264_    ] o.a.s.c.Overseer Overseer (id=94152474781614083-127.0.0.1:59264_-n_0000000000) starting
   [junit4]   2> 1742879 INFO  (TEST-CollectionsAPIDistributedZkTest.test-seed#[A0846DB02E8884FF]) [n:127.0.0.1:59264_    ] o.a.s.c.c.SolrZkClient makePath: /overseer/queue-work
   [junit4]   2> 1742885 INFO  (TEST-CollectionsAPIDistributedZkTest.test-seed#[A0846DB02E8884FF]) [n:127.0.0.1:59264_    ] o.a.s.c.OverseerAutoReplicaFailoverThread Starting OverseerAutoReplicaFailoverThread autoReplicaFailoverWorkLoopDelay=10000 autoReplicaFailoverWaitAfterExpiration=10000 autoReplicaFailoverBadNodeExpiration=60000
   [junit4]   2> 1742885 INFO  (OverseerCollectionProcessor-94152474781614083-127.0.0.1:59264_-n_0000000000) [n:127.0.0.1:59264_    ] o.a.s.c.OverseerCollectionProcessor Process current queue of collection creations
   [junit4]   2> 1742885 INFO  (TEST-CollectionsAPIDistributedZkTest.test-seed#[A0846DB02E8884FF]) [n:127.0.0.1:59264_    ] o.a.s.c.c.ZkStateReader Updating cluster state from ZooKeeper... 
   [junit4]   2> 1742886 INFO  (OverseerStateUpdate-94152474781614083-127.0.0.1:59264_-n_0000000000) [n:127.0.0.1:59264_    ] o.a.s.c.Overseer Starting to work on the main queue
   [junit4]   2> 1742889 INFO  (TEST-CollectionsAPIDistributedZkTest.test-seed#[A0846DB02E8884FF]) [n:127.0.0.1:59264_    ] o.a.s.c.CoreContainer No authentication plugin used.
   [junit4]   2> 1742889 INFO  (TEST-CollectionsAPIDistributedZkTest.test-seed#[A0846DB02E8884FF]) [n:127.0.0.1:59264_    ] o.a.s.c.CoreContainer Security conf doesn't exist. Skipping setup for authorization module.
   [junit4]   2> 1742890 INFO  (TEST-CollectionsAPIDistributedZkTest.test-seed#[A0846DB02E8884FF]) [n:127.0.0.1:59264_    ] o.a.s.c.CoresLocator Looking for core definitions underneath /x1/jenkins/jenkins-slave/workspace/Lucene-Solr-NightlyTests-5.x/solr/build/solr-core/test/J0/../../../../../../../../../../x1/jenkins/jenkins-slave/workspace/Lucene-Solr-NightlyTests-5.x/solr/build/solr-core/test/J0/temp/solr.cloud.CollectionsAPIDistributedZkTest_A0846DB02E8884FF-001/control-001/cores
   [junit4]   2> 1742891 INFO  (TEST-CollectionsAPIDistributedZkTest.test-seed#[A0846DB02E8884FF]) [n:127.0.0.1:59264_    ] o.a.s.c.SolrCore Created CoreDescriptor: {shard=, instanceDir=/x1/jenkins/jenkins-slave/workspace/Lucene-Solr-NightlyTests-5.x/solr/build/solr-core/test/J0/../../../../../../../../../../x1/jenkins/jenkins-slave/workspace/Lucene-Solr-NightlyTests-5.x/solr/build/solr-core/test/J0/temp/solr.cloud.CollectionsAPIDistributedZkTest_A0846DB02E8884FF-001/control-001/cores/collection1, transient=false, dataDir=data/, config=solrconfig.xml, schema=schema.xml, loadOnStartup=true, name=collection1, collection=control_collection, coreNodeName=, absoluteInstDir=/x1/jenkins/jenkins-slave/workspace/Lucene-Solr-NightlyTests-5.x/solr/build/solr-core/test/J0/../../../../../../../../../../x1/jenkins/jenkins-slave/workspace/Lucene-Solr-NightlyTests-5.x/solr/build/solr-core/test/J0/temp/solr.cloud.CollectionsAPIDistributedZkTest_A0846DB02E8884FF-001/control-001/cores/collection1/}
   [junit4]   2> 1742891 INFO  (TEST-CollectionsAPIDistributedZkTest.test-seed#[A0846DB02E8884FF]) [n:127.0.0.1:59264_    ] o.a.s.c.CoresLocator Found core collection1 in /x1/jenkins/jenkins-slave/workspace/Lucene-Solr-NightlyTests-5.x/solr/build/solr-core/test/J0/../../../../../../../../../../x1/jenkins/jenkins-slave/workspace/Lucene-Solr-NightlyTests-5.x/solr/build/solr-core/test/J0/temp/solr.cloud.CollectionsAPIDistributedZkTest_A0846DB02E8884FF-001/control-001/cores/collection1/
   [junit4]   2> 1742891 INFO  (TEST-CollectionsAPIDistributedZkTest.test-seed#[A0846DB02E8884FF]) [n:127.0.0.1:59264_    ] o.a.s.c.CoresLocator Found 1 core definitions
   [junit4]   2> 1742892 INFO  (coreLoadExecutor-3083-thread-1-processing-n:127.0.0.1:59264_) [n:127.0.0.1:59264_ c:control_collection   x:collection1] o.a.s.c.ZkController publishing state=down
   [junit4]   2> 1742893 INFO  (TEST-CollectionsAPIDistributedZkTest.test-seed#[A0846DB02E8884FF]) [n:127.0.0.1:59264_    ] o.a.s.s.SolrDispatchFilter user.dir=/x1/jenkins/jenkins-slave/workspace/Lucene-Solr-NightlyTests-5.x/solr/build/solr-core/test/J0
   [junit4]   2> 1742893 INFO  (TEST-CollectionsAPIDistributedZkTest.test-seed#[A0846DB02E8884FF]) [n:127.0.0.1:59264_    ] o.a.s.s.SolrDispatchFilter SolrDispatchFilter.init() done
   [junit4]   2> 1742893 INFO  (coreLoadExecutor-3083-thread-1-processing-n:127.0.0.1:59264_) [n:127.0.0.1:59264_ c:control_collection   x:collection1] o.a.s.c.ZkController numShards not found on descriptor - reading it from system property
   [junit4]   2> 1742894 INFO  (coreLoadExecutor-3083-thread-1-processing-n:127.0.0.1:59264_) [n:127.0.0.1:59264_ c:control_collection   x:collection1] o.a.s.c.ZkController look for our core node name
   [junit4]   2> 1742894 INFO  (OverseerStateUpdate-94152474781614083-127.0.0.1:59264_-n_0000000000) [n:127.0.0.1:59264_    ] o.a.s.c.Overseer processMessage: queueSize: 1, message = {
   [junit4]   2>   "numShards":"1",
   [junit4]   2>   "operation":"state",
   [junit4]   2>   "base_url":"http://127.0.0.1:59264",
   [junit4]   2>   "state":"down",
   [junit4]   2>   "core":"collection1",
   [junit4]   2>   "node_name":"127.0.0.1:59264_",
   [junit4]   2>   "roles":null,
   [junit4]   2>   "shard":null,
   [junit4]   2>   "collection":"control_collection"} current state version: 0
   [junit4]   2> 1742895 INFO  (OverseerStateUpdate-94152474781614083-127.0.0.1:59264_-n_0000000000) [n:127.0.0.1:59264_    ] o.a.s.c.o.ReplicaMutator Update state numShards=1 message={
   [junit4]   2>   "numShards":"1",
   [junit4]   2>   "operation":"state",
   [junit4]   2>   "base_url":"http://127.0.0.1:59264",
   [junit4]   2>   "state":"down",
   [junit4]   2>   "core":"collection1",
   [junit4]   2>   "node_name":"127.0.0.1:59264_",
   [junit4]   2>   "roles":null,
   [junit4]   2>   "shard":null,
   [junit4]   2>   "collection":"control_collection"}
   [junit4]   2> 1742895 INFO  (OverseerStateUpdate-94152474781614083-127.0.0.1:59264_-n_0000000000) [n:127.0.0.1:59264_    ] o.a.s.c.o.ClusterStateMutator building a new cName: control_collection
   [junit4]   2> 1742895 INFO  (OverseerStateUpdate-94152474781614083-127.0.0.1:59264_-n_0000000000) [n:127.0.0.1:59264_    ] o.a.s.c.o.ReplicaMutator Assigning new node to shard shard=shard1
   [junit4]   2> 1742896 INFO  (zkCallback-823-thread-1-processing-n:127.0.0.1:59264_) [n:127.0.0.1:59264_    ] o.a.s.c.c.ZkStateReader A cluster state change: WatchedEvent state:SyncConnected type:NodeDataChanged path:/clusterstate.json, has occurred - updating... (live nodes size: 1)
   [junit4]   2> 1742898 INFO  (zkCallback-823-thread-1-processing-n:127.0.0.1:59264_) [n:127.0.0.1:59264_    ] o.a.s.c.c.ZkStateReader Updated cluster state version to 1
   [junit4]   2> 1742898 INFO  (zkCallback-823-thread-1-processing-n:127.0.0.1:59264_) [n:127.0.0.1:59264_    ] o.a.s.c.DistributedQueue NodeChildrenChanged fired on path /overseer/queue state SyncConnected
   [junit4]   2> 1743894 INFO  (coreLoadExecutor-3083-thread-1-processing-n:127.0.0.1:59264_) [n:127.0.0.1:59264_ c:control_collection   x:collection1] o.a.s.c.ZkController waiting to find shard id in clusterstate for collection1
   [junit4]   2> 1743894 INFO  (coreLoadExecutor-3083-thread-1-processing-n:127.0.0.1:59264_) [n:127.0.0.1:59264_ c:control_collection   x:collection1] o.a.s.c.ZkController Check for collection zkNode:control_collection
   [junit4]   2> 1743895 INFO  (coreLoadExecutor-3083-thread-1-processing-n:127.0.0.1:59264_) [n:127.0.0.1:59264_ c:control_collection   x:collection1] o.a.s.c.ZkController Collection zkNode exists
   [junit4]   2> 1743895 INFO  (coreLoadExecutor-3083-thread-1-processing-n:127.0.0.1:59264_) [n:127.0.0.1:59264_ c:control_collection   x:collection1] o.a.s.c.c.ZkStateReader Load collection config from:/collections/control_collection
   [junit4]   2> 1743896 INFO  (coreLoadExecutor-3083-thread-1-processing-n:127.0.0.1:59264_) [n:127.0.0.1:59264_ c:control_collection   x:collection1] o.a.s.c.c.ZkStateReader path=/collections/control_collection configName=conf1 specified config exists in ZooKeeper
   [junit4]   2> 1743896 INFO  (coreLoadExecutor-3083-thread-1-processing-n:127.0.0.1:59264_) [n:127.0.0.1:59264_ c:control_collection   x:collection1] o.a.s.c.SolrResourceLoader new SolrResourceLoader for directory: '/x1/jenkins/jenkins-slave/workspace/Lucene-Solr-NightlyTests-5.x/solr/build/solr-core/test/J0/../../../../../../../../../../x1/jenkins/jenkins-slave/workspace/Lucene-Solr-NightlyTests-5.x/solr/build/solr-core/test/J0/temp/solr.cloud.CollectionsAPIDistributedZkTest_A0846DB02E8884FF-001/control-001/cores/collection1/'
   [junit4]   2> 1743918 INFO  (coreLoadExecutor-3083-thread-1-processing-n:127.0.0.1:59264_) [n:127.0.0.1:59264_ c:control_collection   x:collection1] o.a.s.c.Config loaded config solrconfig.xml with version 0 
   [junit4]   2> 1743927 INFO  (coreLoadExecutor-3083-thread-1-processing-n:127.0.0.1:59264_) [n:127.0.0.1:59264_ c:control_collection   x:collection1] o.a.s.c.SolrConfig current version of requestparams : -1
   [junit4]   2> 1743947 INFO  (coreLoadExecutor-3083-thread-1-processing-n:127.0.0.1:59264_) [n:127.0.0.1:59264_ c:control_collection   x:collection1] o.a.s.c.SolrConfig Using Lucene MatchVersion: 5.3.0
   [junit4]   2> 1743989 INFO  (coreLoadExecutor-3083-thread-1-processing-n:127.0.0.1:59264_) [n:127.0.0.1:59264_ c:control_collection   x:collection1] o.a.s.c.Config Loaded SolrConfig: solrconfig.xml
   [junit4]   2> 1743990 INFO  (coreLoadExecutor-3083-thread-1-processing-n:127.0.0.1:59264_) [n:127.0.0.1:59264_ c:control_collection   x:collection1] o.a.s.s.IndexSchema Reading Solr Schema from /configs/conf1/schema.xml
   [junit4]   2> 1744000 INFO  (coreLoadExecutor-3083-thread-1-processing-n:127.0.0.1:59264_) [n:127.0.0.1:59264_ c:control_collection   x:collection1] o.a.s.s.IndexSchema [collection1] Schema name=test
   [junit4]   2> 1744311 INFO  (coreLoadExecutor-3083-thread-1-processing-n:127.0.0.1:59264_) [n:127.0.0.1:59264_ c:control_collection   x:collection1] o.a.s.s.OpenExchangeRatesOrgProvider Initialized with rates=open-exchange-rates.json, refreshInterval=1440.
   [junit4]   2> 1744319 INFO  (coreLoadExecutor-3083-thread-1-processing-n:127.0.0.1:59264_) [n:127.0.0.1:59264_ c:control_collection   x:collection1] o.a.s.s.IndexSchema default search field in schema is text
   [junit4]   2> 1744321 INFO  (coreLoadExecutor-3083-thread-1-processing-n:127.0.0.1:59264_) [n:127.0.0.1:59264_ c:control_collection   x:collection1] o.a.s.s.IndexSchema unique key field: id
   [junit4]   2> 1744330 INFO  (coreLoadExecutor-3083-thread-1-processing-n:127.0.0.1:59264_) [n:127.0.0.1:59264_ c:control_collection   x:collection1] o.a.s.s.FileExchangeRateProvider Reloading exchange rates from file currency.xml
   [junit4]   2> 1744334 INFO  (coreLoadExecutor-3083-thread-1-processing-n:127.0.0.1:59264_) [n:127.0.0.1:59264_ c:control_collection   x:collection1] o.a.s.s.FileExchangeRateProvider Reloading exchange rates from file currency.xml
   [junit4]   2> 1744336 INFO  (coreLoadExecutor-3083-thread-1-processing-n:127.0.0.1:59264_) [n:127.0.0.1:59264_ c:control_collection   x:collection1] o.a.s.s.OpenExchangeRatesOrgProvider Reloading exchange rates from open-exchange-rates.json
   [junit4]   2> 1744337 WARN  (coreLoadExecutor-3083-thread-1-processing-n:127.0.0.1:59264_) [n:127.0.0.1:59264_ c:control_collection   x:collection1] o.a.s.s.OpenExchangeRatesOrgProvider Unknown key IMPORTANT NOTE
   [junit4]   2> 1744337 WARN  (coreLoadExecutor-3083-thread-1-processing-n:127.0.0.1:59264_) [n:127.0.0.1:59264_ c:control_collection   x:collection1] o.a.s.s.OpenExchangeRatesOrgProvider Expected key, got STRING
   [junit4]   2> 1744338 INFO  (coreLoadExecutor-3083-thread-1-processing-n:127.0.0.1:59264_) [n:127.0.0.1:59264_ c:control_collection   x:collection1] o.a.s.s.OpenExchangeRatesOrgProvider Reloading exchange rates from open-exchange-rates.json
   [junit4]   2> 1744338 WARN  (coreLoadExecutor-3083-thread-1-processing-n:127.0.0.1:59264_) [n:127.0.0.1:59264_ c:control_collection   x:collection1] o.a.s.s.OpenExchangeRatesOrgProvider Unknown key IMPORTANT NOTE
   [junit4]   2> 1744338 WARN  (coreLoadExecutor-3083-thread-1-processing-n:127.0.0.1:59264_) [n:127.0.0.1:59264_ c:control_collection   x:collection1] o.a.s.s.OpenExchangeRatesOrgProvider Expected key, got STRING
   [junit4]   2> 1744338 INFO  (coreLoadExecutor-3083-thread-1-processing-n:127.0.0.1:59264_) [n:127.0.0.1:59264_ c:control_collection   x:collection1] o.a.s.c.CoreContainer Creating SolrCore 'collection1' using configuration from collection control_collection
   [junit4]   2> 1744339 INFO  (coreLoadExecutor-3083-thread-1-processing-n:127.0.0.1:59264_) [n:127.0.0.1:59264_ c:control_collection s:shard1 r:core_node1 x:collection1] o.a.s.c.SolrCore org.apache.solr.core.MockDirectoryFactory
   [junit4]   2> 1744339 INFO  (coreLoadExecutor-3083-thread-1-processing-n:127.0.0.1:59264_) [n:127.0.0.1:59264_ c:control_collection s:shard1 r:core_node1 x:collection1] o.a.s.c.SolrCore [[collection1] ] Opening new SolrCore at [/x1/jenkins/jenkins-slave/workspace/Lucene-Solr-NightlyTests-5.x/solr/build/solr-core/test/J0/../../../../../../../../../../x1/jenkins/jenkins-slave/workspace/Lucene-Solr-NightlyTests-5.x/solr/build/solr-core/test/J0/temp/solr.cloud.CollectionsAPIDistributedZkTest_A0846DB02E8884FF-001/control-001/cores/collection1/], dataDir=[null]
   [junit4]   2> 1744339 INFO  (coreLoadExecutor-3083-thread-1-processing-n:127.0.0.1:59264_) [n:127.0.0.1:59264_ c:control_collection s:shard1 r:core_node1 x:collection1] o.a.s.c.JmxMonitoredMap JMX monitoring is enabled. Adding Solr mbeans to JMX Server: com.sun.jmx.mbeanserver.JmxMBeanServer@986fff7
   [junit4]   2> 1744340 INFO  (coreLoadExecutor-3083-thread-1-processing-n:127.0.0.1:59264_) [n:127.0.0.1:59264_ c:control_collection s:shard1 r:core_node1 x:collection1] o.a.s.c.CachingDirectoryFactory return new directory for /x1/jenkins/jenkins-slave/workspace/Lucene-Solr-NightlyTests-5.x/solr/build/solr-core/test/J0/../../../../../../../../../../x1/jenkins/jenkins-slave/workspace/Lucene-Solr-NightlyTests-5.x/solr/build/solr-core/test/J0/temp/solr.cloud.CollectionsAPIDistributedZkTest_A0846DB02E8884FF-001/control-001/cores/collection1/data
   [junit4]   2> 1744340 INFO  (coreLoadExecutor-3083-thread-1-processing-n:127.0.0.1:59264_) [n:127.0.0.1:59264_ c:control_collection s:shard1 r:core_node1 x:collection1] o.a.s.c.SolrCore New index directory detected: old=null new=/x1/jenkins/jenkins-slave/workspace/Lucene-Solr-NightlyTests-5.x/solr/build/solr-core/test/J0/../../../../../../../../../../x1/jenkins/jenkins-slave/workspace/Lucene-Solr-NightlyTests-5.x/solr/build/solr-core/test/J0/temp/solr.cloud.CollectionsAPIDistributedZkTest_A0846DB02E8884FF-001/control-001/cores/collection1/data/index/
   [junit4]   2> 1744340 WARN  (coreLoadExecutor-3083-thread-1-processing-n:127.0.0.1:59264_) [n:127.0.0.1:59264_ c:control_collection s:shard1 r:core_node1 x:collection1] o.a.s.c.SolrCore [collection1] Solr index directory '/x1/jenkins/jenkins-slave/workspace/Lucene-Solr-NightlyTests-5.x/solr/build/solr-core/test/J0/../../../../../../../../../../x1/jenkins/jenkins-slave/workspace/Lucene-Solr-NightlyTests-5.x/solr/build/solr-core/test/J0/temp/solr.cloud.CollectionsAPIDistributedZkTest_A0846DB02E8884FF-001/control-001/cores/collection1/data/index' doesn't exist. Creating new index...
   [junit4]   2> 1744340 INFO  (coreLoadExecutor-3083-thread-1-processing-n:127.0.0.1:59264_) [n:127.0.0.1:59264_ c:control_collection s:shard1 r:core_node1 x:collection1] o.a.s.c.CachingDirectoryFactory return new directory for /x1/jenkins/jenkins-slave/workspace/Lucene-Solr-NightlyTests-5.x/solr/build/solr-core/test/J0/../../../../../../../../../../x1/jenkins/jenkins-slave/workspace/Lucene-Solr-NightlyTests-5.x/solr/build/solr-core/test/J0/temp/solr.cloud.CollectionsAPIDistributedZkTest_A0846DB02E8884FF-001/control-001/cores/collection1/data/index
   [junit4]   2> 1744341 INFO  (coreLoadExecutor-3083-thread-1-processing-n:127.0.0.1:59264_) [n:127.0.0.1:59264_ c:control_collection s:shard1 r:core_node1 x:collection1] o.a.s.u.RandomMergePolicy RandomMergePolicy wrapping class org.apache.lucene.index.TieredMergePolicy: [TieredMergePolicy: maxMergeAtOnce=50, maxMergeAtOnceExplicit=23, maxMergedSegmentMB=92.443359375, floorSegmentMB=1.0078125, forceMergeDeletesPctAllowed=24.397193727987904, segmentsPerTier=44.0, maxCFSSegmentSizeMB=1.646484375, noCFSRatio=0.0
   [junit4]   2> 1744341 INFO  (coreLoadExecutor-3083-thread-1-processing-n:127.0.0.1:59264_) [n:127.0.0.1:59264_ c:control_collection s:shard1 r:core_node1 x:collection1] o.a.s.c.SolrCore SolrDeletionPolicy.onCommit: commits: num=1
   [junit4]   2> 	commit{dir=MockDirectoryWrapper(NRTCachingDirectory(RAMDirectory@51d0b85f lockFactory=org.apache.lucene.store.SingleInstanceLockFactory@5df88eef; maxCacheMB=0.009765625 maxMergeSizeMB=0.69140625)),segFN=segments_1,generation=1}
   [junit4]   2> 1744342 INFO  (coreLoadExecutor-3083-thread-1-processing-n:127.0.0.1:59264_) [n:127.0.0.1:59264_ c:control_collection s:shard1 r:core_node1 x:collection1] o.a.s.c.SolrCore newest commit generation = 1
   [junit4]   2> 1744342 INFO  (OldIndexDirectoryCleanupThreadForCore-collection1) [n:127.0.0.1:59264_ c:control_collection s:shard1 r:core_node1 x:collection1] o.a.s.c.SolrCore Looking for old index directories to cleanup for core collection1 in /x1/jenkins/jenkins-slave/workspace/Lucene-Solr-NightlyTests-5.x/solr/build/solr-core/test/J0/../../../../../../../../../../x1/jenkins/jenkins-slave/workspace/Lucene-Solr-NightlyTests-5.x/solr/build/solr-core/test/J0/temp/solr.cloud.CollectionsAPIDistributedZkTest_A0846DB02E8884FF-001/control-001/cores/collection1/data/
   [junit4]   2> 1744342 WARN  (OldIndexDirectoryCleanupThreadForCore-collection1) [n:127.0.0.1:59264_ c:control_collection s:shard1 r:core_node1 x:collection1] o.a.s.c.DirectoryFactory /x1/jenkins/jenkins-slave/workspace/Lucene-Solr-NightlyTests-5.x/solr/build/solr-core/test/J0/../../../../../../../../../../x1/jenkins/jenkins-slave/workspace/Lucene-Solr-NightlyTests-5.x/solr/build/solr-core/test/J0/temp/solr.cloud.CollectionsAPIDistributedZkTest_A0846DB02E8884FF-001/control-001/cores/collection1/data/ does not point to a valid data directory; skipping clean-up of old index directories.
   [junit4]   2> 1744346 INFO  (coreLoadExecutor-3083-thread-1-processing-n:127.0.0.1:59264_) [n:127.0.0.1:59264_ c:control_collection s:shard1 r:core_node1 x:collection1] o.a.s.u.p.UpdateRequestProcessorChain creating updateRequestProcessorChain "nodistrib"
   [junit4]   2> 1744347 INFO  (coreLoadExecutor-3083-thread-1-processing-n:127.0.0.1:59264_) [n:127.0.0.1:59264_ c:control_collection s:shard1 r:core_node1 x:collection1] o.a.s.u.p.UpdateRequestProcessorChain creating updateRequestProcessorChain "dedupe"
   [junit4]   2> 1744347 INFO  (coreLoadExecutor-3083-thread-1-processing-n:127.0.0.1:59264_) [n:127.0.0.1:59264_ c:control_collection s:shard1 r:core_node1 x:collection1] o.a.s.u.p.UpdateRequestProcessorChain inserting DistributedUpdateProcessorFactory into updateRequestProcessorChain "dedupe"
   [junit4]   2> 1744347 INFO  (coreLoadExecutor-3083-thread-1-processing-n:127.0.0.1:59264_) [n:127.0.0.1:59264_ c:control_collection s:shard1 r:core_node1 x:collection1] o.a.s.u.p.UpdateRequestProcessorChain creating updateRequestProcessorChain "stored_sig"
   [junit4]   2> 1744347 INFO  (coreLoadExecutor-3083-thread-1-processing-n:127.0.0.1:59264_) [n:127.0.0.1:59264_ c:control_collection s:shard1 r:core_node1 x:collection1] o.a.s.u.p.UpdateRequestProcessorChain inserting DistributedUpdateProcessorFactory into updateRequestProcessorChain "stored_sig"
   [junit4]   2> 1744347 INFO  (coreLoadExecutor-3083-thread-1-processing-n:127.0.0.1:59264_) [n:127.0.0.1:59264_ c:control_collection s:shard1 r:core_node1 x:collection1] o.a.s.u.p.UpdateRequestProcessorChain creating updateRequestProcessorChain "distrib-dup-test-chain-explicit"
   [junit4]   2> 1744348 INFO  (coreLoadExecutor-3083-thread-1-processing-n:127.0.0.1:59264_) [n:127.0.0.1:59264_ c:control_collection s:shard1 r:core_node1 x:collection1] o.a.s.u.p.UpdateRequestProcessorChain creating updateRequestProcessorChain "distrib-dup-test-chain-implicit"
   [junit4]   2> 1744348 INFO  (coreLoadExecutor-3083-thread-1-processing-n:127.0.0.1:59264_) [n:127.0.0.1:59264_ c:control_collection s:shard1 r:core_node1 x:collection1] o.a.s.u.p.UpdateRequestProcessorChain inserting DistributedUpdateProcessorFactory into updateRequestProcessorChain "distrib-dup-test-chain-implicit"
   [junit4]   2> 1744348 INFO  (coreLoadExecutor-3083-thread-1-processing-n:127.0.0.1:59264_) [n:127.0.0.1:59264_ c:control_collection s:shard1 r:core_node1 x:collection1] o.a.s.c.SolrCore no updateRequestProcessorChain defined as default, creating implicit default
   [junit4]   2> 1744351 INFO  (coreLoadExecutor-3083-thread-1-processing-n:127.0.0.1:59264_) [n:127.0.0.1:59264_ c:control_collection s:shard1 r:core_node1 x:collection1] o.a.s.h.l.XMLLoader xsltCacheLifetimeSeconds=60
   [junit4]   2> 1744352 INFO  (coreLoadExecutor-3083-thread-1-processing-n:127.0.0.1:59264_) [n:127.0.0.1:59264_ c:control_collection s:shard1 r:core_node1 x:collection1] o.a.s.h.l.XMLLoader xsltCacheLifetimeSeconds=60
   [junit4]   2> 1744353 INFO  (coreLoadExecutor-3083-thread-1-processing-n:127.0.0.1:59264_) [n:127.0.0.1:59264_ c:control_collection s:shard1 r:core_node1 x:collection1] o.a.s.h.l.XMLLoader xsltCacheLifetimeSeconds=60
   [junit4]   2> 1744355 INFO  (coreLoadExecutor-3083-thread-1-processing-n:127.0.0.1:59264_) [n:127.0.0.1:59264_ c:control_collection s:shard1 r:core_node1 x:collection1] o.a.s.h.l.XMLLoader xsltCacheLifetimeSeconds=60
   [junit4]   2> 1744358 INFO  (coreLoadExecutor-3083-thread-1-processing-n:127.0.0.1:59264_) [n:127.0.0.1:59264_ c:control_collection s:shard1 r:core_node1 x:collection1] o.a.s.c.RequestHandlers Registered paths: /update/json/docs,/admin/file,/admin/mbeans,/admin/luke,/update,/admin/properties,/admin/logging,/update/json,/admin/ping,/config,/schema,/update/csv,/get,/admin/threads,/replication,standard,/admin/plugins,/admin/system,/admin/segments
   [junit4]   2> 1744360 INFO  (coreLoadExecutor-3083-thread-1-processing-n:127.0.0.1:59264_) [n:127.0.0.1:59264_ c:control_collection s:shard1 r:core_node1 x:collection1] o.a.s.c.SolrCore Using default statsCache cache: org.apache.solr.search.stats.LocalStatsCache
   [junit4]   2> 1744360 INFO  (coreLoadExecutor-3083-thread-1-processing-n:127.0.0.1:59264_) [n:127.0.0.1:59264_ c:control_collection s:shard1 r:core_node1 x:collection1] o.a.s.u.UpdateHandler Using UpdateLog implementation: org.apache.solr.update.UpdateLog
   [junit4]   2> 1744360 INFO  (coreLoadExecutor-3083-thread-1-processing-n:127.0.0.1:59264_) [n:127.0.0.1:59264_ c:control_collection s:shard1 r:core_node1 x:collection1] o.a.s.u.UpdateLog Initializing UpdateLog: dataDir= defaultSyncLevel=FLUSH numRecordsToKeep=100 maxNumLogsToKeep=10 numVersionBuckets=65536
   [junit4]   2> 1744361 INFO  (coreLoadExecutor-3083-thread-1-processing-n:127.0.0.1:59264_) [n:127.0.0.1:59264_ c:control_collection s:shard1 r:core_node1 x:collection1] o.a.s.c.SolrCore Hard AutoCommit: disabled
   [junit4]   2> 1744361 INFO  (coreLoadExecutor-3083-thread-1-processing-n:127.0.0.1:59264_) [n:127.0.0.1:59264_ c:control_collection s:shard1 r:core_node1 x:collection1] o.a.s.c.SolrCore Soft AutoCommit: disabled
   [junit4]   2> 1744362 INFO  (coreLoadExecutor-3083-thread-1-processing-n:127.0.0.1:59264_) [n:127.0.0.1:59264_ c:control_collection s:shard1 r:core_node1 x:collection1] o.a.s.u.RandomMergePolicy RandomMergePolicy wrapping class org.apache.lucene.index.TieredMergePolicy: [TieredMergePolicy: maxMergeAtOnce=13, maxMergeAtOnceExplicit=13, maxMergedSegmentMB=40.869140625, floorSegmentMB=0.8798828125, forceMergeDeletesPctAllowed=5.762530306037198, segmentsPerTier=23.0, maxCFSSegmentSizeMB=8.796093022207999E12, noCFSRatio=0.6719651768887707
   [junit4]   2> 1744362 INFO  (coreLoadExecutor-3083-thread-1-processing-n:127.0.0.1:59264_) [n:127.0.0.1:59264_ c:control_collection s:shard1 r:core_node1 x:collection1] o.a.s.c.SolrCore SolrDeletionPolicy.onInit: commits: num=1
   [junit4]   2> 	commit{dir=MockDirectoryWrapper(NRTCachingDirectory(RAMDirectory@51d0b85f lockFactory=org.apache.lucene.store.SingleInstanceLockFactory@5df88eef; maxCacheMB=0.009765625 maxMergeSizeMB=0.69140625)),segFN=segments_1,generation=1}
   [junit4]   2> 1744362 INFO  (coreLoadExecutor-3083-thread-1-processing-n:127.0.0.1:59264_) [n:127.0.0.1:59264_ c:control_collection s:shard1 r:core_node1 x:collection1] o.a.s.c.SolrCore newest commit generation = 1
   [junit4]   2> 1744363 INFO  (coreLoadExecutor-3083-thread-1-processing-n:127.0.0.1:59264_) [n:127.0.0.1:59264_ c:control_collection s:shard1 r:core_node1 x:collection1] o.a.s.s.SolrIndexSearcher Opening Searcher@7fa50626[collection1] main
   [junit4]   2> 1744363 INFO  (coreLoadExecutor-3083-thread-1-processing-n:127.0.0.1:59264_) [n:127.0.0.1:59264_ c:control_collection s:shard1 r:core_node1 x:collection1] o.a.s.c.c.ZkStateReader Load collection config from:/collections/control_collection
   [junit4]   2> 1744364 INFO  (coreLoadExecutor-3083-thread-1-processing-n:127.0.0.1:59264_) [n:127.0.0.1:59264_ c:control_collection s:shard1 r:core_node1 x:collection1] o.a.s.c.c.ZkStateReader path=/collections/control_collection configName=conf1 specified config exists in ZooKeeper
   [junit4]   2> 1744364 INFO  (coreLoadExecutor-3083-thread-1-processing-n:127.0.0.1:59264_) [n:127.0.0.1:59264_ c:control_collection s:shard1 r:core_node1 x:collection1] o.a.s.r.ManagedResourceStorage Setting up ZooKeeper-based storage for the RestManager with znodeBase: /configs/conf1
   [junit4]   2> 1744364 INFO  (coreLoadExecutor-3083-thread-1-processing-n:127.0.0.1:59264_) [n:127.0.0.1:59264_ c:control_collection s:shard1 r:core_node1 x:collection1] o.a.s.r.ManagedResourceStorage Configured ZooKeeperStorageIO with znodeBase: /configs/conf1
   [junit4]   2> 1744364 INFO  (coreLoadExecutor-3083-thread-1-processing-n:127.0.0.1:59264_) [n:127.0.0.1:59264_ c:control_collection s:shard1 r:core_node1 x:collection1] o.a.s.r.RestManager Initializing RestManager with initArgs: {}
   [junit4]   2> 1744364 INFO  (coreLoadExecutor-3083-thread-1-processing-n:127.0.0.1:59264_) [n:127.0.0.1:59264_ c:control_collection s:shard1 r:core_node1 x:collection1] o.a.s.r.ManagedResourceStorage Reading _rest_managed.json using ZooKeeperStorageIO:path=/configs/conf1
   [junit4]   2> 1744365 INFO  (coreLoadExecutor-3083-thread-1-processing-n:127.0.0.1:59264_) [n:127.0.0.1:59264_ c:control_collection s:shard1 r:core_node1 x:collection1] o.a.s.r.ManagedResourceStorage No data found for znode /configs/conf1/_rest_managed.json
   [junit4]   2> 1744365 INFO  (coreLoadExecutor-3083-thread-1-processing-n:127.0.0.1:59264_) [n:127.0.0.1:59264_ c:control_collection s:shard1 r:core_node1 x:collection1] o.a.s.r.ManagedResourceStorage Loaded null at path _rest_managed.json using ZooKeeperStorageIO:path=/configs/conf1
   [junit4]   2> 1744365 INFO  (coreLoadExecutor-3083-thread-1-processing-n:127.0.0.1:59264_) [n:127.0.0.1:59264_ c:control_collection s:shard1 r:core_node1 x:collection1] o.a.s.r.RestManager Initializing 0 registered ManagedResources
   [junit4]   2> 1744365 INFO  (coreLoadExecutor-3083-thread-1-processing-n:127.0.0.1:59264_) [n:127.0.0.1:59264_ c:control_collection s:shard1 r:core_node1 x:collection1] o.a.s.h.ReplicationHandler Commits will be reserved for  10000
   [junit4]   2> 1744366 INFO  (searcherExecutor-3084-thread-1-processing-r:core_node1 x:collection1 n:127.0.0.1:59264_ s:shard1 c:control_collection) [n:127.0.0.1:59264_ c:control_collection s:shard1 r:core_node1 x:collection1] o.a.s.c.SolrCore [collection1] Registered new searcher Searcher@7fa50626[collection1] main{ExitableDirectoryReader(UninvertingDirectoryReader())}
   [junit4]   2> 1744366 INFO  (coreLoadExecutor-3083-thread-1-processing-n:127.0.0.1:59264_) [n:127.0.0.1:59264_ c:control_collection s:shard1 r:core_node1 x:collection1] o.a.s.u.UpdateLog Looking up max value of version field to seed version buckets
   [junit4]   2> 1744366 INFO  (coreLoadExecutor-3083-thread-1-processing-n:127.0.0.1:59264_) [n:127.0.0.1:59264_ c:control_collection s:shard1 r:core_node1 x:collection1] o.a.s.u.VersionInfo Refreshing highest value of _version_ for 65536 version buckets from index
   [junit4]   2> 1744366 INFO  (coreLoadExecutor-3083-thread-1-processing-n:127.0.0.1:59264_) [n:127.0.0.1:59264_ c:control_collection s:shard1 r:core_node1 x:collection1] o.a.s.u.VersionInfo No terms found for _version_, cannot seed version bucket highest value from index
   [junit4]   2> 1744366 INFO  (coreLoadExecutor-3083-thread-1-processing-n:127.0.0.1:59264_) [n:127.0.0.1:59264_ c:control_collection s:shard1 r:core_node1 x:collection1] o.a.s.u.UpdateLog Could not find max version in index or recent updates, using new clock 1506439598605074432
   [junit4]   2> 1744369 INFO  (coreLoadExecutor-3083-thread-1-processing-n:127.0.0.1:59264_) [n:127.0.0.1:59264_ c:control_collection s:shard1 r:core_node1 x:collection1] o.a.s.u.UpdateLog Took 3 ms to seed version buckets with highest version 1506439598605074432
   [junit4]   2> 1744369 INFO  (coreLoadExecutor-3083-thread-1-processing-n:127.0.0.1:59264_) [n:127.0.0.1:59264_ c:control_collection s:shard1 r:core_node1 x:collection1] o.a.s.c.ZkController watch zkdir /configs/conf1
   [junit4]   2> 1744369 INFO  (coreLoadExecutor-3083-thread-1-processing-n:127.0.0.1:59264_) [n:127.0.0.1:59264_ c:control_collection s:shard1 r:core_node1 x:collection1] o.a.s.c.CoreContainer registering core: collection1
   [junit4]   2> 1744370 INFO  (coreZkRegister-3077-thread-1-processing-r:core_node1 x:collection1 n:127.0.0.1:59264_ s:shard1 c:control_collection) [n:127.0.0.1:59264_ c:control_collection s:shard1 r:core_node1 x:collection1] o.a.s.c.ZkController Register replica - core:collection1 address:http://127.0.0.1:59264 collection:control_collection shard:shard1
   [junit4]   2> 1744371 INFO  (coreZkRegister-3077-thread-1-processing-r:core_node1 x:collection1 n:127.0.0.1:59264_ s:shard1 c:control_collection) [n:127.0.0.1:59264_ c:control_collection s:shard1 r:core_node1 x:collection1] o.a.s.c.c.SolrZkClient makePath: /collections/control_collection/leader_elect/shard1/election
   [junit4]   2> 1744374 INFO  (coreZkRegister-3077-thread-1-processing-r:core_node1 x:collection1 n:127.0.0.1:59264_ s:shard1 c:control_collection) [n:127.0.0.1:59264_ c:control_collection s:shard1 r:core_node1 x:collection1] o.a.s.c.LeaderElector Joined leadership election with path: /collections/control_collection/leader_elect/shard1/election/94152474781614083-core_node1-n_0000000000
   [junit4]   2> 1744375 INFO  (coreZkRegister-3077-thread-1-processing-r:core_node1 x:collection1 n:127.0.0.1:59264_ s:shard1 c:control_collection) [n:127.0.0.1:59264_ c:control_collection s:shard1 r:core_node1 x:collection1] o.a.s.c.ShardLeaderElectionContext Running the leader process for shard shard1
   [junit4]   2> 1744377 INFO  (zkCallback-823-thread-1-processing-n:127.0.0.1:59264_) [n:127.0.0.1:59264_    ] o.a.s.c.DistributedQueue NodeChildrenChanged fired on path /overseer/queue state SyncConnected
   [junit4]   2> 1744377 INFO  (coreZkRegister-3077-thread-1-processing-r:core_node1 x:collection1 n:127.0.0.1:59264_ s:shard1 c:control_collection) [n:127.0.0.1:59264_ c:control_collection s:shard1 r:core_node1 x:collection1] o.a.s.c.ShardLeaderElectionContext Enough replicas found to continue.
   [junit4]   2> 1744377 INFO  (coreZkRegister-3077-thread-1-processing-r:core_node1 x:collection1 n:127.0.0.1:59264_ s:shard1 c:control_collection) [n:127.0.0.1:59264_ c:control_collection s:shard1 r:core_node1 x:collection1] o.a.s.c.ShardLeaderElectionContext I may be the new leader - try and sync
   [junit4]   2> 1744377 INFO  (coreZkRegister-3077-thread-1-processing-r:core_node1 x:collection1 n:127.0.0.1:59264_ s:shard1 c:control_collection) [n:127.0.0.1:59264_ c:control_collection s:shard1 r:core_node1 x:collection1] o.a.s.c.SyncStrategy Sync replicas to http://127.0.0.1:59264/collection1/
   [junit4]   2> 1744377 INFO  (coreZkRegister-3077-thread-1-processing-r:core_node1 x:collection1 n:127.0.0.1:59264_ s:shard1 c:control_collection) [n:127.0.0.1:59264_ c:control_collection s:shard1 r:core_node1 x:collection1] o.a.s.c.SyncStrategy Sync Success - now sync replicas to me
   [junit4]   2> 1744377 INFO  (coreZkRegister-3077-thread-1-processing-r:core_node1 x:collection1 n:127.0.0.1:59264_ s:shard1 c:control_collection) [n:127.0.0.1:59264_ c:control_collection s:shard1 r:core_node1 x:collection1] o.a.s.c.SyncStrategy http://127.0.0.1:59264/collection1/ has no replicas
   [junit4]   2> 1744378 INFO  (OverseerStateUpdate-94152474781614083-127.0.0.1:59264_-n_0000000000) [n:127.0.0.1:59264_    ] o.a.s.c.Overseer processMessage: queueSize: 1, message = {
   [junit4]   2>   "operation":"leader",
   [junit4]   2>   "shard":"shard1",
   [junit4]   2>   "collection":"control_collection"} current state version: 1
   [junit4]   2> 1744378 INFO  (coreZkRegister-3077-thread-1-processing-r:core_node1 x:collection1 n:127.0.0.1:59264_ s:shard1 c:control_collection) [n:127.0.0.1:59264_ c:control_collection s:shard1 r:core_node1 x:collection1] o.a.s.c.ShardLeaderElectionContext I am the new leader: http://127.0.0.1:59264/collection1/ shard1
   [junit4]   2> 1744378 INFO  (coreZkRegister-3077-thread-1-processing-r:core_node1 x:collection1 n:127.0.0.1:59264_ s:shard1 c:control_collection) [n:127.0.0.1:59264_ c:control_collection s:shard1 r:core_node1 x:collection1] o.a.s.c.c.SolrZkClient makePath: /collections/control_collection/leaders/shard1
   [junit4]   2> 1744382 INFO  (zkCallback-823-thread-1-processing-n:127.0.0.1:59264_) [n:127.0.0.1:59264_    ] o.a.s.c.DistributedQueue NodeChildrenChanged fired on path /overseer/queue state SyncConnected
   [junit4]   2> 1744382 INFO  (OverseerStateUpdate-94152474781614083-127.0.0.1:59264_-n_0000000000) [n:127.0.0.1:59264_    ] o.a.s.c.Overseer processMessage: queueSize: 1, message = {
   [junit4]   2>   "operation":"leader",
   [junit4]   2>   "shard":"shard1",
   [junit4]   2>   "collection":"control_collection",
   [junit4]   2>   "base_url":"http://127.0.0.1:59264",
   [junit4]   2>   "core":"collection1",
   [junit4]   2>   "state":"active"} current state version: 1
   [junit4]   2> 1744395 INFO  (TEST-CollectionsAPIDistributedZkTest.test-seed#[A0846DB02E8884FF]) [    ] o.a.s.c.c.SolrZkClient Using default ZkCredentialsProvider
   [junit4]   2> 1744396 INFO  (TEST-CollectionsAPIDistributedZkTest.test-seed#[A0846DB02E8884FF]) [    ] o.a.s.c.c.ConnectionManager Waiting for client to connect to ZooKeeper
   [junit4]   2> 1744400 INFO  (zkCallback-825-thread-1) [    ] o.a.s.c.c.ConnectionManager Watcher org.apache.solr.common.cloud.ConnectionManager@5a5127f9 name:ZooKeeperConnection Watcher:127.0.0.1:37101/solr got event WatchedEvent state:SyncConnected type:None path:null path:null type:None
   [junit4]   2> 1744401 INFO  (TEST-CollectionsAPIDistributedZkTest.test-seed#[A0846DB02E8884FF]) [    ] o.a.s.c.c.ConnectionManager Client is connected to ZooKeeper
   [junit4]   2> 1744401 INFO  (TEST-CollectionsAPIDistributedZkTest.test-seed#[A0846DB02E8884FF]) [    ] o.a.s.c.c.SolrZkClient Using default ZkACLProvider
   [junit4]   2> 1744401 INFO  (TEST-CollectionsAPIDistributedZkTest.test-seed#[A0846DB02E8884FF]) [    ] o.a.s.c.c.ZkStateReader Updating cluster state from ZooKeeper... 
   [junit4]   2> 1744405 INFO  (TEST-CollectionsAPIDistributedZkTest.test-seed#[A0846DB02E8884FF]) [    ] o.a.s.c.ChaosMonkey monkey: init - expire sessions:false cause connection loss:false
   [junit4]   2> 1744405 INFO  (TEST-CollectionsAPIDistributedZkTest.test-seed#[A0846DB02E8884FF]) [    ] o.a.s.c.AbstractFullDistribZkTestBase Creating collection1 with stateFormat=2
   [junit4]   2> 1744405 INFO  (TEST-CollectionsAPIDistributedZkTest.test-seed#[A0846DB02E8884FF]) [    ] o.a.s.c.c.SolrZkClient Using default ZkCredentialsProvider
   [junit4]   2> 1744416 INFO  (TEST-CollectionsAPIDistributedZkTest.test-seed#[A0846DB02E8884FF]) [    ] o.a.s.c.c.ConnectionManager Waiting for client to connect to ZooKeeper
   [junit4]   2> 1744418 INFO  (zkCallback-826-thread-1) [    ] o.a.s.c.c.ConnectionManager Watcher org.apache.solr.common.cloud.ConnectionManager@5276c84b name:ZooKeeperConnection Watcher:127.0.0.1:37101/solr got event WatchedEvent state:SyncConnected type:None path:null path:null type:None
   [junit4]   2> 1744418 INFO  (TEST-CollectionsAPIDistributedZkTest.test-seed#[A0846DB02E8884FF]) [    ] o.a.s.c.c.ConnectionManager Client is connected to ZooKeeper
   [junit4]   2> 1744419 INFO  (TEST-CollectionsAPIDistributedZkTest.test-seed#[A0846DB02E8884FF]) [    ] o.a.s.c.c.SolrZkClient Using default ZkACLProvider
   [junit4]   2> 1744421 INFO  (zkCallback-823-thread-1-processing-n:127.0.0.1:59264_) [n:127.0.0.1:59264_    ] o.a.s.c.DistributedQueue NodeChildrenChanged fired on path /overseer/queue state SyncConnected
   [junit4]   2> 1744421 INFO  (OverseerStateUpdate-94152474781614083-127.0.0.1:59264_-n_0000000000) [n:127.0.0.1:59264_    ] o.a.s.c.Overseer processMessage: queueSize: 1, message = {
   [junit4]   2>   "operation":"create",
   [junit4]   2>   "name":"collection1",
   [junit4]   2>   "numShards":"2",
   [junit4]   2>   "stateFormat":"2"} current state version: 1
   [junit4]   2> 1744422 INFO  (OverseerStateUpdate-94152474781614083-127.0.0.1:59264_-n_0000000000) [n:127.0.0.1:59264_    ] o.a.s.c.o.ClusterStateMutator building a new cName: collection1
   [junit4]   2> 1744423 INFO  (zkCallback-825-thread-1) [    ] o.a.s.c.c.ZkStateReader A cluster state change: WatchedEvent state:SyncConnected type:NodeDataChanged path:/clusterstate.json, has occurred - updating... (live nodes size: 1)
   [junit4]   2> 1744423 INFO  (zkCallback-823-thread-1-processing-n:127.0.0.1:59264_) [n:127.0.0.1:59264_    ] o.a.s.c.c.ZkStateReader A cluster state change: WatchedEvent state:SyncConnected type:NodeDataChanged path:/clusterstate.json, has occurred - updating... (live nodes size: 1)
   [junit4]   2> 1744426 INFO  (zkCallback-825-thread-1) [    ] o.a.s.c.c.ZkStateReader Updated cluster state version to 2
   [junit4]   2> 1744426 INFO  (zkCallback-823-thread-1-processing-n:127.0.0.1:59264_) [n:127.0.0.1:59264_    ] o.a.s.c.c.ZkStateReader Updated cluster state version to 2
   [junit4]   2> 1744432 INFO  (coreZkRegister-3077-thread-1-processing-r:core_node1 x:collection1 n:127.0.0.1:59264_ s:shard1 c:control_collection) [n:127.0.0.1:59264_ c:control_collection s:shard1 r:core_node1 x:collection1] o.a.s.c.ZkController We are http://127.0.0.1:59264/collection1/ and leader is http://127.0.0.1:59264/collection1/
   [junit4]   2> 1744433 INFO  (coreZkRegister-3077-thread-1-processing-r:core_node1 x:collection1 n:127.0.0.1:59264_ s:shard1 c:control_collection) [n:127.0.0.1:59264_ c:control_collection s:shard1 r:core_node1 x:collection1] o.a.s.c.ZkController No LogReplay needed for core=collection1 baseURL=http://127.0.0.1:59264
   [junit4]   2> 1744433 INFO  (coreZkRegister-3077-thread-1-processing-r:core_node1 x:collection1 n:127.0.0.1:59264_ s:shard1 c:control_collection) [n:127.0.0.1:59264_ c:control_collection s:shard1 r:core_node1 x:collection1] o.a.s.c.ZkController I am the leader, no recovery necessary
   [junit4]   2> 1744433 INFO  (coreZkRegister-3077-thread-1-processing-r:core_node1 x:collection1 n:127.0.0.1:59264_ s:shard1 c:control_collection) [n:127.0.0.1:59264_ c:control_collection s:shard1 r:core_node1 x:collection1] o.a.s.c.ZkController publishing state=active
   [junit4]   2> 1744433 INFO  (coreZkRegister-3077-thread-1-processing-r:core_node1 x:collection1 n:127.0.0.1:59264_ s:shard1 c:control_collection) [n:127.0.0.1:59264_ c:control_collection s:shard1 r:core_node1 x:collection1] o.a.s.c.ZkController numShards not found on descriptor - reading it from system property
   [junit4]   2> 1744434 INFO  (zkCallback-823-thread-1-processing-n:127.0.0.1:59264_) [n:127.0.0.1:59264_    ] o.a.s.c.DistributedQueue NodeChildrenChanged fired on path /overseer/queue state SyncConnected
   [junit4]   2> 1744435 INFO  (OverseerStateUpdate-94152474781614083-127.0.0.1:59264_-n_0000000000) [n:127.0.0.1:59264_    ] o.a.s.c.Overseer processMessage: queueSize: 1, message = {
   [junit4]   2>   "numShards":"2",
   [junit4]   2>   "operation":"state",
   [junit4]   2>   "base_url":"http://127.0.0.1:59264",
   [junit4]   2>   "state":"active",
   [junit4]   2>   "core":"collection1",
   [junit4]   2>   "node_name":"127.0.0.1:59264_",
   [junit4]   2>   "roles":null,
   [junit4]   2>   "shard":"shard1",
   [junit4]   2>   "collection":"control_collection",
   [junit4]   2>   "core_node_name":"core_node1"} current state version: 2
   [junit4]   2> 1744436 INFO  (OverseerStateUpdate-94152474781614083-127.0.0.1:59264_-n_0000000000) [n:127.0.0.1:59264_    ] o.a.s.c.o.ReplicaMutator Update state numShards=2 message={
   [junit4]   2>   "numShards":"2",
   [junit4]   2>   "operation":"state",
   [junit4]   2>   "base_url":"http://127.0.0.1:59264",
   [junit4]   2>   "state":"active",
   [junit4]   2>   "core":"collection1",
   [junit4]   2>   "node_name":"127.0.0.1:59264_",
   [junit4]   2>   "roles":null,
   [junit4]   2>   "shard":"shard1",
   [junit4]   2>   "collection":"control_collection",
   [junit4]   2>   "core_node_name":"core_node1"}
   [junit4]   2> 1744436 INFO  (OverseerStateUpdate-94152474781614083-127.0.0.1:59264_-n_0000000000) [n:127.0.0.1:59264_    ] o.a.s.c.o.ZkStateWriter going to create_collection /collections/collection1/state.json
   [junit4]   2> 1744437 INFO  (zkCallback-823-thread-1-processing-n:127.0.0.1:59264_) [n:127.0.0.1:59264_    ] o.a.s.c.c.ZkStateReader A cluster state change: WatchedEvent state:SyncConnected type:NodeDataChanged path:/clusterstate.json, has occurred - updating... (live nodes size: 1)
   [junit4]   2> 1744437 INFO  (zkCallback-825-thread-1) [    ] o.a.s.c.c.ZkStateReader A cluster state change: WatchedEvent state:SyncConnected type:NodeDataChanged path:/clusterstate.json, has occurred - updating... (live nodes size: 1)
   [junit4]   2> 1744439 INFO  (zkCallback-825-thread-1) [    ] o.a.s.c.c.ZkStateReader Updated cluster state version to 3
   [junit4]   2> 1744440 INFO  (zkCallback-823-thread-1-processing-n:127.0.0.1:59264_) [n:127.0.0.1:59264_    ] o.a.s.c.c.ZkStateReader Updated cluster state version to 3
   [junit4]   2> 1744541 INFO  (zkCallback-823-thread-1-processing-n:127.0.0.1:59264_) [n:127.0.0.1:59264_    ] o.a.s.c.c.ZkStateReader A cluster state change: WatchedEvent state:SyncConnected type:NodeDataChanged path:/clusterstate.json, has occurred - updating... (live nodes size: 1)
   [junit4]   2> 1744542 INFO  (zkCallback-825-thread-1) [    ] o.a.s.c.c.ZkStateReader A cluster state change: WatchedEvent state:SyncConnected type:NodeDataChanged path:/clusterstate.json, has occurred - updating... (live nodes size: 1)
   [junit4]   2> 1744548 INFO  (zkCallback-825-thread-1) [    ] o.a.s.c.c.ZkStateReader Updated cluster state version to 4
   [junit4]   2> 1744548 INFO  (zkCallback-823-thread-1-processing-n:127.0.0.1:59264_) [n:127.0.0.1:59264_    ] o.a.s.c.c.ZkStateReader Updated cluster state version to 4
   [junit4]   2> 1744713 INFO  (TEST-CollectionsAPIDistributedZkTest.test-seed#[A0846DB02E8884FF]) [    ] o.a.s.SolrTestCaseJ4 Writing core.properties file to /x1/jenkins/jenkins-slave/workspace/Lucene-Solr-NightlyTests-5.x/solr/build/solr-core/test/J0/temp/solr.cloud.CollectionsAPIDistributedZkTest_A0846DB02E8884FF-001/shard-1-001/cores/collection1
   [junit4]   2> 1744714 INFO  (TEST-CollectionsAPIDistributedZkTest.test-seed#[A0846DB02E8884FF]) [    ] o.a.s.c.AbstractFullDistribZkTestBase create jetty 1 in directory /x1/jenkins/jenkins-slave/workspace/Lucene-Solr-NightlyTests-5.x/solr/build/solr-core/test/J0/temp/solr.cloud.CollectionsAPIDistributedZkTest_A0846DB02E8884FF-001/shard-1-001
   [junit4]   2> 1744715 INFO  (TEST-CollectionsAPIDistributedZkTest.test-seed#[A0846DB02E8884FF]) [    ] o.e.j.s.Server jetty-9.2.11.v20150529
   [junit4]   2> 1744717 INFO  (TEST-CollectionsAPIDistributedZkTest.test-seed#[A0846DB02E8884FF]) [    ] o.e.j.s.h.ContextHandler Started o.e.j.s.ServletContextHandler@51aafb9a{/,null,AVAILABLE}
   [junit4]   2> 1744718 INFO  (TEST-CollectionsAPIDistributedZkTest.test-seed#[A0846DB02E8884FF]) [    ] o.e.j.s.ServerConnector Started ServerConnector@1c71cee5{HTTP/1.1}{127.0.0.1:33400}
   [junit4]   2> 1744718 INFO  (TEST-CollectionsAPIDistributedZkTest.test-seed#[A0846DB02E8884FF]) [    ] o.e.j.s.Server Started @1747665ms
   [junit4]   2> 1744718 INFO  (TEST-CollectionsAPIDistributedZkTest.test-seed#[A0846DB02E8884FF]) [    ] o.a.s.c.s.e.JettySolrRunner Jetty properties: {solrconfig=solrconfig.xml, hostContext=/, solr.data.dir=/x1/jenkins/jenkins-slave/workspace/Lucene-Solr-NightlyTests-5.x/solr/build/solr-core/test/J0/temp/solr.cloud.CollectionsAPIDistributedZkTest_A0846DB02E8884FF-001/tempDir-001/jetty1, hostPort=33400, coreRootDirectory=/x1/jenkins/jenkins-slave/workspace/Lucene-Solr-NightlyTests-5.x/solr/build/solr-core/test/J0/../../../../../../../../../../x1/jenkins/jenkins-slave/workspace/Lucene-Solr-NightlyTests-5.x/solr/build/solr-core/test/J0/temp/solr.cloud.CollectionsAPIDistributedZkTest_A0846DB02E8884FF-001/shard-1-001/cores}
   [junit4]   2> 1744719 INFO  (TEST-CollectionsAPIDistributedZkTest.test-seed#[A0846DB02E8884FF]) [    ] o.a.s.s.SolrDispatchFilter SolrDispatchFilter.init(): sun.misc.Launcher$AppClassLoader@1fe91485
   [junit4]   2> 1744719 INFO  (TEST-CollectionsAPIDistributedZkTest.test-seed#[A0846DB02E8884FF]) [    ] o.a.s.c.SolrResourceLoader new SolrResourceLoader for directory: '/x1/jenkins/jenkins-slave/workspace/Lucene-Solr-NightlyTests-5.x/solr/build/solr-core/test/J0/../../../../../../../../../../x1/jenkins/jenkins-slave/workspace/Lucene-Solr-NightlyTests-5.x/solr/build/solr-core/test/J0/temp/solr.cloud.CollectionsAPIDistributedZkTest_A0846DB02E8884FF-001/shard-1-001/'
   [junit4]   2> 1744735 INFO  (TEST-CollectionsAPIDistributedZkTest.test-seed#[A0846DB02E8884FF]) [    ] o.a.s.c.SolrXmlConfig Loading container configuration from /x1/jenkins/jenkins-slave/workspace/Lucene-Solr-NightlyTests-5.x/solr/build/solr-core/test/J0/../../../../../../../../../../x1/jenkins/jenkins-slave/workspace/Lucene-Solr-NightlyTests-5.x/solr/build/solr-core/test/J0/temp/solr.cloud.CollectionsAPIDistributedZkTest_A0846DB02E8884FF-001/shard-1-001/solr.xml
   [junit4]   2> 1744749 INFO  (TEST-CollectionsAPIDistributedZkTest.test-seed#[A0846DB02E8884FF]) [    ] o.a.s.c.CoresLocator Config-defined core root directory: /x1/jenkins/jenkins-slave/workspace/Lucene-Solr-NightlyTests-5.x/solr/build/solr-core/test/J0/../../../../../../../../../../x1/jenkins/jenkins-slave/workspace/Lucene-Solr-NightlyTests-5.x/solr/build/solr-core/test/J0/temp/solr.cloud.CollectionsAPIDistributedZkTest_A0846DB02E8884FF-001/shard-1-001/cores
   [junit4]   2> 1744749 INFO  (TEST-CollectionsAPIDistributedZkTest.test-seed#[A0846DB02E8884FF]) [    ] o.a.s.c.CoreContainer New CoreContainer 108371770
   [junit4]   2> 1744749 INFO  (TEST-CollectionsAPIDistributedZkTest.test-seed#[A0846DB02E8884FF]) [    ] o.a.s.c.CoreContainer Loading cores into CoreContainer [instanceDir=/x1/jenkins/jenkins-slave/workspace/Lucene-Solr-NightlyTests-5.x/solr/build/solr-core/test/J0/../../../../../../../../../../x1/jenkins/jenkins-slave/workspace/Lucene-Solr-NightlyTests-5.x/solr/build/solr-core/test/J0/temp/solr.cloud.CollectionsAPIDistributedZkTest_A0846DB02E8884FF-001/shard-1-001/]
   [junit4]   2> 1744750 INFO  (TEST-CollectionsAPIDistributedZkTest.test-seed#[A0846DB02E8884FF]) [    ] o.a.s.c.CoreContainer loading shared library: /x1/jenkins/jenkins-slave/workspace/Lucene-Solr-NightlyTests-5.x/solr/build/solr-core/test/J0/../../../../../../../../../../x1/jenkins/jenkins-slave/workspace/Lucene-Solr-NightlyTests-5.x/solr/build/solr-core/test/J0/temp/solr.cloud.CollectionsAPIDistributedZkTest_A0846DB02E8884FF-001/shard-1-001/lib
   [junit4]   2> 1744750 WARN  (TEST-CollectionsAPIDistributedZkTest.test-seed#[A0846DB02E8884FF]) [    ] o.a.s.c.SolrResourceLoader Can't find (or read) directory to add to classloader: lib (resolved as: /x1/jenkins/jenkins-slave/workspace/Lucene-Solr-NightlyTests-5.x/solr/build/solr-core/test/J0/../../../../../../../../../../x1/jenkins/jenkins-slave/workspace/Lucene-Solr-NightlyTests-5.x/solr/build/solr-core/test/J0/temp/solr.cloud.CollectionsAPIDistributedZkTest_A0846DB02E8884FF-001/shard-1-001/lib).
   [junit4]   2> 1744757 INFO  (TEST-CollectionsAPIDistributedZkTest.test-seed#[A0846DB02E8884FF]) [    ] o.a.s.h.c.HttpShardHandlerFactory created with socketTimeout : 90000,urlScheme : ,connTimeout : 15000,maxConnectionsPerHost : 20,maxConnections : 10000,corePoolSize : 0,maximumPoolSize : 2147483647,maxThreadIdleTime : 5,sizeOfQueue : -1,fairnessPolicy : false,useRetries : false,
   [junit4]   2> 1744759 INFO  (TEST-CollectionsAPIDistributedZkTest.test-seed#[A0846DB02E8884FF]) [    ] o.a.s.u.UpdateShardHandler Creating UpdateShardHandler HTTP client with params: socketTimeout=340000&connTimeout=45000&retry=true
   [junit4]   2> 1744759 INFO  (TEST-CollectionsAPIDistributedZkTest.test-seed#[A0846DB02E8884FF]) [    ] o.a.s.l.LogWatcher SLF4J impl is org.slf4j.impl.Log4jLoggerFactory
   [junit4]   2> 1744759 INFO  (TEST-CollectionsAPIDistributedZkTest.test-seed#[A0846DB02E8884FF]) [    ] o.a.s.l.LogWatcher Registering Log Listener [Log4j (org.slf4j.impl.Log4jLoggerFactory)]
   [junit4]   2> 1744759 INFO  (TEST-CollectionsAPIDistributedZkTest.test-seed#[A0846DB02E8884FF]) [    ] o.a.s.c.ZkContainer Zookeeper client=127.0.0.1:37101/solr
   [junit4]   2> 1744760 INFO  (TEST-CollectionsAPIDistributedZkTest.test-seed#[A0846DB02E8884FF]) [    ] o.a.s.c.ZkController zkHost includes chroot
   [junit4]   2> 1744760 INFO  (TEST-CollectionsAPIDistributedZkTest.test-seed#[A0846DB02E8884FF]) [    ] o.a.s.c.c.SolrZkClient Using default ZkCredentialsProvider
   [junit4]   2> 1744760 INFO  (TEST-CollectionsAPIDistributedZkTest.test-seed#[A0846DB02E8884FF]) [    ] o.a.s.c.c.ConnectionManager Waiting for client to connect to ZooKeeper
   [junit4]   2> 1744762 INFO  (zkCallback-828-thread-1) [    ] o.a.s.c.c.ConnectionManager Watcher org.apache.solr.common.cloud.ConnectionManager@5a6c692d name:ZooKeeperConnection Watcher:127.0.0.1:37101 got event WatchedEvent state:SyncConnected type:None path:null path:null type:None
   [junit4]   2> 1744762 INFO  (TEST-CollectionsAPIDistributedZkTest.test-seed#[A0846DB02E8884FF]) [    ] o.a.s.c.c.ConnectionManager Client is connected to ZooKeeper
   [junit4]   2> 1744763 INFO  (TEST-CollectionsAPIDistributedZkTest.test-seed#[A0846DB02E8884FF]) [    ] o.a.s.c.c.SolrZkClient Using default ZkACLProvider
   [junit4]   2> 1744765 INFO  (TEST-CollectionsAPIDistributedZkTest.test-seed#[A0846DB02E8884FF]) [n:127.0.0.1:33400_    ] o.a.s.c.c.ConnectionManager Waiting for client to connect to ZooKeeper
   [junit4]   2> 1744766 INFO  (zkCallback-829-thread-1-processing-n:127.0.0.1:33400_) [n:127.0.0.1:33400_    ] o.a.s.c.c.ConnectionManager Watcher org.apache.solr.common.cloud.ConnectionManager@68875bbf name:ZooKeeperConnection Watcher:127.0.0.1:37101/solr got event WatchedEvent state:SyncConnected type:None path:null path:null type:None
   [junit4]   2> 1744766 INFO  (TEST-CollectionsAPIDistributedZkTest.test-seed#[A0846DB02E8884FF]) [n:127.0.0.1:33400_    ] o.a.s.c.c.ConnectionManager Client is connected to ZooKeeper
   [junit4]   2> 1744770 INFO  (TEST-CollectionsAPIDistributedZkTest.test-seed#[A0846DB02E8884FF]) [n:127.0.0.1:33400_    ] o.a.s.c.c.ZkStateReader Updating cluster state from ZooKeeper... 
   [junit4]   2> 1745775 INFO  (TEST-CollectionsAPIDistributedZkTest.test-seed#[A0846DB02E8884FF]) [n:127.0.0.1:33400_    ] o.a.s.c.ZkController Register node as live in ZooKeeper:/live_nodes/127.0.0.1:33400_
   [junit4]   2> 1745776 INFO  (TEST-CollectionsAPIDistributedZkTest.test-seed#[A0846DB02E8884FF]) [n:127.0.0.1:33400_    ] o.a.s.c.c.SolrZkClient makePath: /live_nodes/127.0.0.1:33400_
   [junit4]   2> 1745779 INFO  (TEST-CollectionsAPIDistributedZkTest.test-seed#[A0846DB02E8884FF]) [n:127.0.0.1:33400_    ] o.a.s.c.Overseer Overseer (id=null) closing
   [junit4]   2> 1745780 INFO  (TEST-CollectionsAPIDistributedZkTest.test-seed#[A0846DB02E8884FF]) [n:127.0.0.1:33400_    ] o.a.s.c.LeaderElector Joined leadership election with path: /overseer_elect/election/94152474781614087-127.0.0.1:33400_-n_0000000001
   [junit4]   2> 1745781 INFO  (TEST-CollectionsAPIDistributedZkTest.test-seed#[A0846DB02E8884FF]) [n:127.0.0.1:33400_    ] o.a.s.c.LeaderElector Watching path /overseer_elect/election/94152474781614083-127.0.0.1:59264_-n_0000000000 to know if I could be the leader
   [junit4]   2> 1745781 INFO  (TEST-CollectionsAPIDistributedZkTest.test-seed#[A0846DB02E8884FF]) [n:127.0.0.1:33400_    ] o.a.s.c.CoreContainer No authentication plugin used.
   [junit4]   2> 1745782 INFO  (TEST-CollectionsAPIDistributedZkTest.test-seed#[A0846DB02E8884FF]) [n:127.0.0.1:33400_    ] o.a.s.c.CoreContainer Security conf doesn't exist. Skipping setup for authorization module.
   [junit4]   2> 1745783 INFO  (TEST-CollectionsAPIDistributedZkTest.test-seed#[A0846DB02E8884FF]) [n:127.0.0.1:33400_    ] o.a.s.c.CoresLocator Looking for core definitions underneath /x1/jenkins/jenkins-slave/workspace/Lucene-Solr-NightlyTests-5.x/solr/build/solr-core/test/J0/../../../../../../../../../../x1/jenkins/jenkins-slave/workspace/Lucene-Solr-NightlyTests-5.x/solr/build/solr-core/test/J0/temp/solr.cloud.CollectionsAPIDistributedZkTest_A0846DB02E8884FF-001/shard-1-001/cores
   [junit4]   2> 1745784 INFO  (TEST-CollectionsAPIDistributedZkTest.test-seed#[A0846DB02E8884FF]) [n:127.0.0.1:33400_    ] o.a.s.c.SolrCore Created CoreDescriptor: {loadOnStartup=true, transient=false, dataDir=data/, schema=schema.xml, coreNodeName=, shard=, absoluteInstDir=/x1/jenkins/jenkins-slave/workspace/Lucene-Solr-NightlyTests-5.x/solr/build/solr-core/test/J0/../../../../../../../../../../x1/jenkins/jenkins-slave/workspace/Lucene-Solr-NightlyTests-5.x/solr/build/solr-core/test/J0/temp/solr.cloud.CollectionsAPIDistributedZkTest_A0846DB02E8884FF-001/shard-1-001/cores/collection1/, config=solrconfig.xml, collection=collection1, name=collection1, instanceDir=/x1/jenkins/jenkins-slave/workspace/Lucene-Solr-NightlyTests-5.x/solr/build/solr-core/test/J0/../../../../../../../../../../x1/jenkins/jenkins-slave/workspace/Lucene-Solr-NightlyTests-5.x/solr/build/solr-core/test/J0/temp/solr.cloud.CollectionsAPIDistributedZkTest_A0846DB02E8884FF-001/shard-1-001/cores/collection1}
   [junit4]   2> 1745784 INFO  (TEST-CollectionsAPIDistributedZkTest.test-seed#[A0846DB02E8884FF]) [n:127.0.0.1:33400_    ] o.a.s.c.CoresLocator Found core collection1 in /x1/jenkins/jenkins-slave/workspace/Lucene-Solr-NightlyTests-5.x/solr/build/solr-core/test/J0/../../../../../../../../../../x1/jenkins/jenkins-slave/workspace/Lucene-Solr-NightlyTests-5.x/solr/build/solr-core/test/J0/temp/solr.cloud.CollectionsAPIDistributedZkTest_A0846DB02E8884FF-001/shard-1-001/cores/collection1/
   [junit4]   2> 1745784 INFO  (TEST-CollectionsAPIDistributedZkTest.test-seed#[A0846DB02E8884FF]) [n:127.0.0.1:33400_    ] o.a.s.c.CoresLocator Found 1 core definitions
   [junit4]   2> 1745786 INFO  (coreLoadExecutor-3094-thread-1-processing-n:127.0.0.1:33400_) [n:127.0.0.1:33400_ c:collection1   x:collection1] o.a.s.c.ZkController publishing state=down
   [junit4]   2> 1745786 INFO  (coreLoadExecutor-3094-thread-1-processing-n:127.0.0.1:33400_) [n:127.0.0.1:33400_ c:collection1   x:collection1] o.a.s.c.ZkController numShards not found on descriptor - reading it from system property
   [junit4]   2> 1745788 INFO  (zkCallback-823-thread-1-processing-n:127.0.0.1:59264_) [n:127.0.0.1:59264_    ] o.a.s.c.DistributedQueue NodeChildrenChanged fired on path /overseer/queue state SyncConnected
   [junit4]   2> 1745788 INFO  (coreLoadExecutor-3094-thread-1-processing-n:127.0.0.1:33400_) [n:127.0.0.1:33400_ c:collection1   x:collection1] o.a.s.c.ZkController Registering watch for external collection collection1
   [junit4]   2> 1745788 INFO  (coreLoadExecutor-3094-thread-1-processing-n:127.0.0.1:33400_) [n:127.0.0.1:33400_ c:collection1   x:collection1] o.a.s.c.c.ZkStateReader addZkWatch collection1
   [junit4]   2> 1745788 INFO  (OverseerStateUpdate-94152474781614083-127.0.0.1:59264_-n_0000000000) [n:127.0.0.1:59264_    ] o.a.s.c.Overseer processMessage: queueSize: 1, message = {
   [junit4]   2>   "numShards":"2",
   [junit4]   2>   "operation":"state",
   [junit4]   2>   "base_url":"http://127.0.0.1:33400",
   [junit4]   2>   "state":"down",
   [junit4]   2>   "core":"collection1",
   [junit4]   2>   "node_name":"127.0.0.1:33400_",
   [junit4]   2>   "roles":null,
   [junit4]   2>   "shard":null,
   [junit4]   2>   "collection":"collection1"} current state version: 4
   [junit4]   2> 1745788 INFO  (coreLoadExecutor-3094-thread-1-processing-n:127.0.0.1:33400_) [n:127.0.0.1:33400_ c:collection1   x:collection1] o.a.s.c.c.ZkStateReader Updating collection state at /collections/collection1/state.json from ZooKeeper... 
   [junit4]   2> 1745789 INFO  (OverseerStateUpdate-94152474781614083-127.0.0.1:59264_-n_0000000000) [n:127.0.0.1:59264_    ] o.a.s.c.o.ReplicaMutator Update state numShards=2 message={
   [junit4]   2>   "numShards":"2",
   [junit4]   2>   "operation":"state",
   [junit4]   2>   "base_url":"http://127.0.0.1:33400",
   [junit4]   2>   "state":"down",
   [junit4]   2>   "core":"collection1",
   [junit4]   2>   "node_name":"127.0.0.1:33400_",
   [junit4]   2>   "roles":null,
   [junit4]   2>   "shard":null,
   [junit4]   2>   "collection":"collection1"}
   [junit4]   2> 1745789 INFO  (OverseerStateUpdate-94152474781614083-127.0.0.1:59264_-n_0000000000) [n:127.0.0.1:59264_    ] o.a.s.c.o.ReplicaMutator Collection already exists with numShards=2
   [junit4]   2> 1745789 INFO  (OverseerStateUpdate-94152474781614083-127.0.0.1:59264_-n_0000000000) [n:127.0.0.1:59264_    ] o.a.s.c.o.ReplicaMutator Assigning new node to shard shard=shard2
   [junit4]   2> 1745790 INFO  (coreLoadExecutor-3094-thread-1-processing-n:127.0.0.1:33400_) [n:127.0.0.1:33400_ c:collection1   x:collection1] o.a.s.c.c.ZkStateReader Updating data for collection1 to ver 0 
   [junit4]   2> 1745790 INFO  (coreLoadExecutor-3094-thread-1-processing-n:127.0.0.1:33400_) [n:127.0.0.1:33400_ c:collection1   x:collection1] o.a.s.c.ZkController look for our core node name
   [junit4]   2> 1745790 INFO  (TEST-CollectionsAPIDistributedZkTest.test-seed#[A0846DB02E8884FF]) [n:127.0.0.1:33400_    ] o.a.s.s.SolrDispatchFilter user.dir=/x1/jenkins/jenkins-slave/workspace/Lucene-Solr-NightlyTests-5.x/solr/build/solr-core/test/J0
   [junit4]   2> 1745790 INFO  (TEST-CollectionsAPIDistributedZkTest.test-seed#[A0846DB02E8884FF]) [n:127.0.0.1:33400_    ] o.a.s.s.SolrDispatchFilter SolrDispatchFilter.init() done
   [junit4]   2> 1745893 INFO  (OverseerStateUpdate-94152474781614083-127.0.0.1:59264_-n_0000000000) [n:127.0.0.1:59264_    ] o.a.s.c.o.ZkStateWriter going to update_collection /collections/collection1/state.json version: 0
   [junit4]   2> 1745894 INFO  (zkCallback-829-thread-1-processing-n:127.0.0.1:33400_) [n:127.0.0.1:33400_    ] o.a.s.c.c.ZkStateReader A cluster state change: WatchedEvent state:SyncConnected type:NodeDataChanged path:/collections/collection1/state.json for collection collection1 has occurred - updating... (live nodes size: 2)
   [junit4]   2> 1745895 INFO  (zkCallback-829-thread-1-processing-n:127.0.0.1:33400_) [n:127.0.0.1:33400_    ] o.a.s.c.c.ZkStateReader Updating data for collection1 to ver 1 
   [junit4]   2> 1746790 INFO  (coreLoadExecutor-3094-thread-1-processing-n:127.0.0.1:33400_) [n:127.0.0.1:33400_ c:collection1   x:collection1] o.a.s.c.ZkController waiting to find shard id in clusterstate for collection1
   [junit4]   2> 1746791 INFO  (coreLoadExecutor-3094-thread-1-processing-n:127.0.0.1:33400_) [n:127.0.0.1:33400_ c:collection1   x:collection1] o.a.s.c.ZkController Check for collection zkNode:collection1
   [junit4]   2> 1746791 INFO  (coreLoadExecutor-3094-thread-1-processing-n:127.0.0.1:33400_) [n:127.0.0.1:33400_ c:collection1   x:collection1] o.a.s.c.ZkController Collection zkNode exists
   [junit4]   2> 1746791 INFO  (coreLoadExecutor-3094-thread-1-processing-n:127.0.0.1:33400_) [n:127.0.0.1:33400_ c:collection1   x:collection1] o.a.s.c.c.ZkStateReader Load collection config from:/collections/collection1
   [junit4]   2> 1746792 INFO  (coreLoadExecutor-3094-thread-1-processing-n:127.0.0.1:33400_) [n:127.0.0.1:33400_ c:collection1   x:collection1] o.a.s.c.c.ZkStateReader path=/collections/collection1 configName=conf1 specified config exists in ZooKeeper
   [junit4]   2> 1746793 INFO  (coreLoadExecutor-3094-thread-1-processing-n:127.0.0.1:33400_) [n:127.0.0.1:33400_ c:collection1   x:collection1] o.a.s.c.SolrResourceLoader new SolrResourceLoader for directory: '/x1/jenkins/jenkins-slave/workspace/Lucene-Solr-NightlyTests-5.x/solr/build/solr-core/test/J0/../../../../../../../../../../x1/jenkins/jenkins-slave/workspace/Lucene-Solr-NightlyTests-5.x/solr/build/solr-core/test/J0/temp/solr.cloud.CollectionsAPIDistributedZkTest_A0846DB02E8884FF-001/shard-1-001/cores/collection1/'
   [junit4]   2> 1746808 INFO  (coreLoadExecutor-3094-thread-1-processing-n:127.0.0.1:33400_) [n:127.0.0.1:33400_ c:collection1   x:collection1] o.a.s.c.Config loaded config solrconfig.xml with version 0 
   [junit4]   2> 1746814 INFO  (coreLoadExecutor-3094-thread-1-processing-n:127.0.0.1:33400_) [n:127.0.0.1:33400_ c:collection1   x:collection1] o.a.s.c.SolrConfig current version of requestparams : -1
   [junit4]   2> 1746827 INFO  (coreLoadExecutor-3094-thread-1-processing-n:127.0.0.1:33400_) [n:127.0.0.1:33400_ c:collection1   x:collection1] o.a.s.c.SolrConfig Using Lucene MatchVersion: 5.3.0
   [junit4]   2> 1746869 INFO  (coreLoadExecutor-3094-thread-1-processing-n:127.0.0.1:33400_) [n:127.0.0.1:33400_ c:collection1   x:collection1] o.a.s.c.Config Loaded SolrConfig: solrconfig.xml
   [junit4]   2> 1746870 INFO  (coreLoadExecutor-3094-thread-1-processing-n:127.0.0.1:33400_) [n:127.0.0.1:33400_ c:collection1   x:collection1] o.a.s.s.IndexSchema Reading Solr Schema from /configs/conf1/schema.xml
   [junit4]   2> 1746876 INFO  (coreLoadExecutor-3094-thread-1-processing-n:127.0.0.1:33400_) [n:127.0.0.1:33400_ c:collection1   x:collection1] o.a.s.s.IndexSchema [collection1] Schema name=test
   [junit4]   2> 1747743 INFO  (coreLoadExecutor-3094-thread-1-processing-n:127.0.0.1:33400_) [n:127.0.0.1:33400_ c:collection1   x:collection1] o.a.s.s.OpenExchangeRatesOrgProvider Initialized with rates=open-exchange-rates.json, refreshInterval=1440.
   [junit4]   2> 1747751 INFO  (coreLoadExecutor-3094-thread-1-processing-n:127.0.0.1:33400_) [n:127.0.0.1:33400_ c:collection1   x:collection1] o.a.s.s.IndexSchema default search field in schema is text
   [junit4]   2> 1747753 INFO  (coreLoadExecutor-3094-thread-1-processing-n:127.0.0.1:33400_) [n:127.0.0.1:33400_ c:collection1   x:collection1] o.a.s.s.IndexSchema unique key field: id
   [junit4]   2> 1747762 INFO  (coreLoadExecutor-3094-thread-1-processing-n:127.0.0.1:33400_) [n:127.0.0.1:33400_ c:collection1   x:collection1] o.a.s.s.FileExchangeRateProvider Reloading exchange rates from file currency.xml
   [junit4]   2> 1747770 INFO  (coreLoadExecutor-3094-thread-1-processing-n:127.0.0.1:33400_) [n:127.0.0.1:33400_ c:collection1   x:collection1] o.a.s.s.FileExchangeRateProvider Reloading exchange rates from file currency.xml
   [junit4]   2> 1747773 INFO  (coreLoadExecutor-3094-thread-1-processing-n:127.0.0.1:33400_) [n:127.0.0.1:33400_ c:collection1   x:collection1] o.a.s.s.OpenExchangeRatesOrgProvider Reloading exchange rates from open-exchange-rates.json
   [junit4]   2> 1747773 WARN  (coreLoadExecutor-3094-thread-1-processing-n:127.0.0.1:33400_) [n:127.0.0.1:33400_ c:collection1   x:collection1] o.a.s.s.OpenExchangeRatesOrgProvider Unknown key IMPORTANT NOTE
   [junit4]   2> 1747773 WARN  (coreLoadExecutor-3094-thread-1-processing-n:127.0.0.1:33400_) [n:127.0.0.1:33400_ c:collection1   x:collection1] o.a.s.s.OpenExchangeRatesOrgProvider Expected key, got STRING
   [junit4]   2> 1747774 INFO  (coreLoadExecutor-3094-thread-1-processing-n:127.0.0.1:33400_) [n:127.0.0.1:33400_ c:collection1   x:collection1] o.a.s.s.OpenExchangeRatesOrgProvider Reloading exchange rates from open-exchange-rates.json
   [junit4]   2> 1747774 WARN  (coreLoadExecutor-3094-thread-1-processing-n:127.0.0.1:33400_) [n:127.0.0.1:33400_ c:collection1   x:collection1] o.a.s.s.OpenExchangeRatesOrgProvider Unknown key IMPORTANT NOTE
   [junit4]   2> 1747774 WARN  (coreLoadExecutor-3094-thread-1-processing-n:127.0.0.1:33400_) [n:127.0.0.1:33400_ c:collection1   x:collection1] o.a.s.s.OpenExchangeRatesOrgProvider Expected key, got STRING
   [junit4]   2> 1747774 INFO  (coreLoadExecutor-3094-thread-1-processing-n:127.0.0.1:33400_) [n:127.0.0.1:33400_ c:collection1   x:collection1] o.a.s.c.CoreContainer Creating SolrCore 'collection1' using configuration from collection collection1
   [junit4]   2> 1747775 INFO  (coreLoadExecutor-3094-thread-1-processing-n:127.0.0.1:33400_) [n:127.0.0.1:33400_ c:collection1 s:shard2 r:core_node1 x:collection1] o.a.s.c.SolrCore org.apache.solr.core.MockDirectoryFactory
   [junit4]   2> 1747775 INFO  (coreLoadExecutor-3094-thread-1-processing-n:127.0.0.1:33400_) [n:127.0.0.1:33400_ c:collection1 s:shard2 r:core_node1 x:collection1] o.a.s.c.SolrCore [[collection1] ] Opening new SolrCore at [/x1/jenkins/jenkins-slave/workspace/Lucene-Solr-NightlyTests-5.x/solr/build/solr-core/test/J0/../../../../../../../../../../x1/jenkins/jenkins-slave/workspace/Lucene-Solr-NightlyTests-5.x/solr/build/solr-core/test/J0/temp/solr.cloud.CollectionsAPIDistributedZkTest_A0846DB02E8884FF-001/shard-1-001/cores/collection1/], dataDir=[null]
   [junit4]   2> 1747775 INFO  (coreLoadExecutor-3094-thread-1-processing-n:127.0.0.1:33400_) [n:127.0.0.1:33400_ c:collection1 s:shard2 r:core_node1 x:collection1] o.a.s.c.JmxMonitoredMap JMX monitoring is enabled. Adding Solr mbeans to JMX Server: com.sun.jmx.mbeanserver.JmxMBeanServer@986fff7
   [junit4]   2> 1747776 INFO  (coreLoadExecutor-3094-thread-1-processing-n:127.0.0.1:33400_) [n:127.0.0.1:33400_ c:collection1 s:shard2 r:core_node1 x:collection1] o.a.s.c.CachingDirectoryFactory return new directory for /x1/jenkins/jenkins-slave/workspace/Lucene-Solr-NightlyTests-5.x/solr/build/solr-core/test/J0/../../../../../../../../../../x1/jenkins/jenkins-slave/workspace/Lucene-Solr-NightlyTests-5.x/solr/build/solr-core/test/J0/temp/solr.cloud.CollectionsAPIDistributedZkTest_A0846DB02E8884FF-001/shard-1-001/cores/collection1/data
   [junit4]   2> 1747776 INFO  (coreLoadExecutor-3094-thread-1-processing-n:127.0.0.1:33400_) [n:127.0.0.1:33400_ c:collection1 s:shard2 r:core_node1 x:collection1] o.a.s.c.SolrCore New index directory detected: old=null new=/x1/jenkins/jenkins-slave/workspace/Lucene-Solr-NightlyTests-5.x/solr/build/solr-core/test/J0/../../../../../../../../../../x1/jenkins/jenkins-slave/workspace/Lucene-Solr-NightlyTests-5.x/solr/build/solr-core/test/J0/temp/solr.cloud.CollectionsAPIDistributedZkTest_A0846DB02E8884FF-001/shard-1-001/cores/collection1/data/index/
   [junit4]   2> 1747776 WARN  (coreLoadExecutor-3094-thread-1-processing-n:127.0.0.1:33400_) [n:127.0.0.1:33400_ c:collection1 s:shard2 r:core_node1 x:collection1] o.a.s.c.SolrCore [collection1] Solr index directory '/x1/jenkins/jenkins-slave/workspace/Lucene-Solr

[...truncated too long message...]

lr.client.solrj.impl.HttpSolrClient$RemoteSolrException: Error from server at http://127.0.0.1:34293: collection already exists: awholynewstresscollection_collection4_4
   [junit4]    > 	at __randomizedtesting.SeedInfo.seed([A0846DB02E8884FF]:0)
   [junit4]    > 	at org.apache.solr.client.solrj.impl.HttpSolrClient.executeMethod(HttpSolrClient.java:560)
   [junit4]    > 	at org.apache.solr.client.solrj.impl.HttpSolrClient.request(HttpSolrClient.java:234)
   [junit4]    > 	at org.apache.solr.client.solrj.impl.HttpSolrClient.request(HttpSolrClient.java:226)
   [junit4]    > 	at org.apache.solr.client.solrj.impl.LBHttpSolrClient.doRequest(LBHttpSolrClient.java:376)
   [junit4]    > 	at org.apache.solr.client.solrj.impl.LBHttpSolrClient.request(LBHttpSolrClient.java:328)
   [junit4]    > 	at org.apache.solr.client.solrj.impl.CloudSolrClient.sendRequest(CloudSolrClient.java:1086)
   [junit4]    > 	at org.apache.solr.client.solrj.impl.CloudSolrClient.requestWithRetryOnStaleState(CloudSolrClient.java:856)
   [junit4]    > 	at org.apache.solr.client.solrj.impl.CloudSolrClient.request(CloudSolrClient.java:799)
   [junit4]    > 	at org.apache.solr.client.solrj.SolrClient.request(SolrClient.java:1220)
   [junit4]    > 	at org.apache.solr.cloud.AbstractFullDistribZkTestBase.createCollection(AbstractFullDistribZkTestBase.java:1572)
   [junit4]    > 	at org.apache.solr.cloud.AbstractFullDistribZkTestBase.createCollection(AbstractFullDistribZkTestBase.java:1593)
   [junit4]    > 	at org.apache.solr.cloud.CollectionsAPIDistributedZkTest$1CollectionThread.run(CollectionsAPIDistributedZkTest.java:887)Throwable #5: com.carrotsearch.randomizedtesting.UncaughtExceptionError: Captured an uncaught exception in thread: Thread[id=55152, name=collection3, state=RUNNABLE, group=TGRP-CollectionsAPIDistributedZkTest]
   [junit4]    > Caused by: org.apache.solr.client.solrj.impl.HttpSolrClient$RemoteSolrException: Error from server at http://127.0.0.1:34293: collection already exists: awholynewstresscollection_collection3_4
   [junit4]    > 	at __randomizedtesting.SeedInfo.seed([A0846DB02E8884FF]:0)
   [junit4]    > 	at org.apache.solr.client.solrj.impl.HttpSolrClient.executeMethod(HttpSolrClient.java:560)
   [junit4]    > 	at org.apache.solr.client.solrj.impl.HttpSolrClient.request(HttpSolrClient.java:234)
   [junit4]    > 	at org.apache.solr.client.solrj.impl.HttpSolrClient.request(HttpSolrClient.java:226)
   [junit4]    > 	at org.apache.solr.client.solrj.impl.LBHttpSolrClient.doRequest(LBHttpSolrClient.java:376)
   [junit4]    > 	at org.apache.solr.client.solrj.impl.LBHttpSolrClient.request(LBHttpSolrClient.java:328)
   [junit4]    > 	at org.apache.solr.client.solrj.impl.CloudSolrClient.sendRequest(CloudSolrClient.java:1086)
   [junit4]    > 	at org.apache.solr.client.solrj.impl.CloudSolrClient.requestWithRetryOnStaleState(CloudSolrClient.java:856)
   [junit4]    > 	at org.apache.solr.client.solrj.impl.CloudSolrClient.request(CloudSolrClient.java:799)
   [junit4]    > 	at org.apache.solr.client.solrj.SolrClient.request(SolrClient.java:1220)
   [junit4]    > 	at org.apache.solr.cloud.AbstractFullDistribZkTestBase.createCollection(AbstractFullDistribZkTestBase.java:1572)
   [junit4]    > 	at org.apache.solr.cloud.AbstractFullDistribZkTestBase.createCollection(AbstractFullDistribZkTestBase.java:1593)
   [junit4]    > 	at org.apache.solr.cloud.CollectionsAPIDistributedZkTest$1CollectionThread.run(CollectionsAPIDistributedZkTest.java:887)Throwable #6: com.carrotsearch.randomizedtesting.UncaughtExceptionError: Captured an uncaught exception in thread: Thread[id=55151, name=collection2, state=RUNNABLE, group=TGRP-CollectionsAPIDistributedZkTest]
   [junit4]    > Caused by: org.apache.solr.client.solrj.impl.HttpSolrClient$RemoteSolrException: Error from server at http://127.0.0.1:34293: Could not find collection : awholynewstresscollection_collection2_3
   [junit4]    > 	at __randomizedtesting.SeedInfo.seed([A0846DB02E8884FF]:0)
   [junit4]    > 	at org.apache.solr.client.solrj.impl.HttpSolrClient.executeMethod(HttpSolrClient.java:560)
   [junit4]    > 	at org.apache.solr.client.solrj.impl.HttpSolrClient.request(HttpSolrClient.java:234)
   [junit4]    > 	at org.apache.solr.client.solrj.impl.HttpSolrClient.request(HttpSolrClient.java:226)
   [junit4]    > 	at org.apache.solr.client.solrj.impl.LBHttpSolrClient.doRequest(LBHttpSolrClient.java:376)
   [junit4]    > 	at org.apache.solr.client.solrj.impl.LBHttpSolrClient.request(LBHttpSolrClient.java:328)
   [junit4]    > 	at org.apache.solr.client.solrj.impl.CloudSolrClient.sendRequest(CloudSolrClient.java:1086)
   [junit4]    > 	at org.apache.solr.client.solrj.impl.CloudSolrClient.requestWithRetryOnStaleState(CloudSolrClient.java:856)
   [junit4]    > 	at org.apache.solr.client.solrj.impl.CloudSolrClient.request(CloudSolrClient.java:799)
   [junit4]    > 	at org.apache.solr.client.solrj.SolrClient.request(SolrClient.java:1220)
   [junit4]    > 	at org.apache.solr.cloud.CollectionsAPIDistributedZkTest$1CollectionThread.run(CollectionsAPIDistributedZkTest.java:894)
   [junit4]   2> 2052930 INFO  (SUITE-CollectionsAPIDistributedZkTest-seed#[A0846DB02E8884FF]-worker) [n:127.0.0.1:33711_ c:addReplicaColl s:shard2 r:core_node2 x:addReplicaColl_shard2_replica2] o.a.s.SolrTestCaseJ4 ###deleteCore
   [junit4]   2> NOTE: test params are: codec=Asserting(Lucene53): {a_t=PostingsFormat(name=Direct), _version_=PostingsFormat(name=MockRandom), range_facet_i_dv=PostingsFormat(name=Direct), other_tl1=PostingsFormat(name=MockRandom), intDefault=PostingsFormat(name=MockRandom), range_facet_l_dv=PostingsFormat(name=LuceneFixedGap), multiDefault=PostingsFormat(name=Direct), a_i1=PostingsFormat(name=Direct), text=PostingsFormat(name=LuceneVarGapFixedInterval), id=PostingsFormat(name=LuceneFixedGap), range_facet_l=PostingsFormat(name=Direct), timestamp=PostingsFormat(name=Direct)}, docValues:{range_facet_i_dv=DocValuesFormat(name=Asserting), range_facet_l_dv=DocValuesFormat(name=Lucene50), timestamp=DocValuesFormat(name=Asserting)}, sim=RandomSimilarityProvider(queryNorm=true,coord=yes): {}, locale=sr, timezone=America/Buenos_Aires
   [junit4]   2> NOTE: Linux 3.13.0-52-generic amd64/Oracle Corporation 1.7.0_72 (64-bit)/cpus=4,threads=1,free=86466176,total=530055168
   [junit4]   2> NOTE: All tests run in this JVM: [TestMergePolicyConfig, TestConfigOverlay, CustomCollectionTest, SolrXmlInZkTest, LeaderElectionIntegrationTest, TestSolrQueryParserDefaultOperatorResource, PrimitiveFieldTypeTest, BasicZkTest, TestRangeQuery, AnalyticsQueryTest, DateFieldTest, TestSweetSpotSimilarityFactory, BufferStoreTest, SolrRequestParserTest, PingRequestHandlerTest, EnumFieldTest, TestPhraseSuggestions, TestBadConfig, MultiTermTest, DistributedExpandComponentTest, TestSimpleTrackingShardHandler, IndexSchemaTest, DateMathParserTest, TestInfoStreamLogging, CSVRequestHandlerTest, TestConfig, SharedFSAutoReplicaFailoverUtilsTest, TestSchemaNameResource, SignatureUpdateProcessorFactoryTest, TestManagedSchemaFieldTypeResource, TestSolrConfigHandlerConcurrent, TestLazyCores, DistributedFacetPivotWhiteBoxTest, TestBulkSchemaConcurrent, TestQuerySenderListener, ChaosMonkeyNothingIsSafeTest, TestTrieFacet, SimplePostToolTest, TestSolrDeletionPolicy1, SaslZkACLProviderTest, TestRandomDVFaceting, DistributedFacetPivotSmallAdvancedTest, CurrencyFieldXmlFileTest, TestAuthorizationFramework, TestSolr4Spatial2, TestRestoreCore, ParsingFieldUpdateProcessorsTest, QueryElevationComponentTest, BlockDirectoryTest, DebugComponentTest, TestCloudManagedSchema, RuleEngineTest, ResponseHeaderTest, TestSolrConfigHandler, TestShortCircuitedRequests, OverseerStatusTest, TestComplexPhraseQParserPlugin, TestSolr4Spatial, TestFieldResource, TestWordDelimiterFilterFactory, CleanupOldIndexTest, HighlighterConfigTest, TestStressLucene, TestRandomRequestDistribution, TestFunctionQuery, RemoteQueryErrorTest, TestCSVLoader, DistributedQueryComponentOptimizationTest, TestIBSimilarityFactory, TestRealTimeGet, TestDistributedSearch, TestSchemaVersionResource, TestSolrIndexConfig, TestIndexingPerformance, AliasIntegrationTest, TestNRTOpen, TestCodecSupport, TestJoin, OutOfBoxZkACLAndCredentialsProvidersTest, DistributedSuggestComponentTest, StandardRequestHandlerTest, IndexBasedSpellCheckerTest, CollectionsAPIDistributedZkTest]
   [junit4] Completed [270/508] on J0 in 311.37s, 1 test, 1 error <<< FAILURES!

[...truncated 744 lines...]
BUILD FAILED
/x1/jenkins/jenkins-slave/workspace/Lucene-Solr-NightlyTests-5.x/build.xml:543: The following error occurred while executing this line:
/x1/jenkins/jenkins-slave/workspace/Lucene-Solr-NightlyTests-5.x/build.xml:484: The following error occurred while executing this line:
/x1/jenkins/jenkins-slave/workspace/Lucene-Solr-NightlyTests-5.x/build.xml:61: The following error occurred while executing this line:
/x1/jenkins/jenkins-slave/workspace/Lucene-Solr-NightlyTests-5.x/extra-targets.xml:39: The following error occurred while executing this line:
/x1/jenkins/jenkins-slave/workspace/Lucene-Solr-NightlyTests-5.x/solr/build.xml:230: The following error occurred while executing this line:
/x1/jenkins/jenkins-slave/workspace/Lucene-Solr-NightlyTests-5.x/solr/common-build.xml:512: The following error occurred while executing this line:
/x1/jenkins/jenkins-slave/workspace/Lucene-Solr-NightlyTests-5.x/lucene/common-build.xml:1444: The following error occurred while executing this line:
/x1/jenkins/jenkins-slave/workspace/Lucene-Solr-NightlyTests-5.x/lucene/common-build.xml:999: There were test failures: 508 suites, 2012 tests, 1 error, 53 ignored (10 assumptions)

Total time: 225 minutes 12 seconds
Build step 'Invoke Ant' marked build as failure
Archiving artifacts
Sending artifact delta relative to Lucene-Solr-NightlyTests-5.x #874
Archived 4 artifacts
Archive block size is 32768
Received 0 blocks and 988199522 bytes
Compression is 0.0%
Took 3 min 8 sec
Recording test results
Email was triggered for: Failure
Sending email for trigger: Failure



Mime
View raw message