lucene-dev mailing list archives

Site index · List index
Message view « Date » · « Thread »
Top « Date » · « Thread »
From Apache Jenkins Server <jenk...@builds.apache.org>
Subject [JENKINS] Lucene-Solr-NightlyTests-5.x - Build # 895 - Still Failing
Date Tue, 07 Jul 2015 17:33:50 GMT
Build: https://builds.apache.org/job/Lucene-Solr-NightlyTests-5.x/895/

1 tests failed.
FAILED:  org.apache.solr.cloud.CollectionsAPIDistributedZkTest.test

Error Message:
Captured an uncaught exception in thread: Thread[id=7191, name=collection4, state=RUNNABLE, group=TGRP-CollectionsAPIDistributedZkTest]

Stack Trace:
com.carrotsearch.randomizedtesting.UncaughtExceptionError: Captured an uncaught exception in thread: Thread[id=7191, name=collection4, state=RUNNABLE, group=TGRP-CollectionsAPIDistributedZkTest]
Caused by: org.apache.solr.client.solrj.impl.HttpSolrClient$RemoteSolrException: Error from server at https://127.0.0.1:48015/rf/e: collection already exists: awholynewstresscollection_collection4_9
	at __randomizedtesting.SeedInfo.seed([76E30C4D0133C65]:0)
	at org.apache.solr.client.solrj.impl.HttpSolrClient.executeMethod(HttpSolrClient.java:560)
	at org.apache.solr.client.solrj.impl.HttpSolrClient.request(HttpSolrClient.java:234)
	at org.apache.solr.client.solrj.impl.HttpSolrClient.request(HttpSolrClient.java:226)
	at org.apache.solr.client.solrj.impl.LBHttpSolrClient.doRequest(LBHttpSolrClient.java:376)
	at org.apache.solr.client.solrj.impl.LBHttpSolrClient.request(LBHttpSolrClient.java:328)
	at org.apache.solr.client.solrj.impl.CloudSolrClient.sendRequest(CloudSolrClient.java:1086)
	at org.apache.solr.client.solrj.impl.CloudSolrClient.requestWithRetryOnStaleState(CloudSolrClient.java:856)
	at org.apache.solr.client.solrj.impl.CloudSolrClient.request(CloudSolrClient.java:799)
	at org.apache.solr.client.solrj.SolrClient.request(SolrClient.java:1220)
	at org.apache.solr.cloud.AbstractFullDistribZkTestBase.createCollection(AbstractFullDistribZkTestBase.java:1572)
	at org.apache.solr.cloud.AbstractFullDistribZkTestBase.createCollection(AbstractFullDistribZkTestBase.java:1593)
	at org.apache.solr.cloud.CollectionsAPIDistributedZkTest$1CollectionThread.run(CollectionsAPIDistributedZkTest.java:887)




Build Log:
[...truncated 10919 lines...]
   [junit4] Suite: org.apache.solr.cloud.CollectionsAPIDistributedZkTest
   [junit4]   2> Creating dataDir: /x1/jenkins/jenkins-slave/workspace/Lucene-Solr-NightlyTests-5.x/solr/build/solr-core/test/J0/temp/solr.cloud.CollectionsAPIDistributedZkTest_76E30C4D0133C65-001/init-core-data-001
   [junit4]   2> 1417538 INFO  (SUITE-CollectionsAPIDistributedZkTest-seed#[76E30C4D0133C65]-worker) [    ] o.a.s.SolrTestCaseJ4 Randomized ssl (true) and clientAuth (false)
   [junit4]   2> 1417538 INFO  (SUITE-CollectionsAPIDistributedZkTest-seed#[76E30C4D0133C65]-worker) [    ] o.a.s.BaseDistributedSearchTestCase Setting hostContext system property: /rf/e
   [junit4]   2> 1417543 INFO  (TEST-CollectionsAPIDistributedZkTest.test-seed#[76E30C4D0133C65]) [    ] o.a.s.c.ZkTestServer STARTING ZK TEST SERVER
   [junit4]   2> 1417544 INFO  (Thread-2804) [    ] o.a.s.c.ZkTestServer client port:0.0.0.0/0.0.0.0:0
   [junit4]   2> 1417544 INFO  (Thread-2804) [    ] o.a.s.c.ZkTestServer Starting server
   [junit4]   2> 1417644 INFO  (TEST-CollectionsAPIDistributedZkTest.test-seed#[76E30C4D0133C65]) [    ] o.a.s.c.ZkTestServer start zk server on port:55347
   [junit4]   2> 1417644 INFO  (TEST-CollectionsAPIDistributedZkTest.test-seed#[76E30C4D0133C65]) [    ] o.a.s.c.c.SolrZkClient Using default ZkCredentialsProvider
   [junit4]   2> 1417645 INFO  (TEST-CollectionsAPIDistributedZkTest.test-seed#[76E30C4D0133C65]) [    ] o.a.s.c.c.ConnectionManager Waiting for client to connect to ZooKeeper
   [junit4]   2> 1417648 INFO  (zkCallback-669-thread-1) [    ] o.a.s.c.c.ConnectionManager Watcher org.apache.solr.common.cloud.ConnectionManager@f6916c2 name:ZooKeeperConnection Watcher:127.0.0.1:55347 got event WatchedEvent state:SyncConnected type:None path:null path:null type:None
   [junit4]   2> 1417649 INFO  (TEST-CollectionsAPIDistributedZkTest.test-seed#[76E30C4D0133C65]) [    ] o.a.s.c.c.ConnectionManager Client is connected to ZooKeeper
   [junit4]   2> 1417649 INFO  (TEST-CollectionsAPIDistributedZkTest.test-seed#[76E30C4D0133C65]) [    ] o.a.s.c.c.SolrZkClient Using default ZkACLProvider
   [junit4]   2> 1417649 INFO  (TEST-CollectionsAPIDistributedZkTest.test-seed#[76E30C4D0133C65]) [    ] o.a.s.c.c.SolrZkClient makePath: /solr
   [junit4]   2> 1417654 INFO  (TEST-CollectionsAPIDistributedZkTest.test-seed#[76E30C4D0133C65]) [    ] o.a.s.c.c.SolrZkClient Using default ZkCredentialsProvider
   [junit4]   2> 1417655 INFO  (TEST-CollectionsAPIDistributedZkTest.test-seed#[76E30C4D0133C65]) [    ] o.a.s.c.c.ConnectionManager Waiting for client to connect to ZooKeeper
   [junit4]   2> 1417656 INFO  (zkCallback-670-thread-1) [    ] o.a.s.c.c.ConnectionManager Watcher org.apache.solr.common.cloud.ConnectionManager@5ca9fbe3 name:ZooKeeperConnection Watcher:127.0.0.1:55347/solr got event WatchedEvent state:SyncConnected type:None path:null path:null type:None
   [junit4]   2> 1417656 INFO  (TEST-CollectionsAPIDistributedZkTest.test-seed#[76E30C4D0133C65]) [    ] o.a.s.c.c.ConnectionManager Client is connected to ZooKeeper
   [junit4]   2> 1417657 INFO  (TEST-CollectionsAPIDistributedZkTest.test-seed#[76E30C4D0133C65]) [    ] o.a.s.c.c.SolrZkClient Using default ZkACLProvider
   [junit4]   2> 1417657 INFO  (TEST-CollectionsAPIDistributedZkTest.test-seed#[76E30C4D0133C65]) [    ] o.a.s.c.c.SolrZkClient makePath: /collections/collection1
   [junit4]   2> 1417660 INFO  (TEST-CollectionsAPIDistributedZkTest.test-seed#[76E30C4D0133C65]) [    ] o.a.s.c.c.SolrZkClient makePath: /collections/collection1/shards
   [junit4]   2> 1417662 INFO  (TEST-CollectionsAPIDistributedZkTest.test-seed#[76E30C4D0133C65]) [    ] o.a.s.c.c.SolrZkClient makePath: /collections/control_collection
   [junit4]   2> 1417664 INFO  (TEST-CollectionsAPIDistributedZkTest.test-seed#[76E30C4D0133C65]) [    ] o.a.s.c.c.SolrZkClient makePath: /collections/control_collection/shards
   [junit4]   2> 1417667 INFO  (TEST-CollectionsAPIDistributedZkTest.test-seed#[76E30C4D0133C65]) [    ] o.a.s.c.AbstractZkTestCase put /x1/jenkins/jenkins-slave/workspace/Lucene-Solr-NightlyTests-5.x/solr/core/src/test-files/solr/collection1/conf/solrconfig-tlog.xml to /configs/conf1/solrconfig.xml
   [junit4]   2> 1417668 INFO  (TEST-CollectionsAPIDistributedZkTest.test-seed#[76E30C4D0133C65]) [    ] o.a.s.c.c.SolrZkClient makePath: /configs/conf1/solrconfig.xml
   [junit4]   2> 1417672 INFO  (TEST-CollectionsAPIDistributedZkTest.test-seed#[76E30C4D0133C65]) [    ] o.a.s.c.AbstractZkTestCase put /x1/jenkins/jenkins-slave/workspace/Lucene-Solr-NightlyTests-5.x/solr/core/src/test-files/solr/collection1/conf/schema.xml to /configs/conf1/schema.xml
   [junit4]   2> 1417672 INFO  (TEST-CollectionsAPIDistributedZkTest.test-seed#[76E30C4D0133C65]) [    ] o.a.s.c.c.SolrZkClient makePath: /configs/conf1/schema.xml
   [junit4]   2> 1417675 INFO  (TEST-CollectionsAPIDistributedZkTest.test-seed#[76E30C4D0133C65]) [    ] o.a.s.c.AbstractZkTestCase put /x1/jenkins/jenkins-slave/workspace/Lucene-Solr-NightlyTests-5.x/solr/core/src/test-files/solr/collection1/conf/solrconfig.snippet.randomindexconfig.xml to /configs/conf1/solrconfig.snippet.randomindexconfig.xml
   [junit4]   2> 1417676 INFO  (TEST-CollectionsAPIDistributedZkTest.test-seed#[76E30C4D0133C65]) [    ] o.a.s.c.c.SolrZkClient makePath: /configs/conf1/solrconfig.snippet.randomindexconfig.xml
   [junit4]   2> 1417678 INFO  (TEST-CollectionsAPIDistributedZkTest.test-seed#[76E30C4D0133C65]) [    ] o.a.s.c.AbstractZkTestCase put /x1/jenkins/jenkins-slave/workspace/Lucene-Solr-NightlyTests-5.x/solr/core/src/test-files/solr/collection1/conf/stopwords.txt to /configs/conf1/stopwords.txt
   [junit4]   2> 1417678 INFO  (TEST-CollectionsAPIDistributedZkTest.test-seed#[76E30C4D0133C65]) [    ] o.a.s.c.c.SolrZkClient makePath: /configs/conf1/stopwords.txt
   [junit4]   2> 1417680 INFO  (TEST-CollectionsAPIDistributedZkTest.test-seed#[76E30C4D0133C65]) [    ] o.a.s.c.AbstractZkTestCase put /x1/jenkins/jenkins-slave/workspace/Lucene-Solr-NightlyTests-5.x/solr/core/src/test-files/solr/collection1/conf/protwords.txt to /configs/conf1/protwords.txt
   [junit4]   2> 1417681 INFO  (TEST-CollectionsAPIDistributedZkTest.test-seed#[76E30C4D0133C65]) [    ] o.a.s.c.c.SolrZkClient makePath: /configs/conf1/protwords.txt
   [junit4]   2> 1417683 INFO  (TEST-CollectionsAPIDistributedZkTest.test-seed#[76E30C4D0133C65]) [    ] o.a.s.c.AbstractZkTestCase put /x1/jenkins/jenkins-slave/workspace/Lucene-Solr-NightlyTests-5.x/solr/core/src/test-files/solr/collection1/conf/currency.xml to /configs/conf1/currency.xml
   [junit4]   2> 1417683 INFO  (TEST-CollectionsAPIDistributedZkTest.test-seed#[76E30C4D0133C65]) [    ] o.a.s.c.c.SolrZkClient makePath: /configs/conf1/currency.xml
   [junit4]   2> 1417685 INFO  (TEST-CollectionsAPIDistributedZkTest.test-seed#[76E30C4D0133C65]) [    ] o.a.s.c.AbstractZkTestCase put /x1/jenkins/jenkins-slave/workspace/Lucene-Solr-NightlyTests-5.x/solr/core/src/test-files/solr/collection1/conf/enumsConfig.xml to /configs/conf1/enumsConfig.xml
   [junit4]   2> 1417686 INFO  (TEST-CollectionsAPIDistributedZkTest.test-seed#[76E30C4D0133C65]) [    ] o.a.s.c.c.SolrZkClient makePath: /configs/conf1/enumsConfig.xml
   [junit4]   2> 1417688 INFO  (TEST-CollectionsAPIDistributedZkTest.test-seed#[76E30C4D0133C65]) [    ] o.a.s.c.AbstractZkTestCase put /x1/jenkins/jenkins-slave/workspace/Lucene-Solr-NightlyTests-5.x/solr/core/src/test-files/solr/collection1/conf/open-exchange-rates.json to /configs/conf1/open-exchange-rates.json
   [junit4]   2> 1417688 INFO  (TEST-CollectionsAPIDistributedZkTest.test-seed#[76E30C4D0133C65]) [    ] o.a.s.c.c.SolrZkClient makePath: /configs/conf1/open-exchange-rates.json
   [junit4]   2> 1417690 INFO  (TEST-CollectionsAPIDistributedZkTest.test-seed#[76E30C4D0133C65]) [    ] o.a.s.c.AbstractZkTestCase put /x1/jenkins/jenkins-slave/workspace/Lucene-Solr-NightlyTests-5.x/solr/core/src/test-files/solr/collection1/conf/mapping-ISOLatin1Accent.txt to /configs/conf1/mapping-ISOLatin1Accent.txt
   [junit4]   2> 1417691 INFO  (TEST-CollectionsAPIDistributedZkTest.test-seed#[76E30C4D0133C65]) [    ] o.a.s.c.c.SolrZkClient makePath: /configs/conf1/mapping-ISOLatin1Accent.txt
   [junit4]   2> 1417693 INFO  (TEST-CollectionsAPIDistributedZkTest.test-seed#[76E30C4D0133C65]) [    ] o.a.s.c.AbstractZkTestCase put /x1/jenkins/jenkins-slave/workspace/Lucene-Solr-NightlyTests-5.x/solr/core/src/test-files/solr/collection1/conf/old_synonyms.txt to /configs/conf1/old_synonyms.txt
   [junit4]   2> 1417693 INFO  (TEST-CollectionsAPIDistributedZkTest.test-seed#[76E30C4D0133C65]) [    ] o.a.s.c.c.SolrZkClient makePath: /configs/conf1/old_synonyms.txt
   [junit4]   2> 1417695 INFO  (TEST-CollectionsAPIDistributedZkTest.test-seed#[76E30C4D0133C65]) [    ] o.a.s.c.AbstractZkTestCase put /x1/jenkins/jenkins-slave/workspace/Lucene-Solr-NightlyTests-5.x/solr/core/src/test-files/solr/collection1/conf/synonyms.txt to /configs/conf1/synonyms.txt
   [junit4]   2> 1417696 INFO  (TEST-CollectionsAPIDistributedZkTest.test-seed#[76E30C4D0133C65]) [    ] o.a.s.c.c.SolrZkClient makePath: /configs/conf1/synonyms.txt
   [junit4]   2> 1417699 INFO  (TEST-CollectionsAPIDistributedZkTest.test-seed#[76E30C4D0133C65]) [    ] o.a.s.c.c.SolrZkClient Using default ZkCredentialsProvider
   [junit4]   2> 1417700 INFO  (TEST-CollectionsAPIDistributedZkTest.test-seed#[76E30C4D0133C65]) [    ] o.a.s.c.c.ConnectionManager Waiting for client to connect to ZooKeeper
   [junit4]   2> 1417702 INFO  (zkCallback-671-thread-1) [    ] o.a.s.c.c.ConnectionManager Watcher org.apache.solr.common.cloud.ConnectionManager@720c5307 name:ZooKeeperConnection Watcher:127.0.0.1:55347/solr got event WatchedEvent state:SyncConnected type:None path:null path:null type:None
   [junit4]   2> 1417702 INFO  (TEST-CollectionsAPIDistributedZkTest.test-seed#[76E30C4D0133C65]) [    ] o.a.s.c.c.ConnectionManager Client is connected to ZooKeeper
   [junit4]   2> 1417703 INFO  (TEST-CollectionsAPIDistributedZkTest.test-seed#[76E30C4D0133C65]) [    ] o.a.s.c.c.SolrZkClient Using default ZkACLProvider
   [junit4]   2> 1417704 INFO  (TEST-CollectionsAPIDistributedZkTest.test-seed#[76E30C4D0133C65]) [    ] o.a.s.c.c.SolrZkClient Using default ZkCredentialsProvider
   [junit4]   2> 1417705 INFO  (TEST-CollectionsAPIDistributedZkTest.test-seed#[76E30C4D0133C65]) [    ] o.a.s.c.c.ConnectionManager Waiting for client to connect to ZooKeeper
   [junit4]   2> 1417706 INFO  (zkCallback-672-thread-1) [    ] o.a.s.c.c.ConnectionManager Watcher org.apache.solr.common.cloud.ConnectionManager@5e59bc00 name:ZooKeeperConnection Watcher:127.0.0.1:55347 got event WatchedEvent state:SyncConnected type:None path:null path:null type:None
   [junit4]   2> 1417706 INFO  (TEST-CollectionsAPIDistributedZkTest.test-seed#[76E30C4D0133C65]) [    ] o.a.s.c.c.ConnectionManager Client is connected to ZooKeeper
   [junit4]   2> 1417707 INFO  (TEST-CollectionsAPIDistributedZkTest.test-seed#[76E30C4D0133C65]) [    ] o.a.s.c.c.SolrZkClient Using default ZkACLProvider
   [junit4]   2> 1417707 INFO  (TEST-CollectionsAPIDistributedZkTest.test-seed#[76E30C4D0133C65]) [    ] o.a.s.c.c.SolrZkClient makePath: /solr
   [junit4]   2> 1417709 INFO  (TEST-CollectionsAPIDistributedZkTest.test-seed#[76E30C4D0133C65]) [    ] o.a.s.c.c.SolrZkClient Using default ZkCredentialsProvider
   [junit4]   2> 1417710 INFO  (TEST-CollectionsAPIDistributedZkTest.test-seed#[76E30C4D0133C65]) [    ] o.a.s.c.c.ConnectionManager Waiting for client to connect to ZooKeeper
   [junit4]   2> 1417711 INFO  (zkCallback-673-thread-1) [    ] o.a.s.c.c.ConnectionManager Watcher org.apache.solr.common.cloud.ConnectionManager@624f03aa name:ZooKeeperConnection Watcher:127.0.0.1:55347/solr got event WatchedEvent state:SyncConnected type:None path:null path:null type:None
   [junit4]   2> 1417711 INFO  (TEST-CollectionsAPIDistributedZkTest.test-seed#[76E30C4D0133C65]) [    ] o.a.s.c.c.ConnectionManager Client is connected to ZooKeeper
   [junit4]   2> 1417712 INFO  (TEST-CollectionsAPIDistributedZkTest.test-seed#[76E30C4D0133C65]) [    ] o.a.s.c.c.SolrZkClient Using default ZkACLProvider
   [junit4]   2> 1417712 INFO  (TEST-CollectionsAPIDistributedZkTest.test-seed#[76E30C4D0133C65]) [    ] o.a.s.c.AbstractZkTestCase put /x1/jenkins/jenkins-slave/workspace/Lucene-Solr-NightlyTests-5.x/solr/core/src/test-files/solr/collection1/conf/solrconfig-tlog.xml to /configs/conf2/solrconfig.xml
   [junit4]   2> 1417712 INFO  (TEST-CollectionsAPIDistributedZkTest.test-seed#[76E30C4D0133C65]) [    ] o.a.s.c.c.SolrZkClient makePath: /configs/conf2/solrconfig.xml
   [junit4]   2> 1417715 INFO  (TEST-CollectionsAPIDistributedZkTest.test-seed#[76E30C4D0133C65]) [    ] o.a.s.c.AbstractZkTestCase put /x1/jenkins/jenkins-slave/workspace/Lucene-Solr-NightlyTests-5.x/solr/core/src/test-files/solr/collection1/conf/schema.xml to /configs/conf2/schema.xml
   [junit4]   2> 1417715 INFO  (TEST-CollectionsAPIDistributedZkTest.test-seed#[76E30C4D0133C65]) [    ] o.a.s.c.c.SolrZkClient makePath: /configs/conf2/schema.xml
   [junit4]   2> 1417718 INFO  (TEST-CollectionsAPIDistributedZkTest.test-seed#[76E30C4D0133C65]) [    ] o.a.s.c.AbstractZkTestCase put /x1/jenkins/jenkins-slave/workspace/Lucene-Solr-NightlyTests-5.x/solr/core/src/test-files/solr/collection1/conf/enumsConfig.xml to /configs/conf2/enumsConfig.xml
   [junit4]   2> 1417718 INFO  (TEST-CollectionsAPIDistributedZkTest.test-seed#[76E30C4D0133C65]) [    ] o.a.s.c.c.SolrZkClient makePath: /configs/conf2/enumsConfig.xml
   [junit4]   2> 1417723 INFO  (TEST-CollectionsAPIDistributedZkTest.test-seed#[76E30C4D0133C65]) [    ] o.a.s.c.AbstractZkTestCase put /x1/jenkins/jenkins-slave/workspace/Lucene-Solr-NightlyTests-5.x/solr/core/src/test-files/solr/collection1/conf/solrconfig.snippet.randomindexconfig.xml to /configs/conf2/solrconfig.snippet.randomindexconfig.xml
   [junit4]   2> 1417723 INFO  (TEST-CollectionsAPIDistributedZkTest.test-seed#[76E30C4D0133C65]) [    ] o.a.s.c.c.SolrZkClient makePath: /configs/conf2/solrconfig.snippet.randomindexconfig.xml
   [junit4]   2> 1417725 INFO  (TEST-CollectionsAPIDistributedZkTest.test-seed#[76E30C4D0133C65]) [    ] o.a.s.c.AbstractZkTestCase put /x1/jenkins/jenkins-slave/workspace/Lucene-Solr-NightlyTests-5.x/solr/core/src/test-files/solr/collection1/conf/stopwords.txt to /configs/conf2/stopwords.txt
   [junit4]   2> 1417725 INFO  (TEST-CollectionsAPIDistributedZkTest.test-seed#[76E30C4D0133C65]) [    ] o.a.s.c.c.SolrZkClient makePath: /configs/conf2/stopwords.txt
   [junit4]   2> 1417727 INFO  (TEST-CollectionsAPIDistributedZkTest.test-seed#[76E30C4D0133C65]) [    ] o.a.s.c.AbstractZkTestCase put /x1/jenkins/jenkins-slave/workspace/Lucene-Solr-NightlyTests-5.x/solr/core/src/test-files/solr/collection1/conf/protwords.txt to /configs/conf2/protwords.txt
   [junit4]   2> 1417727 INFO  (TEST-CollectionsAPIDistributedZkTest.test-seed#[76E30C4D0133C65]) [    ] o.a.s.c.c.SolrZkClient makePath: /configs/conf2/protwords.txt
   [junit4]   2> 1417729 INFO  (TEST-CollectionsAPIDistributedZkTest.test-seed#[76E30C4D0133C65]) [    ] o.a.s.c.AbstractZkTestCase put /x1/jenkins/jenkins-slave/workspace/Lucene-Solr-NightlyTests-5.x/solr/core/src/test-files/solr/collection1/conf/currency.xml to /configs/conf2/currency.xml
   [junit4]   2> 1417729 INFO  (TEST-CollectionsAPIDistributedZkTest.test-seed#[76E30C4D0133C65]) [    ] o.a.s.c.c.SolrZkClient makePath: /configs/conf2/currency.xml
   [junit4]   2> 1417731 INFO  (TEST-CollectionsAPIDistributedZkTest.test-seed#[76E30C4D0133C65]) [    ] o.a.s.c.AbstractZkTestCase put /x1/jenkins/jenkins-slave/workspace/Lucene-Solr-NightlyTests-5.x/solr/core/src/test-files/solr/collection1/conf/open-exchange-rates.json to /configs/conf2/open-exchange-rates.json
   [junit4]   2> 1417732 INFO  (TEST-CollectionsAPIDistributedZkTest.test-seed#[76E30C4D0133C65]) [    ] o.a.s.c.c.SolrZkClient makePath: /configs/conf2/open-exchange-rates.json
   [junit4]   2> 1417733 INFO  (TEST-CollectionsAPIDistributedZkTest.test-seed#[76E30C4D0133C65]) [    ] o.a.s.c.AbstractZkTestCase put /x1/jenkins/jenkins-slave/workspace/Lucene-Solr-NightlyTests-5.x/solr/core/src/test-files/solr/collection1/conf/mapping-ISOLatin1Accent.txt to /configs/conf2/mapping-ISOLatin1Accent.txt
   [junit4]   2> 1417734 INFO  (TEST-CollectionsAPIDistributedZkTest.test-seed#[76E30C4D0133C65]) [    ] o.a.s.c.c.SolrZkClient makePath: /configs/conf2/mapping-ISOLatin1Accent.txt
   [junit4]   2> 1417736 INFO  (TEST-CollectionsAPIDistributedZkTest.test-seed#[76E30C4D0133C65]) [    ] o.a.s.c.AbstractZkTestCase put /x1/jenkins/jenkins-slave/workspace/Lucene-Solr-NightlyTests-5.x/solr/core/src/test-files/solr/collection1/conf/old_synonyms.txt to /configs/conf2/old_synonyms.txt
   [junit4]   2> 1417736 INFO  (TEST-CollectionsAPIDistributedZkTest.test-seed#[76E30C4D0133C65]) [    ] o.a.s.c.c.SolrZkClient makePath: /configs/conf2/old_synonyms.txt
   [junit4]   2> 1417738 INFO  (TEST-CollectionsAPIDistributedZkTest.test-seed#[76E30C4D0133C65]) [    ] o.a.s.c.AbstractZkTestCase put /x1/jenkins/jenkins-slave/workspace/Lucene-Solr-NightlyTests-5.x/solr/core/src/test-files/solr/collection1/conf/synonyms.txt to /configs/conf2/synonyms.txt
   [junit4]   2> 1417738 INFO  (TEST-CollectionsAPIDistributedZkTest.test-seed#[76E30C4D0133C65]) [    ] o.a.s.c.c.SolrZkClient makePath: /configs/conf2/synonyms.txt
   [junit4]   2> 1417740 INFO  (TEST-CollectionsAPIDistributedZkTest.test-seed#[76E30C4D0133C65]) [    ] o.a.s.c.AbstractZkTestCase put /x1/jenkins/jenkins-slave/workspace/Lucene-Solr-NightlyTests-5.x/solr/core/src/test-files/solr/collection1/conf/elevate.xml to /configs/conf2/elevate.xml
   [junit4]   2> 1417741 INFO  (TEST-CollectionsAPIDistributedZkTest.test-seed#[76E30C4D0133C65]) [    ] o.a.s.c.c.SolrZkClient makePath: /configs/conf2/elevate.xml
   [junit4]   2> 1418070 INFO  (TEST-CollectionsAPIDistributedZkTest.test-seed#[76E30C4D0133C65]) [    ] o.a.s.SolrTestCaseJ4 Writing core.properties file to /x1/jenkins/jenkins-slave/workspace/Lucene-Solr-NightlyTests-5.x/solr/build/solr-core/test/J0/temp/solr.cloud.CollectionsAPIDistributedZkTest_76E30C4D0133C65-001/control-001/cores/collection1
   [junit4]   2> 1418072 INFO  (TEST-CollectionsAPIDistributedZkTest.test-seed#[76E30C4D0133C65]) [    ] o.e.j.s.Server jetty-9.2.11.v20150529
   [junit4]   2> 1418074 INFO  (TEST-CollectionsAPIDistributedZkTest.test-seed#[76E30C4D0133C65]) [    ] o.e.j.s.h.ContextHandler Started o.e.j.s.ServletContextHandler@6087deb0{/rf/e,null,AVAILABLE}
   [junit4]   2> 1418077 INFO  (TEST-CollectionsAPIDistributedZkTest.test-seed#[76E30C4D0133C65]) [    ] o.e.j.s.ServerConnector Started ServerConnector@5c2f0f21{SSL-http/1.1}{127.0.0.1:43749}
   [junit4]   2> 1418077 INFO  (TEST-CollectionsAPIDistributedZkTest.test-seed#[76E30C4D0133C65]) [    ] o.e.j.s.Server Started @1421057ms
   [junit4]   2> 1418077 INFO  (TEST-CollectionsAPIDistributedZkTest.test-seed#[76E30C4D0133C65]) [    ] o.a.s.c.s.e.JettySolrRunner Jetty properties: {hostContext=/rf/e, hostPort=43749, solr.data.dir=/x1/jenkins/jenkins-slave/workspace/Lucene-Solr-NightlyTests-5.x/solr/build/solr-core/test/J0/temp/solr.cloud.CollectionsAPIDistributedZkTest_76E30C4D0133C65-001/tempDir-001/control/data, coreRootDirectory=/x1/jenkins/jenkins-slave/workspace/Lucene-Solr-NightlyTests-5.x/solr/build/solr-core/test/J0/temp/solr.cloud.CollectionsAPIDistributedZkTest_76E30C4D0133C65-001/control-001/cores}
   [junit4]   2> 1418079 INFO  (TEST-CollectionsAPIDistributedZkTest.test-seed#[76E30C4D0133C65]) [    ] o.a.s.s.SolrDispatchFilter SolrDispatchFilter.init(): sun.misc.Launcher$AppClassLoader@6b482747
   [junit4]   2> 1418079 INFO  (TEST-CollectionsAPIDistributedZkTest.test-seed#[76E30C4D0133C65]) [    ] o.a.s.c.SolrResourceLoader new SolrResourceLoader for directory: '/x1/jenkins/jenkins-slave/workspace/Lucene-Solr-NightlyTests-5.x/solr/build/solr-core/test/J0/temp/solr.cloud.CollectionsAPIDistributedZkTest_76E30C4D0133C65-001/control-001/'
   [junit4]   2> 1418098 INFO  (TEST-CollectionsAPIDistributedZkTest.test-seed#[76E30C4D0133C65]) [    ] o.a.s.c.SolrXmlConfig Loading container configuration from /x1/jenkins/jenkins-slave/workspace/Lucene-Solr-NightlyTests-5.x/solr/build/solr-core/test/J0/temp/solr.cloud.CollectionsAPIDistributedZkTest_76E30C4D0133C65-001/control-001/solr.xml
   [junit4]   2> 1418113 INFO  (TEST-CollectionsAPIDistributedZkTest.test-seed#[76E30C4D0133C65]) [    ] o.a.s.c.CoresLocator Config-defined core root directory: /x1/jenkins/jenkins-slave/workspace/Lucene-Solr-NightlyTests-5.x/solr/build/solr-core/test/J0/temp/solr.cloud.CollectionsAPIDistributedZkTest_76E30C4D0133C65-001/control-001/cores
   [junit4]   2> 1418114 INFO  (TEST-CollectionsAPIDistributedZkTest.test-seed#[76E30C4D0133C65]) [    ] o.a.s.c.CoreContainer New CoreContainer 1258911661
   [junit4]   2> 1418114 INFO  (TEST-CollectionsAPIDistributedZkTest.test-seed#[76E30C4D0133C65]) [    ] o.a.s.c.CoreContainer Loading cores into CoreContainer [instanceDir=/x1/jenkins/jenkins-slave/workspace/Lucene-Solr-NightlyTests-5.x/solr/build/solr-core/test/J0/temp/solr.cloud.CollectionsAPIDistributedZkTest_76E30C4D0133C65-001/control-001/]
   [junit4]   2> 1418114 INFO  (TEST-CollectionsAPIDistributedZkTest.test-seed#[76E30C4D0133C65]) [    ] o.a.s.c.CoreContainer loading shared library: /x1/jenkins/jenkins-slave/workspace/Lucene-Solr-NightlyTests-5.x/solr/build/solr-core/test/J0/temp/solr.cloud.CollectionsAPIDistributedZkTest_76E30C4D0133C65-001/control-001/lib
   [junit4]   2> 1418114 WARN  (TEST-CollectionsAPIDistributedZkTest.test-seed#[76E30C4D0133C65]) [    ] o.a.s.c.SolrResourceLoader Can't find (or read) directory to add to classloader: lib (resolved as: /x1/jenkins/jenkins-slave/workspace/Lucene-Solr-NightlyTests-5.x/solr/build/solr-core/test/J0/temp/solr.cloud.CollectionsAPIDistributedZkTest_76E30C4D0133C65-001/control-001/lib).
   [junit4]   2> 1418124 INFO  (TEST-CollectionsAPIDistributedZkTest.test-seed#[76E30C4D0133C65]) [    ] o.a.s.h.c.HttpShardHandlerFactory created with socketTimeout : 90000,urlScheme : ,connTimeout : 15000,maxConnectionsPerHost : 20,maxConnections : 10000,corePoolSize : 0,maximumPoolSize : 2147483647,maxThreadIdleTime : 5,sizeOfQueue : -1,fairnessPolicy : false,useRetries : false,
   [junit4]   2> 1418127 INFO  (TEST-CollectionsAPIDistributedZkTest.test-seed#[76E30C4D0133C65]) [    ] o.a.s.u.UpdateShardHandler Creating UpdateShardHandler HTTP client with params: socketTimeout=340000&connTimeout=45000&retry=true
   [junit4]   2> 1418128 INFO  (TEST-CollectionsAPIDistributedZkTest.test-seed#[76E30C4D0133C65]) [    ] o.a.s.l.LogWatcher SLF4J impl is org.slf4j.impl.Log4jLoggerFactory
   [junit4]   2> 1418128 INFO  (TEST-CollectionsAPIDistributedZkTest.test-seed#[76E30C4D0133C65]) [    ] o.a.s.l.LogWatcher Registering Log Listener [Log4j (org.slf4j.impl.Log4jLoggerFactory)]
   [junit4]   2> 1418128 INFO  (TEST-CollectionsAPIDistributedZkTest.test-seed#[76E30C4D0133C65]) [    ] o.a.s.c.ZkContainer Zookeeper client=127.0.0.1:55347/solr
   [junit4]   2> 1418129 INFO  (TEST-CollectionsAPIDistributedZkTest.test-seed#[76E30C4D0133C65]) [    ] o.a.s.c.ZkController zkHost includes chroot
   [junit4]   2> 1418129 INFO  (TEST-CollectionsAPIDistributedZkTest.test-seed#[76E30C4D0133C65]) [    ] o.a.s.c.c.SolrZkClient Using default ZkCredentialsProvider
   [junit4]   2> 1418129 INFO  (TEST-CollectionsAPIDistributedZkTest.test-seed#[76E30C4D0133C65]) [    ] o.a.s.c.c.ConnectionManager Waiting for client to connect to ZooKeeper
   [junit4]   2> 1418131 INFO  (zkCallback-675-thread-1) [    ] o.a.s.c.c.ConnectionManager Watcher org.apache.solr.common.cloud.ConnectionManager@37b0501b name:ZooKeeperConnection Watcher:127.0.0.1:55347 got event WatchedEvent state:SyncConnected type:None path:null path:null type:None
   [junit4]   2> 1418132 INFO  (TEST-CollectionsAPIDistributedZkTest.test-seed#[76E30C4D0133C65]) [    ] o.a.s.c.c.ConnectionManager Client is connected to ZooKeeper
   [junit4]   2> 1418132 INFO  (TEST-CollectionsAPIDistributedZkTest.test-seed#[76E30C4D0133C65]) [    ] o.a.s.c.c.SolrZkClient Using default ZkACLProvider
   [junit4]   2> 1418134 INFO  (TEST-CollectionsAPIDistributedZkTest.test-seed#[76E30C4D0133C65]) [n:127.0.0.1:43749_rf%2Fe    ] o.a.s.c.c.ConnectionManager Waiting for client to connect to ZooKeeper
   [junit4]   2> 1418135 INFO  (zkCallback-676-thread-1-processing-n:127.0.0.1:43749_rf%2Fe) [n:127.0.0.1:43749_rf%2Fe    ] o.a.s.c.c.ConnectionManager Watcher org.apache.solr.common.cloud.ConnectionManager@5e458952 name:ZooKeeperConnection Watcher:127.0.0.1:55347/solr got event WatchedEvent state:SyncConnected type:None path:null path:null type:None
   [junit4]   2> 1418135 INFO  (TEST-CollectionsAPIDistributedZkTest.test-seed#[76E30C4D0133C65]) [n:127.0.0.1:43749_rf%2Fe    ] o.a.s.c.c.ConnectionManager Client is connected to ZooKeeper
   [junit4]   2> 1418137 INFO  (TEST-CollectionsAPIDistributedZkTest.test-seed#[76E30C4D0133C65]) [n:127.0.0.1:43749_rf%2Fe    ] o.a.s.c.c.SolrZkClient makePath: /overseer/queue
   [junit4]   2> 1418139 INFO  (TEST-CollectionsAPIDistributedZkTest.test-seed#[76E30C4D0133C65]) [n:127.0.0.1:43749_rf%2Fe    ] o.a.s.c.c.SolrZkClient makePath: /overseer/collection-queue-work
   [junit4]   2> 1418141 INFO  (TEST-CollectionsAPIDistributedZkTest.test-seed#[76E30C4D0133C65]) [n:127.0.0.1:43749_rf%2Fe    ] o.a.s.c.c.SolrZkClient makePath: /overseer/collection-map-running
   [junit4]   2> 1418143 INFO  (TEST-CollectionsAPIDistributedZkTest.test-seed#[76E30C4D0133C65]) [n:127.0.0.1:43749_rf%2Fe    ] o.a.s.c.c.SolrZkClient makePath: /overseer/collection-map-completed
   [junit4]   2> 1418146 INFO  (TEST-CollectionsAPIDistributedZkTest.test-seed#[76E30C4D0133C65]) [n:127.0.0.1:43749_rf%2Fe    ] o.a.s.c.c.SolrZkClient makePath: /overseer/collection-map-failure
   [junit4]   2> 1418148 INFO  (TEST-CollectionsAPIDistributedZkTest.test-seed#[76E30C4D0133C65]) [n:127.0.0.1:43749_rf%2Fe    ] o.a.s.c.c.SolrZkClient makePath: /live_nodes
   [junit4]   2> 1418150 INFO  (TEST-CollectionsAPIDistributedZkTest.test-seed#[76E30C4D0133C65]) [n:127.0.0.1:43749_rf%2Fe    ] o.a.s.c.c.SolrZkClient makePath: /aliases.json
   [junit4]   2> 1418151 INFO  (TEST-CollectionsAPIDistributedZkTest.test-seed#[76E30C4D0133C65]) [n:127.0.0.1:43749_rf%2Fe    ] o.a.s.c.c.SolrZkClient makePath: /clusterstate.json
   [junit4]   2> 1418153 INFO  (TEST-CollectionsAPIDistributedZkTest.test-seed#[76E30C4D0133C65]) [n:127.0.0.1:43749_rf%2Fe    ] o.a.s.c.ZkController Register node as live in ZooKeeper:/live_nodes/127.0.0.1:43749_rf%2Fe
   [junit4]   2> 1418153 INFO  (TEST-CollectionsAPIDistributedZkTest.test-seed#[76E30C4D0133C65]) [n:127.0.0.1:43749_rf%2Fe    ] o.a.s.c.c.SolrZkClient makePath: /live_nodes/127.0.0.1:43749_rf%2Fe
   [junit4]   2> 1418155 INFO  (TEST-CollectionsAPIDistributedZkTest.test-seed#[76E30C4D0133C65]) [n:127.0.0.1:43749_rf%2Fe    ] o.a.s.c.c.SolrZkClient makePath: /overseer_elect
   [junit4]   2> 1418156 INFO  (TEST-CollectionsAPIDistributedZkTest.test-seed#[76E30C4D0133C65]) [n:127.0.0.1:43749_rf%2Fe    ] o.a.s.c.c.SolrZkClient makePath: /overseer_elect/election
   [junit4]   2> 1418158 INFO  (TEST-CollectionsAPIDistributedZkTest.test-seed#[76E30C4D0133C65]) [n:127.0.0.1:43749_rf%2Fe    ] o.a.s.c.Overseer Overseer (id=null) closing
   [junit4]   2> 1418159 INFO  (TEST-CollectionsAPIDistributedZkTest.test-seed#[76E30C4D0133C65]) [n:127.0.0.1:43749_rf%2Fe    ] o.a.s.c.LeaderElector Joined leadership election with path: /overseer_elect/election/94128594408046598-127.0.0.1:43749_rf%2Fe-n_0000000000
   [junit4]   2> 1418160 INFO  (TEST-CollectionsAPIDistributedZkTest.test-seed#[76E30C4D0133C65]) [n:127.0.0.1:43749_rf%2Fe    ] o.a.s.c.OverseerElectionContext I am going to be the leader 127.0.0.1:43749_rf%2Fe
   [junit4]   2> 1418160 INFO  (TEST-CollectionsAPIDistributedZkTest.test-seed#[76E30C4D0133C65]) [n:127.0.0.1:43749_rf%2Fe    ] o.a.s.c.c.SolrZkClient makePath: /overseer_elect/leader
   [junit4]   2> 1418161 INFO  (TEST-CollectionsAPIDistributedZkTest.test-seed#[76E30C4D0133C65]) [n:127.0.0.1:43749_rf%2Fe    ] o.a.s.c.Overseer Overseer (id=94128594408046598-127.0.0.1:43749_rf%2Fe-n_0000000000) starting
   [junit4]   2> 1418163 INFO  (TEST-CollectionsAPIDistributedZkTest.test-seed#[76E30C4D0133C65]) [n:127.0.0.1:43749_rf%2Fe    ] o.a.s.c.c.SolrZkClient makePath: /overseer/queue-work
   [junit4]   2> 1418170 INFO  (TEST-CollectionsAPIDistributedZkTest.test-seed#[76E30C4D0133C65]) [n:127.0.0.1:43749_rf%2Fe    ] o.a.s.c.OverseerAutoReplicaFailoverThread Starting OverseerAutoReplicaFailoverThread autoReplicaFailoverWorkLoopDelay=10000 autoReplicaFailoverWaitAfterExpiration=10000 autoReplicaFailoverBadNodeExpiration=60000
   [junit4]   2> 1418171 INFO  (OverseerCollectionProcessor-94128594408046598-127.0.0.1:43749_rf%2Fe-n_0000000000) [n:127.0.0.1:43749_rf%2Fe    ] o.a.s.c.OverseerCollectionProcessor Process current queue of collection creations
   [junit4]   2> 1418171 INFO  (TEST-CollectionsAPIDistributedZkTest.test-seed#[76E30C4D0133C65]) [n:127.0.0.1:43749_rf%2Fe    ] o.a.s.c.c.ZkStateReader Updating cluster state from ZooKeeper... 
   [junit4]   2> 1418172 INFO  (OverseerStateUpdate-94128594408046598-127.0.0.1:43749_rf%2Fe-n_0000000000) [n:127.0.0.1:43749_rf%2Fe    ] o.a.s.c.Overseer Starting to work on the main queue
   [junit4]   2> 1418175 INFO  (TEST-CollectionsAPIDistributedZkTest.test-seed#[76E30C4D0133C65]) [n:127.0.0.1:43749_rf%2Fe    ] o.a.s.c.CoreContainer No authentication plugin used.
   [junit4]   2> 1418176 INFO  (TEST-CollectionsAPIDistributedZkTest.test-seed#[76E30C4D0133C65]) [n:127.0.0.1:43749_rf%2Fe    ] o.a.s.c.CoreContainer Security conf doesn't exist. Skipping setup for authorization module.
   [junit4]   2> 1418177 INFO  (TEST-CollectionsAPIDistributedZkTest.test-seed#[76E30C4D0133C65]) [n:127.0.0.1:43749_rf%2Fe    ] o.a.s.c.CoresLocator Looking for core definitions underneath /x1/jenkins/jenkins-slave/workspace/Lucene-Solr-NightlyTests-5.x/solr/build/solr-core/test/J0/temp/solr.cloud.CollectionsAPIDistributedZkTest_76E30C4D0133C65-001/control-001/cores
   [junit4]   2> 1418178 INFO  (TEST-CollectionsAPIDistributedZkTest.test-seed#[76E30C4D0133C65]) [n:127.0.0.1:43749_rf%2Fe    ] o.a.s.c.SolrCore Created CoreDescriptor: {collection=control_collection, config=solrconfig.xml, coreNodeName=, shard=, dataDir=data/, name=collection1, transient=false, schema=schema.xml, absoluteInstDir=/x1/jenkins/jenkins-slave/workspace/Lucene-Solr-NightlyTests-5.x/solr/build/solr-core/test/J0/temp/solr.cloud.CollectionsAPIDistributedZkTest_76E30C4D0133C65-001/control-001/cores/collection1/, loadOnStartup=true, instanceDir=/x1/jenkins/jenkins-slave/workspace/Lucene-Solr-NightlyTests-5.x/solr/build/solr-core/test/J0/temp/solr.cloud.CollectionsAPIDistributedZkTest_76E30C4D0133C65-001/control-001/cores/collection1}
   [junit4]   2> 1418178 INFO  (TEST-CollectionsAPIDistributedZkTest.test-seed#[76E30C4D0133C65]) [n:127.0.0.1:43749_rf%2Fe    ] o.a.s.c.CoresLocator Found core collection1 in /x1/jenkins/jenkins-slave/workspace/Lucene-Solr-NightlyTests-5.x/solr/build/solr-core/test/J0/temp/solr.cloud.CollectionsAPIDistributedZkTest_76E30C4D0133C65-001/control-001/cores/collection1/
   [junit4]   2> 1418179 INFO  (TEST-CollectionsAPIDistributedZkTest.test-seed#[76E30C4D0133C65]) [n:127.0.0.1:43749_rf%2Fe    ] o.a.s.c.CoresLocator Found 1 core definitions
   [junit4]   2> 1418180 INFO  (TEST-CollectionsAPIDistributedZkTest.test-seed#[76E30C4D0133C65]) [n:127.0.0.1:43749_rf%2Fe    ] o.a.s.s.SolrDispatchFilter user.dir=/x1/jenkins/jenkins-slave/workspace/Lucene-Solr-NightlyTests-5.x/solr/build/solr-core/test/J0
   [junit4]   2> 1418180 INFO  (coreLoadExecutor-2918-thread-1-processing-n:127.0.0.1:43749_rf%2Fe) [n:127.0.0.1:43749_rf%2Fe c:control_collection   x:collection1] o.a.s.c.ZkController publishing state=down
   [junit4]   2> 1418180 INFO  (coreLoadExecutor-2918-thread-1-processing-n:127.0.0.1:43749_rf%2Fe) [n:127.0.0.1:43749_rf%2Fe c:control_collection   x:collection1] o.a.s.c.ZkController numShards not found on descriptor - reading it from system property
   [junit4]   2> 1418180 INFO  (TEST-CollectionsAPIDistributedZkTest.test-seed#[76E30C4D0133C65]) [n:127.0.0.1:43749_rf%2Fe    ] o.a.s.s.SolrDispatchFilter SolrDispatchFilter.init() done
   [junit4]   2> 1418181 INFO  (coreLoadExecutor-2918-thread-1-processing-n:127.0.0.1:43749_rf%2Fe) [n:127.0.0.1:43749_rf%2Fe c:control_collection   x:collection1] o.a.s.c.ZkController look for our core node name
   [junit4]   2> 1418181 INFO  (zkCallback-676-thread-1-processing-n:127.0.0.1:43749_rf%2Fe) [n:127.0.0.1:43749_rf%2Fe    ] o.a.s.c.DistributedQueue NodeChildrenChanged fired on path /overseer/queue state SyncConnected
   [junit4]   2> 1418182 INFO  (OverseerStateUpdate-94128594408046598-127.0.0.1:43749_rf%2Fe-n_0000000000) [n:127.0.0.1:43749_rf%2Fe    ] o.a.s.c.Overseer processMessage: queueSize: 1, message = {
   [junit4]   2>   "shard":null,
   [junit4]   2>   "numShards":"1",
   [junit4]   2>   "base_url":"https://127.0.0.1:43749/rf/e",
   [junit4]   2>   "operation":"state",
   [junit4]   2>   "collection":"control_collection",
   [junit4]   2>   "state":"down",
   [junit4]   2>   "roles":null,
   [junit4]   2>   "node_name":"127.0.0.1:43749_rf%2Fe",
   [junit4]   2>   "core":"collection1"} current state version: 0
   [junit4]   2> 1418183 INFO  (OverseerStateUpdate-94128594408046598-127.0.0.1:43749_rf%2Fe-n_0000000000) [n:127.0.0.1:43749_rf%2Fe    ] o.a.s.c.o.ReplicaMutator Update state numShards=1 message={
   [junit4]   2>   "shard":null,
   [junit4]   2>   "numShards":"1",
   [junit4]   2>   "base_url":"https://127.0.0.1:43749/rf/e",
   [junit4]   2>   "operation":"state",
   [junit4]   2>   "collection":"control_collection",
   [junit4]   2>   "state":"down",
   [junit4]   2>   "roles":null,
   [junit4]   2>   "node_name":"127.0.0.1:43749_rf%2Fe",
   [junit4]   2>   "core":"collection1"}
   [junit4]   2> 1418183 INFO  (OverseerStateUpdate-94128594408046598-127.0.0.1:43749_rf%2Fe-n_0000000000) [n:127.0.0.1:43749_rf%2Fe    ] o.a.s.c.o.ClusterStateMutator building a new cName: control_collection
   [junit4]   2> 1418184 INFO  (OverseerStateUpdate-94128594408046598-127.0.0.1:43749_rf%2Fe-n_0000000000) [n:127.0.0.1:43749_rf%2Fe    ] o.a.s.c.o.ReplicaMutator Assigning new node to shard shard=shard1
   [junit4]   2> 1418185 INFO  (zkCallback-676-thread-1-processing-n:127.0.0.1:43749_rf%2Fe) [n:127.0.0.1:43749_rf%2Fe    ] o.a.s.c.c.ZkStateReader A cluster state change: WatchedEvent state:SyncConnected type:NodeDataChanged path:/clusterstate.json, has occurred - updating... (live nodes size: 1)
   [junit4]   2> 1418186 INFO  (zkCallback-676-thread-1-processing-n:127.0.0.1:43749_rf%2Fe) [n:127.0.0.1:43749_rf%2Fe    ] o.a.s.c.c.ZkStateReader Updated cluster state version to 1
   [junit4]   2> 1419181 INFO  (coreLoadExecutor-2918-thread-1-processing-n:127.0.0.1:43749_rf%2Fe) [n:127.0.0.1:43749_rf%2Fe c:control_collection   x:collection1] o.a.s.c.ZkController waiting to find shard id in clusterstate for collection1
   [junit4]   2> 1419182 INFO  (coreLoadExecutor-2918-thread-1-processing-n:127.0.0.1:43749_rf%2Fe) [n:127.0.0.1:43749_rf%2Fe c:control_collection   x:collection1] o.a.s.c.ZkController Check for collection zkNode:control_collection
   [junit4]   2> 1419183 INFO  (coreLoadExecutor-2918-thread-1-processing-n:127.0.0.1:43749_rf%2Fe) [n:127.0.0.1:43749_rf%2Fe c:control_collection   x:collection1] o.a.s.c.ZkController Collection zkNode exists
   [junit4]   2> 1419183 INFO  (coreLoadExecutor-2918-thread-1-processing-n:127.0.0.1:43749_rf%2Fe) [n:127.0.0.1:43749_rf%2Fe c:control_collection   x:collection1] o.a.s.c.c.ZkStateReader Load collection config from:/collections/control_collection
   [junit4]   2> 1419184 INFO  (coreLoadExecutor-2918-thread-1-processing-n:127.0.0.1:43749_rf%2Fe) [n:127.0.0.1:43749_rf%2Fe c:control_collection   x:collection1] o.a.s.c.c.ZkStateReader path=/collections/control_collection configName=conf1 specified config exists in ZooKeeper
   [junit4]   2> 1419184 INFO  (coreLoadExecutor-2918-thread-1-processing-n:127.0.0.1:43749_rf%2Fe) [n:127.0.0.1:43749_rf%2Fe c:control_collection   x:collection1] o.a.s.c.SolrResourceLoader new SolrResourceLoader for directory: '/x1/jenkins/jenkins-slave/workspace/Lucene-Solr-NightlyTests-5.x/solr/build/solr-core/test/J0/temp/solr.cloud.CollectionsAPIDistributedZkTest_76E30C4D0133C65-001/control-001/cores/collection1/'
   [junit4]   2> 1419199 INFO  (coreLoadExecutor-2918-thread-1-processing-n:127.0.0.1:43749_rf%2Fe) [n:127.0.0.1:43749_rf%2Fe c:control_collection   x:collection1] o.a.s.c.Config loaded config solrconfig.xml with version 0 
   [junit4]   2> 1419205 INFO  (coreLoadExecutor-2918-thread-1-processing-n:127.0.0.1:43749_rf%2Fe) [n:127.0.0.1:43749_rf%2Fe c:control_collection   x:collection1] o.a.s.c.SolrConfig current version of requestparams : -1
   [junit4]   2> 1419219 INFO  (coreLoadExecutor-2918-thread-1-processing-n:127.0.0.1:43749_rf%2Fe) [n:127.0.0.1:43749_rf%2Fe c:control_collection   x:collection1] o.a.s.c.SolrConfig Using Lucene MatchVersion: 5.3.0
   [junit4]   2> 1419247 INFO  (coreLoadExecutor-2918-thread-1-processing-n:127.0.0.1:43749_rf%2Fe) [n:127.0.0.1:43749_rf%2Fe c:control_collection   x:collection1] o.a.s.c.Config Loaded SolrConfig: solrconfig.xml
   [junit4]   2> 1419248 INFO  (coreLoadExecutor-2918-thread-1-processing-n:127.0.0.1:43749_rf%2Fe) [n:127.0.0.1:43749_rf%2Fe c:control_collection   x:collection1] o.a.s.s.IndexSchema Reading Solr Schema from /configs/conf1/schema.xml
   [junit4]   2> 1419254 INFO  (coreLoadExecutor-2918-thread-1-processing-n:127.0.0.1:43749_rf%2Fe) [n:127.0.0.1:43749_rf%2Fe c:control_collection   x:collection1] o.a.s.s.IndexSchema [collection1] Schema name=test
   [junit4]   2> 1419498 INFO  (coreLoadExecutor-2918-thread-1-processing-n:127.0.0.1:43749_rf%2Fe) [n:127.0.0.1:43749_rf%2Fe c:control_collection   x:collection1] o.a.s.s.OpenExchangeRatesOrgProvider Initialized with rates=open-exchange-rates.json, refreshInterval=1440.
   [junit4]   2> 1419506 INFO  (coreLoadExecutor-2918-thread-1-processing-n:127.0.0.1:43749_rf%2Fe) [n:127.0.0.1:43749_rf%2Fe c:control_collection   x:collection1] o.a.s.s.IndexSchema default search field in schema is text
   [junit4]   2> 1419508 INFO  (coreLoadExecutor-2918-thread-1-processing-n:127.0.0.1:43749_rf%2Fe) [n:127.0.0.1:43749_rf%2Fe c:control_collection   x:collection1] o.a.s.s.IndexSchema unique key field: id
   [junit4]   2> 1419521 INFO  (coreLoadExecutor-2918-thread-1-processing-n:127.0.0.1:43749_rf%2Fe) [n:127.0.0.1:43749_rf%2Fe c:control_collection   x:collection1] o.a.s.s.FileExchangeRateProvider Reloading exchange rates from file currency.xml
   [junit4]   2> 1419524 INFO  (coreLoadExecutor-2918-thread-1-processing-n:127.0.0.1:43749_rf%2Fe) [n:127.0.0.1:43749_rf%2Fe c:control_collection   x:collection1] o.a.s.s.FileExchangeRateProvider Reloading exchange rates from file currency.xml
   [junit4]   2> 1419527 INFO  (coreLoadExecutor-2918-thread-1-processing-n:127.0.0.1:43749_rf%2Fe) [n:127.0.0.1:43749_rf%2Fe c:control_collection   x:collection1] o.a.s.s.OpenExchangeRatesOrgProvider Reloading exchange rates from open-exchange-rates.json
   [junit4]   2> 1419528 WARN  (coreLoadExecutor-2918-thread-1-processing-n:127.0.0.1:43749_rf%2Fe) [n:127.0.0.1:43749_rf%2Fe c:control_collection   x:collection1] o.a.s.s.OpenExchangeRatesOrgProvider Unknown key IMPORTANT NOTE
   [junit4]   2> 1419528 WARN  (coreLoadExecutor-2918-thread-1-processing-n:127.0.0.1:43749_rf%2Fe) [n:127.0.0.1:43749_rf%2Fe c:control_collection   x:collection1] o.a.s.s.OpenExchangeRatesOrgProvider Expected key, got STRING
   [junit4]   2> 1419528 INFO  (coreLoadExecutor-2918-thread-1-processing-n:127.0.0.1:43749_rf%2Fe) [n:127.0.0.1:43749_rf%2Fe c:control_collection   x:collection1] o.a.s.s.OpenExchangeRatesOrgProvider Reloading exchange rates from open-exchange-rates.json
   [junit4]   2> 1419529 WARN  (coreLoadExecutor-2918-thread-1-processing-n:127.0.0.1:43749_rf%2Fe) [n:127.0.0.1:43749_rf%2Fe c:control_collection   x:collection1] o.a.s.s.OpenExchangeRatesOrgProvider Unknown key IMPORTANT NOTE
   [junit4]   2> 1419529 WARN  (coreLoadExecutor-2918-thread-1-processing-n:127.0.0.1:43749_rf%2Fe) [n:127.0.0.1:43749_rf%2Fe c:control_collection   x:collection1] o.a.s.s.OpenExchangeRatesOrgProvider Expected key, got STRING
   [junit4]   2> 1419529 INFO  (coreLoadExecutor-2918-thread-1-processing-n:127.0.0.1:43749_rf%2Fe) [n:127.0.0.1:43749_rf%2Fe c:control_collection   x:collection1] o.a.s.c.CoreContainer Creating SolrCore 'collection1' using configuration from collection control_collection
   [junit4]   2> 1419529 INFO  (coreLoadExecutor-2918-thread-1-processing-n:127.0.0.1:43749_rf%2Fe) [n:127.0.0.1:43749_rf%2Fe c:control_collection s:shard1 r:core_node1 x:collection1] o.a.s.c.SolrCore org.apache.solr.core.MockDirectoryFactory
   [junit4]   2> 1419529 INFO  (coreLoadExecutor-2918-thread-1-processing-n:127.0.0.1:43749_rf%2Fe) [n:127.0.0.1:43749_rf%2Fe c:control_collection s:shard1 r:core_node1 x:collection1] o.a.s.c.SolrCore [[collection1] ] Opening new SolrCore at [/x1/jenkins/jenkins-slave/workspace/Lucene-Solr-NightlyTests-5.x/solr/build/solr-core/test/J0/temp/solr.cloud.CollectionsAPIDistributedZkTest_76E30C4D0133C65-001/control-001/cores/collection1/], dataDir=[null]
   [junit4]   2> 1419529 INFO  (coreLoadExecutor-2918-thread-1-processing-n:127.0.0.1:43749_rf%2Fe) [n:127.0.0.1:43749_rf%2Fe c:control_collection s:shard1 r:core_node1 x:collection1] o.a.s.c.JmxMonitoredMap JMX monitoring is enabled. Adding Solr mbeans to JMX Server: com.sun.jmx.mbeanserver.JmxMBeanServer@2279f558
   [junit4]   2> 1419530 INFO  (coreLoadExecutor-2918-thread-1-processing-n:127.0.0.1:43749_rf%2Fe) [n:127.0.0.1:43749_rf%2Fe c:control_collection s:shard1 r:core_node1 x:collection1] o.a.s.c.CachingDirectoryFactory return new directory for /x1/jenkins/jenkins-slave/workspace/Lucene-Solr-NightlyTests-5.x/solr/build/solr-core/test/J0/temp/solr.cloud.CollectionsAPIDistributedZkTest_76E30C4D0133C65-001/control-001/cores/collection1/data
   [junit4]   2> 1419531 INFO  (coreLoadExecutor-2918-thread-1-processing-n:127.0.0.1:43749_rf%2Fe) [n:127.0.0.1:43749_rf%2Fe c:control_collection s:shard1 r:core_node1 x:collection1] o.a.s.c.SolrCore New index directory detected: old=null new=/x1/jenkins/jenkins-slave/workspace/Lucene-Solr-NightlyTests-5.x/solr/build/solr-core/test/J0/temp/solr.cloud.CollectionsAPIDistributedZkTest_76E30C4D0133C65-001/control-001/cores/collection1/data/index/
   [junit4]   2> 1419531 WARN  (coreLoadExecutor-2918-thread-1-processing-n:127.0.0.1:43749_rf%2Fe) [n:127.0.0.1:43749_rf%2Fe c:control_collection s:shard1 r:core_node1 x:collection1] o.a.s.c.SolrCore [collection1] Solr index directory '/x1/jenkins/jenkins-slave/workspace/Lucene-Solr-NightlyTests-5.x/solr/build/solr-core/test/J0/temp/solr.cloud.CollectionsAPIDistributedZkTest_76E30C4D0133C65-001/control-001/cores/collection1/data/index' doesn't exist. Creating new index...
   [junit4]   2> 1419531 INFO  (coreLoadExecutor-2918-thread-1-processing-n:127.0.0.1:43749_rf%2Fe) [n:127.0.0.1:43749_rf%2Fe c:control_collection s:shard1 r:core_node1 x:collection1] o.a.s.c.CachingDirectoryFactory return new directory for /x1/jenkins/jenkins-slave/workspace/Lucene-Solr-NightlyTests-5.x/solr/build/solr-core/test/J0/temp/solr.cloud.CollectionsAPIDistributedZkTest_76E30C4D0133C65-001/control-001/cores/collection1/data/index
   [junit4]   2> 1419531 INFO  (coreLoadExecutor-2918-thread-1-processing-n:127.0.0.1:43749_rf%2Fe) [n:127.0.0.1:43749_rf%2Fe c:control_collection s:shard1 r:core_node1 x:collection1] o.a.s.u.RandomMergePolicy RandomMergePolicy wrapping class org.apache.lucene.index.MockRandomMergePolicy: org.apache.lucene.index.MockRandomMergePolicy@18360f2e
   [junit4]   2> 1419532 INFO  (coreLoadExecutor-2918-thread-1-processing-n:127.0.0.1:43749_rf%2Fe) [n:127.0.0.1:43749_rf%2Fe c:control_collection s:shard1 r:core_node1 x:collection1] o.a.s.c.SolrCore SolrDeletionPolicy.onCommit: commits: num=1
   [junit4]   2> 	commit{dir=MockDirectoryWrapper(RAMDirectory@51ea16d lockFactory=org.apache.lucene.store.SingleInstanceLockFactory@1df7fdbb),segFN=segments_1,generation=1}
   [junit4]   2> 1419532 INFO  (coreLoadExecutor-2918-thread-1-processing-n:127.0.0.1:43749_rf%2Fe) [n:127.0.0.1:43749_rf%2Fe c:control_collection s:shard1 r:core_node1 x:collection1] o.a.s.c.SolrCore newest commit generation = 1
   [junit4]   2> 1419533 INFO  (OldIndexDirectoryCleanupThreadForCore-collection1) [n:127.0.0.1:43749_rf%2Fe c:control_collection s:shard1 r:core_node1 x:collection1] o.a.s.c.SolrCore Looking for old index directories to cleanup for core collection1 in /x1/jenkins/jenkins-slave/workspace/Lucene-Solr-NightlyTests-5.x/solr/build/solr-core/test/J0/temp/solr.cloud.CollectionsAPIDistributedZkTest_76E30C4D0133C65-001/control-001/cores/collection1/data/
   [junit4]   2> 1419533 WARN  (OldIndexDirectoryCleanupThreadForCore-collection1) [n:127.0.0.1:43749_rf%2Fe c:control_collection s:shard1 r:core_node1 x:collection1] o.a.s.c.DirectoryFactory /x1/jenkins/jenkins-slave/workspace/Lucene-Solr-NightlyTests-5.x/solr/build/solr-core/test/J0/temp/solr.cloud.CollectionsAPIDistributedZkTest_76E30C4D0133C65-001/control-001/cores/collection1/data/ does not point to a valid data directory; skipping clean-up of old index directories.
   [junit4]   2> 1419537 INFO  (coreLoadExecutor-2918-thread-1-processing-n:127.0.0.1:43749_rf%2Fe) [n:127.0.0.1:43749_rf%2Fe c:control_collection s:shard1 r:core_node1 x:collection1] o.a.s.u.p.UpdateRequestProcessorChain creating updateRequestProcessorChain "nodistrib"
   [junit4]   2> 1419537 INFO  (coreLoadExecutor-2918-thread-1-processing-n:127.0.0.1:43749_rf%2Fe) [n:127.0.0.1:43749_rf%2Fe c:control_collection s:shard1 r:core_node1 x:collection1] o.a.s.u.p.UpdateRequestProcessorChain creating updateRequestProcessorChain "dedupe"
   [junit4]   2> 1419537 INFO  (coreLoadExecutor-2918-thread-1-processing-n:127.0.0.1:43749_rf%2Fe) [n:127.0.0.1:43749_rf%2Fe c:control_collection s:shard1 r:core_node1 x:collection1] o.a.s.u.p.UpdateRequestProcessorChain inserting DistributedUpdateProcessorFactory into updateRequestProcessorChain "dedupe"
   [junit4]   2> 1419537 INFO  (coreLoadExecutor-2918-thread-1-processing-n:127.0.0.1:43749_rf%2Fe) [n:127.0.0.1:43749_rf%2Fe c:control_collection s:shard1 r:core_node1 x:collection1] o.a.s.u.p.UpdateRequestProcessorChain creating updateRequestProcessorChain "stored_sig"
   [junit4]   2> 1419538 INFO  (coreLoadExecutor-2918-thread-1-processing-n:127.0.0.1:43749_rf%2Fe) [n:127.0.0.1:43749_rf%2Fe c:control_collection s:shard1 r:core_node1 x:collection1] o.a.s.u.p.UpdateRequestProcessorChain inserting DistributedUpdateProcessorFactory into updateRequestProcessorChain "stored_sig"
   [junit4]   2> 1419538 INFO  (coreLoadExecutor-2918-thread-1-processing-n:127.0.0.1:43749_rf%2Fe) [n:127.0.0.1:43749_rf%2Fe c:control_collection s:shard1 r:core_node1 x:collection1] o.a.s.u.p.UpdateRequestProcessorChain creating updateRequestProcessorChain "distrib-dup-test-chain-explicit"
   [junit4]   2> 1419538 INFO  (coreLoadExecutor-2918-thread-1-processing-n:127.0.0.1:43749_rf%2Fe) [n:127.0.0.1:43749_rf%2Fe c:control_collection s:shard1 r:core_node1 x:collection1] o.a.s.u.p.UpdateRequestProcessorChain creating updateRequestProcessorChain "distrib-dup-test-chain-implicit"
   [junit4]   2> 1419538 INFO  (coreLoadExecutor-2918-thread-1-processing-n:127.0.0.1:43749_rf%2Fe) [n:127.0.0.1:43749_rf%2Fe c:control_collection s:shard1 r:core_node1 x:collection1] o.a.s.u.p.UpdateRequestProcessorChain inserting DistributedUpdateProcessorFactory into updateRequestProcessorChain "distrib-dup-test-chain-implicit"
   [junit4]   2> 1419538 INFO  (coreLoadExecutor-2918-thread-1-processing-n:127.0.0.1:43749_rf%2Fe) [n:127.0.0.1:43749_rf%2Fe c:control_collection s:shard1 r:core_node1 x:collection1] o.a.s.c.SolrCore no updateRequestProcessorChain defined as default, creating implicit default
   [junit4]   2> 1419541 INFO  (coreLoadExecutor-2918-thread-1-processing-n:127.0.0.1:43749_rf%2Fe) [n:127.0.0.1:43749_rf%2Fe c:control_collection s:shard1 r:core_node1 x:collection1] o.a.s.h.l.XMLLoader xsltCacheLifetimeSeconds=60
   [junit4]   2> 1419543 INFO  (coreLoadExecutor-2918-thread-1-processing-n:127.0.0.1:43749_rf%2Fe) [n:127.0.0.1:43749_rf%2Fe c:control_collection s:shard1 r:core_node1 x:collection1] o.a.s.h.l.XMLLoader xsltCacheLifetimeSeconds=60
   [junit4]   2> 1419544 INFO  (coreLoadExecutor-2918-thread-1-processing-n:127.0.0.1:43749_rf%2Fe) [n:127.0.0.1:43749_rf%2Fe c:control_collection s:shard1 r:core_node1 x:collection1] o.a.s.h.l.XMLLoader xsltCacheLifetimeSeconds=60
   [junit4]   2> 1419545 INFO  (coreLoadExecutor-2918-thread-1-processing-n:127.0.0.1:43749_rf%2Fe) [n:127.0.0.1:43749_rf%2Fe c:control_collection s:shard1 r:core_node1 x:collection1] o.a.s.h.l.XMLLoader xsltCacheLifetimeSeconds=60
   [junit4]   2> 1419549 INFO  (coreLoadExecutor-2918-thread-1-processing-n:127.0.0.1:43749_rf%2Fe) [n:127.0.0.1:43749_rf%2Fe c:control_collection s:shard1 r:core_node1 x:collection1] o.a.s.c.RequestHandlers Registered paths: /admin/logging,/update/json/docs,/admin/mbeans,/update,standard,/schema,/admin/file,/update/csv,/get,/admin/properties,/admin/ping,/admin/system,/admin/plugins,/admin/luke,/admin/threads,/update/json,/replication,/admin/segments,/config
   [junit4]   2> 1419550 INFO  (coreLoadExecutor-2918-thread-1-processing-n:127.0.0.1:43749_rf%2Fe) [n:127.0.0.1:43749_rf%2Fe c:control_collection s:shard1 r:core_node1 x:collection1] o.a.s.c.SolrCore Using default statsCache cache: org.apache.solr.search.stats.LocalStatsCache
   [junit4]   2> 1419551 INFO  (coreLoadExecutor-2918-thread-1-processing-n:127.0.0.1:43749_rf%2Fe) [n:127.0.0.1:43749_rf%2Fe c:control_collection s:shard1 r:core_node1 x:collection1] o.a.s.u.UpdateHandler Using UpdateLog implementation: org.apache.solr.update.UpdateLog
   [junit4]   2> 1419551 INFO  (coreLoadExecutor-2918-thread-1-processing-n:127.0.0.1:43749_rf%2Fe) [n:127.0.0.1:43749_rf%2Fe c:control_collection s:shard1 r:core_node1 x:collection1] o.a.s.u.UpdateLog Initializing UpdateLog: dataDir= defaultSyncLevel=FLUSH numRecordsToKeep=100 maxNumLogsToKeep=10 numVersionBuckets=65536
   [junit4]   2> 1419551 INFO  (coreLoadExecutor-2918-thread-1-processing-n:127.0.0.1:43749_rf%2Fe) [n:127.0.0.1:43749_rf%2Fe c:control_collection s:shard1 r:core_node1 x:collection1] o.a.s.c.SolrCore Hard AutoCommit: disabled
   [junit4]   2> 1419552 INFO  (coreLoadExecutor-2918-thread-1-processing-n:127.0.0.1:43749_rf%2Fe) [n:127.0.0.1:43749_rf%2Fe c:control_collection s:shard1 r:core_node1 x:collection1] o.a.s.c.SolrCore Soft AutoCommit: disabled
   [junit4]   2> 1419552 INFO  (coreLoadExecutor-2918-thread-1-processing-n:127.0.0.1:43749_rf%2Fe) [n:127.0.0.1:43749_rf%2Fe c:control_collection s:shard1 r:core_node1 x:collection1] o.a.s.u.RandomMergePolicy RandomMergePolicy wrapping class org.apache.lucene.index.AlcoholicMergePolicy: [AlcoholicMergePolicy: minMergeSize=0, mergeFactor=10, maxMergeSize=702128712, maxMergeSizeForForcedMerge=9223372036854775807, calibrateSizeByDeletes=true, maxMergeDocs=2147483647, maxCFSSegmentSizeMB=8.796093022207999E12, noCFSRatio=0.1]
   [junit4]   2> 1419553 INFO  (coreLoadExecutor-2918-thread-1-processing-n:127.0.0.1:43749_rf%2Fe) [n:127.0.0.1:43749_rf%2Fe c:control_collection s:shard1 r:core_node1 x:collection1] o.a.s.c.SolrCore SolrDeletionPolicy.onInit: commits: num=1
   [junit4]   2> 	commit{dir=MockDirectoryWrapper(RAMDirectory@51ea16d lockFactory=org.apache.lucene.store.SingleInstanceLockFactory@1df7fdbb),segFN=segments_1,generation=1}
   [junit4]   2> 1419553 INFO  (coreLoadExecutor-2918-thread-1-processing-n:127.0.0.1:43749_rf%2Fe) [n:127.0.0.1:43749_rf%2Fe c:control_collection s:shard1 r:core_node1 x:collection1] o.a.s.c.SolrCore newest commit generation = 1
   [junit4]   2> 1419553 INFO  (coreLoadExecutor-2918-thread-1-processing-n:127.0.0.1:43749_rf%2Fe) [n:127.0.0.1:43749_rf%2Fe c:control_collection s:shard1 r:core_node1 x:collection1] o.a.s.s.SolrIndexSearcher Opening Searcher@38232c71[collection1] main
   [junit4]   2> 1419553 INFO  (coreLoadExecutor-2918-thread-1-processing-n:127.0.0.1:43749_rf%2Fe) [n:127.0.0.1:43749_rf%2Fe c:control_collection s:shard1 r:core_node1 x:collection1] o.a.s.c.c.ZkStateReader Load collection config from:/collections/control_collection
   [junit4]   2> 1419554 INFO  (coreLoadExecutor-2918-thread-1-processing-n:127.0.0.1:43749_rf%2Fe) [n:127.0.0.1:43749_rf%2Fe c:control_collection s:shard1 r:core_node1 x:collection1] o.a.s.c.c.ZkStateReader path=/collections/control_collection configName=conf1 specified config exists in ZooKeeper
   [junit4]   2> 1419554 INFO  (coreLoadExecutor-2918-thread-1-processing-n:127.0.0.1:43749_rf%2Fe) [n:127.0.0.1:43749_rf%2Fe c:control_collection s:shard1 r:core_node1 x:collection1] o.a.s.r.ManagedResourceStorage Setting up ZooKeeper-based storage for the RestManager with znodeBase: /configs/conf1
   [junit4]   2> 1419555 INFO  (coreLoadExecutor-2918-thread-1-processing-n:127.0.0.1:43749_rf%2Fe) [n:127.0.0.1:43749_rf%2Fe c:control_collection s:shard1 r:core_node1 x:collection1] o.a.s.r.ManagedResourceStorage Configured ZooKeeperStorageIO with znodeBase: /configs/conf1
   [junit4]   2> 1419555 INFO  (coreLoadExecutor-2918-thread-1-processing-n:127.0.0.1:43749_rf%2Fe) [n:127.0.0.1:43749_rf%2Fe c:control_collection s:shard1 r:core_node1 x:collection1] o.a.s.r.RestManager Initializing RestManager with initArgs: {}
   [junit4]   2> 1419555 INFO  (coreLoadExecutor-2918-thread-1-processing-n:127.0.0.1:43749_rf%2Fe) [n:127.0.0.1:43749_rf%2Fe c:control_collection s:shard1 r:core_node1 x:collection1] o.a.s.r.ManagedResourceStorage Reading _rest_managed.json using ZooKeeperStorageIO:path=/configs/conf1
   [junit4]   2> 1419555 INFO  (coreLoadExecutor-2918-thread-1-processing-n:127.0.0.1:43749_rf%2Fe) [n:127.0.0.1:43749_rf%2Fe c:control_collection s:shard1 r:core_node1 x:collection1] o.a.s.r.ManagedResourceStorage No data found for znode /configs/conf1/_rest_managed.json
   [junit4]   2> 1419555 INFO  (coreLoadExecutor-2918-thread-1-processing-n:127.0.0.1:43749_rf%2Fe) [n:127.0.0.1:43749_rf%2Fe c:control_collection s:shard1 r:core_node1 x:collection1] o.a.s.r.ManagedResourceStorage Loaded null at path _rest_managed.json using ZooKeeperStorageIO:path=/configs/conf1
   [junit4]   2> 1419556 INFO  (coreLoadExecutor-2918-thread-1-processing-n:127.0.0.1:43749_rf%2Fe) [n:127.0.0.1:43749_rf%2Fe c:control_collection s:shard1 r:core_node1 x:collection1] o.a.s.r.RestManager Initializing 0 registered ManagedResources
   [junit4]   2> 1419556 INFO  (coreLoadExecutor-2918-thread-1-processing-n:127.0.0.1:43749_rf%2Fe) [n:127.0.0.1:43749_rf%2Fe c:control_collection s:shard1 r:core_node1 x:collection1] o.a.s.h.ReplicationHandler Commits will be reserved for  10000
   [junit4]   2> 1419556 INFO  (searcherExecutor-2919-thread-1-processing-s:shard1 r:core_node1 c:control_collection x:collection1 n:127.0.0.1:43749_rf%2Fe) [n:127.0.0.1:43749_rf%2Fe c:control_collection s:shard1 r:core_node1 x:collection1] o.a.s.c.SolrCore [collection1] Registered new searcher Searcher@38232c71[collection1] main{ExitableDirectoryReader(UninvertingDirectoryReader())}
   [junit4]   2> 1419557 INFO  (coreLoadExecutor-2918-thread-1-processing-n:127.0.0.1:43749_rf%2Fe) [n:127.0.0.1:43749_rf%2Fe c:control_collection s:shard1 r:core_node1 x:collection1] o.a.s.u.UpdateLog Looking up max value of version field to seed version buckets
   [junit4]   2> 1419557 INFO  (coreLoadExecutor-2918-thread-1-processing-n:127.0.0.1:43749_rf%2Fe) [n:127.0.0.1:43749_rf%2Fe c:control_collection s:shard1 r:core_node1 x:collection1] o.a.s.u.VersionInfo Refreshing highest value of _version_ for 65536 version buckets from index
   [junit4]   2> 1419557 INFO  (coreLoadExecutor-2918-thread-1-processing-n:127.0.0.1:43749_rf%2Fe) [n:127.0.0.1:43749_rf%2Fe c:control_collection s:shard1 r:core_node1 x:collection1] o.a.s.u.VersionInfo No terms found for _version_, cannot seed version bucket highest value from index
   [junit4]   2> 1419557 INFO  (coreLoadExecutor-2918-thread-1-processing-n:127.0.0.1:43749_rf%2Fe) [n:127.0.0.1:43749_rf%2Fe c:control_collection s:shard1 r:core_node1 x:collection1] o.a.s.u.UpdateLog Could not find max version in index or recent updates, using new clock 1506057512636383232
   [junit4]   2> 1419559 INFO  (coreLoadExecutor-2918-thread-1-processing-n:127.0.0.1:43749_rf%2Fe) [n:127.0.0.1:43749_rf%2Fe c:control_collection s:shard1 r:core_node1 x:collection1] o.a.s.u.UpdateLog Took 2 ms to seed version buckets with highest version 1506057512636383232
   [junit4]   2> 1419559 INFO  (coreLoadExecutor-2918-thread-1-processing-n:127.0.0.1:43749_rf%2Fe) [n:127.0.0.1:43749_rf%2Fe c:control_collection s:shard1 r:core_node1 x:collection1] o.a.s.c.ZkController watch zkdir /configs/conf1
   [junit4]   2> 1419560 INFO  (coreLoadExecutor-2918-thread-1-processing-n:127.0.0.1:43749_rf%2Fe) [n:127.0.0.1:43749_rf%2Fe c:control_collection s:shard1 r:core_node1 x:collection1] o.a.s.c.CoreContainer registering core: collection1
   [junit4]   2> 1419560 INFO  (coreZkRegister-2912-thread-1-processing-s:shard1 r:core_node1 c:control_collection x:collection1 n:127.0.0.1:43749_rf%2Fe) [n:127.0.0.1:43749_rf%2Fe c:control_collection s:shard1 r:core_node1 x:collection1] o.a.s.c.ZkController Register replica - core:collection1 address:https://127.0.0.1:43749/rf/e collection:control_collection shard:shard1
   [junit4]   2> 1419561 INFO  (coreZkRegister-2912-thread-1-processing-s:shard1 r:core_node1 c:control_collection x:collection1 n:127.0.0.1:43749_rf%2Fe) [n:127.0.0.1:43749_rf%2Fe c:control_collection s:shard1 r:core_node1 x:collection1] o.a.s.c.c.SolrZkClient makePath: /collections/control_collection/leader_elect/shard1/election
   [junit4]   2> 1419564 INFO  (coreZkRegister-2912-thread-1-processing-s:shard1 r:core_node1 c:control_collection x:collection1 n:127.0.0.1:43749_rf%2Fe) [n:127.0.0.1:43749_rf%2Fe c:control_collection s:shard1 r:core_node1 x:collection1] o.a.s.c.LeaderElector Joined leadership election with path: /collections/control_collection/leader_elect/shard1/election/94128594408046598-core_node1-n_0000000000
   [junit4]   2> 1419565 INFO  (coreZkRegister-2912-thread-1-processing-s:shard1 r:core_node1 c:control_collection x:collection1 n:127.0.0.1:43749_rf%2Fe) [n:127.0.0.1:43749_rf%2Fe c:control_collection s:shard1 r:core_node1 x:collection1] o.a.s.c.ShardLeaderElectionContext Running the leader process for shard shard1
   [junit4]   2> 1419566 INFO  (zkCallback-676-thread-1-processing-n:127.0.0.1:43749_rf%2Fe) [n:127.0.0.1:43749_rf%2Fe    ] o.a.s.c.DistributedQueue NodeChildrenChanged fired on path /overseer/queue state SyncConnected
   [junit4]   2> 1419567 INFO  (coreZkRegister-2912-thread-1-processing-s:shard1 r:core_node1 c:control_collection x:collection1 n:127.0.0.1:43749_rf%2Fe) [n:127.0.0.1:43749_rf%2Fe c:control_collection s:shard1 r:core_node1 x:collection1] o.a.s.c.ShardLeaderElectionContext Enough replicas found to continue.
   [junit4]   2> 1419567 INFO  (coreZkRegister-2912-thread-1-processing-s:shard1 r:core_node1 c:control_collection x:collection1 n:127.0.0.1:43749_rf%2Fe) [n:127.0.0.1:43749_rf%2Fe c:control_collection s:shard1 r:core_node1 x:collection1] o.a.s.c.ShardLeaderElectionContext I may be the new leader - try and sync
   [junit4]   2> 1419567 INFO  (OverseerStateUpdate-94128594408046598-127.0.0.1:43749_rf%2Fe-n_0000000000) [n:127.0.0.1:43749_rf%2Fe    ] o.a.s.c.Overseer processMessage: queueSize: 1, message = {
   [junit4]   2>   "operation":"leader",
   [junit4]   2>   "shard":"shard1",
   [junit4]   2>   "collection":"control_collection"} current state version: 1
   [junit4]   2> 1419567 INFO  (coreZkRegister-2912-thread-1-processing-s:shard1 r:core_node1 c:control_collection x:collection1 n:127.0.0.1:43749_rf%2Fe) [n:127.0.0.1:43749_rf%2Fe c:control_collection s:shard1 r:core_node1 x:collection1] o.a.s.c.SyncStrategy Sync replicas to https://127.0.0.1:43749/rf/e/collection1/
   [junit4]   2> 1419568 INFO  (coreZkRegister-2912-thread-1-processing-s:shard1 r:core_node1 c:control_collection x:collection1 n:127.0.0.1:43749_rf%2Fe) [n:127.0.0.1:43749_rf%2Fe c:control_collection s:shard1 r:core_node1 x:collection1] o.a.s.c.SyncStrategy Sync Success - now sync replicas to me
   [junit4]   2> 1419568 INFO  (coreZkRegister-2912-thread-1-processing-s:shard1 r:core_node1 c:control_collection x:collection1 n:127.0.0.1:43749_rf%2Fe) [n:127.0.0.1:43749_rf%2Fe c:control_collection s:shard1 r:core_node1 x:collection1] o.a.s.c.SyncStrategy https://127.0.0.1:43749/rf/e/collection1/ has no replicas
   [junit4]   2> 1419568 INFO  (coreZkRegister-2912-thread-1-processing-s:shard1 r:core_node1 c:control_collection x:collection1 n:127.0.0.1:43749_rf%2Fe) [n:127.0.0.1:43749_rf%2Fe c:control_collection s:shard1 r:core_node1 x:collection1] o.a.s.c.ShardLeaderElectionContext I am the new leader: https://127.0.0.1:43749/rf/e/collection1/ shard1
   [junit4]   2> 1419568 INFO  (coreZkRegister-2912-thread-1-processing-s:shard1 r:core_node1 c:control_collection x:collection1 n:127.0.0.1:43749_rf%2Fe) [n:127.0.0.1:43749_rf%2Fe c:control_collection s:shard1 r:core_node1 x:collection1] o.a.s.c.c.SolrZkClient makePath: /collections/control_collection/leaders/shard1
   [junit4]   2> 1419572 INFO  (zkCallback-676-thread-1-processing-n:127.0.0.1:43749_rf%2Fe) [n:127.0.0.1:43749_rf%2Fe    ] o.a.s.c.DistributedQueue NodeChildrenChanged fired on path /overseer/queue state SyncConnected
   [junit4]   2> 1419572 INFO  (OverseerStateUpdate-94128594408046598-127.0.0.1:43749_rf%2Fe-n_0000000000) [n:127.0.0.1:43749_rf%2Fe    ] o.a.s.c.Overseer processMessage: queueSize: 1, message = {
   [junit4]   2>   "operation":"leader",
   [junit4]   2>   "shard":"shard1",
   [junit4]   2>   "collection":"control_collection",
   [junit4]   2>   "base_url":"https://127.0.0.1:43749/rf/e",
   [junit4]   2>   "core":"collection1",
   [junit4]   2>   "state":"active"} current state version: 1
   [junit4]   2> 1419675 INFO  (zkCallback-676-thread-1-processing-n:127.0.0.1:43749_rf%2Fe) [n:127.0.0.1:43749_rf%2Fe    ] o.a.s.c.c.ZkStateReader A cluster state change: WatchedEvent state:SyncConnected type:NodeDataChanged path:/clusterstate.json, has occurred - updating... (live nodes size: 1)
   [junit4]   2> 1419677 INFO  (zkCallback-676-thread-1-processing-n:127.0.0.1:43749_rf%2Fe) [n:127.0.0.1:43749_rf%2Fe    ] o.a.s.c.c.ZkStateReader Updated cluster state version to 2
   [junit4]   2> 1419684 INFO  (TEST-CollectionsAPIDistributedZkTest.test-seed#[76E30C4D0133C65]) [    ] o.a.s.c.c.SolrZkClient Using default ZkCredentialsProvider
   [junit4]   2> 1419690 INFO  (TEST-CollectionsAPIDistributedZkTest.test-seed#[76E30C4D0133C65]) [    ] o.a.s.c.c.ConnectionManager Waiting for client to connect to ZooKeeper
   [junit4]   2> 1419694 INFO  (zkCallback-678-thread-1) [    ] o.a.s.c.c.ConnectionManager Watcher org.apache.solr.common.cloud.ConnectionManager@384523e3 name:ZooKeeperConnection Watcher:127.0.0.1:55347/solr got event WatchedEvent state:SyncConnected type:None path:null path:null type:None
   [junit4]   2> 1419695 INFO  (TEST-CollectionsAPIDistributedZkTest.test-seed#[76E30C4D0133C65]) [    ] o.a.s.c.c.ConnectionManager Client is connected to ZooKeeper
   [junit4]   2> 1419695 INFO  (TEST-CollectionsAPIDistributedZkTest.test-seed#[76E30C4D0133C65]) [    ] o.a.s.c.c.SolrZkClient Using default ZkACLProvider
   [junit4]   2> 1419695 INFO  (TEST-CollectionsAPIDistributedZkTest.test-seed#[76E30C4D0133C65]) [    ] o.a.s.c.c.ZkStateReader Updating cluster state from ZooKeeper... 
   [junit4]   2> 1419698 INFO  (TEST-CollectionsAPIDistributedZkTest.test-seed#[76E30C4D0133C65]) [    ] o.a.s.c.ChaosMonkey monkey: init - expire sessions:false cause connection loss:false
   [junit4]   2> 1419698 INFO  (TEST-CollectionsAPIDistributedZkTest.test-seed#[76E30C4D0133C65]) [    ] o.a.s.c.AbstractFullDistribZkTestBase Creating collection1 with stateFormat=2
   [junit4]   2> 1419698 INFO  (TEST-CollectionsAPIDistributedZkTest.test-seed#[76E30C4D0133C65]) [    ] o.a.s.c.c.SolrZkClient Using default ZkCredentialsProvider
   [junit4]   2> 1419698 INFO  (TEST-CollectionsAPIDistributedZkTest.test-seed#[76E30C4D0133C65]) [    ] o.a.s.c.c.ConnectionManager Waiting for client to connect to ZooKeeper
   [junit4]   2> 1419700 INFO  (zkCallback-679-thread-1) [    ] o.a.s.c.c.ConnectionManager Watcher org.apache.solr.common.cloud.ConnectionManager@397820c6 name:ZooKeeperConnection Watcher:127.0.0.1:55347/solr got event WatchedEvent state:SyncConnected type:None path:null path:null type:None
   [junit4]   2> 1419700 INFO  (TEST-CollectionsAPIDistributedZkTest.test-seed#[76E30C4D0133C65]) [    ] o.a.s.c.c.ConnectionManager Client is connected to ZooKeeper
   [junit4]   2> 1419700 INFO  (TEST-CollectionsAPIDistributedZkTest.test-seed#[76E30C4D0133C65]) [    ] o.a.s.c.c.SolrZkClient Using default ZkACLProvider
   [junit4]   2> 1419702 INFO  (zkCallback-676-thread-1-processing-n:127.0.0.1:43749_rf%2Fe) [n:127.0.0.1:43749_rf%2Fe    ] o.a.s.c.DistributedQueue NodeChildrenChanged fired on path /overseer/queue state SyncConnected
   [junit4]   2> 1419704 INFO  (OverseerStateUpdate-94128594408046598-127.0.0.1:43749_rf%2Fe-n_0000000000) [n:127.0.0.1:43749_rf%2Fe    ] o.a.s.c.Overseer processMessage: queueSize: 1, message = {
   [junit4]   2>   "operation":"create",
   [junit4]   2>   "name":"collection1",
   [junit4]   2>   "numShards":"2",
   [junit4]   2>   "stateFormat":"2"} current state version: 2
   [junit4]   2> 1419704 INFO  (OverseerStateUpdate-94128594408046598-127.0.0.1:43749_rf%2Fe-n_0000000000) [n:127.0.0.1:43749_rf%2Fe    ] o.a.s.c.o.ClusterStateMutator building a new cName: collection1
   [junit4]   2> 1419723 INFO  (coreZkRegister-2912-thread-1-processing-s:shard1 r:core_node1 c:control_collection x:collection1 n:127.0.0.1:43749_rf%2Fe) [n:127.0.0.1:43749_rf%2Fe c:control_collection s:shard1 r:core_node1 x:collection1] o.a.s.c.ZkController We are https://127.0.0.1:43749/rf/e/collection1/ and leader is https://127.0.0.1:43749/rf/e/collection1/
   [junit4]   2> 1419724 INFO  (coreZkRegister-2912-thread-1-processing-s:shard1 r:core_node1 c:control_collection x:collection1 n:127.0.0.1:43749_rf%2Fe) [n:127.0.0.1:43749_rf%2Fe c:control_collection s:shard1 r:core_node1 x:collection1] o.a.s.c.ZkController No LogReplay needed for core=collection1 baseURL=https://127.0.0.1:43749/rf/e
   [junit4]   2> 1419724 INFO  (coreZkRegister-2912-thread-1-processing-s:shard1 r:core_node1 c:control_collection x:collection1 n:127.0.0.1:43749_rf%2Fe) [n:127.0.0.1:43749_rf%2Fe c:control_collection s:shard1 r:core_node1 x:collection1] o.a.s.c.ZkController I am the leader, no recovery necessary
   [junit4]   2> 1419724 INFO  (coreZkRegister-2912-thread-1-processing-s:shard1 r:core_node1 c:control_collection x:collection1 n:127.0.0.1:43749_rf%2Fe) [n:127.0.0.1:43749_rf%2Fe c:control_collection s:shard1 r:core_node1 x:collection1] o.a.s.c.ZkController publishing state=active
   [junit4]   2> 1419724 INFO  (coreZkRegister-2912-thread-1-processing-s:shard1 r:core_node1 c:control_collection x:collection1 n:127.0.0.1:43749_rf%2Fe) [n:127.0.0.1:43749_rf%2Fe c:control_collection s:shard1 r:core_node1 x:collection1] o.a.s.c.ZkController numShards not found on descriptor - reading it from system property
   [junit4]   2> 1419725 INFO  (zkCallback-676-thread-1-processing-n:127.0.0.1:43749_rf%2Fe) [n:127.0.0.1:43749_rf%2Fe    ] o.a.s.c.DistributedQueue NodeChildrenChanged fired on path /overseer/queue state SyncConnected
   [junit4]   2> 1419726 INFO  (OverseerStateUpdate-94128594408046598-127.0.0.1:43749_rf%2Fe-n_0000000000) [n:127.0.0.1:43749_rf%2Fe    ] o.a.s.c.Overseer processMessage: queueSize: 1, message = {
   [junit4]   2>   "shard":"shard1",
   [junit4]   2>   "core_node_name":"core_node1",
   [junit4]   2>   "numShards":"2",
   [junit4]   2>   "base_url":"https://127.0.0.1:43749/rf/e",
   [junit4]   2>   "operation":"state",
   [junit4]   2>   "collection":"control_collection",
   [junit4]   2>   "state":"active",
   [junit4]   2>   "roles":null,
   [junit4]   2>   "node_name":"127.0.0.1:43749_rf%2Fe",
   [junit4]   2>   "core":"collection1"} current state version: 2
   [junit4]   2> 1419731 INFO  (OverseerStateUpdate-94128594408046598-127.0.0.1:43749_rf%2Fe-n_0000000000) [n:127.0.0.1:43749_rf%2Fe    ] o.a.s.c.o.ReplicaMutator Update state numShards=2 message={
   [junit4]   2>   "shard":"shard1",
   [junit4]   2>   "core_node_name":"core_node1",
   [junit4]   2>   "numShards":"2",
   [junit4]   2>   "base_url":"https://127.0.0.1:43749/rf/e",
   [junit4]   2>   "operation":"state",
   [junit4]   2>   "collection":"control_collection",
   [junit4]   2>   "state":"active",
   [junit4]   2>   "roles":null,
   [junit4]   2>   "node_name":"127.0.0.1:43749_rf%2Fe",
   [junit4]   2>   "core":"collection1"}
   [junit4]   2> 1419731 INFO  (OverseerStateUpdate-94128594408046598-127.0.0.1:43749_rf%2Fe-n_0000000000) [n:127.0.0.1:43749_rf%2Fe    ] o.a.s.c.o.ZkStateWriter going to create_collection /collections/collection1/state.json
   [junit4]   2> 1419732 INFO  (zkCallback-678-thread-1) [    ] o.a.s.c.c.ZkStateReader A cluster state change: WatchedEvent state:SyncConnected type:NodeDataChanged path:/clusterstate.json, has occurred - updating... (live nodes size: 1)
   [junit4]   2> 1419732 INFO  (zkCallback-676-thread-1-processing-n:127.0.0.1:43749_rf%2Fe) [n:127.0.0.1:43749_rf%2Fe    ] o.a.s.c.c.ZkStateReader A cluster state change: WatchedEvent state:SyncConnected type:NodeDataChanged path:/clusterstate.json, has occurred - updating... (live nodes size: 1)
   [junit4]   2> 1419734 INFO  (zkCallback-678-thread-1) [    ] o.a.s.c.c.ZkStateReader Updated cluster state version to 3
   [junit4]   2> 1419735 INFO  (zkCallback-676-thread-1-processing-n:127.0.0.1:43749_rf%2Fe) [n:127.0.0.1:43749_rf%2Fe    ] o.a.s.c.c.ZkStateReader Updated cluster state version to 3
   [junit4]   2> 1419837 INFO  (zkCallback-678-thread-1) [    ] o.a.s.c.c.ZkStateReader A cluster state change: WatchedEvent state:SyncConnected type:NodeDataChanged path:/clusterstate.json, has occurred - updating... (live nodes size: 1)
   [junit4]   2> 1419837 INFO  (zkCallback-676-thread-1-processing-n:127.0.0.1:43749_rf%2Fe) [n:127.0.0.1:43749_rf%2Fe    ] o.a.s.c.c.ZkStateReader A cluster state change: WatchedEvent state:SyncConnected type:NodeDataChanged path:/clusterstate.json, has occurred - updating... (live nodes size: 1)
   [junit4]   2> 1419839 INFO  (zkCallback-678-thread-1) [    ] o.a.s.c.c.ZkStateReader Updated cluster state version to 4
   [junit4]   2> 1419840 INFO  (zkCallback-676-thread-1-processing-n:127.0.0.1:43749_rf%2Fe) [n:127.0.0.1:43749_rf%2Fe    ] o.a.s.c.c.ZkStateReader Updated cluster state version to 4
   [junit4]   2> 1419974 INFO  (TEST-CollectionsAPIDistributedZkTest.test-seed#[76E30C4D0133C65]) [    ] o.a.s.SolrTestCaseJ4 Writing core.properties file to /x1/jenkins/jenkins-slave/workspace/Lucene-Solr-NightlyTests-5.x/solr/build/solr-core/test/J0/temp/solr.cloud.CollectionsAPIDistributedZkTest_76E30C4D0133C65-001/shard-1-001/cores/collection1
   [junit4]   2> 1419975 INFO  (TEST-CollectionsAPIDistributedZkTest.test-seed#[76E30C4D0133C65]) [    ] o.a.s.c.AbstractFullDistribZkTestBase create jetty 1 in directory /x1/jenkins/jenkins-slave/workspace/Lucene-Solr-NightlyTests-5.x/solr/build/solr-core/test/J0/temp/solr.cloud.CollectionsAPIDistributedZkTest_76E30C4D0133C65-001/shard-1-001
   [junit4]   2> 1419976 INFO  (TEST-CollectionsAPIDistributedZkTest.test-seed#[76E30C4D0133C65]) [    ] o.e.j.s.Server jetty-9.2.11.v20150529
   [junit4]   2> 1419977 INFO  (TEST-CollectionsAPIDistributedZkTest.test-seed#[76E30C4D0133C65]) [    ] o.e.j.s.h.ContextHandler Started o.e.j.s.ServletContextHandler@174bf483{/rf/e,null,AVAILABLE}
   [junit4]   2> 1419980 INFO  (TEST-CollectionsAPIDistributedZkTest.test-seed#[76E30C4D0133C65]) [    ] o.e.j.s.ServerConnector Started ServerConnector@7b3a9fe7{SSL-http/1.1}{127.0.0.1:56468}
   [junit4]   2> 1419981 INFO  (TEST-CollectionsAPIDistributedZkTest.test-seed#[76E30C4D0133C65]) [    ] o.e.j.s.Server Started @1422961ms
   [junit4]   2> 1419981 INFO  (TEST-CollectionsAPIDistributedZkTest.test-seed#[76E30C4D0133C65]) [    ] o.a.s.c.s.e.JettySolrRunner Jetty properties: {solr.data.dir=/x1/jenkins/jenkins-slave/workspace/Lucene-Solr-NightlyTests-5.x/solr/build/solr-core/test/J0/temp/solr.cloud.CollectionsAPIDistributedZkTest_76E30C4D0133C65-001/tempDir-001/jetty1, coreRootDirectory=/x1/jenkins/jenkins-slave/workspace/Lucene-Solr-NightlyTests-5.x/solr/build/solr-core/test/J0/temp/solr.cloud.CollectionsAPIDistributedZkTest_76E30C4D0133C65-001/shard-1-001/cores, hostPort=56468, hostContext=/rf/e, solrconfig=solrconfig.xml}
   [junit4]   2> 1419982 INFO  (TEST-CollectionsAPIDistributedZkTest.test-seed#[76E30C4D0133C65]) [    ] o.a.s.s.SolrDispatchFilter SolrDispatchFilter.init(): sun.misc.Launcher$AppClassLoader@6b482747
   [junit4]   2> 1419982 INFO  (TEST-CollectionsAPIDistributedZkTest.test-seed#[76E30C4D0133C65]) [    ] o.a.s.c.SolrResourceLoader new SolrResourceLoader for directory: '/x1/jenkins/jenkins-slave/workspace/Lucene-Solr-NightlyTests-5.x/solr/build/solr-core/test/J0/temp/solr.cloud.CollectionsAPIDistributedZkTest_76E30C4D0133C65-001/shard-1-001/'
   [junit4]   2> 1419998 INFO  (TEST-CollectionsAPIDistributedZkTest.test-seed#[76E30C4D0133C65]) [    ] o.a.s.c.SolrXmlConfig Loading container configuration from /x1/jenkins/jenkins-slave/workspace/Lucene-Solr-NightlyTests-5.x/solr/build/solr-core/test/J0/temp/solr.cloud.CollectionsAPIDistributedZkTest_76E30C4D0133C65-001/shard-1-001/solr.xml
   [junit4]   2> 1420024 INFO  (TEST-CollectionsAPIDistributedZkTest.test-seed#[76E30C4D0133C65]) [    ] o.a.s.c.CoresLocator Config-defined core root directory: /x1/jenkins/jenkins-slave/workspace/Lucene-Solr-NightlyTests-5.x/solr/build/solr-core/test/J0/temp/solr.cloud.CollectionsAPIDistributedZkTest_76E30C4D0133C65-001/shard-1-001/cores
   [junit4]   2> 1420024 INFO  (TEST-CollectionsAPIDistributedZkTest.test-seed#[76E30C4D0133C65]) [    ] o.a.s.c.CoreContainer New CoreContainer 1710189455
   [junit4]   2> 1420025 INFO  (TEST-CollectionsAPIDistributedZkTest.test-seed#[76E30C4D0133C65]) [    ] o.a.s.c.CoreContainer Loading cores into CoreContainer [instanceDir=/x1/jenkins/jenkins-slave/workspace/Lucene-Solr-NightlyTests-5.x/solr/build/solr-core/test/J0/temp/solr.cloud.CollectionsAPIDistributedZkTest_76E30C4D0133C65-001/shard-1-001/]
   [junit4]   2> 1420025 INFO  (TEST-CollectionsAPIDistributedZkTest.test-seed#[76E30C4D0133C65]) [    ] o.a.s.c.CoreContainer loading shared library: /x1/jenkins/jenkins-slave/workspace/Lucene-Solr-NightlyTests-5.x/solr/build/solr-core/test/J0/temp/solr.cloud.CollectionsAPIDistributedZkTest_76E30C4D0133C65-001/shard-1-001/lib
   [junit4]   2> 1420025 WARN  (TEST-CollectionsAPIDistributedZkTest.test-seed#[76E30C4D0133C65]) [    ] o.a.s.c.SolrResourceLoader Can't find (or read) directory to add to classloader: lib (resolved as: /x1/jenkins/jenkins-slave/workspace/Lucene-Solr-NightlyTests-5.x/solr/build/solr-core/test/J0/temp/solr.cloud.CollectionsAPIDistributedZkTest_76E30C4D0133C65-001/shard-1-001/lib).
   [junit4]   2> 1420033 INFO  (TEST-CollectionsAPIDistributedZkTest.test-seed#[76E30C4D0133C65]) [    ] o.a.s.h.c.HttpShardHandlerFactory created with socketTimeout : 90000,urlScheme : ,connTimeout : 15000,maxConnectionsPerHost : 20,maxConnections : 10000,corePoolSize : 0,maximumPoolSize : 2147483647,maxThreadIdleTime : 5,sizeOfQueue : -1,fairnessPolicy : false,useRetries : false,
   [junit4]   2> 1420035 INFO  (TEST-CollectionsAPIDistributedZkTest.test-seed#[76E30C4D0133C65]) [    ] o.a.s.u.UpdateShardHandler Creating UpdateShardHandler HTTP client with params: socketTimeout=340000&connTimeout=45000&retry=true
   [junit4]   2> 1420036 INFO  (TEST-CollectionsAPIDistributedZkTest.test-seed#[76E30C4D0133C65]) [    ] o.a.s.l.LogWatcher SLF4J impl is org.slf4j.impl.Log4jLoggerFactory
   [junit4]   2> 1420037 INFO  (TEST-CollectionsAPIDistributedZkTest.test-seed#[76E30C4D0133C65]) [    ] o.a.s.l.LogWatcher Registering Log Listener [Log4j (org.slf4j.impl.Log4jLoggerFactory)]
   [junit4]   2> 1420037 INFO  (TEST-CollectionsAPIDistributedZkTest.test-seed#[76E30C4D0133C65]) [    ] o.a.s.c.ZkContainer Zookeeper client=127.0.0.1:55347/solr
   [junit4]   2> 1420037 INFO  (TEST-CollectionsAPIDistributedZkTest.test-seed#[76E30C4D0133C65]) [    ] o.a.s.c.ZkController zkHost includes chroot
   [junit4]   2> 1420037 INFO  (TEST-CollectionsAPIDistributedZkTest.test-seed#[76E30C4D0133C65]) [    ] o.a.s.c.c.SolrZkClient Using default ZkCredentialsProvider
   [junit4]   2> 1420038 INFO  (TEST-CollectionsAPIDistributedZkTest.test-seed#[76E30C4D0133C65]) [    ] o.a.s.c.c.ConnectionManager Waiting for client to connect to ZooKeeper
   [junit4]   2> 1420039 INFO  (zkCallback-681-thread-1) [    ] o.a.s.c.c.ConnectionManager Watcher org.apache.solr.common.cloud.ConnectionManager@6a78ed21 name:ZooKeeperConnection Watcher:127.0.0.1:55347 got event WatchedEvent state:SyncConnected type:None path:null path:null type:None
   [junit4]   2> 1420040 INFO  (TEST-CollectionsAPIDistributedZkTest.test-seed#[76E30C4D0133C65]) [    ] o.a.s.c.c.ConnectionManager Client is connected to ZooKeeper
   [junit4]   2> 1420040 INFO  (TEST-CollectionsAPIDistributedZkTest.test-seed#[76E30C4D0133C65]) [    ] o.a.s.c.c.SolrZkClient Using default ZkACLProvider
   [junit4]   2> 1420042 INFO  (TEST-CollectionsAPIDistributedZkTest.test-seed#[76E30C4D0133C65]) [n:127.0.0.1:56468_rf%2Fe    ] o.a.s.c.c.ConnectionManager Waiting for client to connect to ZooKeeper
   [junit4]   2> 1420043 INFO  (zkCallback-682-thread-1-processing-n:127.0.0.1:56468_rf%2Fe) [n:127.0.0.1:56468_rf%2Fe    ] o.a.s.c.c.ConnectionManager Watcher org.apache.solr.common.cloud.ConnectionManager@955553c name:ZooKeeperConnection Watcher:127.0.0.1:55347/solr got event WatchedEvent state:SyncConnected type:None path:null path:null type:None
   [junit4]   2> 1420044 INFO  (TEST-CollectionsAPIDistributedZkTest.test-seed#[76E30C4D0133C65]) [n:127.0.0.1:56468_rf%2Fe    ] o.a.s.c.c.ConnectionManager Client is connected to ZooKeeper
   [junit4]   2> 1420048 INFO  (TEST-CollectionsAPIDistributedZkTest.test-seed#[76E30C4D0133C65]) [n:127.0.0.1:56468_rf%2Fe    ] o.a.s.c.c.ZkStateReader Updating cluster state from ZooKeeper... 
   [junit4]   2> 1421053 INFO  (TEST-CollectionsAPIDistributedZkTest.test-seed#[76E30C4D0133C65]) [n:127.0.0.1:56468_rf%2Fe    ] o.a.s.c.ZkController Register node as live in ZooKeeper:/live_nodes/127.0.0.1:56468_rf%2Fe
   [junit4]   2> 1421054 INFO  (TEST-CollectionsAPIDistributedZkTest.test-seed#[76E30C4D0133C65]) [n:127.0.0.1:56468_rf%2Fe    ] o.a.s.c.c.SolrZkClient makePath: /live_nodes/127.0.0.1:56468_rf%2Fe
   [junit4]   2> 1421057 INFO  (TEST-CollectionsAPIDistributedZkTest.test-seed#[76E30C4D0133C65]) [n:127.0.0.1:56468_rf%2Fe    ] o.a.s.c.Overseer Overseer (id=null) closing
   [junit4]   2> 1421058 INFO  (TEST-CollectionsAPIDistributedZkTest.test-seed#[76E30C4D0133C65]) [n:127.0.0.1:56468_rf%2Fe    ] o.a.s.c.LeaderElector Joined leadership election with path: /overseer_elect/election/94128594408046602-127.0.0.1:56468_rf%2Fe-n_0000000001
   [junit4]   2> 1421059 INFO  (TEST-CollectionsAPIDistributedZkTest.test-seed#[76E30C4D0133C65]) [n:127.0.0.1:56468_rf%2Fe    ] o.a.s.c.LeaderElector Watching path /overseer_elect/election/94128594408046598-127.0.0.1:43749_rf%2Fe-n_0000000000 to know if I could be the leader
   [junit4]   2> 1421059 INFO  (TEST-CollectionsAPIDistributedZkTest.test-seed#[76E30C4D0133C65]) [n:127.0.0.1:56468_rf%2Fe    ] o.a.s.c.CoreContainer No authentication plugin used.
   [junit4]   2> 1421059 INFO  (TEST-CollectionsAPIDistributedZkTest.test-seed#[76E30C4D0133C65]) [n:127.0.0.1:56468_rf%2Fe    ] o.a.s.c.CoreContainer Security conf doesn't exist. Skipping setup for authorization module.
   [junit4]   2> 1421060 INFO  (TEST-CollectionsAPIDistributedZkTest.test-seed#[76E30C4D0133C65]) [n:127.0.0.1:56468_rf%2Fe    ] o.a.s.c.CoresLocator Looking for core definitions underneath /x1/jenkins/jenkins-slave/workspace/Lucene-Solr-NightlyTests-5.x/solr/build/solr-core/test/J0/temp/solr.cloud.CollectionsAPIDistributedZkTest_76E30C4D0133C65-001/shard-1-001/cores
   [junit4]   2> 1421061 INFO  (TEST-CollectionsAPIDistributedZkTest.test-seed#[76E30C4D0133C65]) [n:127.0.0.1:56468_rf%2Fe    ] o.a.s.c.SolrCore Created CoreDescriptor: {instanceDir=/x1/jenkins/jenkins-slave/workspace/Lucene-Solr-NightlyTests-5.x/solr/build/solr-core/test/J0/temp/solr.cloud.CollectionsAPIDistributedZkTest_76E30C4D0133C65-001/shard-1-001/cores/collection1, absoluteInstDir=/x1/jenkins/jenkins-slave/workspace/Lucene-Solr-NightlyTests-5.x/solr/build/solr-core/test/J0/temp/solr.cloud.CollectionsAPIDistributedZkTest_76E30C4D0133C65-001/shard-1-001/cores/collection1/, collection=collection1, transient=false, schema=schema.xml, coreNodeName=, name=collection1, config=solrconfig.xml, shard=, dataDir=data/, loadOnStartup=true}
   [junit4]   2> 1421061 INFO  (TEST-CollectionsAPIDistributedZkTest.test-seed#[76E30C4D0133C65]) [n:127.0.0.1:56468_rf%2Fe    ] o.a.s.c.CoresLocator Found core collection1 in /x1/jenkins/jenkins-slave/workspace/Lucene-Solr-NightlyTests-5.x/solr/build/solr-core/test/J0/temp/solr.cloud.CollectionsAPIDistributedZkTest_76E30C4D0133C65-001/shard-1-001/cores/collection1/
   [junit4]   2> 1421061 INFO  (TEST-CollectionsAPIDistributedZkTest.test-seed#[76E30C4D0133C65]) [n:127.0.0.1:56468_rf%2Fe    ] o.a.s.c.CoresLocator Found 1 core definitions
   [junit4]   2> 1421062 INFO  (TEST-CollectionsAPIDistributedZkTest.test-seed#[76E30C4D0133C65]) [n:127.0.0.1:56468_rf%2Fe    ] o.a.s.s.SolrDispatchFilter user.dir=/x1/jenkins/jenkins-slave/workspace/Lucene-Solr-NightlyTests-5.x/solr/build/solr-core/test/J0
   [junit4]   2> 1421062 INFO  (TEST-CollectionsAPIDistributedZkTest.test-seed#[76E30C4D0133C65]) [n:127.0.0.1:56468_rf%2Fe    ] o.a.s.s.SolrDispatchFilter SolrDispatchFilter.init() done
   [junit4]   2> 1421063 INFO  (coreLoadExecutor-2929-thread-1-processing-n:127.0.0.1:56468_rf%2Fe) [n:127.0.0.1:56468_rf%2Fe c:collection1   x:collection1] o.a.s.c.ZkController publishing state=down
   [junit4]   2> 1421063 INFO  (coreLoadExecutor-2929-thread-1-processing-n:127.0.0.1:56468_rf%2Fe) [n:127.0.0.1:56468_rf%2Fe c:collection1   x:collection1] o.a.s.c.ZkController numShards not found on descriptor - reading it from system property
   [junit4]   2> 1421064 INFO  (zkCallback-676-thread-1-processing-n:127.0.0.1:43749_rf%2Fe) [n:127.0.0.1:43749_rf%2Fe    ] o.a.s.c.DistributedQueue NodeChildrenChanged fired on path /overseer/queue state SyncConnected
   [junit4]   2> 1421065 INFO  (coreLoadExecutor-2929-thread-1-processing-n:127.0.0.1:56468_rf%2Fe) [n:127.0.0.1:56468_rf%2Fe c:collection1   x:collection1] o.a.s.c.ZkController Registering watch for external collection collection1
   [junit4]   2> 1421065 INFO  (coreLoadExecutor-2929-thread-1-processing-n:127.0.0.1:56468_rf%2Fe) [n:127.0.0.1:56468_rf%2Fe c:collection1   x:collection1] o.a.s.c.c.ZkStateReader addZkWatch collection1
   [junit4]   2> 1421065 INFO  (OverseerStateUpdate-94128594408046598-127.0.0.1:43749_rf%2Fe-n_0000000000) [n:127.0.0.1:43749_rf%2Fe    ] o.a.s.c.Overseer processMessage: queueSize: 1, message = {
   [junit4]   2>   "shard":null,
   [junit4]   2>   "numShards":"2",
   [junit4]   2>   "base_url":"https://127.0.0.1:56468/rf/e",
   [junit4]   2>   "operation":"state",
   [junit4]   2>   "collection":"collection1",
   [junit4]   2>   "state":"down",
   [junit4]   2>   "roles":null,
   [junit4]   2>   "node_name":"127.0.0.1:56468_rf%2Fe",
   [junit4]   2>   "core":"collection1"} current state version: 4
   [junit4]   2> 1421065 INFO  (coreLoadExecutor-2929-thread-1-processing-n:127.0.0.1:56468_rf%2Fe) [n:127.0.0.1:56468_rf%2Fe c:collection1   x:collection1] o.a.s.c.c.ZkStateReader Updating collection state at /collections/collection1/state.json from ZooKeeper... 
   [junit4]   2> 1421066 INFO  (OverseerStateUpdate-94128594408046598-127.0.0.1:43749_rf%2Fe-n_0000000000) [n:127.0.0.1:43749_rf%2Fe    ] o.a.s.c.o.ReplicaMutator Update state numShards=2 message={
   [junit4]   2>   "shard":null,
   [junit4]   2>   "numShards":"2",
   [junit4]   2>   "base_url":"https://127.0.0.1:56468/rf/e",
   [junit4]   2>   "operation":"state",
   [junit4]   2>   "collection":"collection1",
   [junit4]   2>   "state":"down",
   [junit4]   2>   "roles":null,
   [junit4]   2>   "node_name":"127.0.0.1:56468_rf%2Fe",
   [junit4]   2>   "core":"collection1"}
   [junit4]   2> 1421066 INFO  (OverseerStateUpdate-94128594408046598-127.0.0.1:43749_rf%2Fe-n_0000000000) [n:127.0.0.1:43749_rf%2Fe    ] o.a.s.c.o.ReplicaMutator Collection already exists with numShards=2
   [junit4]   2> 1421066 INFO  (OverseerStateUpdate-94128594408046598-127.0.0.1:43749_rf%2Fe-n_0000000000) [n:127.0.0.1:43749_rf%2Fe    ] o.a.s.c.o.ReplicaMutator Assigning new node to shard shard=shard1
   [junit4]   2> 1421066 INFO  (coreLoadExecutor-2929-thread-1-processing-n:127.0.0.1:56468_rf%2Fe) [n:127.0.0.1:56468_rf%2Fe c:collection1   x:collection1] o.a.s.c.c.ZkStateReader Updating data for collection1 to ver 0 
   [junit4]   2> 1421066 INFO  (coreLoadExecutor-2929-thread-1-processing-n:127.0.0.1:56468_rf%2Fe) [n:127.0.0.1:56468_rf%2Fe c:collection1   x:collection1] o.a.s.c.ZkController look for our core node name
   [junit4]   2> 1421169 INFO  (OverseerStateUpdate-94128594408046598-127.0.0.1:43749_rf%2Fe-n_0000000000) [n:127.0.0.1:43749_rf%2Fe    ] o.a.s.c.o.ZkStateWriter going to update_collection /collections/collection1/state.json version: 0
   [junit4]   2> 1421169 INFO  (zkCallback-682-thread-1-processing-n:127.0.0.1:56468_rf%2Fe) [n:127.0.0.1:56468_rf%2Fe    ] o.a.s.c.c.ZkStateReader A cluster state change: WatchedEvent state:SyncConnected type:NodeDataChanged path:/collections/collection1/state.json for collection collection1 has occurred - updating... (live nodes size: 2)
   [junit4]   2> 1421170 INFO  (zkCallback-682-thread-1-processing-n:127.0.0.1:56468_rf%2Fe) [n:127.0.0.1:56468_rf%2Fe    ] o.a.s.c.c.ZkStateReader Updating data for collection1 to ver 1 
   [junit4]   2> 1422066 INFO  (coreLoadExecutor-2929-thread-1-processing-n:127.0.0.1:56468_rf%2Fe) [n:127.0.0.1:56468_rf%2Fe c:collection1   x:collection1] o.a.s.c.ZkController waiting to find shard id in clusterstate for collection1
   [junit4]   2> 1422067 INFO  (coreLoadExecutor-2929-thread-1-processing-n:127.0.0.1:56468_rf%2Fe) [n:127.0.0.1:56468_rf%2Fe c:collection1   x:collection1] o.a.s.c.ZkController Check for collection zkNode:collection1
   [junit4]   2> 1422068 INFO  (coreLoadExecutor-2929-thread-1-processing-n:127.0.0.1:56468_rf%2Fe) [n:127.0.0.1:56468_rf%2Fe c:collection1   x:collection1] o.a.s.c.ZkController Collection zkNode exists
   [junit4]   2> 1422068 INFO  (coreLoadExecutor-2929-thread-1-processing-n:127.0.0.1:56468_rf%2Fe) [n:127.0.0.1:56468_rf%2Fe c:collection1   x:collection1] o.a.s.c.c.ZkStateReader Load collection config from:/collections/collection1
   [junit4]   2> 1422068 INFO  (coreLoadExecutor-2929-thread-1-processing-n:127.0.0.1:56468_rf%2Fe) [n:127.0.0.1:56468_rf%2Fe c:collection1   x:collection1] o.a.s.c.c.ZkStateReader path=/collections/collection1 configName=conf1 specified config exists in ZooKeeper
   [junit4]   2> 1422069 INFO  (coreLoadExecutor-2929-thread-1-processing-n:127.0.0.1:56468_rf%2Fe) [n:127.0.0.1:56468_rf%2Fe c:collection1   x:collection1] o.a.s.c.SolrResourceLoader new SolrResourceLoader for directory: '/x1/jenkins/jenkins-slave/workspace/Lucene-Solr-NightlyTests-5.x/solr/build/solr-core/test/J0/temp/solr.cloud.CollectionsAPIDistributedZkTest_76E30C4D0133C65-001/shard-1-001/cores/collection1/'
   [junit4]   2> 1422084 INFO  (coreLoadExecutor-2929-thread-1-processing-n:127.0.0.1:56468_rf%2Fe) [n:127.0

[...truncated too long message...]

olrj.impl.CloudSolrClient.requestWithRetryOnStaleState(CloudSolrClient.java:856)
   [junit4]    > 	at org.apache.solr.client.solrj.impl.CloudSolrClient.request(CloudSolrClient.java:799)
   [junit4]    > 	at org.apache.solr.client.solrj.SolrClient.request(SolrClient.java:1220)
   [junit4]    > 	at org.apache.solr.cloud.AbstractFullDistribZkTestBase.createCollection(AbstractFullDistribZkTestBase.java:1572)
   [junit4]    > 	at org.apache.solr.cloud.AbstractFullDistribZkTestBase.createCollection(AbstractFullDistribZkTestBase.java:1593)
   [junit4]    > 	at org.apache.solr.cloud.CollectionsAPIDistributedZkTest$1CollectionThread.run(CollectionsAPIDistributedZkTest.java:887)Throwable #4: com.carrotsearch.randomizedtesting.UncaughtExceptionError: Captured an uncaught exception in thread: Thread[id=7189, name=collection2, state=RUNNABLE, group=TGRP-CollectionsAPIDistributedZkTest]
   [junit4]    > Caused by: org.apache.solr.client.solrj.impl.HttpSolrClient$RemoteSolrException: Error from server at https://127.0.0.1:48015/rf/e: collection already exists: awholynewstresscollection_collection2_9
   [junit4]    > 	at __randomizedtesting.SeedInfo.seed([76E30C4D0133C65]:0)
   [junit4]    > 	at org.apache.solr.client.solrj.impl.HttpSolrClient.executeMethod(HttpSolrClient.java:560)
   [junit4]    > 	at org.apache.solr.client.solrj.impl.HttpSolrClient.request(HttpSolrClient.java:234)
   [junit4]    > 	at org.apache.solr.client.solrj.impl.HttpSolrClient.request(HttpSolrClient.java:226)
   [junit4]    > 	at org.apache.solr.client.solrj.impl.LBHttpSolrClient.doRequest(LBHttpSolrClient.java:376)
   [junit4]    > 	at org.apache.solr.client.solrj.impl.LBHttpSolrClient.request(LBHttpSolrClient.java:328)
   [junit4]    > 	at org.apache.solr.client.solrj.impl.CloudSolrClient.sendRequest(CloudSolrClient.java:1086)
   [junit4]    > 	at org.apache.solr.client.solrj.impl.CloudSolrClient.requestWithRetryOnStaleState(CloudSolrClient.java:856)
   [junit4]    > 	at org.apache.solr.client.solrj.impl.CloudSolrClient.request(CloudSolrClient.java:799)
   [junit4]    > 	at org.apache.solr.client.solrj.SolrClient.request(SolrClient.java:1220)
   [junit4]    > 	at org.apache.solr.cloud.AbstractFullDistribZkTestBase.createCollection(AbstractFullDistribZkTestBase.java:1572)
   [junit4]    > 	at org.apache.solr.cloud.AbstractFullDistribZkTestBase.createCollection(AbstractFullDistribZkTestBase.java:1593)
   [junit4]    > 	at org.apache.solr.cloud.CollectionsAPIDistributedZkTest$1CollectionThread.run(CollectionsAPIDistributedZkTest.java:887)Throwable #5: com.carrotsearch.randomizedtesting.UncaughtExceptionError: Captured an uncaught exception in thread: Thread[id=7192, name=collection5, state=RUNNABLE, group=TGRP-CollectionsAPIDistributedZkTest]
   [junit4]    > Caused by: org.apache.solr.client.solrj.impl.HttpSolrClient$RemoteSolrException: Error from server at https://127.0.0.1:48015/rf/e: Could not find collection : awholynewstresscollection_collection5_8
   [junit4]    > 	at __randomizedtesting.SeedInfo.seed([76E30C4D0133C65]:0)
   [junit4]    > 	at org.apache.solr.client.solrj.impl.HttpSolrClient.executeMethod(HttpSolrClient.java:560)
   [junit4]    > 	at org.apache.solr.client.solrj.impl.HttpSolrClient.request(HttpSolrClient.java:234)
   [junit4]    > 	at org.apache.solr.client.solrj.impl.HttpSolrClient.request(HttpSolrClient.java:226)
   [junit4]    > 	at org.apache.solr.client.solrj.impl.LBHttpSolrClient.doRequest(LBHttpSolrClient.java:376)
   [junit4]    > 	at org.apache.solr.client.solrj.impl.LBHttpSolrClient.request(LBHttpSolrClient.java:328)
   [junit4]    > 	at org.apache.solr.client.solrj.impl.CloudSolrClient.sendRequest(CloudSolrClient.java:1086)
   [junit4]    > 	at org.apache.solr.client.solrj.impl.CloudSolrClient.requestWithRetryOnStaleState(CloudSolrClient.java:856)
   [junit4]    > 	at org.apache.solr.client.solrj.impl.CloudSolrClient.request(CloudSolrClient.java:799)
   [junit4]    > 	at org.apache.solr.client.solrj.SolrClient.request(SolrClient.java:1220)
   [junit4]    > 	at org.apache.solr.cloud.CollectionsAPIDistributedZkTest$1CollectionThread.run(CollectionsAPIDistributedZkTest.java:894)Throwable #6: com.carrotsearch.randomizedtesting.UncaughtExceptionError: Captured an uncaught exception in thread: Thread[id=7188, name=collection1, state=RUNNABLE, group=TGRP-CollectionsAPIDistributedZkTest]
   [junit4]    > Caused by: org.apache.solr.client.solrj.impl.HttpSolrClient$RemoteSolrException: Error from server at https://127.0.0.1:48015/rf/e: Could not find collection : awholynewstresscollection_collection1_8
   [junit4]    > 	at __randomizedtesting.SeedInfo.seed([76E30C4D0133C65]:0)
   [junit4]    > 	at org.apache.solr.client.solrj.impl.HttpSolrClient.executeMethod(HttpSolrClient.java:560)
   [junit4]    > 	at org.apache.solr.client.solrj.impl.HttpSolrClient.request(HttpSolrClient.java:234)
   [junit4]    > 	at org.apache.solr.client.solrj.impl.HttpSolrClient.request(HttpSolrClient.java:226)
   [junit4]    > 	at org.apache.solr.client.solrj.impl.LBHttpSolrClient.doRequest(LBHttpSolrClient.java:376)
   [junit4]    > 	at org.apache.solr.client.solrj.impl.LBHttpSolrClient.request(LBHttpSolrClient.java:328)
   [junit4]    > 	at org.apache.solr.client.solrj.impl.CloudSolrClient.sendRequest(CloudSolrClient.java:1086)
   [junit4]    > 	at org.apache.solr.client.solrj.impl.CloudSolrClient.requestWithRetryOnStaleState(CloudSolrClient.java:856)
   [junit4]    > 	at org.apache.solr.client.solrj.impl.CloudSolrClient.request(CloudSolrClient.java:799)
   [junit4]    > 	at org.apache.solr.client.solrj.SolrClient.request(SolrClient.java:1220)
   [junit4]    > 	at org.apache.solr.cloud.CollectionsAPIDistributedZkTest$1CollectionThread.run(CollectionsAPIDistributedZkTest.java:894)
   [junit4]   2> 1801395 INFO  (SUITE-CollectionsAPIDistributedZkTest-seed#[76E30C4D0133C65]-worker) [n:127.0.0.1:51775_rf%2Fe c:addReplicaColl s:shard2 r:core_node6 x:addReplicaColl_shard2_replica3] o.a.s.SolrTestCaseJ4 ###deleteCore
   [junit4]   2> NOTE: test params are: codec=CheapBastard, sim=DefaultSimilarity, locale=ru, timezone=Australia/Lindeman
   [junit4]   2> NOTE: Linux 3.13.0-52-generic amd64/Oracle Corporation 1.7.0_72 (64-bit)/cpus=4,threads=1,free=132732032,total=525336576
   [junit4]   2> NOTE: All tests run in this JVM: [EnumFieldTest, ExitableDirectoryReaderTest, RemoteQueryErrorTest, SuggesterWFSTTest, TestFunctionQuery, TestSolrIndexConfig, DataDrivenBlockJoinTest, TestSolrDeletionPolicy1, PeerSyncTest, TriLevelCompositeIdRoutingTest, TermsComponentTest, BasicZkTest, SchemaVersionSpecificBehaviorTest, DateFieldTest, SolrRequestParserTest, ParsingFieldUpdateProcessorsTest, DistributedFacetPivotSmallTest, TestRandomRequestDistribution, HighlighterConfigTest, DebugComponentTest, CurrencyFieldXmlFileTest, UniqFieldsUpdateProcessorFactoryTest, TestLeaderElectionZkExpiry, TestRandomFaceting, OutOfBoxZkACLAndCredentialsProvidersTest, DistributedExpandComponentTest, TestAddFieldRealTimeGet, TestWordDelimiterFilterFactory, TestBadConfig, MBeansHandlerTest, JavabinLoaderTest, DeleteShardTest, TestJmxIntegration, LeaderElectionIntegrationTest, TestTrackingShardHandlerFactory, BlockCacheTest, PingRequestHandlerTest, TestConfigOverlay, HdfsUnloadDistributedZkTest, TestClusterStateMutator, TestPhraseSuggestions, MergeStrategyTest, SolrCoreTest, HdfsDirectoryTest, ShardSplitTest, BufferStoreTest, TestFieldCollectionResource, ExternalFileFieldSortTest, TestExactStatsCache, HighlighterMaxOffsetTest, CollectionReloadTest, TestRealTimeGet, TestConfig, SyncSliceTest, TestConfigReload, HdfsBasicDistributedZkTest, CSVRequestHandlerTest, DefaultValueUpdateProcessorTest, SimplePostToolTest, TestManagedStopFilterFactory, DistanceUnitsTest, TestJmxMonitoredMap, DistributedDebugComponentTest, TestNoOpRegenerator, ChaosMonkeyNothingIsSafeTest, TestExpandComponent, TestQuerySenderListener, MinimalSchemaTest, HdfsRecoveryZkTest, TestExceedMaxTermLength, TestSchemaManager, CloudExitableDirectoryReaderTest, TestSweetSpotSimilarityFactory, TestRebalanceLeaders, TestBinaryField, ChangedSchemaMergeTest, TestRangeQuery, TestPivotHelperCode, TermVectorComponentTest, TestOrdValues, AnalyticsQueryTest, TestBulkSchemaConcurrent, TestSimpleTrackingShardHandler, BasicDistributedZkTest, BasicDistributedZk2Test, CollectionsAPIDistributedZkTest]
   [junit4] Completed [245/507] on J0 in 384.51s, 1 test, 1 error <<< FAILURES!

[...truncated 833 lines...]
BUILD FAILED
/x1/jenkins/jenkins-slave/workspace/Lucene-Solr-NightlyTests-5.x/build.xml:543: The following error occurred while executing this line:
/x1/jenkins/jenkins-slave/workspace/Lucene-Solr-NightlyTests-5.x/build.xml:484: The following error occurred while executing this line:
/x1/jenkins/jenkins-slave/workspace/Lucene-Solr-NightlyTests-5.x/build.xml:61: The following error occurred while executing this line:
/x1/jenkins/jenkins-slave/workspace/Lucene-Solr-NightlyTests-5.x/extra-targets.xml:39: The following error occurred while executing this line:
/x1/jenkins/jenkins-slave/workspace/Lucene-Solr-NightlyTests-5.x/solr/build.xml:230: The following error occurred while executing this line:
/x1/jenkins/jenkins-slave/workspace/Lucene-Solr-NightlyTests-5.x/solr/common-build.xml:512: The following error occurred while executing this line:
/x1/jenkins/jenkins-slave/workspace/Lucene-Solr-NightlyTests-5.x/lucene/common-build.xml:1444: The following error occurred while executing this line:
/x1/jenkins/jenkins-slave/workspace/Lucene-Solr-NightlyTests-5.x/lucene/common-build.xml:999: There were test failures: 507 suites, 2009 tests, 1 error, 53 ignored (10 assumptions)

Total time: 165 minutes 38 seconds
Build step 'Invoke Ant' marked build as failure
Archiving artifacts
Sending artifact delta relative to Lucene-Solr-NightlyTests-5.x #874
Archived 4 artifacts
Archive block size is 32768
Received 0 blocks and 1087754572 bytes
Compression is 0.0%
Took 3 min 1 sec
Recording test results
Email was triggered for: Failure
Sending email for trigger: Failure



Mime
View raw message