lucene-dev mailing list archives

Site index · List index
Message view « Date » · « Thread »
Top « Date » · « Thread »
From Apache Jenkins Server <jenk...@builds.apache.org>
Subject [JENKINS] Lucene-Solr-Tests-5.x-Java7 - Build # 3316 - Failure
Date Thu, 09 Jul 2015 08:22:40 GMT
Build: https://builds.apache.org/job/Lucene-Solr-Tests-5.x-Java7/3316/

3 tests failed.
FAILED:  junit.framework.TestSuite.org.apache.solr.core.TestLazyCores

Error Message:
ERROR: SolrIndexSearcher opens=51 closes=50

Stack Trace:
java.lang.AssertionError: ERROR: SolrIndexSearcher opens=51 closes=50
	at __randomizedtesting.SeedInfo.seed([D39203B3C85C715F]:0)
	at org.junit.Assert.fail(Assert.java:93)
	at org.apache.solr.SolrTestCaseJ4.endTrackingSearchers(SolrTestCaseJ4.java:472)
	at org.apache.solr.SolrTestCaseJ4.afterClass(SolrTestCaseJ4.java:232)
	at sun.reflect.GeneratedMethodAccessor37.invoke(Unknown Source)
	at sun.reflect.DelegatingMethodAccessorImpl.invoke(DelegatingMethodAccessorImpl.java:43)
	at java.lang.reflect.Method.invoke(Method.java:606)
	at com.carrotsearch.randomizedtesting.RandomizedRunner.invoke(RandomizedRunner.java:1627)
	at com.carrotsearch.randomizedtesting.RandomizedRunner$5.evaluate(RandomizedRunner.java:799)
	at com.carrotsearch.randomizedtesting.rules.StatementAdapter.evaluate(StatementAdapter.java:36)
	at com.carrotsearch.randomizedtesting.rules.SystemPropertiesRestoreRule$1.evaluate(SystemPropertiesRestoreRule.java:57)
	at org.apache.lucene.util.AbstractBeforeAfterRule$1.evaluate(AbstractBeforeAfterRule.java:46)
	at com.carrotsearch.randomizedtesting.rules.StatementAdapter.evaluate(StatementAdapter.java:36)
	at org.apache.lucene.util.TestRuleStoreClassName$1.evaluate(TestRuleStoreClassName.java:42)
	at com.carrotsearch.randomizedtesting.rules.NoShadowingOrOverridesOnMethodsRule$1.evaluate(NoShadowingOrOverridesOnMethodsRule.java:39)
	at com.carrotsearch.randomizedtesting.rules.NoShadowingOrOverridesOnMethodsRule$1.evaluate(NoShadowingOrOverridesOnMethodsRule.java:39)
	at com.carrotsearch.randomizedtesting.rules.StatementAdapter.evaluate(StatementAdapter.java:36)
	at com.carrotsearch.randomizedtesting.rules.StatementAdapter.evaluate(StatementAdapter.java:36)
	at com.carrotsearch.randomizedtesting.rules.StatementAdapter.evaluate(StatementAdapter.java:36)
	at org.apache.lucene.util.TestRuleAssertionsRequired$1.evaluate(TestRuleAssertionsRequired.java:54)
	at org.apache.lucene.util.TestRuleMarkFailure$1.evaluate(TestRuleMarkFailure.java:48)
	at org.apache.lucene.util.TestRuleIgnoreAfterMaxFailures$1.evaluate(TestRuleIgnoreAfterMaxFailures.java:65)
	at org.apache.lucene.util.TestRuleIgnoreTestSuites$1.evaluate(TestRuleIgnoreTestSuites.java:55)
	at com.carrotsearch.randomizedtesting.rules.StatementAdapter.evaluate(StatementAdapter.java:36)
	at com.carrotsearch.randomizedtesting.ThreadLeakControl$StatementRunner.run(ThreadLeakControl.java:365)
	at java.lang.Thread.run(Thread.java:745)


FAILED:  junit.framework.TestSuite.org.apache.solr.core.TestLazyCores

Error Message:
1 thread leaked from SUITE scope at org.apache.solr.core.TestLazyCores:     1) Thread[id=13683, name=searcherExecutor-5132-thread-1, state=WAITING, group=TGRP-TestLazyCores]         at sun.misc.Unsafe.park(Native Method)         at java.util.concurrent.locks.LockSupport.park(LockSupport.java:186)         at java.util.concurrent.locks.AbstractQueuedSynchronizer$ConditionObject.await(AbstractQueuedSynchronizer.java:2043)         at java.util.concurrent.LinkedBlockingQueue.take(LinkedBlockingQueue.java:442)         at java.util.concurrent.ThreadPoolExecutor.getTask(ThreadPoolExecutor.java:1068)         at java.util.concurrent.ThreadPoolExecutor.runWorker(ThreadPoolExecutor.java:1130)         at java.util.concurrent.ThreadPoolExecutor$Worker.run(ThreadPoolExecutor.java:615)         at java.lang.Thread.run(Thread.java:745)

Stack Trace:
com.carrotsearch.randomizedtesting.ThreadLeakError: 1 thread leaked from SUITE scope at org.apache.solr.core.TestLazyCores: 
   1) Thread[id=13683, name=searcherExecutor-5132-thread-1, state=WAITING, group=TGRP-TestLazyCores]
        at sun.misc.Unsafe.park(Native Method)
        at java.util.concurrent.locks.LockSupport.park(LockSupport.java:186)
        at java.util.concurrent.locks.AbstractQueuedSynchronizer$ConditionObject.await(AbstractQueuedSynchronizer.java:2043)
        at java.util.concurrent.LinkedBlockingQueue.take(LinkedBlockingQueue.java:442)
        at java.util.concurrent.ThreadPoolExecutor.getTask(ThreadPoolExecutor.java:1068)
        at java.util.concurrent.ThreadPoolExecutor.runWorker(ThreadPoolExecutor.java:1130)
        at java.util.concurrent.ThreadPoolExecutor$Worker.run(ThreadPoolExecutor.java:615)
        at java.lang.Thread.run(Thread.java:745)
	at __randomizedtesting.SeedInfo.seed([D39203B3C85C715F]:0)


FAILED:  junit.framework.TestSuite.org.apache.solr.core.TestLazyCores

Error Message:
There are still zombie threads that couldn't be terminated:    1) Thread[id=13683, name=searcherExecutor-5132-thread-1, state=WAITING, group=TGRP-TestLazyCores]         at sun.misc.Unsafe.park(Native Method)         at java.util.concurrent.locks.LockSupport.park(LockSupport.java:186)         at java.util.concurrent.locks.AbstractQueuedSynchronizer$ConditionObject.await(AbstractQueuedSynchronizer.java:2043)         at java.util.concurrent.LinkedBlockingQueue.take(LinkedBlockingQueue.java:442)         at java.util.concurrent.ThreadPoolExecutor.getTask(ThreadPoolExecutor.java:1068)         at java.util.concurrent.ThreadPoolExecutor.runWorker(ThreadPoolExecutor.java:1130)         at java.util.concurrent.ThreadPoolExecutor$Worker.run(ThreadPoolExecutor.java:615)         at java.lang.Thread.run(Thread.java:745)

Stack Trace:
com.carrotsearch.randomizedtesting.ThreadLeakError: There are still zombie threads that couldn't be terminated:
   1) Thread[id=13683, name=searcherExecutor-5132-thread-1, state=WAITING, group=TGRP-TestLazyCores]
        at sun.misc.Unsafe.park(Native Method)
        at java.util.concurrent.locks.LockSupport.park(LockSupport.java:186)
        at java.util.concurrent.locks.AbstractQueuedSynchronizer$ConditionObject.await(AbstractQueuedSynchronizer.java:2043)
        at java.util.concurrent.LinkedBlockingQueue.take(LinkedBlockingQueue.java:442)
        at java.util.concurrent.ThreadPoolExecutor.getTask(ThreadPoolExecutor.java:1068)
        at java.util.concurrent.ThreadPoolExecutor.runWorker(ThreadPoolExecutor.java:1130)
        at java.util.concurrent.ThreadPoolExecutor$Worker.run(ThreadPoolExecutor.java:615)
        at java.lang.Thread.run(Thread.java:745)
	at __randomizedtesting.SeedInfo.seed([D39203B3C85C715F]:0)




Build Log:
[...truncated 11045 lines...]
   [junit4] Suite: org.apache.solr.core.TestLazyCores
   [junit4]   2> Creating dataDir: /x1/jenkins/jenkins-slave/workspace/Lucene-Solr-Tests-5.x-Java7/solr/build/solr-core/test/J0/temp/solr.core.TestLazyCores_D39203B3C85C715F-001/init-core-data-001
   [junit4]   2> 1750684 INFO  (SUITE-TestLazyCores-seed#[D39203B3C85C715F]-worker) [    ] o.a.s.SolrTestCaseJ4 Randomized ssl (false) and clientAuth (false)
   [junit4]   2> 1750687 INFO  (TEST-TestLazyCores.testCachingLimit-seed#[D39203B3C85C715F]) [    ] o.a.s.SolrTestCaseJ4 ###Starting testCachingLimit
   [junit4]   2> 1750700 INFO  (TEST-TestLazyCores.testCachingLimit-seed#[D39203B3C85C715F]) [    ] o.a.s.c.SolrResourceLoader new SolrResourceLoader for directory: '/x1/jenkins/jenkins-slave/workspace/Lucene-Solr-Tests-5.x-Java7/solr/build/solr-core/test/J0/temp/solr.core.TestLazyCores_D39203B3C85C715F-001/tempDir-001/'
   [junit4]   2> 1750716 INFO  (TEST-TestLazyCores.testCachingLimit-seed#[D39203B3C85C715F]) [    ] o.a.s.c.CoreContainer New CoreContainer 335727219
   [junit4]   2> 1750716 INFO  (TEST-TestLazyCores.testCachingLimit-seed#[D39203B3C85C715F]) [    ] o.a.s.c.CoreContainer Loading cores into CoreContainer [instanceDir=/x1/jenkins/jenkins-slave/workspace/Lucene-Solr-Tests-5.x-Java7/solr/build/solr-core/test/J0/temp/solr.core.TestLazyCores_D39203B3C85C715F-001/tempDir-001/]
   [junit4]   2> 1750716 INFO  (TEST-TestLazyCores.testCachingLimit-seed#[D39203B3C85C715F]) [    ] o.a.s.c.CoreContainer loading shared library: /x1/jenkins/jenkins-slave/workspace/Lucene-Solr-Tests-5.x-Java7/solr/build/solr-core/test/J0/temp/solr.core.TestLazyCores_D39203B3C85C715F-001/tempDir-001/lib
   [junit4]   2> 1750716 WARN  (TEST-TestLazyCores.testCachingLimit-seed#[D39203B3C85C715F]) [    ] o.a.s.c.SolrResourceLoader Can't find (or read) directory to add to classloader: lib (resolved as: /x1/jenkins/jenkins-slave/workspace/Lucene-Solr-Tests-5.x-Java7/solr/build/solr-core/test/J0/temp/solr.core.TestLazyCores_D39203B3C85C715F-001/tempDir-001/lib).
   [junit4]   2> 1750723 INFO  (TEST-TestLazyCores.testCachingLimit-seed#[D39203B3C85C715F]) [    ] o.a.s.h.c.HttpShardHandlerFactory created with socketTimeout : 600000,connTimeout : 60000,maxConnectionsPerHost : 20,maxConnections : 10000,corePoolSize : 0,maximumPoolSize : 2147483647,maxThreadIdleTime : 5,sizeOfQueue : -1,fairnessPolicy : false,useRetries : false,
   [junit4]   2> 1750725 INFO  (TEST-TestLazyCores.testCachingLimit-seed#[D39203B3C85C715F]) [    ] o.a.s.u.UpdateShardHandler Creating UpdateShardHandler HTTP client with params: socketTimeout=600000&connTimeout=60000&retry=true
   [junit4]   2> 1750725 INFO  (TEST-TestLazyCores.testCachingLimit-seed#[D39203B3C85C715F]) [    ] o.a.s.c.CoreContainer Allocating transient cache for 4 transient cores
   [junit4]   2> 1750727 INFO  (TEST-TestLazyCores.testCachingLimit-seed#[D39203B3C85C715F]) [    ] o.a.s.l.LogWatcher SLF4J impl is org.slf4j.impl.Log4jLoggerFactory
   [junit4]   2> 1750727 INFO  (TEST-TestLazyCores.testCachingLimit-seed#[D39203B3C85C715F]) [    ] o.a.s.l.LogWatcher Registering Log Listener [Log4j (org.slf4j.impl.Log4jLoggerFactory)]
   [junit4]   2> 1750727 INFO  (TEST-TestLazyCores.testCachingLimit-seed#[D39203B3C85C715F]) [    ] o.a.s.c.CoreContainer No authentication plugin used.
   [junit4]   2> 1750728 INFO  (TEST-TestLazyCores.testCachingLimit-seed#[D39203B3C85C715F]) [    ] o.a.s.c.SolrCore Created CoreDescriptor: {transient=false, instanceDir=collection1, dataDir=data/, config=solrconfig.xml, schema=schema.xml, loadOnStartup=true, name=collection1, absoluteInstDir=/x1/jenkins/jenkins-slave/workspace/Lucene-Solr-Tests-5.x-Java7/solr/build/solr-core/test/J0/temp/solr.core.TestLazyCores_D39203B3C85C715F-001/tempDir-001/collection1/}
   [junit4]   2> 1750728 INFO  (TEST-TestLazyCores.testCachingLimit-seed#[D39203B3C85C715F]) [    ] o.a.s.c.SolrCore Created CoreDescriptor: {instanceDir=collection2, transient=true, name=collectionLazy2, dataDir=data/, config=solrconfig.xml, absoluteInstDir=/x1/jenkins/jenkins-slave/workspace/Lucene-Solr-Tests-5.x-Java7/solr/build/solr-core/test/J0/temp/solr.core.TestLazyCores_D39203B3C85C715F-001/tempDir-001/collection2/, loadOnStartup=true, schema=schema.xml}
   [junit4]   2> 1750729 INFO  (TEST-TestLazyCores.testCachingLimit-seed#[D39203B3C85C715F]) [    ] o.a.s.c.SolrCore Created CoreDescriptor: {dataDir=data/, schema=schema.xml, absoluteInstDir=/x1/jenkins/jenkins-slave/workspace/Lucene-Solr-Tests-5.x-Java7/solr/build/solr-core/test/J0/temp/solr.core.TestLazyCores_D39203B3C85C715F-001/tempDir-001/collection3/, name=collectionLazy3, instanceDir=collection3, config=solrconfig.xml, loadOnStartup=false, transient=on}
   [junit4]   2> 1750729 INFO  (TEST-TestLazyCores.testCachingLimit-seed#[D39203B3C85C715F]) [    ] o.a.s.c.SolrCore Created CoreDescriptor: {transient=false, dataDir=data/, schema=schema.xml, config=solrconfig.xml, instanceDir=collection4, absoluteInstDir=/x1/jenkins/jenkins-slave/workspace/Lucene-Solr-Tests-5.x-Java7/solr/build/solr-core/test/J0/temp/solr.core.TestLazyCores_D39203B3C85C715F-001/tempDir-001/collection4/, loadOnStartup=false, name=collectionLazy4}
   [junit4]   2> 1750729 INFO  (TEST-TestLazyCores.testCachingLimit-seed#[D39203B3C85C715F]) [    ] o.a.s.c.SolrCore Created CoreDescriptor: {config=solrconfig.xml, name=collectionLazy5, absoluteInstDir=/x1/jenkins/jenkins-slave/workspace/Lucene-Solr-Tests-5.x-Java7/solr/build/solr-core/test/J0/temp/solr.core.TestLazyCores_D39203B3C85C715F-001/tempDir-001/collection5/, loadOnStartup=true, transient=false, dataDir=data/, schema=schema.xml, instanceDir=collection5}
   [junit4]   2> 1750730 INFO  (TEST-TestLazyCores.testCachingLimit-seed#[D39203B3C85C715F]) [    ] o.a.s.c.SolrCore Created CoreDescriptor: {transient=true, loadOnStartup=false, absoluteInstDir=/x1/jenkins/jenkins-slave/workspace/Lucene-Solr-Tests-5.x-Java7/solr/build/solr-core/test/J0/temp/solr.core.TestLazyCores_D39203B3C85C715F-001/tempDir-001/collection6/, name=collectionLazy6, schema=schema.xml, config=solrconfig.xml, instanceDir=collection6, dataDir=data/}
   [junit4]   2> 1750730 INFO  (TEST-TestLazyCores.testCachingLimit-seed#[D39203B3C85C715F]) [    ] o.a.s.c.SolrCore Created CoreDescriptor: {schema=schema.xml, loadOnStartup=false, absoluteInstDir=/x1/jenkins/jenkins-slave/workspace/Lucene-Solr-Tests-5.x-Java7/solr/build/solr-core/test/J0/temp/solr.core.TestLazyCores_D39203B3C85C715F-001/tempDir-001/collection7/, dataDir=data/, config=solrconfig.xml, transient=true, instanceDir=collection7, name=collectionLazy7}
   [junit4]   2> 1750730 INFO  (TEST-TestLazyCores.testCachingLimit-seed#[D39203B3C85C715F]) [    ] o.a.s.c.SolrCore Created CoreDescriptor: {name=collectionLazy8, transient=true, absoluteInstDir=/x1/jenkins/jenkins-slave/workspace/Lucene-Solr-Tests-5.x-Java7/solr/build/solr-core/test/J0/temp/solr.core.TestLazyCores_D39203B3C85C715F-001/tempDir-001/collection8/, dataDir=data/, config=solrconfig.xml, instanceDir=collection8, schema=schema.xml, loadOnStartup=false}
   [junit4]   2> 1750731 INFO  (TEST-TestLazyCores.testCachingLimit-seed#[D39203B3C85C715F]) [    ] o.a.s.c.SolrCore Created CoreDescriptor: {absoluteInstDir=/x1/jenkins/jenkins-slave/workspace/Lucene-Solr-Tests-5.x-Java7/solr/build/solr-core/test/J0/temp/solr.core.TestLazyCores_D39203B3C85C715F-001/tempDir-001/collection9/, name=collectionLazy9, transient=true, schema=schema.xml, dataDir=data/, instanceDir=collection9, loadOnStartup=false, config=solrconfig.xml}
   [junit4]   2> 1750731 INFO  (coreLoadExecutor-5131-thread-1) [    ] o.a.s.c.SolrResourceLoader new SolrResourceLoader for directory: '/x1/jenkins/jenkins-slave/workspace/Lucene-Solr-Tests-5.x-Java7/solr/build/solr-core/test/J0/temp/solr.core.TestLazyCores_D39203B3C85C715F-001/tempDir-001/collection1/'
   [junit4]   2> 1750731 INFO  (coreLoadExecutor-5131-thread-2) [    ] o.a.s.c.SolrResourceLoader new SolrResourceLoader for directory: '/x1/jenkins/jenkins-slave/workspace/Lucene-Solr-Tests-5.x-Java7/solr/build/solr-core/test/J0/temp/solr.core.TestLazyCores_D39203B3C85C715F-001/tempDir-001/collection2/'
   [junit4]   2> 1750733 INFO  (coreLoadExecutor-5131-thread-3) [    ] o.a.s.c.SolrResourceLoader new SolrResourceLoader for directory: '/x1/jenkins/jenkins-slave/workspace/Lucene-Solr-Tests-5.x-Java7/solr/build/solr-core/test/J0/temp/solr.core.TestLazyCores_D39203B3C85C715F-001/tempDir-001/collection5/'
   [junit4]   2> 1750753 INFO  (coreLoadExecutor-5131-thread-2) [    ] o.a.s.c.SolrConfig current version of requestparams : -1
   [junit4]   2> 1750757 INFO  (coreLoadExecutor-5131-thread-1) [    ] o.a.s.c.SolrConfig current version of requestparams : -1
   [junit4]   2> 1750758 INFO  (coreLoadExecutor-5131-thread-3) [    ] o.a.s.c.SolrConfig current version of requestparams : -1
   [junit4]   2> 1750766 INFO  (coreLoadExecutor-5131-thread-2) [    ] o.a.s.c.SolrConfig Using Lucene MatchVersion: 5.3.0
   [junit4]   2> 1750771 INFO  (coreLoadExecutor-5131-thread-1) [    ] o.a.s.c.SolrConfig Using Lucene MatchVersion: 5.3.0
   [junit4]   2> 1750771 INFO  (coreLoadExecutor-5131-thread-3) [    ] o.a.s.c.SolrConfig Using Lucene MatchVersion: 5.3.0
   [junit4]   2> 1750804 INFO  (coreLoadExecutor-5131-thread-2) [    ] o.a.s.c.Config Loaded SolrConfig: solrconfig.xml
   [junit4]   2> 1750804 INFO  (coreLoadExecutor-5131-thread-2) [    ] o.a.s.s.IndexSchema Reading Solr Schema from /x1/jenkins/jenkins-slave/workspace/Lucene-Solr-Tests-5.x-Java7/solr/build/solr-core/test/J0/temp/solr.core.TestLazyCores_D39203B3C85C715F-001/tempDir-001/collection2/conf/schema.xml
   [junit4]   2> 1750809 INFO  (coreLoadExecutor-5131-thread-2) [    ] o.a.s.s.IndexSchema [collectionLazy2] Schema name=tiny
   [junit4]   2> 1750810 INFO  (coreLoadExecutor-5131-thread-3) [    ] o.a.s.c.Config Loaded SolrConfig: solrconfig.xml
   [junit4]   2> 1750810 INFO  (coreLoadExecutor-5131-thread-3) [    ] o.a.s.s.IndexSchema Reading Solr Schema from /x1/jenkins/jenkins-slave/workspace/Lucene-Solr-Tests-5.x-Java7/solr/build/solr-core/test/J0/temp/solr.core.TestLazyCores_D39203B3C85C715F-001/tempDir-001/collection5/conf/schema.xml
   [junit4]   2> 1750814 INFO  (coreLoadExecutor-5131-thread-3) [    ] o.a.s.s.IndexSchema [collectionLazy5] Schema name=tiny
   [junit4]   2> 1750818 INFO  (coreLoadExecutor-5131-thread-2) [    ] o.a.s.s.IndexSchema unique key field: id
   [junit4]   2> 1750819 INFO  (coreLoadExecutor-5131-thread-2) [    ] o.a.s.c.CoreContainer Creating SolrCore 'collectionLazy2' using configuration from instancedir /x1/jenkins/jenkins-slave/workspace/Lucene-Solr-Tests-5.x-Java7/solr/build/solr-core/test/J0/temp/solr.core.TestLazyCores_D39203B3C85C715F-001/tempDir-001/collection2/
   [junit4]   2> 1750819 INFO  (coreLoadExecutor-5131-thread-2) [    x:collectionLazy2] o.a.s.c.SolrCore org.apache.solr.core.MockDirectoryFactory
   [junit4]   2> 1750820 INFO  (coreLoadExecutor-5131-thread-2) [    x:collectionLazy2] o.a.s.c.SolrCore [[collectionLazy2] ] Opening new SolrCore at [/x1/jenkins/jenkins-slave/workspace/Lucene-Solr-Tests-5.x-Java7/solr/build/solr-core/test/J0/temp/solr.core.TestLazyCores_D39203B3C85C715F-001/tempDir-001/collection2/], dataDir=[null]
   [junit4]   2> 1750820 INFO  (coreLoadExecutor-5131-thread-2) [    x:collectionLazy2] o.a.s.c.SolrCore JMX monitoring not detected for core: collectionLazy2
   [junit4]   2> 1750820 INFO  (coreLoadExecutor-5131-thread-2) [    x:collectionLazy2] o.a.s.c.CachingDirectoryFactory return new directory for /x1/jenkins/jenkins-slave/workspace/Lucene-Solr-Tests-5.x-Java7/solr/build/solr-core/test/J0/temp/solr.core.TestLazyCores_D39203B3C85C715F-001/tempDir-001/collection2/data
   [junit4]   2> 1750821 INFO  (coreLoadExecutor-5131-thread-2) [    x:collectionLazy2] o.a.s.c.SolrCore New index directory detected: old=null new=/x1/jenkins/jenkins-slave/workspace/Lucene-Solr-Tests-5.x-Java7/solr/build/solr-core/test/J0/temp/solr.core.TestLazyCores_D39203B3C85C715F-001/tempDir-001/collection2/data/index/
   [junit4]   2> 1750821 WARN  (coreLoadExecutor-5131-thread-2) [    x:collectionLazy2] o.a.s.c.SolrCore [collectionLazy2] Solr index directory '/x1/jenkins/jenkins-slave/workspace/Lucene-Solr-Tests-5.x-Java7/solr/build/solr-core/test/J0/temp/solr.core.TestLazyCores_D39203B3C85C715F-001/tempDir-001/collection2/data/index' doesn't exist. Creating new index...
   [junit4]   2> 1750821 INFO  (coreLoadExecutor-5131-thread-2) [    x:collectionLazy2] o.a.s.c.CachingDirectoryFactory return new directory for /x1/jenkins/jenkins-slave/workspace/Lucene-Solr-Tests-5.x-Java7/solr/build/solr-core/test/J0/temp/solr.core.TestLazyCores_D39203B3C85C715F-001/tempDir-001/collection2/data/index
   [junit4]   2> 1750821 INFO  (coreLoadExecutor-5131-thread-2) [    x:collectionLazy2] o.a.s.u.RandomMergePolicy RandomMergePolicy wrapping class org.apache.lucene.index.TieredMergePolicy: [TieredMergePolicy: maxMergeAtOnce=40, maxMergeAtOnceExplicit=45, maxMergedSegmentMB=99.9912109375, floorSegmentMB=1.9638671875, forceMergeDeletesPctAllowed=13.758982175123899, segmentsPerTier=31.0, maxCFSSegmentSizeMB=8.796093022207999E12, noCFSRatio=0.38621627197608777
   [junit4]   2> 1750822 INFO  (coreLoadExecutor-5131-thread-2) [    x:collectionLazy2] o.a.s.c.SolrCore SolrDeletionPolicy.onCommit: commits: num=1
   [junit4]   2> 	commit{dir=MockDirectoryWrapper(RAMDirectory@69e06dd7 lockFactory=org.apache.lucene.store.SingleInstanceLockFactory@d4b748f),segFN=segments_1,generation=1}
   [junit4]   2> 1750822 INFO  (coreLoadExecutor-5131-thread-2) [    x:collectionLazy2] o.a.s.c.SolrCore newest commit generation = 1
   [junit4]   2> 1750823 INFO  (coreLoadExecutor-5131-thread-3) [    ] o.a.s.s.IndexSchema unique key field: id
   [junit4]   2> 1750824 INFO  (coreLoadExecutor-5131-thread-3) [    ] o.a.s.c.CoreContainer Creating SolrCore 'collectionLazy5' using configuration from instancedir /x1/jenkins/jenkins-slave/workspace/Lucene-Solr-Tests-5.x-Java7/solr/build/solr-core/test/J0/temp/solr.core.TestLazyCores_D39203B3C85C715F-001/tempDir-001/collection5/
   [junit4]   2> 1750824 INFO  (coreLoadExecutor-5131-thread-3) [    x:collectionLazy5] o.a.s.c.SolrCore org.apache.solr.core.MockDirectoryFactory
   [junit4]   2> 1750825 INFO  (coreLoadExecutor-5131-thread-3) [    x:collectionLazy5] o.a.s.c.SolrCore [[collectionLazy5] ] Opening new SolrCore at [/x1/jenkins/jenkins-slave/workspace/Lucene-Solr-Tests-5.x-Java7/solr/build/solr-core/test/J0/temp/solr.core.TestLazyCores_D39203B3C85C715F-001/tempDir-001/collection5/], dataDir=[null]
   [junit4]   2> 1750825 INFO  (coreLoadExecutor-5131-thread-3) [    x:collectionLazy5] o.a.s.c.SolrCore JMX monitoring not detected for core: collectionLazy5
   [junit4]   2> 1750825 INFO  (coreLoadExecutor-5131-thread-3) [    x:collectionLazy5] o.a.s.c.CachingDirectoryFactory return new directory for /x1/jenkins/jenkins-slave/workspace/Lucene-Solr-Tests-5.x-Java7/solr/build/solr-core/test/J0/temp/solr.core.TestLazyCores_D39203B3C85C715F-001/tempDir-001/collection5/data
   [junit4]   2> 1750826 INFO  (coreLoadExecutor-5131-thread-3) [    x:collectionLazy5] o.a.s.c.SolrCore New index directory detected: old=null new=/x1/jenkins/jenkins-slave/workspace/Lucene-Solr-Tests-5.x-Java7/solr/build/solr-core/test/J0/temp/solr.core.TestLazyCores_D39203B3C85C715F-001/tempDir-001/collection5/data/index/
   [junit4]   2> 1750826 WARN  (coreLoadExecutor-5131-thread-3) [    x:collectionLazy5] o.a.s.c.SolrCore [collectionLazy5] Solr index directory '/x1/jenkins/jenkins-slave/workspace/Lucene-Solr-Tests-5.x-Java7/solr/build/solr-core/test/J0/temp/solr.core.TestLazyCores_D39203B3C85C715F-001/tempDir-001/collection5/data/index' doesn't exist. Creating new index...
   [junit4]   2> 1750826 INFO  (coreLoadExecutor-5131-thread-1) [    ] o.a.s.c.Config Loaded SolrConfig: solrconfig.xml
   [junit4]   2> 1750826 INFO  (coreLoadExecutor-5131-thread-3) [    x:collectionLazy5] o.a.s.c.CachingDirectoryFactory return new directory for /x1/jenkins/jenkins-slave/workspace/Lucene-Solr-Tests-5.x-Java7/solr/build/solr-core/test/J0/temp/solr.core.TestLazyCores_D39203B3C85C715F-001/tempDir-001/collection5/data/index
   [junit4]   2> 1750826 INFO  (coreLoadExecutor-5131-thread-1) [    ] o.a.s.s.IndexSchema Reading Solr Schema from /x1/jenkins/jenkins-slave/workspace/Lucene-Solr-Tests-5.x-Java7/solr/build/solr-core/test/J0/temp/solr.core.TestLazyCores_D39203B3C85C715F-001/tempDir-001/collection1/conf/schema.xml
   [junit4]   2> 1750826 INFO  (coreLoadExecutor-5131-thread-3) [    x:collectionLazy5] o.a.s.u.RandomMergePolicy RandomMergePolicy wrapping class org.apache.lucene.index.TieredMergePolicy: [TieredMergePolicy: maxMergeAtOnce=40, maxMergeAtOnceExplicit=45, maxMergedSegmentMB=99.9912109375, floorSegmentMB=1.9638671875, forceMergeDeletesPctAllowed=13.758982175123899, segmentsPerTier=31.0, maxCFSSegmentSizeMB=8.796093022207999E12, noCFSRatio=0.38621627197608777
   [junit4]   2> 1750827 INFO  (coreLoadExecutor-5131-thread-3) [    x:collectionLazy5] o.a.s.c.SolrCore SolrDeletionPolicy.onCommit: commits: num=1
   [junit4]   2> 	commit{dir=MockDirectoryWrapper(RAMDirectory@2ee8293a lockFactory=org.apache.lucene.store.SingleInstanceLockFactory@beab6e5),segFN=segments_1,generation=1}
   [junit4]   2> 1750827 INFO  (coreLoadExecutor-5131-thread-3) [    x:collectionLazy5] o.a.s.c.SolrCore newest commit generation = 1
   [junit4]   2> 1750831 INFO  (coreLoadExecutor-5131-thread-1) [    ] o.a.s.s.IndexSchema [collection1] Schema name=tiny
   [junit4]   2> 1750833 INFO  (coreLoadExecutor-5131-thread-2) [    x:collectionLazy2] o.a.s.c.SolrCore no updateRequestProcessorChain defined as default, creating implicit default
   [junit4]   2> 1750835 INFO  (OldIndexDirectoryCleanupThreadForCore-collectionLazy2) [    x:collectionLazy2] o.a.s.c.SolrCore Looking for old index directories to cleanup for core collectionLazy2 in /x1/jenkins/jenkins-slave/workspace/Lucene-Solr-Tests-5.x-Java7/solr/build/solr-core/test/J0/temp/solr.core.TestLazyCores_D39203B3C85C715F-001/tempDir-001/collection2/data/
   [junit4]   2> 1750835 WARN  (OldIndexDirectoryCleanupThreadForCore-collectionLazy2) [    x:collectionLazy2] o.a.s.c.DirectoryFactory /x1/jenkins/jenkins-slave/workspace/Lucene-Solr-Tests-5.x-Java7/solr/build/solr-core/test/J0/temp/solr.core.TestLazyCores_D39203B3C85C715F-001/tempDir-001/collection2/data/ does not point to a valid data directory; skipping clean-up of old index directories.
   [junit4]   2> 1750836 INFO  (coreLoadExecutor-5131-thread-2) [    x:collectionLazy2] o.a.s.h.l.XMLLoader xsltCacheLifetimeSeconds=60
   [junit4]   2> 1750837 INFO  (coreLoadExecutor-5131-thread-2) [    x:collectionLazy2] o.a.s.h.l.XMLLoader xsltCacheLifetimeSeconds=60
   [junit4]   2> 1750837 INFO  (coreLoadExecutor-5131-thread-3) [    x:collectionLazy5] o.a.s.c.SolrCore no updateRequestProcessorChain defined as default, creating implicit default
   [junit4]   2> 1750838 INFO  (coreLoadExecutor-5131-thread-2) [    x:collectionLazy2] o.a.s.h.l.XMLLoader xsltCacheLifetimeSeconds=60
   [junit4]   2> 1750839 INFO  (coreLoadExecutor-5131-thread-3) [    x:collectionLazy5] o.a.s.h.l.XMLLoader xsltCacheLifetimeSeconds=60
   [junit4]   2> 1750840 INFO  (coreLoadExecutor-5131-thread-2) [    x:collectionLazy2] o.a.s.h.l.XMLLoader xsltCacheLifetimeSeconds=60
   [junit4]   2> 1750840 INFO  (coreLoadExecutor-5131-thread-1) [    ] o.a.s.s.IndexSchema unique key field: id
   [junit4]   2> 1750840 INFO  (coreLoadExecutor-5131-thread-1) [    ] o.a.s.c.CoreContainer Creating SolrCore 'collection1' using configuration from instancedir /x1/jenkins/jenkins-slave/workspace/Lucene-Solr-Tests-5.x-Java7/solr/build/solr-core/test/J0/temp/solr.core.TestLazyCores_D39203B3C85C715F-001/tempDir-001/collection1/
   [junit4]   2> 1750841 INFO  (coreLoadExecutor-5131-thread-2) [    x:collectionLazy2] o.a.s.c.RequestHandlers Registered paths: /update/csv,/admin/luke,/config,/admin/plugins,/admin/mbeans,/admin/properties,/admin/segments,/get,/admin/threads,/update/json/docs,/select,/schema,/update/json,/admin/logging,/update,/admin/ping,/admin/system,/admin/file,/replication
   [junit4]   2> 1750841 INFO  (OldIndexDirectoryCleanupThreadForCore-collectionLazy5) [    x:collectionLazy5] o.a.s.c.SolrCore Looking for old index directories to cleanup for core collectionLazy5 in /x1/jenkins/jenkins-slave/workspace/Lucene-Solr-Tests-5.x-Java7/solr/build/solr-core/test/J0/temp/solr.core.TestLazyCores_D39203B3C85C715F-001/tempDir-001/collection5/data/
   [junit4]   2> 1750840 INFO  (coreLoadExecutor-5131-thread-3) [    x:collectionLazy5] o.a.s.h.l.XMLLoader xsltCacheLifetimeSeconds=60
   [junit4]   2> 1750842 WARN  (OldIndexDirectoryCleanupThreadForCore-collectionLazy5) [    x:collectionLazy5] o.a.s.c.DirectoryFactory /x1/jenkins/jenkins-slave/workspace/Lucene-Solr-Tests-5.x-Java7/solr/build/solr-core/test/J0/temp/solr.core.TestLazyCores_D39203B3C85C715F-001/tempDir-001/collection5/data/ does not point to a valid data directory; skipping clean-up of old index directories.
   [junit4]   2> 1750842 INFO  (coreLoadExecutor-5131-thread-1) [    x:collection1] o.a.s.c.SolrCore org.apache.solr.core.MockDirectoryFactory
   [junit4]   2> 1750842 INFO  (coreLoadExecutor-5131-thread-1) [    x:collection1] o.a.s.c.SolrCore [[collection1] ] Opening new SolrCore at [/x1/jenkins/jenkins-slave/workspace/Lucene-Solr-Tests-5.x-Java7/solr/build/solr-core/test/J0/temp/solr.core.TestLazyCores_D39203B3C85C715F-001/tempDir-001/collection1/], dataDir=[null]
   [junit4]   2> 1750843 INFO  (coreLoadExecutor-5131-thread-1) [    x:collection1] o.a.s.c.SolrCore JMX monitoring not detected for core: collection1
   [junit4]   2> 1750843 INFO  (coreLoadExecutor-5131-thread-2) [    x:collectionLazy2] o.a.s.c.SolrCore Using default statsCache cache: org.apache.solr.search.stats.LocalStatsCache
   [junit4]   2> 1750843 INFO  (coreLoadExecutor-5131-thread-3) [    x:collectionLazy5] o.a.s.h.l.XMLLoader xsltCacheLifetimeSeconds=60
   [junit4]   2> 1750843 INFO  (coreLoadExecutor-5131-thread-1) [    x:collection1] o.a.s.c.CachingDirectoryFactory return new directory for /x1/jenkins/jenkins-slave/workspace/Lucene-Solr-Tests-5.x-Java7/solr/build/solr-core/test/J0/temp/solr.core.TestLazyCores_D39203B3C85C715F-001/tempDir-001/collection1/data
   [junit4]   2> 1750844 INFO  (coreLoadExecutor-5131-thread-1) [    x:collection1] o.a.s.c.SolrCore New index directory detected: old=null new=/x1/jenkins/jenkins-slave/workspace/Lucene-Solr-Tests-5.x-Java7/solr/build/solr-core/test/J0/temp/solr.core.TestLazyCores_D39203B3C85C715F-001/tempDir-001/collection1/data/index/
   [junit4]   2> 1750844 WARN  (coreLoadExecutor-5131-thread-1) [    x:collection1] o.a.s.c.SolrCore [collection1] Solr index directory '/x1/jenkins/jenkins-slave/workspace/Lucene-Solr-Tests-5.x-Java7/solr/build/solr-core/test/J0/temp/solr.core.TestLazyCores_D39203B3C85C715F-001/tempDir-001/collection1/data/index' doesn't exist. Creating new index...
   [junit4]   2> 1750844 INFO  (coreLoadExecutor-5131-thread-1) [    x:collection1] o.a.s.c.CachingDirectoryFactory return new directory for /x1/jenkins/jenkins-slave/workspace/Lucene-Solr-Tests-5.x-Java7/solr/build/solr-core/test/J0/temp/solr.core.TestLazyCores_D39203B3C85C715F-001/tempDir-001/collection1/data/index
   [junit4]   2> 1750844 INFO  (coreLoadExecutor-5131-thread-1) [    x:collection1] o.a.s.u.RandomMergePolicy RandomMergePolicy wrapping class org.apache.lucene.index.TieredMergePolicy: [TieredMergePolicy: maxMergeAtOnce=40, maxMergeAtOnceExplicit=45, maxMergedSegmentMB=99.9912109375, floorSegmentMB=1.9638671875, forceMergeDeletesPctAllowed=13.758982175123899, segmentsPerTier=31.0, maxCFSSegmentSizeMB=8.796093022207999E12, noCFSRatio=0.38621627197608777
   [junit4]   2> 1750844 INFO  (coreLoadExecutor-5131-thread-3) [    x:collectionLazy5] o.a.s.h.l.XMLLoader xsltCacheLifetimeSeconds=60
   [junit4]   2> 1750845 INFO  (coreLoadExecutor-5131-thread-1) [    x:collection1] o.a.s.c.SolrCore SolrDeletionPolicy.onCommit: commits: num=1
   [junit4]   2> 	commit{dir=MockDirectoryWrapper(RAMDirectory@1530b198 lockFactory=org.apache.lucene.store.SingleInstanceLockFactory@2fdb7d06),segFN=segments_1,generation=1}
   [junit4]   2> 1750845 INFO  (coreLoadExecutor-5131-thread-1) [    x:collection1] o.a.s.c.SolrCore newest commit generation = 1
   [junit4]   2> 1750846 INFO  (coreLoadExecutor-5131-thread-2) [    x:collectionLazy2] o.a.s.c.SolrCore Hard AutoCommit: disabled
   [junit4]   2> 1750846 INFO  (OldIndexDirectoryCleanupThreadForCore-collection1) [    x:collection1] o.a.s.c.SolrCore Looking for old index directories to cleanup for core collection1 in /x1/jenkins/jenkins-slave/workspace/Lucene-Solr-Tests-5.x-Java7/solr/build/solr-core/test/J0/temp/solr.core.TestLazyCores_D39203B3C85C715F-001/tempDir-001/collection1/data/
   [junit4]   2> 1750846 INFO  (coreLoadExecutor-5131-thread-2) [    x:collectionLazy2] o.a.s.c.SolrCore Soft AutoCommit: disabled
   [junit4]   2> 1750846 WARN  (OldIndexDirectoryCleanupThreadForCore-collection1) [    x:collection1] o.a.s.c.DirectoryFactory /x1/jenkins/jenkins-slave/workspace/Lucene-Solr-Tests-5.x-Java7/solr/build/solr-core/test/J0/temp/solr.core.TestLazyCores_D39203B3C85C715F-001/tempDir-001/collection1/data/ does not point to a valid data directory; skipping clean-up of old index directories.
   [junit4]   2> 1750847 INFO  (coreLoadExecutor-5131-thread-2) [    x:collectionLazy2] o.a.s.u.RandomMergePolicy RandomMergePolicy wrapping class org.apache.lucene.index.TieredMergePolicy: [TieredMergePolicy: maxMergeAtOnce=19, maxMergeAtOnceExplicit=19, maxMergedSegmentMB=93.3369140625, floorSegmentMB=0.2578125, forceMergeDeletesPctAllowed=24.612644943921403, segmentsPerTier=47.0, maxCFSSegmentSizeMB=8.796093022207999E12, noCFSRatio=1.0
   [junit4]   2> 1750847 INFO  (coreLoadExecutor-5131-thread-2) [    x:collectionLazy2] o.a.s.c.SolrCore SolrDeletionPolicy.onInit: commits: num=1
   [junit4]   2> 	commit{dir=MockDirectoryWrapper(RAMDirectory@69e06dd7 lockFactory=org.apache.lucene.store.SingleInstanceLockFactory@d4b748f),segFN=segments_1,generation=1}
   [junit4]   2> 1750847 INFO  (coreLoadExecutor-5131-thread-2) [    x:collectionLazy2] o.a.s.c.SolrCore newest commit generation = 1
   [junit4]   2> 1750848 INFO  (coreLoadExecutor-5131-thread-2) [    x:collectionLazy2] o.a.s.s.SolrIndexSearcher Opening Searcher@6c8f5c1f[collectionLazy2] main
   [junit4]   2> 1750848 INFO  (coreLoadExecutor-5131-thread-1) [    x:collection1] o.a.s.c.SolrCore no updateRequestProcessorChain defined as default, creating implicit default
   [junit4]   2> 1750848 INFO  (coreLoadExecutor-5131-thread-2) [    x:collectionLazy2] o.a.s.r.ManagedResourceStorage File-based storage initialized to use dir: /x1/jenkins/jenkins-slave/workspace/Lucene-Solr-Tests-5.x-Java7/solr/build/solr-core/test/J0/temp/solr.core.TestLazyCores_D39203B3C85C715F-001/tempDir-001/collection2/conf
   [junit4]   2> 1750848 INFO  (coreLoadExecutor-5131-thread-2) [    x:collectionLazy2] o.a.s.r.RestManager Initializing RestManager with initArgs: {storageDir=/x1/jenkins/jenkins-slave/workspace/Lucene-Solr-Tests-5.x-Java7/solr/build/solr-core/test/J0/temp/solr.core.TestLazyCores_D39203B3C85C715F-001/tempDir-001/collection2/conf}
   [junit4]   2> 1750848 INFO  (coreLoadExecutor-5131-thread-2) [    x:collectionLazy2] o.a.s.r.ManagedResourceStorage Reading _rest_managed.json using file:dir=/x1/jenkins/jenkins-slave/workspace/Lucene-Solr-Tests-5.x-Java7/solr/build/solr-core/test/J0/temp/solr.core.TestLazyCores_D39203B3C85C715F-001/tempDir-001/collection2/conf
   [junit4]   2> 1750849 INFO  (coreLoadExecutor-5131-thread-2) [    x:collectionLazy2] o.a.s.r.RestManager Initializing 0 registered ManagedResources
   [junit4]   2> 1750849 INFO  (coreLoadExecutor-5131-thread-2) [    x:collectionLazy2] o.a.s.h.ReplicationHandler Commits will be reserved for  10000
   [junit4]   2> 1750849 INFO  (coreLoadExecutor-5131-thread-2) [    x:collectionLazy2] o.a.s.c.CoreContainer Opening transient core collectionLazy2
   [junit4]   2> 1750849 INFO  (coreLoadExecutor-5131-thread-2) [    x:collectionLazy2] o.a.s.c.CoreContainer registering core: collectionLazy2
   [junit4]   2> 1750849 INFO  (coreLoadExecutor-5131-thread-1) [    x:collection1] o.a.s.h.l.XMLLoader xsltCacheLifetimeSeconds=60
   [junit4]   2> 1750849 INFO  (searcherExecutor-5132-thread-1-processing-x:collectionLazy2) [    x:collectionLazy2] o.a.s.c.SolrCore [collectionLazy2] Registered new searcher Searcher@6c8f5c1f[collectionLazy2] main{ExitableDirectoryReader(UninvertingDirectoryReader())}
   [junit4]   2> 1750850 INFO  (coreLoadExecutor-5131-thread-1) [    x:collection1] o.a.s.h.l.XMLLoader xsltCacheLifetimeSeconds=60
   [junit4]   2> 1750852 INFO  (coreLoadExecutor-5131-thread-1) [    x:collection1] o.a.s.h.l.XMLLoader xsltCacheLifetimeSeconds=60
   [junit4]   2> 1750853 INFO  (coreLoadExecutor-5131-thread-1) [    x:collection1] o.a.s.h.l.XMLLoader xsltCacheLifetimeSeconds=60
   [junit4]   2> 1750855 INFO  (coreLoadExecutor-5131-thread-1) [    x:collection1] o.a.s.c.RequestHandlers Registered paths: /update/csv,/admin/luke,/config,/admin/plugins,/admin/mbeans,/admin/properties,/admin/segments,/get,/admin/threads,/update/json/docs,/select,/schema,/update/json,/admin/logging,/update,/admin/ping,/admin/system,/admin/file,/replication
   [junit4]   2> 1750855 INFO  (coreLoadExecutor-5131-thread-3) [    x:collectionLazy5] o.a.s.c.RequestHandlers Registered paths: /update/csv,/admin/luke,/config,/admin/plugins,/admin/mbeans,/admin/properties,/admin/segments,/get,/admin/threads,/update/json/docs,/select,/schema,/update/json,/admin/logging,/update,/admin/ping,/admin/system,/admin/file,/replication
   [junit4]   2> 1750856 INFO  (coreLoadExecutor-5131-thread-1) [    x:collection1] o.a.s.c.SolrCore Using default statsCache cache: org.apache.solr.search.stats.LocalStatsCache
   [junit4]   2> 1750856 INFO  (coreLoadExecutor-5131-thread-1) [    x:collection1] o.a.s.c.SolrCore Hard AutoCommit: disabled
   [junit4]   2> 1750856 INFO  (coreLoadExecutor-5131-thread-1) [    x:collection1] o.a.s.c.SolrCore Soft AutoCommit: disabled
   [junit4]   2> 1750857 INFO  (coreLoadExecutor-5131-thread-1) [    x:collection1] o.a.s.u.RandomMergePolicy RandomMergePolicy wrapping class org.apache.lucene.index.TieredMergePolicy: [TieredMergePolicy: maxMergeAtOnce=19, maxMergeAtOnceExplicit=19, maxMergedSegmentMB=93.3369140625, floorSegmentMB=0.2578125, forceMergeDeletesPctAllowed=24.612644943921403, segmentsPerTier=47.0, maxCFSSegmentSizeMB=8.796093022207999E12, noCFSRatio=1.0
   [junit4]   2> 1750857 INFO  (coreLoadExecutor-5131-thread-1) [    x:collection1] o.a.s.c.SolrCore SolrDeletionPolicy.onInit: commits: num=1
   [junit4]   2> 	commit{dir=MockDirectoryWrapper(RAMDirectory@1530b198 lockFactory=org.apache.lucene.store.SingleInstanceLockFactory@2fdb7d06),segFN=segments_1,generation=1}
   [junit4]   2> 1750857 INFO  (coreLoadExecutor-5131-thread-1) [    x:collection1] o.a.s.c.SolrCore newest commit generation = 1
   [junit4]   2> 1750857 INFO  (coreLoadExecutor-5131-thread-1) [    x:collection1] o.a.s.s.SolrIndexSearcher Opening Searcher@4b42ee7b[collection1] main
   [junit4]   2> 1750858 INFO  (coreLoadExecutor-5131-thread-1) [    x:collection1] o.a.s.r.ManagedResourceStorage File-based storage initialized to use dir: /x1/jenkins/jenkins-slave/workspace/Lucene-Solr-Tests-5.x-Java7/solr/build/solr-core/test/J0/temp/solr.core.TestLazyCores_D39203B3C85C715F-001/tempDir-001/collection1/conf
   [junit4]   2> 1750858 INFO  (coreLoadExecutor-5131-thread-1) [    x:collection1] o.a.s.r.RestManager Initializing RestManager with initArgs: {storageDir=/x1/jenkins/jenkins-slave/workspace/Lucene-Solr-Tests-5.x-Java7/solr/build/solr-core/test/J0/temp/solr.core.TestLazyCores_D39203B3C85C715F-001/tempDir-001/collection1/conf}
   [junit4]   2> 1750858 INFO  (coreLoadExecutor-5131-thread-1) [    x:collection1] o.a.s.r.ManagedResourceStorage Reading _rest_managed.json using file:dir=/x1/jenkins/jenkins-slave/workspace/Lucene-Solr-Tests-5.x-Java7/solr/build/solr-core/test/J0/temp/solr.core.TestLazyCores_D39203B3C85C715F-001/tempDir-001/collection1/conf
   [junit4]   2> 1750858 INFO  (coreLoadExecutor-5131-thread-1) [    x:collection1] o.a.s.r.RestManager Initializing 0 registered ManagedResources
   [junit4]   2> 1750858 INFO  (coreLoadExecutor-5131-thread-1) [    x:collection1] o.a.s.h.ReplicationHandler Commits will be reserved for  10000
   [junit4]   2> 1750858 INFO  (coreLoadExecutor-5131-thread-1) [    x:collection1] o.a.s.c.CoreContainer registering core: collection1
   [junit4]   2> 1750859 INFO  (searcherExecutor-5135-thread-1-processing-x:collection1) [    x:collection1] o.a.s.c.SolrCore [collection1] Registered new searcher Searcher@4b42ee7b[collection1] main{ExitableDirectoryReader(UninvertingDirectoryReader())}
   [junit4]   2> 1750857 INFO  (coreLoadExecutor-5131-thread-3) [    x:collectionLazy5] o.a.s.c.SolrCore Using default statsCache cache: org.apache.solr.search.stats.LocalStatsCache
   [junit4]   2> 1750859 INFO  (coreLoadExecutor-5131-thread-3) [    x:collectionLazy5] o.a.s.c.SolrCore Hard AutoCommit: disabled
   [junit4]   2> 1750859 INFO  (coreLoadExecutor-5131-thread-3) [    x:collectionLazy5] o.a.s.c.SolrCore Soft AutoCommit: disabled
   [junit4]   2> 1750860 INFO  (coreLoadExecutor-5131-thread-3) [    x:collectionLazy5] o.a.s.u.RandomMergePolicy RandomMergePolicy wrapping class org.apache.lucene.index.TieredMergePolicy: [TieredMergePolicy: maxMergeAtOnce=19, maxMergeAtOnceExplicit=19, maxMergedSegmentMB=93.3369140625, floorSegmentMB=0.2578125, forceMergeDeletesPctAllowed=24.612644943921403, segmentsPerTier=47.0, maxCFSSegmentSizeMB=8.796093022207999E12, noCFSRatio=1.0
   [junit4]   2> 1750860 INFO  (coreLoadExecutor-5131-thread-3) [    x:collectionLazy5] o.a.s.c.SolrCore SolrDeletionPolicy.onInit: commits: num=1
   [junit4]   2> 	commit{dir=MockDirectoryWrapper(RAMDirectory@2ee8293a lockFactory=org.apache.lucene.store.SingleInstanceLockFactory@beab6e5),segFN=segments_1,generation=1}
   [junit4]   2> 1750860 INFO  (coreLoadExecutor-5131-thread-3) [    x:collectionLazy5] o.a.s.c.SolrCore newest commit generation = 1
   [junit4]   2> 1750860 INFO  (coreLoadExecutor-5131-thread-3) [    x:collectionLazy5] o.a.s.s.SolrIndexSearcher Opening Searcher@66bbba09[collectionLazy5] main
   [junit4]   2> 1750861 INFO  (coreLoadExecutor-5131-thread-3) [    x:collectionLazy5] o.a.s.r.ManagedResourceStorage File-based storage initialized to use dir: /x1/jenkins/jenkins-slave/workspace/Lucene-Solr-Tests-5.x-Java7/solr/build/solr-core/test/J0/temp/solr.core.TestLazyCores_D39203B3C85C715F-001/tempDir-001/collection5/conf
   [junit4]   2> 1750861 INFO  (coreLoadExecutor-5131-thread-3) [    x:collectionLazy5] o.a.s.r.RestManager Initializing RestManager with initArgs: {storageDir=/x1/jenkins/jenkins-slave/workspace/Lucene-Solr-Tests-5.x-Java7/solr/build/solr-core/test/J0/temp/solr.core.TestLazyCores_D39203B3C85C715F-001/tempDir-001/collection5/conf}
   [junit4]   2> 1750861 INFO  (coreLoadExecutor-5131-thread-3) [    x:collectionLazy5] o.a.s.r.ManagedResourceStorage Reading _rest_managed.json using file:dir=/x1/jenkins/jenkins-slave/workspace/Lucene-Solr-Tests-5.x-Java7/solr/build/solr-core/test/J0/temp/solr.core.TestLazyCores_D39203B3C85C715F-001/tempDir-001/collection5/conf
   [junit4]   2> 1750861 INFO  (coreLoadExecutor-5131-thread-3) [    x:collectionLazy5] o.a.s.r.RestManager Initializing 0 registered ManagedResources
   [junit4]   2> 1750861 INFO  (coreLoadExecutor-5131-thread-3) [    x:collectionLazy5] o.a.s.h.ReplicationHandler Commits will be reserved for  10000
   [junit4]   2> 1750861 INFO  (searcherExecutor-5133-thread-1-processing-x:collectionLazy5) [    x:collectionLazy5] o.a.s.c.SolrCore [collectionLazy5] Registered new searcher Searcher@66bbba09[collectionLazy5] main{ExitableDirectoryReader(UninvertingDirectoryReader())}
   [junit4]   2> 1750861 INFO  (coreLoadExecutor-5131-thread-3) [    x:collectionLazy5] o.a.s.c.CoreContainer registering core: collectionLazy5
   [junit4]   2> 1750863 INFO  (TEST-TestLazyCores.testCachingLimit-seed#[D39203B3C85C715F]) [    ] o.a.s.c.SolrResourceLoader new SolrResourceLoader for directory: '/x1/jenkins/jenkins-slave/workspace/Lucene-Solr-Tests-5.x-Java7/solr/build/solr-core/test/J0/temp/solr.core.TestLazyCores_D39203B3C85C715F-001/tempDir-001/collection3/'
   [junit4]   2> 1750886 INFO  (TEST-TestLazyCores.testCachingLimit-seed#[D39203B3C85C715F]) [    ] o.a.s.c.SolrConfig current version of requestparams : -1
   [junit4]   2> 1750899 INFO  (TEST-TestLazyCores.testCachingLimit-seed#[D39203B3C85C715F]) [    ] o.a.s.c.SolrConfig Using Lucene MatchVersion: 5.3.0
   [junit4]   2> 1750924 INFO  (TEST-TestLazyCores.testCachingLimit-seed#[D39203B3C85C715F]) [    ] o.a.s.c.Config Loaded SolrConfig: solrconfig.xml
   [junit4]   2> 1750924 INFO  (TEST-TestLazyCores.testCachingLimit-seed#[D39203B3C85C715F]) [    ] o.a.s.s.IndexSchema Reading Solr Schema from /x1/jenkins/jenkins-slave/workspace/Lucene-Solr-Tests-5.x-Java7/solr/build/solr-core/test/J0/temp/solr.core.TestLazyCores_D39203B3C85C715F-001/tempDir-001/collection3/conf/schema.xml
   [junit4]   2> 1750929 INFO  (TEST-TestLazyCores.testCachingLimit-seed#[D39203B3C85C715F]) [    ] o.a.s.s.IndexSchema [collectionLazy3] Schema name=tiny
   [junit4]   2> 1750937 INFO  (TEST-TestLazyCores.testCachingLimit-seed#[D39203B3C85C715F]) [    ] o.a.s.s.IndexSchema unique key field: id
   [junit4]   2> 1750938 INFO  (TEST-TestLazyCores.testCachingLimit-seed#[D39203B3C85C715F]) [    ] o.a.s.c.CoreContainer Creating SolrCore 'collectionLazy3' using configuration from instancedir /x1/jenkins/jenkins-slave/workspace/Lucene-Solr-Tests-5.x-Java7/solr/build/solr-core/test/J0/temp/solr.core.TestLazyCores_D39203B3C85C715F-001/tempDir-001/collection3/
   [junit4]   2> 1750938 INFO  (TEST-TestLazyCores.testCachingLimit-seed#[D39203B3C85C715F]) [    x:collectionLazy3] o.a.s.c.SolrCore org.apache.solr.core.MockDirectoryFactory
   [junit4]   2> 1750939 INFO  (TEST-TestLazyCores.testCachingLimit-seed#[D39203B3C85C715F]) [    x:collectionLazy3] o.a.s.c.SolrCore [[collectionLazy3] ] Opening new SolrCore at [/x1/jenkins/jenkins-slave/workspace/Lucene-Solr-Tests-5.x-Java7/solr/build/solr-core/test/J0/temp/solr.core.TestLazyCores_D39203B3C85C715F-001/tempDir-001/collection3/], dataDir=[null]
   [junit4]   2> 1750939 INFO  (TEST-TestLazyCores.testCachingLimit-seed#[D39203B3C85C715F]) [    x:collectionLazy3] o.a.s.c.SolrCore JMX monitoring not detected for core: collectionLazy3
   [junit4]   2> 1750939 INFO  (TEST-TestLazyCores.testCachingLimit-seed#[D39203B3C85C715F]) [    x:collectionLazy3] o.a.s.c.CachingDirectoryFactory return new directory for /x1/jenkins/jenkins-slave/workspace/Lucene-Solr-Tests-5.x-Java7/solr/build/solr-core/test/J0/temp/solr.core.TestLazyCores_D39203B3C85C715F-001/tempDir-001/collection3/data
   [junit4]   2> 1750939 INFO  (TEST-TestLazyCores.testCachingLimit-seed#[D39203B3C85C715F]) [    x:collectionLazy3] o.a.s.c.SolrCore New index directory detected: old=null new=/x1/jenkins/jenkins-slave/workspace/Lucene-Solr-Tests-5.x-Java7/solr/build/solr-core/test/J0/temp/solr.core.TestLazyCores_D39203B3C85C715F-001/tempDir-001/collection3/data/index/
   [junit4]   2> 1750940 WARN  (TEST-TestLazyCores.testCachingLimit-seed#[D39203B3C85C715F]) [    x:collectionLazy3] o.a.s.c.SolrCore [collectionLazy3] Solr index directory '/x1/jenkins/jenkins-slave/workspace/Lucene-Solr-Tests-5.x-Java7/solr/build/solr-core/test/J0/temp/solr.core.TestLazyCores_D39203B3C85C715F-001/tempDir-001/collection3/data/index' doesn't exist. Creating new index...
   [junit4]   2> 1750940 INFO  (TEST-TestLazyCores.testCachingLimit-seed#[D39203B3C85C715F]) [    x:collectionLazy3] o.a.s.c.CachingDirectoryFactory return new directory for /x1/jenkins/jenkins-slave/workspace/Lucene-Solr-Tests-5.x-Java7/solr/build/solr-core/test/J0/temp/solr.core.TestLazyCores_D39203B3C85C715F-001/tempDir-001/collection3/data/index
   [junit4]   2> 1750940 INFO  (TEST-TestLazyCores.testCachingLimit-seed#[D39203B3C85C715F]) [    x:collectionLazy3] o.a.s.u.RandomMergePolicy RandomMergePolicy wrapping class org.apache.lucene.index.LogByteSizeMergePolicy: [LogByteSizeMergePolicy: minMergeSize=1677721, mergeFactor=25, maxMergeSize=2147483648, maxMergeSizeForForcedMerge=9223372036854775807, calibrateSizeByDeletes=false, maxMergeDocs=2147483647, maxCFSSegmentSizeMB=8.796093022207999E12, noCFSRatio=0.16881050618435467]
   [junit4]   2> 1750941 INFO  (TEST-TestLazyCores.testCachingLimit-seed#[D39203B3C85C715F]) [    x:collectionLazy3] o.a.s.c.SolrCore SolrDeletionPolicy.onCommit: commits: num=1
   [junit4]   2> 	commit{dir=MockDirectoryWrapper(RAMDirectory@568b866a lockFactory=org.apache.lucene.store.SingleInstanceLockFactory@6225c589),segFN=segments_1,generation=1}
   [junit4]   2> 1750941 INFO  (TEST-TestLazyCores.testCachingLimit-seed#[D39203B3C85C715F]) [    x:collectionLazy3] o.a.s.c.SolrCore newest commit generation = 1
   [junit4]   2> 1750943 INFO  (TEST-TestLazyCores.testCachingLimit-seed#[D39203B3C85C715F]) [    x:collectionLazy3] o.a.s.c.SolrCore no updateRequestProcessorChain defined as default, creating implicit default
   [junit4]   2> 1750945 INFO  (TEST-TestLazyCores.testCachingLimit-seed#[D39203B3C85C715F]) [    x:collectionLazy3] o.a.s.h.l.XMLLoader xsltCacheLifetimeSeconds=60
   [junit4]   2> 1750946 INFO  (TEST-TestLazyCores.testCachingLimit-seed#[D39203B3C85C715F]) [    x:collectionLazy3] o.a.s.h.l.XMLLoader xsltCacheLifetimeSeconds=60
   [junit4]   2> 1750947 INFO  (TEST-TestLazyCores.testCachingLimit-seed#[D39203B3C85C715F]) [    x:collectionLazy3] o.a.s.h.l.XMLLoader xsltCacheLifetimeSeconds=60
   [junit4]   2> 1750948 INFO  (TEST-TestLazyCores.testCachingLimit-seed#[D39203B3C85C715F]) [    x:collectionLazy3] o.a.s.h.l.XMLLoader xsltCacheLifetimeSeconds=60
   [junit4]   2> 1750950 INFO  (TEST-TestLazyCores.testCachingLimit-seed#[D39203B3C85C715F]) [    x:collectionLazy3] o.a.s.c.RequestHandlers Registered paths: /update/csv,/admin/luke,/config,/admin/plugins,/admin/mbeans,/admin/properties,/admin/segments,/get,/admin/threads,/update/json/docs,/select,/schema,/update/json,/admin/logging,/update,/admin/ping,/admin/system,/admin/file,/replication
   [junit4]   2> 1750951 INFO  (OldIndexDirectoryCleanupThreadForCore-collectionLazy3) [    x:collectionLazy3] o.a.s.c.SolrCore Looking for old index directories to cleanup for core collectionLazy3 in /x1/jenkins/jenkins-slave/workspace/Lucene-Solr-Tests-5.x-Java7/solr/build/solr-core/test/J0/temp/solr.core.TestLazyCores_D39203B3C85C715F-001/tempDir-001/collection3/data/
   [junit4]   2> 1750952 WARN  (OldIndexDirectoryCleanupThreadForCore-collectionLazy3) [    x:collectionLazy3] o.a.s.c.DirectoryFactory /x1/jenkins/jenkins-slave/workspace/Lucene-Solr-Tests-5.x-Java7/solr/build/solr-core/test/J0/temp/solr.core.TestLazyCores_D39203B3C85C715F-001/tempDir-001/collection3/data/ does not point to a valid data directory; skipping clean-up of old index directories.
   [junit4]   2> 1750952 INFO  (TEST-TestLazyCores.testCachingLimit-seed#[D39203B3C85C715F]) [    x:collectionLazy3] o.a.s.c.SolrCore Using default statsCache cache: org.apache.solr.search.stats.LocalStatsCache
   [junit4]   2> 1750953 INFO  (TEST-TestLazyCores.testCachingLimit-seed#[D39203B3C85C715F]) [    x:collectionLazy3] o.a.s.c.SolrCore Hard AutoCommit: disabled
   [junit4]   2> 1750953 INFO  (TEST-TestLazyCores.testCachingLimit-seed#[D39203B3C85C715F]) [    x:collectionLazy3] o.a.s.c.SolrCore Soft AutoCommit: disabled
   [junit4]   2> 1750953 INFO  (TEST-TestLazyCores.testCachingLimit-seed#[D39203B3C85C715F]) [    x:collectionLazy3] o.a.s.u.RandomMergePolicy RandomMergePolicy wrapping class org.apache.lucene.index.AlcoholicMergePolicy: [AlcoholicMergePolicy: minMergeSize=0, mergeFactor=10, maxMergeSize=970715238, maxMergeSizeForForcedMerge=9223372036854775807, calibrateSizeByDeletes=true, maxMergeDocs=2147483647, maxCFSSegmentSizeMB=8.796093022207999E12, noCFSRatio=0.1]
   [junit4]   2> 1750954 INFO  (TEST-TestLazyCores.testCachingLimit-seed#[D39203B3C85C715F]) [    x:collectionLazy3] o.a.s.c.SolrCore SolrDeletionPolicy.onInit: commits: num=1
   [junit4]   2> 	commit{dir=MockDirectoryWrapper(RAMDirectory@568b866a lockFactory=org.apache.lucene.store.SingleInstanceLockFactory@6225c589),segFN=segments_1,generation=1}
   [junit4]   2> 1750954 INFO  (TEST-TestLazyCores.testCachingLimit-seed#[D39203B3C85C715F]) [    x:collectionLazy3] o.a.s.c.SolrCore newest commit generation = 1
   [junit4]   2> 1750954 INFO  (TEST-TestLazyCores.testCachingLimit-seed#[D39203B3C85C715F]) [    x:collectionLazy3] o.a.s.s.SolrIndexSearcher Opening Searcher@5a46586d[collectionLazy3] main
   [junit4]   2> 1750954 INFO  (TEST-TestLazyCores.testCachingLimit-seed#[D39203B3C85C715F]) [    x:collectionLazy3] o.a.s.r.ManagedResourceStorage File-based storage initialized to use dir: /x1/jenkins/jenkins-slave/workspace/Lucene-Solr-Tests-5.x-Java7/solr/build/solr-core/test/J0/temp/solr.core.TestLazyCores_D39203B3C85C715F-001/tempDir-001/collection3/conf
   [junit4]   2> 1750954 INFO  (TEST-TestLazyCores.testCachingLimit-seed#[D39203B3C85C715F]) [    x:collectionLazy3] o.a.s.r.RestManager Initializing RestManager with initArgs: {storageDir=/x1/jenkins/jenkins-slave/workspace/Lucene-Solr-Tests-5.x-Java7/solr/build/solr-core/test/J0/temp/solr.core.TestLazyCores_D39203B3C85C715F-001/tempDir-001/collection3/conf}
   [junit4]   2> 1750955 INFO  (TEST-TestLazyCores.testCachingLimit-seed#[D39203B3C85C715F]) [    x:collectionLazy3] o.a.s.r.ManagedResourceStorage Reading _rest_managed.json using file:dir=/x1/jenkins/jenkins-slave/workspace/Lucene-Solr-Tests-5.x-Java7/solr/build/solr-core/test/J0/temp/solr.core.TestLazyCores_D39203B3C85C715F-001/tempDir-001/collection3/conf
   [junit4]   2> 1750955 INFO  (TEST-TestLazyCores.testCachingLimit-seed#[D39203B3C85C715F]) [    x:collectionLazy3] o.a.s.r.RestManager Initializing 0 registered ManagedResources
   [junit4]   2> 1750955 INFO  (TEST-TestLazyCores.testCachingLimit-seed#[D39203B3C85C715F]) [    x:collectionLazy3] o.a.s.h.ReplicationHandler Commits will be reserved for  10000
   [junit4]   2> 1750955 INFO  (TEST-TestLazyCores.testCachingLimit-seed#[D39203B3C85C715F]) [    x:collectionLazy3] o.a.s.c.CoreContainer Opening transient core collectionLazy3
   [junit4]   2> 1750955 INFO  (TEST-TestLazyCores.testCachingLimit-seed#[D39203B3C85C715F]) [    x:collectionLazy3] o.a.s.c.CoreContainer registering core: collectionLazy3
   [junit4]   2> 1750956 INFO  (TEST-TestLazyCores.testCachingLimit-seed#[D39203B3C85C715F]) [    x:collectionLazy3] o.a.s.c.SolrResourceLoader new SolrResourceLoader for directory: '/x1/jenkins/jenkins-slave/workspace/Lucene-Solr-Tests-5.x-Java7/solr/build/solr-core/test/J0/temp/solr.core.TestLazyCores_D39203B3C85C715F-001/tempDir-001/collection4/'
   [junit4]   2> 1750967 INFO  (searcherExecutor-5144-thread-1-processing-x:collectionLazy3) [    x:collectionLazy3] o.a.s.c.SolrCore [collectionLazy3] Registered new searcher Searcher@5a46586d[collectionLazy3] main{ExitableDirectoryReader(UninvertingDirectoryReader())}
   [junit4]   2> 1750985 INFO  (TEST-TestLazyCores.testCachingLimit-seed#[D39203B3C85C715F]) [    x:collectionLazy3] o.a.s.c.SolrConfig current version of requestparams : -1
   [junit4]   2> 1750998 INFO  (TEST-TestLazyCores.testCachingLimit-seed#[D39203B3C85C715F]) [    x:collectionLazy3] o.a.s.c.SolrConfig Using Lucene MatchVersion: 5.3.0
   [junit4]   2> 1751064 INFO  (TEST-TestLazyCores.testCachingLimit-seed#[D39203B3C85C715F]) [    x:collectionLazy3] o.a.s.c.Config Loaded SolrConfig: solrconfig.xml
   [junit4]   2> 1751065 INFO  (TEST-TestLazyCores.testCachingLimit-seed#[D39203B3C85C715F]) [    x:collectionLazy3] o.a.s.s.IndexSchema Reading Solr Schema from /x1/jenkins/jenkins-slave/workspace/Lucene-Solr-Tests-5.x-Java7/solr/build/solr-core/test/J0/temp/solr.core.TestLazyCores_D39203B3C85C715F-001/tempDir-001/collection4/conf/schema.xml
   [junit4]   2> 1751069 INFO  (TEST-TestLazyCores.testCachingLimit-seed#[D39203B3C85C715F]) [    x:collectionLazy3] o.a.s.s.IndexSchema [collectionLazy4] Schema name=tiny
   [junit4]   2> 1751099 INFO  (TEST-TestLazyCores.testCachingLimit-seed#[D39203B3C85C715F]) [    x:collectionLazy3] o.a.s.s.IndexSchema unique key field: id
   [junit4]   2> 1751100 INFO  (TEST-TestLazyCores.testCachingLimit-seed#[D39203B3C85C715F]) [    x:collectionLazy3] o.a.s.c.CoreContainer Creating SolrCore 'collectionLazy4' using configuration from instancedir /x1/jenkins/jenkins-slave/workspace/Lucene-Solr-Tests-5.x-Java7/solr/build/solr-core/test/J0/temp/solr.core.TestLazyCores_D39203B3C85C715F-001/tempDir-001/collection4/
   [junit4]   2> 1751100 INFO  (TEST-TestLazyCores.testCachingLimit-seed#[D39203B3C85C715F]) [    x:collectionLazy4] o.a.s.c.SolrCore org.apache.solr.core.MockDirectoryFactory
   [junit4]   2> 1751100 INFO  (TEST-TestLazyCores.testCachingLimit-seed#[D39203B3C85C715F]) [    x:collectionLazy4] o.a.s.c.SolrCore [[collectionLazy4] ] Opening new SolrCore at [/x1/jenkins/jenkins-slave/workspace/Lucene-Solr-Tests-5.x-Java7/solr/build/solr-core/test/J0/temp/solr.core.TestLazyCores_D39203B3C85C715F-001/tempDir-001/collection4/], dataDir=[null]
   [junit4]   2> 1751100 INFO  (TEST-TestLazyCores.testCachingLimit-seed#[D39203B3C85C715F]) [    x:collectionLazy4] o.a.s.c.SolrCore JMX monitoring not detected for core: collectionLazy4
   [junit4]   2> 1751101 INFO  (TEST-TestLazyCores.testCachingLimit-seed#[D39203B3C85C715F]) [    x:collectionLazy4] o.a.s.c.CachingDirectoryFactory return new directory for /x1/jenkins/jenkins-slave/workspace/Lucene-Solr-Tests-5.x-Java7/solr/build/solr-core/test/J0/temp/solr.core.TestLazyCores_D39203B3C85C715F-001/tempDir-001/collection4/data
   [junit4]   2> 1751115 INFO  (TEST-TestLazyCores.testCachingLimit-seed#[D39203B3C85C715F]) [    x:collectionLazy4] o.a.s.c.SolrCore New index directory detected: old=null new=/x1/jenkins/jenkins-slave/workspace/Lucene-Solr-Tests-5.x-Java7/solr/build/solr-core/test/J0/temp/solr.core.TestLazyCores_D39203B3C85C715F-001/tempDir-001/collection4/data/index/
   [junit4]   2> 1751116 WARN  (TEST-TestLazyCores.testCachingLimit-seed#[D39203B3C85C715F]) [    x:collectionLazy4] o.a.s.c.SolrCore [collectionLazy4] Solr index directory '/x1/jenkins/jenkins-slave/workspace/Lucene-Solr-Tests-5.x-Java7/solr/build/solr-core/test/J0/temp/solr.core.TestLazyCores_D39203B3C85C715F-001/tempDir-001/collection4/data/index' doesn't exist. Creating new index...
   [junit4]   2> 1751116 INFO  (TEST-TestLazyCores.testCachingLimit-seed#[D39203B3C85C715F]) [    x:collectionLazy4] o.a.s.c.CachingDirectoryFactory return new directory for /x1/jenkins/jenkins-slave/workspace/Lucene-Solr-Tests-5.x-Java7/solr/build/solr-core/test/J0/temp/solr.core.TestLazyCores_D39203B3C85C715F-001/tempDir-001/collection4/data/index
   [junit4]   2> 1751116 INFO  (TEST-TestLazyCores.testCachingLimit-seed#[D39203B3C85C715F]) [    x:collectionLazy4] o.a.s.u.RandomMergePolicy RandomMergePolicy wrapping class org.apache.lucene.index.LogByteSizeMergePolicy: [LogByteSizeMergePolicy: minMergeSize=1677721, mergeFactor=17, maxMergeSize=2147483648, maxMergeSizeForForcedMerge=9223372036854775807, calibrateSizeByDeletes=false, maxMergeDocs=2147483647, maxCFSSegmentSizeMB=8.796093022207999E12, noCFSRatio=0.7768851625921599]
   [junit4]   2> 1751117 INFO  (TEST-TestLazyCores.testCachingLimit-seed#[D39203B3C85C715F]) [    x:collectionLazy4] o.a.s.c.SolrCore SolrDeletionPolicy.onCommit: commits: num=1
   [junit4]   2> 	commit{dir=MockDirectoryWrapper(RAMDirectory@2e1c91c3 lockFactory=org.apache.lucene.store.SingleInstanceLockFactory@55a5b0db),segFN=segments_1,generation=1}
   [junit4]   2> 1751118 INFO  (TEST-TestLazyCores.testCachingLimit-seed#[D39203B3C85C715F]) [    x:collectionLazy4] o.a.s.c.SolrCore newest commit generation = 1
   [junit4]   2> 1751128 INFO  (TEST-TestLazyCores.testCachingLimit-seed#[D39203B3C85C715F]) [    x:collectionLazy4] o.a.s.c.SolrCore no updateRequestProcessorChain defined as default, creating implicit default
   [junit4]   2> 1751130 INFO  (OldIndexDirectoryCleanupThreadForCore-collectionLazy4) [    x:collectionLazy4] o.a.s.c.SolrCore Looking for old index directories to cleanup for core collectionLazy4 in /x1/jenkins/jenkins-slave/workspace/Lucene-Solr-Tests-5.x-Java7/solr/build/solr-core/test/J0/temp/solr.core.TestLazyCores_D39203B3C85C715F-001/tempDir-001/collection4/data/
   [junit4]   2> 1751130 INFO  (TEST-TestLazyCores.testCachingLimit-seed#[D39203B3C85C715F]) [    x:collectionLazy4] o.a.s.h.l.XMLLoader xsltCacheLifetimeSeconds=60
   [junit4]   2> 1751130 WARN  (OldIndexDirectoryCleanupThreadForCore-collectionLazy4) [    x:collectionLazy4] o.a.s.c.DirectoryFactory /x1/jenkins/jenkins-slave/workspace/Lucene-Solr-Tests-5.x-Java7/solr/build/solr-core/test/J0/temp/solr.core.TestLazyCores_D39203B3C85C715F-001/tempDir-001/collection4/data/ does not point to a valid data directory; skipping clean-up of old index directories.
   [junit4]   2> 1751182 INFO  (TEST-TestLazyCores.testCachingLimit-seed#[D39203B3C85C715F]) [    x:collectionLazy4] o.a.s.h.l.XMLLoader xsltCacheLifetimeSeconds=60
   [junit4]   2> 1751183 INFO  (TEST-TestLazyCores.testCachingLimit-seed#[D39203B3C85C715F]) [    x:collectionLazy4] o.a.s.h.l.XMLLoader xsltCacheLifetimeSeconds=60
   [junit4]   2> 1751185 INFO  (TEST-TestLazyCores.testCachingLimit-seed#[D39203B3C85C715F]) [    x:collectionLazy4] o.a.s.h.l.XMLLoader xsltCacheLifetimeSeconds=60
   [junit4]   2> 1751189 INFO  (TEST-TestLazyCores.testCachingLimit-seed#[D39203B3C85C715F]) [    x:collectionLazy4] o.a.s.c.RequestHandlers Registered paths: /update/csv,/admin/luke,/config,/admin/plugins,/admin/mbeans,/admin/properties,/admin/segments,/get,/admin/threads,/update/json/docs,/select,/schema,/update/json,/admin/logging,/update,/admin/ping,/admin/system,/admin/file,/replication
   [junit4]   2> 1751190 INFO  (TEST-TestLazyCores.testCachingLimit-seed#[D39203B3C85C715F]) [    x:collectionLazy4] o.a.s.c.SolrCore Using default statsCache cache: org.apache.solr.search.stats.LocalStatsCache
   [junit4]   2> 1751190 INFO  (TEST-TestLazyCores.testCachingLimit-seed#[D39203B3C85C715F]) [    x:collectionLazy4] o.a.s.c.SolrCore Hard AutoCommit: disabled
   [junit4]   2> 1751190 INFO  (TEST-TestLazyCores.testCachingLimit-seed#[D39203B3C85C715F]) [    x:collectionLazy4] o.a.s.c.SolrCore Soft AutoCommit: disabled
   [junit4]   2> 1751191 INFO  (TEST-TestLazyCores.testCachingLimit-seed#[D39203B3C85C715F]) [    x:collectionLazy4] o.a.s.u.RandomMergePolicy RandomMergePolicy wrapping class org.apache.lucene.index.TieredMergePolicy: [TieredMergePolicy: maxMergeAtOnce=39, maxMergeAtOnceExplicit=34, maxMergedSegmentMB=66.11328125, floorSegmentMB=2.1884765625, forceMergeDeletesPctAllowed=25.0525842138935, segmentsPerTier=25.0, maxCFSSegmentSizeMB=8.796093022207999E12, noCFSRatio=1.0
   [junit4]   2> 1751191 INFO  (TEST-TestLazyCores.testCachingLimit-seed#[D39203B3C85C715F]) [    x:collectionLazy4] o.a.s.c.SolrCore SolrDeletionPolicy.onInit: commits: num=1
   [junit4]   2> 	commit{dir=MockDirectoryWrapper(RAMDirectory@2e1c91c3 lockFactory=org.apache.lucene.store.SingleInstanceLockFactory@55a5b0db),segFN=segments_1,generation=1}
   [junit4]   2> 1751215 INFO  (TEST-TestLazyCores.testCachingLimit-seed#[D39203B3C85C715F]) [    x:collectionLazy4] o.a.s.c.SolrCore newest commit generation = 1
   [junit4]   2> 1751216 INFO  (TEST-TestLazyCores.testCachingLimit-seed#[D39203B3C85C715F]) [    x:collectionLazy4] o.a.s.s.SolrIndexSearcher Opening Searcher@51000aca[collectionLazy4] main
   [junit4]   2> 1751216 INFO  (TEST-TestLazyCores.testCachingLimit-seed#[D39203B3C85C715F]) [    x:collectionLazy4] o.a.s.r.ManagedResourceStorage File-based storage initialized to use dir: /x1/jenkins/jenkins-slave/workspace/Lucene-Solr-Tests-5.x-Java7/solr/build/solr-core/test/J0/temp/solr.core.TestLazyCores_D39203B3C85C715F-001/tempDir-001/collection4/conf
   [junit4]   2> 1751216 INFO  (TEST-TestLazyCores.testCachingLimit-seed#[D39203B3C85C715F]) [    x:collectionLazy4] o.a.s.r.RestManager Initializing RestManager with initArgs: {storageDir=/x1/jenkins/jenkins-slave/workspace/Lucene-Solr-Tests-5.x-Java7/solr/build/solr-core/test/J0/temp/solr.core.TestLazyCores_D39203B3C85C715F-001/tempDir-001/collection4/conf}
   [junit4]   2> 1751216 INFO  (TEST-TestLazyCores.testCachingLimit-seed#[D39203B3C85C715F]) [    x:collectionLazy4] o.a.s.r.ManagedResourceStorage Reading _rest_managed.json using file:dir=/x1/jenkins/jenkins-slave/workspace/Lucene-Solr-Tests-5.x-Java7/solr/build/solr-core/test/J0/temp/solr.core.TestLazyCores_D39203B3C85C715F-001/tempDir-001/collection4/conf
   [junit4]   2> 1751217 INFO  (TEST-TestLazyCores.testCachingLimit-seed#[D39203B3C85C715F]) [    x:collectionLazy4] o.a.s.r.RestManager Initializing 0 registered ManagedResources
   [junit4]   2> 1751217 INFO  (TEST-TestLazyCores.testCachingLimit-seed#[D39203B3C85C715F]) [    x:collectionLazy4] o.a.s.h.ReplicationHandler Commits will be reserved for  10000
   [junit4]   2> 1751217 INFO  (TEST-TestLazyCores.testCachingLimit-seed#[D39203B3C85C715F]) [    x:collectionLazy4] o.a.s.c.CoreContainer registering core: collectionLazy4
   [junit4]   2> 1751217 INFO  (TEST-TestLazyCores.testCachingLimit-seed#[D39203B3C85C715F]) [    x:collectionLazy4] o.a.s.c.SolrResourceLoader new SolrResourceLoader for directory: '/x1/jenkins/jenkins-slave/workspace/Lucene-Solr-Tests-5.x-Java7/solr/build/solr-core/test/J0/temp/solr.core.TestLazyCores_D39203B3C85C715F-001/tempDir-001/collection6/'
   [junit4]   2> 1751223 INFO  (searcherExecutor-5148-thread-1-processing-x:collectionLazy4) [    x:collectionLazy4] o.a.s.c.SolrCore [collectionLazy4] Registered new searcher Searcher@51000aca[collectionLazy4] main{ExitableDirectoryReader(UninvertingDirectoryReader())}
   [junit4]   2> 1751330 INFO  (TEST-TestLazyCores.testCachingLimit-seed#[D39203B3C85C715F]) [    x:collectionLazy4] o.a.s.c.SolrConfig current version of requestparams : -1
   [junit4]   2> 1751351 INFO  (TEST-TestLazyCores.testCachingLimit-seed#[D39203B3C85C715F]) [    x:collectionLazy4] o.a.s.c.SolrConfig Using Lucene MatchVersion: 5.3.0
   [junit4]   2> 1751388 INFO  (TEST-TestLazyCores.testCachingLimit-seed#[D39203B3C85C715F]) [    x:collectionLazy4] o.a.s.c.Config Loaded SolrConfig: solrconfig.xml
   [junit4]   2> 1751388 INFO  (TEST-TestLazyCores.testCachingLimit-seed#[D39203B3C85C715F]) [    x:collectionLazy4] o.a.s.s.IndexSchema Reading Solr Schema from /x1/jenkins/jenkins-slave/workspace/Lucene-Solr-Tests-5.x-Java7/solr/build/solr-core/test/J0/temp/solr.core.TestLazyCores_D39203B3C85C715F-001/tempDir-001/collection6/conf/schema.xml
   [junit4]   2> 1751434 INFO  (TEST-TestLazyCores.testCachingLimit-seed#[D39203B3C85C715F]) [    x:collectionLazy4] o.a.s.s.IndexSchema [collectionLazy6] Schema name=tiny
   [junit4]   2> 1751482 INFO  (TEST-TestLazyCores.testCachingLimit-seed#[D39203B3C85C715F]) [    x:collectionLazy4] o.a.s.s.IndexSchema unique key field: id
   [junit4]   2> 1751482 INFO  (TEST-TestLazyCores.testCachingLimit-seed#[D39203B3C85C715F]) [    x:collectionLazy4] o.a.s.c.CoreContainer Creating SolrCore 'collectionLazy6' using configuration from instancedir /x1/jenkins/jenkins-slave/workspace/Lucene-Solr-Tests-5.x-Java7/solr/build/solr-core/test/J0/temp/solr.core.TestLazyCores_D39203B3C85C715F-001/tempDir-001/collection6/
   [junit4]   2> 1751482 INFO  (TEST-TestLazyCores.testCachingLimit-seed#[D39203B3C85C715F]) [    x:collectionLazy6] o.a.s.c.SolrCore org.apache.solr.core.MockDirectoryFactory
   [junit4]   2> 1751483 INFO  (TEST-TestLazyCores.testCachingLimit-seed#[D39203B3C85C715F]) [    x:collectionLazy6] o.a.s.c.SolrCore [[collectionLazy6] ] Opening new SolrCore at [/x1/jenkins/jenkins-slave/workspace/Lucene-Solr-Tests-5.x-Java7/solr/build/solr-core/test/J0/temp/solr.core.TestLazyCores_D39203B3C85C715F-001/tempDir-001/collection6/], dataDir=[null]
   [junit4]   2> 1751483 INFO  (TEST-TestLazyCores.testCachingLimit-seed#[D39203B3C85C715F]) [    x:collectionLazy6] o.a.s.c.SolrCore JMX monitoring not detected for core: collectionLazy6
   [junit4]   2> 1751483 INFO  (TEST-TestLazyCores.testCachingLimit-seed#[D39203B3C85C715F]) [    x:collectionLazy6] o.a.s.c.CachingDirectoryFactory return new directory for /x1/jenkins/jenkins-slave/workspace/Lucene-Solr-Tests-5.x-Java7/solr/build/solr-core/test/J0/temp/solr.core.TestLazyCores_D39203B3C85C715F-001/tempDir-001/collection6/data
   [junit4]   2> 1751484 INFO  (TEST-TestLazyCores.testCachingLimit-seed#[D39203B3C85C715F]) [    x:collectionLazy6] o.a.s.c.SolrCore New index directory detected: old=null new=/x1/jenkins/jenkins-slave/workspace/Lucene-Solr-Tests-5.x-Java7/solr/build/solr-core/test/J0/temp/solr.core.TestLazyCores_D39203B3C85C715F-001/tempDir-001/collection6/data/index/
   [junit4]   2> 1751484 WARN  (TEST-TestLazyCores.testCachingLimit-seed#[D39203B3C85C715F]) [    x:collectionLazy6] o.a.s.c.SolrCore [collectionLazy6] Solr index directory '/x1/jenkins/jenkins-slave/workspace/Lucene-Solr-Tests-5.x-Java7/solr/build/solr-core/test/J0/temp/solr.core.TestLazyCores_D39203B3C85C715F-001/tempDir-001/collection6/data/index' doesn't exist. Creating new index...
   [junit4]   2> 1751484 INFO  (TEST-TestLazyCores.testCachingLimit-seed#[D39203B3C85C715F]) [    x:collectionLazy6] o.a.s.c.CachingDirectoryFactory return new directory for /x1/jenkins/jenkins-slave/workspace/Lucene-Solr-Tests-5.x-Java7/solr/build/solr-core/test/J0/temp/solr.core.TestLazyCores_D39203B3C85C715F-001/tempDir-001/collection6/data/index
   [junit4]   2> 1751484 INFO  (TEST-TestLazyCores.testCachingLimit-seed#[D39203B3C85C715F]) [    x:collectionLazy6] o.a.s.u.RandomMergePolicy RandomMergePolicy wrapping class org.apache.lucene.index.LogByteSizeMergePolicy: [LogByteSizeMergePolicy: minMergeSize=1677721, mergeFactor=29, maxMergeSize=2147483648, maxMergeSizeForForcedMerge=9223372036854775807, calibrateSizeByDeletes=false, maxMergeDocs=2147483647, maxCFSSegmentSizeMB=8.796093022207999E12, noCFSRatio=1.0]
   [junit4]   2> 1751485 INFO  (TEST-TestLazyCores.testCachingLimit-seed#[D39203B3C85C715F]) [    x:collectionLazy6] o.a.s.c.SolrCore SolrDeletionPolicy.onCommit: commits: num=1
   [junit4]   2> 	commit{dir=MockDirectoryWrapper(RAMDirectory@4a7b0e33 lockFactory=org.apache.lucene.store.SingleInstanceLockFactory@54e15c78),segFN=segments_1,generation=1}
   [junit4]   2> 1751485 INFO  (TEST-TestLazyCores.testCachingLimit-seed#[D39203B3C85C715F]) [    x:collectionLazy6] o.a.s.c.SolrCore newest commit generation = 1
   [junit4]   2> 1751487 INFO  (TEST-TestLazyCores.testCachingLimit-seed#[D39203B3C85C715F]) [    x:collectionLazy6] o.a.s.c.SolrCore no updateRequestProcessorChain defined as default, creating implicit default
   [junit4]   2> 1751489 INFO  (TEST-TestLazyCores.testCachingLimit-seed#[D39203B3C85C715F]) [    x:collectionLazy6] o.a.s.h.l.XMLLoader xsltCacheLifetimeSeconds=60
   [junit4]   2> 1751490 INFO  (TEST-TestLazyCores.testCachingLimit-seed#[D39203B3C85C715F]) [    x:collectionLazy6] o.a.s.h.l.XMLLoader xsltCacheLifetimeSeconds=60
   [junit4]   2> 1751491 INFO  (TEST-TestLazyCores.testCachingLimit-seed#[D39203B3C85C715F]) [    x:collectionLazy6] o.a.s.h.l.XMLLoader xsltCacheLifetimeSeconds=60
   [junit4]   2> 1751492 INFO  (TEST-TestLazyCores.testCachingLimit-seed#[D39203B3C85C715F]) [    x:collectionLazy6] o.a.s.h.l.XMLLoader xsltCacheLifetimeSeconds=60
   [junit4]   2> 1751494 INFO  (TEST-TestLazyCores.testCachingLimit-seed#[D39203B3C85C715F]) [    x:collectionLazy6] o.a.s.c.RequestHandlers Registered paths: /update/csv,/admin/luke,/config,/admin/plugins,/admin/mbeans,/admin/properties,/admin/segments,/get,/admin/threads,/update/json/docs,/select,/schema,/update/json,/admin/logging,/update,/admin/ping,/admin/system,/admin/file,/replication
   [junit4]   2> 1751495 INFO  (TEST-TestLazyCores.testCachingLimit-seed#[D39203B3C85C715F]) [    x:collectionLazy6] o.a.s.c.SolrCore Using default statsCache cache: org.apache.solr.search.stats.LocalStatsCache
   [junit4]   2> 1751496 INFO  (OldIndexDirectoryCleanupThreadForCore-collectionLazy6) [    x:collectionLazy6] o.a.s.c.SolrCore Looking for old index directories to cleanup for core collectionLazy6 in /x1/jenkins/jenkins-slave/workspace/Lucene-Solr-Tests-5.x-Java7/solr/build/solr-core/test/J0/temp/solr.core.TestLazyCores_D39203B3C85C715F-001/tempDir-001/collection6/data/
   [junit4]   2> 1751496 WARN  (OldIndexDirectoryCleanupThreadForCore-collectionLazy6) [    x:collectionLazy6] o.a.s.c.DirectoryFactory /x1/jenkins/jenkins-slave/workspace/Lucene-Solr-Tests-5.x-Java7/solr/build/solr-core/test/J0/temp/solr.core.TestLazyCores_D39203B3C85C715F-001/tempDir-001/collection6/data/ does not point to a valid data directory; skipping clean-up of old index directories.
   [junit4]   2> 1751496 INFO  (TEST-TestLazyCores.testCachingLimit-seed#[D39203B3C85C715F]) [    x:collectionLazy6] o.a.s.c.SolrCore Hard AutoCommit: disabled
   [junit4]   2> 1751497 INFO  (TEST-TestLazyCores.testCachingLimit-seed#[D39203B3C85C715F]) [    x:collectionLazy6] o.a.s.c.SolrCore Soft AutoCommit: disabled
   [junit4]   2> 1751497 INFO  (TEST-TestLazyCores.testCachingLimit-seed#[D39203B3C85C715F]) [    x:collectionLazy6] o.a.s.u.RandomMergePolicy RandomMergePolicy wrapping class org.apache.lucene.index.AlcoholicMergePolicy: [AlcoholicMergePolicy: minMergeSize=0, mergeFactor=10, maxMergeSize=777735824, maxMergeSizeForForcedMerge=9223372036854775807, calibrateSizeByDeletes=true, maxMergeDocs=2147483647, maxCFSSegmentSizeMB=8.796093022207999E12, noCFSRatio=0.1]
   [junit4]   2> 1751497 INFO  (TEST-TestLazyCores.testCachingLimit-seed#[D39203B3C85C715F]) [    x:collectionLazy6] o.a.s.c.SolrCore SolrDeletionPolicy.onInit: commits: num=1
   [junit4]   2> 	commit{dir=MockDirectoryWrapper(RAMDirectory@4a7b0e33 lockFactory=org.apache.lucene.store.SingleInstanceLockFactory@54e15c78),segFN=segments_1,generation=1}
   [junit4]   2> 1751498 INFO  (TEST-TestLazyCores.testCachingLimit-seed#[D39203B3C85C715F]) [    x:collectionLazy6] o.a.s.c.SolrCore newest commit generation = 1
   [junit4]   2> 1751498 INFO  (TEST-TestLazyCores.testCachingLimit-seed#[D39203B3C85C715F]) [    x:collectionLazy6] o.a.s.s.SolrIndexSearcher Opening Searcher@2d8cffca[collectionLazy6] main
   [junit4]   2> 1751498 INFO  (TEST-TestLazyCores.testCachingLimit-seed#[D39203B3C85C715F]) [    x:collectionLazy6] o.a.s.r.ManagedResourceStorage File-based storage initialized to use dir: /x1/jenkins/jenkins-slave/workspace/Lucene-Solr-Tests-5.x-Java7/solr/build/solr-core/test/J0/temp/solr.core.TestLazyCores_D39203B3C85C715F-001/tempDir-001/collection6/conf
   [junit4]   2> 1751498 INFO  (TEST-TestLazyCores.testCachingLimit-seed#[D39203B3C85C715F]) [    x:collectionLazy6] o.a.s.r.RestManager Initializing RestManager with initArgs: {storageDir=/x1/jenkins/jenkins-slave/workspace/Lucene-Solr-Tests-5.x-Java7/solr/build/solr-core/test/J0/temp/solr.core.TestLazyCores_D39203B3C85C715F-001/tempDir-001/collection6/conf}
   [junit4]   2> 1751498 INFO  (TEST-TestLazyCores.testCachingLimit-seed#[D39203B3C85C715F]) [    x:collectionLazy6] o.a.s.r.ManagedResourceStorage Reading _rest_managed.json using file:dir=/x1/jenkins/jenkins-slave/workspace/Lucene-Solr-Tests-5.x-Java7/solr/build/solr-core/test/J0/temp/solr.core.TestLazyCores_D39203B3C85C715F-001/tempDir-001/collection6/conf
   [junit4]   2> 1751499 INFO  (TEST-TestLazyCores.testCachingLimit-seed#[D39203B3C85C715F]) [    x:collectionLazy6] o.a.s.r.RestManager Initializing 0 registered ManagedResources
   [junit4]   2> 1751499 INFO  (TEST-TestLazyCores.testCachingLimit-seed#[D39203B3C85C715F]) [    x:collectionLazy6] o.a.s.h.ReplicationHandler Commits will be reserved for  10000
   [junit4]   2> 1751499 INFO  (TEST-TestLazyCores.testCachingLimit-seed#[D39203B3C85C715F]) [    x:collectionLazy6] o.a.s.c.CoreContainer Opening transient core collectionLazy6
   [junit4]   2> 1751499 INFO  (TEST-TestLazyCores.testCachingLimit-seed#[D39203B3C85C715F]) [    x:collectionLazy6] o.a.s.c.CoreContainer registering core: collectionLazy6
   [junit4]   2> 1751499 INFO  (TEST-TestLazyCores.testCachingLimit-seed#[D39203B3C85C715F]) [    x:collectionLazy6] o.a.s.c.SolrResourceLoader new SolrResourceLoader for directory: '/x1/jenkins/jenkins-slave/workspace/Lucene-Solr-Tests-5.x-Java7/solr/build/solr-core/test/J0/temp/solr.core.TestLazyCores_D39203B3C85C715F-001/tempDir-001/collection7/'
   [junit4]   2> 1751515 INFO  (searcherExecutor-5152-thread-1-processing-x:collectionLazy6) [    x:collectionLazy6] o.a.s.c.SolrCore [collectionLazy6] Registered new searcher Searcher@2d8cffca[collectionLazy6] main{ExitableDirectoryReader(UninvertingDirectoryReader())}
   [junit4]   2> 1751569 INFO  (TEST-TestLazyCores.testCachingLimit-seed#[D39203B3C85C715F]) [    x:collectionLazy6] o.a.s.c.SolrConfig current version of requestparams : -1
   [junit4]   2> 1751626 INFO  (TEST-TestLazyCores.testCachingLimit-seed#[D39203B3C85C715F]) [    x:collectionLazy6] o.a.s.c.SolrConfig Using Lucene MatchVersion: 5.3.0
   [junit4]   2> 1751660 INFO  (TEST-TestLazyCores.testCachingLimit-seed#[D39203B3C85C715F]) [    x:collectionLazy6] o.a.s.c.Config Loaded SolrConfig: solrconfig.xml
   [junit4]   2> 1751660 INFO  (TEST-TestLazyCores.testCachingLimit-seed#[D39203B3C85C715F]) [    x:collectionLazy6] o.a.s.s.IndexSchema Reading Solr Schema from /x1/jenkins/jenkins-slave/workspace/Lucene-Solr-Tests-5.x-Java7/solr/build/solr-core/test/J0/temp/solr.core.TestLazyCores_D39203B3C85C715F-001/tempDir-001/collection7/conf/schema.xml
   [junit4]   2> 1751664 INFO  (TEST-TestLazyCores.testCachingLimit-seed#[D39203B3C85C715F]) [    x:collectionLazy6] o.a.s.s.IndexSchema [collectionLazy7] Schema name=tiny
   [junit4]   2> 1751673 INFO  (TEST-TestLazyCores.testCachingLimit-seed#[D39203B3C85C715F]) [    x:collectionLazy6] o.a.s.s.IndexSchema unique key field: id
   [junit4]   2> 1751673 INFO  (TEST-TestLazyCores.testCachingLimit-seed#[D39203B3C85C715F]) [    x:collectionLazy6] o.a.s.c.CoreContainer Creating SolrCore 'collectionLazy7' using configuration from instancedir /x1/jenkins/jenkins-slave/workspace/Lucene-Solr-Tests-5.x-Java7/solr/build/solr-core/test/J0/temp/solr.core.TestLazyCores_D39203B3C85C715F-001/tempDir-001/collection7/
   [junit4]   2> 1751674 INFO  (TEST-TestLazyCores.testCachingLimit-seed#[D39203B3C85C715F]) [    x:collectionLazy7] o.a.s.c.SolrCore org.apache.solr.core.MockDirectoryFactory
   [junit4]   2> 1751674 INFO  (TEST-TestLazyCores.testCachingLimit-seed#[D39203B3C85C715F]) [    x:collectionLazy7] o.a.s.c.SolrCore [[collectionLazy7] ] Opening new SolrCore at [/x1/jenkins/jenkins-slave/workspace/Lucene-Solr-Tests-5.x-Java7/solr/build/solr-core/test/J0/temp/solr.core.TestLazyCores_D39203B3C85C715F-001/tempDir-001/collection7/], dataDir=[null]
   [junit4]   2> 1751674 INFO  (TEST-TestLazyCores.testCachingLimit-seed#[D39203B3C85C715F]) [    x:collectionLazy7] o.a.s.c.SolrCore JMX monitoring not detected for core: collectionLazy7
   [junit4]   2> 1751674 INFO  (TEST-TestLazyCores.testCachingLimit-seed#[D39203B3C85C715F]) [    x:collectionLazy7] o.a.s.c.CachingDirectoryFactory return new directory for /x1/jenkins/jenkins-slave/workspace/Lucene-Solr-Tests-5.x-Java7/solr/build/solr-core/test/J0/temp/solr.core.TestLazyCores_D39203B3C85C715F-001/tempDir-001/collection7/data
   [junit4]   2> 1751675 INFO  (TEST-TestLazyCores.testCachingLimit-seed#[D39203B3C85C715F]) [    x:collectionLazy7] o.a.s.c.SolrCore New index directory detected: old=null new=/x1/jenkins/jenkins-slave/workspace/Lucene-Solr-Tests-5.x-Java7/solr/build/solr-core/test/J0/temp/solr.core.TestLazyCores_D39203B3C85C715F-001/tempDir-001/collection7/data/index/
   [junit4]   2> 1751675 WARN  (TEST-TestLazyCores.testCachingLimit-seed#[D39203B3C85C715F]) [    x:collectionLazy7] o.a.s.c.SolrCore [collectionLazy7] Solr index directory '/x1/jenkins/jenkins-slave/workspace/Lucene-Solr-Tests-5.x-Java7/solr/build/solr-core/test/J0/temp/solr.core.TestLazyCores_D39203B3C85C715F-001/tempDir-001/collection7/data/index' doesn't exist. Creating new index...
   [junit4]   2> 1751675 INFO  (TEST-TestLazyCores.testCachingLimit-seed#[D39203B3C85C715F]) [    x:collectionLazy7] o.a.s.c.CachingDirectoryFactory return new directory for /x1/jenkins/jenkins-slave/workspace/Lucene-Solr-Tests-5.x-Java7/solr/build/solr-core/test/J0/temp/solr.core.TestLazyCores_D39203B3C85C715F-001/tempDir-001/collection7/data/index
   [junit4]   2> 1751675 INFO  (TEST-TestLazyCores.testCachingLimit-seed#[D39203B3C85C715F]) [    x:collectionLazy7] o.a.s.u.RandomMergePolicy RandomMergePolicy wrapping class org.apache.lucene.index.LogDocMergePolicy: [LogDocMergePolicy: minMergeSize=1000, mergeFactor=41, maxMergeSize=9223372036854775807, maxMergeSizeForForcedMerge=9223372036854775807, calibrateSizeByDeletes=true, maxMergeDocs=2147483647, maxCFSSegmentSizeMB=8.796093022207999E12, noCFSRatio=1.0]
   [junit4]   2> 1751677 INFO  (TEST-TestLazyCores.testCachingLimit-seed#[D39203B3C85C715F]) [    x:collectionLazy7] o.a.s.c.SolrCore SolrDeletionPolicy.onCommit: commits: num=1
   [junit4]   2> 	commit{dir=MockDirectoryWrapper(RAMDirectory@2e8313de lockFactory=org.apache.lucene.store.SingleInstanceLockFactory@1f8d6bad),segFN=segments_1,generation=1}
   [junit4]   2> 1751677 INFO  (TEST-TestLazyCores.testCachingLimit-seed#[D39203B3C85C715F]) [    x:collectionLazy7] o.a.s.c.SolrCore newest commit generation = 1
   [junit4]   2> 1751679 INFO  (TEST-TestLazyCores.testCachingLimit-seed#[D39203B3C85C715F]) [    x:collectionLazy7] o.a.s.c.SolrCore no updateRequestProcessorChain defined as default, creating implicit default
   [junit4]   2> 1751681 INFO  (TEST-TestLazyCores.testCachingLimit-seed#[D39203B3C85C715F]) [    x:collectionLazy7] o.a.s.h.l.XMLLoader xsltCacheLifetimeSeconds=60
   [junit4]   2> 1751682 INFO  (TEST-TestLazyCores.testCachingLimit-seed#[D39203B3C85C715F]) [    x:collectionLazy7] o.a.s.h.l.XMLLoader xsltCacheLifetimeSeconds=60
   [junit4]   2> 1751683 INFO  (TEST-TestLazyCores.testCachingLimit-seed#[D39203B3C85C715F]) [    x:collectionLazy7] o.a.s.h.l.XMLLoader xsltCacheLifetimeSeconds=60
   [junit4]   2> 1751684 INFO  (TEST-TestLazyCores.testCachingLimit-seed#[D39203B3C85C715F]) [    x:collectionLazy7] o.a.s.h.l.XMLLoader xsltCacheLifetimeSeconds=60
   [junit4]   2> 1751686 INFO  (TEST-TestLazyCores.testCachingLimit-seed#[D39203B3C85C715F]) [    x:collectionLazy7] o.a.s.c.RequestHandlers Registered paths: /update/csv,/admin/luke,/config,/admin/plugins,/admin/mbeans,/admin/properties,/admin/segments,/get,/admin/threads,/update/json/docs,/select,/schema,/update/json,/admin/logging,/update,/admin/ping,/admin/system,/admin/file,/replication
   [junit4]   2> 1751687 INFO  (TEST-TestLazyCores.testCachingLimit-seed#[D39203B3C85C715F]) [    x:collectionLazy7] o.a.s.c.SolrCore Using default statsCache cache: org.apache.solr.search.stats.LocalStatsCache
   [junit4]   2> 1751688 INFO  (OldIndexDirectoryCleanupThreadForCore-collectionLazy7) [    x:collectionLazy7] o.a.s.c.SolrCore Looking for old index directories to cleanup for core collectionLazy7 in /x1/jenkins/jenkins-slave/workspace/Lucene-Solr-Tests-5.x-Java7/solr/build/solr-core/test/J0/temp/solr.core.TestLazyCores_D39203B3C85C715F-001/tempDir-001/collection7/data/
   [junit4]   2> 1751688 WARN  (OldIndexDirectoryCleanupThreadForCore-collectionLazy7) [    x:collectionLazy7] o.a.s.c.DirectoryFactory /x1/jenkins/jenkins-slave/workspace/Lucene-Solr-Tests-5.x-Java7/solr/build/solr-core/test/J0/temp/solr.core.TestLazyCores_D39203B3C85C715F-001/tempDir-001/collection7/data/ does not point to a valid data directory; skipping clean-up of old index directories.
   [junit4]   2> 1751688 INFO  (TEST-TestLazyCores.testCachingLimit-seed#[D39203B3C85C715F]) [    x:collectionLazy7] o.a.s.c.SolrCore Hard AutoCommit: disabled
   [junit4]   2> 1751689 INFO  (TEST-TestLazyCores.testCachingLimit-seed#[D39203B3C85C715F]) [    x:collectionLazy7] o.a.s.c.SolrCore Soft AutoCommit: disabled
   [junit4]   2> 1751704 INFO  (TEST-TestLazyCores.testCachingLimit-seed#[D39203B3C85C715F]) [    x:collectionLazy7] o.a.s.u.RandomMergePolicy RandomMergePolicy wrapping class org.apache.lucene.index.LogByteSizeMergePolicy: [LogByteSizeMergePolicy: minMergeSize=1677721, mergeFactor=32, maxMergeSize=2147483648, maxMergeSizeForForcedMerge=9223372036854775807, calibrateSizeByDeletes=false, maxMergeDocs=2147483647, maxCFSSegmentSizeMB=8.796093022207999E12, noCFSRatio=1.0]
   [junit4]   2> 1751715 INFO  (TEST-TestLazyCores.testCachingLimit-seed#[D39203B3C85C715F]) [    x:collectionLazy7] o.a.s.c.SolrCore SolrDeletionPolicy.onInit: commits: num=1
   [junit4]   2> 	commit{dir=MockDirectoryWrapper(RAMDirectory@2e8313de lockFactory=org.apache.lucene.store.SingleInstanceLockFactory@1f8d6bad),segFN=segments_1,generation=1}
   [junit4]   2> 1751716 INFO  (TEST-TestLazyCores.testCachingLimit-seed#[D39203B3C85C715F]) [    x:collectionLazy7] o.a.s.c.SolrCore newest commit generation = 1
   [junit4]   2> 1751716 INFO  (TEST-TestLazyCores.testCachingLimit-seed#[D39203B3C85C715F]) [    x:collectionLazy7] o.a.s.s.SolrIndexSearcher Opening Searcher@522d9375[collectionLazy7] main
   [junit4]   2> 1751716 INFO  (TEST-TestLazyCores.testCachingLimit-seed#[D39203B3C85C715F]) [    x:collectionLazy7] o.a.s.r.ManagedResourceStorage File-based storage initialized to use dir: /x1/jenkins/jenkins-slave/workspace/Lucene-Solr-Tests-5.x-Java7/solr/build/solr-core/test/J0/temp/solr.core.TestLazyCores_D39203B3C85C715F-001/tempDir-001/collection7/conf
   [junit4]   2> 1751716 INFO  (TEST-TestLazyCores.testCachingLimit-seed#[D39203B3C85C715F]) [    x:collectionLazy7] o.a.s.r.RestManager Initializing RestManager with initArgs: {storageDir=/x1/jenkins/jenkins-slave/workspace/Lucene-Solr-Tests-5.x-Java7/solr/build/solr-core/test/J0/temp/solr.core.TestLazyCores_D39203B3C85C715F-001/tempDir-001/collection7/conf}
   [junit4]   2> 1751717 INFO  (TEST-TestLazyCores.testCachingLimit-seed#[D39203B3C85C715F]) [    x:collectionLazy7] o.a.s.r.ManagedResourceStorage Reading _rest_managed.json using file:dir=/x1/jenkins/jenkins-slave/workspace/Lucene-Solr-Tests-5.x-Java7/solr/build/solr-core/test/J0/temp/solr.core.TestLazyCores_D39203B3C85C715F-001/tempDir-001/collection7/conf
   [junit4]   2> 1751717 INFO  (TEST-TestLazyCores.testCachingLimit-seed#[D39203B3C85C715F]) [    x:collectionLazy7] o.a.s.r.RestManager Initializing 0 registered ManagedResources
   [junit4]   2> 1751717 INFO  (TEST-TestLazyCores.testCachingLimit-seed#[D39203B3C85C715F]) [    x:collectionLazy7] o.a.s.h.ReplicationHandler Commits will be reserved for  10000
   [junit4]   2> 1751717 INFO  (TEST-TestLazyCores.testCachingLimit-seed#[D39203B3C85C715F]) [    x:collectionLazy7] o.a.s.c.CoreContainer Opening transient core collectionLazy7
   [junit4]   2> 1751717 INFO  (TEST-TestLazyCores.testCachingLimit-seed#[D39203B3C85C715F]) [    x:collectionLazy7] o.a.s.c.CoreContainer registering core: collectionLazy7
   [junit4]   2> 1751718 INFO  (TEST-TestLazyCores.testCachingLimit-seed#[D39203B3C85C715F]) [    x:collectionLazy7] o.a.s.c.SolrResourceLoader new SolrResourceLoader for directory: '/x1/jenkins/jenkins-slave/workspace/Lucene-Solr-Tests-5.x-Java7/solr/build/solr-core/test/J0/temp/solr.core.TestLazyCores_D39203B3C85C715F-001/tempDir-001/collection8/'
   [junit4]   2> 1751727 INFO  (searcherExecutor-5156-thread-1-processing-x:collectionLazy7) [    x:collectionLazy7] o.a.s.c.SolrCore [collectionLazy7] Registered new searcher Searcher@522d9375[collectionLazy7] main{ExitableDirectoryReader(UninvertingDirectoryReader())}
   [junit4]   2> 1751756 INFO  (TEST-TestLazyCores.testCachingLimit-seed#[D39203B3C85C715F]) [    x:collectionLazy7] o.a.s.c.SolrConfig current version of requestparams : -1
   [junit4]   2> 1751778 INFO  (TEST-TestLazyCores.testCachingLimit-seed#[D39203B3C85C715F]) [    x:collectionLazy7] o.a.s.c.SolrConfig Using Lucene MatchVersion: 5.3.0
   [junit4]   2> 1751836 INFO  (TEST-TestLazyCores.testCachingLimit-seed#[D39203B3C85C715F]) [    x:collectionLazy7] o.a.s.c.Config Loaded SolrConfig: solrconfig.xml
   [junit4]   2> 1751836 INFO  (TEST-TestLazyCores.testCachingLimit-seed#[D39203B3C85C715F]) [    x:collectionLazy7] o.a.s.s.IndexSchema Reading Solr Schema from /x1/jenkins/jenkins-slave/workspace/Lucene-Solr-Tests-5.x-Java7/solr/build/solr-core/test/J0/temp/solr.core.TestLazyCores_D39203B3C85C715F-001/tempDir-001/collection8/conf/schema.xml
   [junit4]   2> 1751878 INFO  (TEST-TestLazyCores.testCachingLimit-seed#[D39203B3C85C715F]) [    x:collectionLazy7] o.a.s.s.IndexSchema [collectionLazy8] Schema name=tiny
   [junit4]   2> 1751896 INFO  (TEST-TestLazyCores.testCachingLimit-seed#[D39203B3C85C715F]) [    x:collectionLazy7] o.a.s.s.IndexSchema unique key field: id
   [junit4]   2> 1751897 INFO  (TEST-TestLazyCores.testCachingLimit-seed#[D39203B3C85C715F]) [    x:collectionLazy7] o.a.s.c.CoreContainer Creating SolrCore 'collectionLazy8' using configuration from instancedir /x1/jenkins/jenkins-slave/workspace/Lucene-Solr-Tests-5.x-Java7/solr/build/solr-core/test/J0/temp/solr.core.TestLazyCores_D39203B3C85C715F-001/tempDir-001/collection8/
   [junit4]   2> 1751897 INFO  (TEST-TestLazyCores.testCachingLimit-seed#[D39203B3C85C715F]) [    x:collectionLazy8] o.a.s.c.SolrCore org.apache.solr.core.MockDirectoryFactory
   [junit4]   2> 1751897 INFO  (TEST-TestLazyCores.testCachingLimit-seed#[D39203B3C85C715F]) [    x:collectionLazy8] o.a.s.c.SolrCore [[collectionLazy8] ] Opening new SolrCore at [/x1/jenkins/jenkins-slave/workspace/Lucene-Solr-Tests-5.x-Java7/solr/build/solr-core/test/J0/temp/solr.core.TestLazyCores_D39203B3C85C715F-001/tempDir-001/collection8/], dataDir=[null]
   [junit4]   2> 1751897 INFO  (TEST-TestLazyCores.testCachingLimit-seed#[D39203B3C85C715F]) [    x:collectionLazy8] o.a.s.c.SolrCore JMX monitoring not detected for core: collectionLazy8
   [junit4]   2> 1751898 INFO  (TEST-TestLazyCores.testCachingLimit-seed#[D39203B3C85C715F]) [    x:collectionLazy8] o.a.s.c.CachingDirectoryFactory return new directory for /x1/jenkins/jenkins-slave/workspace/Lucene-Solr-Tests-5.x-Java7/solr/build/solr-core/test/J0/temp/solr.core.TestLazyCores_D39203B3C85C715F-001/tempDir-001/collection8/data
   [junit4]   2> 1751898 INFO  (TEST-TestLazyCores.testCachingLimit-seed#[D39203B3C85C715F]) [    x:collectionLazy8] o.a.s.c.SolrCore New index directory detected: old=null new=/x1/jenkins/jenkins-slave/workspace/Lucene-Solr-Tests-5.x-Java7/solr/build/solr-core/test/J0/temp/solr.core.TestLazyCores_D39203B3C85C715F-001/tempDir-001/collection8/data/index/
   [junit4]   2> 1751898 WARN  (TEST-TestLazyCores.testCachingLimit-seed#[D39203B3C85C715F]) [    x:collectionLazy8] o.a.s.c.SolrCore [collectionLazy8] Solr index directory '/x1/jenkins/jenkins-slave/workspace/Lucene-Solr-Tests-5.x-Java7/solr/build/solr-core/test/J0/temp/solr.core.TestLazyCores_D39203B3C85C715F-001/tempDir-001/collection8/data/index' doesn't exist. Creating new index...
   [junit4]   2> 1751899 INFO  (TEST-TestLazyCores.testCachingLimit-seed#[D39203B3C85C715F]) [    x:collectionLazy8] o.a.s.c.CachingDirectoryFactory return new directory for /x1/jenkins/jenkins-slave/workspace/Lucene-Solr-Tests-5.x-Java7/solr/build/solr-core/test/J0/temp/solr.core.TestLazyCores_D39203B3C85C715F-001/tempDir-001/collection8/data/index
   [junit4]   2> 1751899 INFO  (TEST-TestLazyCores.testCachingLimit-seed#[D39203B3C85C715F]) [    x:collectionLazy8] o.a.s.u.RandomMergePolicy RandomMergePolicy wrapping class org.apache.lucene.index.Alcoho

[...truncated too long message...]

azyCores: 
   [junit4]   2>    1) Thread[id=13683, name=searcherExecutor-5132-thread-1, state=WAITING, group=TGRP-TestLazyCores]
   [junit4]   2>         at sun.misc.Unsafe.park(Native Method)
   [junit4]   2>         at java.util.concurrent.locks.LockSupport.park(LockSupport.java:186)
   [junit4]   2>         at java.util.concurrent.locks.AbstractQueuedSynchronizer$ConditionObject.await(AbstractQueuedSynchronizer.java:2043)
   [junit4]   2>         at java.util.concurrent.LinkedBlockingQueue.take(LinkedBlockingQueue.java:442)
   [junit4]   2>         at java.util.concurrent.ThreadPoolExecutor.getTask(ThreadPoolExecutor.java:1068)
   [junit4]   2>         at java.util.concurrent.ThreadPoolExecutor.runWorker(ThreadPoolExecutor.java:1130)
   [junit4]   2>         at java.util.concurrent.ThreadPoolExecutor$Worker.run(ThreadPoolExecutor.java:615)
   [junit4]   2>         at java.lang.Thread.run(Thread.java:745)
   [junit4]   2> Jul 09, 2015 4:20:37 AM com.carrotsearch.randomizedtesting.ThreadLeakControl tryToInterruptAll
   [junit4]   2> INFO: Starting to interrupt leaked threads:
   [junit4]   2>    1) Thread[id=13683, name=searcherExecutor-5132-thread-1, state=WAITING, group=TGRP-TestLazyCores]
   [junit4]   2> Jul 09, 2015 4:20:40 AM com.carrotsearch.randomizedtesting.ThreadLeakControl tryToInterruptAll
   [junit4]   2> SEVERE: There are still zombie threads that couldn't be terminated:
   [junit4]   2>    1) Thread[id=13683, name=searcherExecutor-5132-thread-1, state=WAITING, group=TGRP-TestLazyCores]
   [junit4]   2>         at sun.misc.Unsafe.park(Native Method)
   [junit4]   2>         at java.util.concurrent.locks.LockSupport.park(LockSupport.java:186)
   [junit4]   2>         at java.util.concurrent.locks.AbstractQueuedSynchronizer$ConditionObject.await(AbstractQueuedSynchronizer.java:2043)
   [junit4]   2>         at java.util.concurrent.LinkedBlockingQueue.take(LinkedBlockingQueue.java:442)
   [junit4]   2>         at java.util.concurrent.ThreadPoolExecutor.getTask(ThreadPoolExecutor.java:1068)
   [junit4]   2>         at java.util.concurrent.ThreadPoolExecutor.runWorker(ThreadPoolExecutor.java:1130)
   [junit4]   2>         at java.util.concurrent.ThreadPoolExecutor$Worker.run(ThreadPoolExecutor.java:615)
   [junit4]   2>         at java.lang.Thread.run(Thread.java:745)
   [junit4]   2> NOTE: test params are: codec=Asserting(Lucene53): {v_t=PostingsFormat(name=LuceneVarGapDocFreqInterval), v_f=PostingsFormat(name=Direct), v_s=FST50, id=PostingsFormat(name=LuceneVarGapDocFreqInterval)}, docValues:{}, sim=RandomSimilarityProvider(queryNorm=false,coord=no): {}, locale=ar_DZ, timezone=Europe/Zurich
   [junit4]   2> NOTE: Linux 3.13.0-52-generic amd64/Oracle Corporation 1.7.0_72 (64-bit)/cpus=4,threads=2,free=228267368,total=529530880
   [junit4]   2> NOTE: All tests run in this JVM: [JSONWriterTest, BlockDirectoryTest, TestFastWriter, SuggesterTSTTest, DirectUpdateHandlerTest, TestDynamicLoading, DeleteShardTest, DeleteInactiveReplicaTest, CollectionsAPIAsyncDistributedZkTest, TestLFUCache, DistributedDebugComponentTest, ReplicationFactorTest, TestCloudSchemaless, LukeRequestHandlerTest, TestCloudManagedSchemaConcurrent, TestRealTimeGet, TestFaceting, RequestHandlersTest, MinimalSchemaTest, RegexBoostProcessorTest, AsyncMigrateRouteKeyTest, TestPerFieldSimilarity, TestSolrConfigHandler, TestStressUserVersions, AsyncCallRequestStatusResponseTest, NotRequiredUniqueKeyTest, TestReplicaProperties, ActionThrottleTest, TestSurroundQueryParser, SolrIndexSplitterTest, TestDefaultStatsCache, TestRawResponseWriter, TestReversedWildcardFilterFactory, ZkStateWriterTest, TestRestoreCore, QueryParsingTest, TestLMJelinekMercerSimilarityFactory, TestArbitraryIndexDir, TestSolr4Spatial, TestReqParamsAPI, HdfsThreadLeakTest, CloudMLTQParserTest, BJQParserTest, ConvertedLegacyTest, TestCloudInspectUtil, TestDownShardTolerantSearch, TestAnalyzedSuggestions, TestShortCircuitedRequests, SchemaVersionSpecificBehaviorTest, TestClassNameShortening, SpatialFilterTest, TestFastLRUCache, RequestLoggingTest, SuggesterTest, HdfsDirectoryTest, SimpleFacetsTest, TestBlendedInfixSuggestions, TestDistribDocBasedVersion, TestManagedSchemaFieldTypeResource, DistributedFacetPivotSmallAdvancedTest, HdfsCollectionsAPIDistributedZkTest, CustomCollectionTest, CollectionStateFormat2Test, TestCollationField, SynonymTokenizerTest, QueryElevationComponentTest, CloudExitableDirectoryReaderTest, TestStandardQParsers, TestPseudoReturnFields, TestManagedSchema, SolrTestCaseJ4Test, ZkControllerTest, TestSolrQueryParser, TestFieldSortValues, TestComponentsName, TestBlobHandler, TestMissingGroups, TestPostingsSolrHighlighter, CursorMarkTest, TestReplicationHandler, TestConfig, TestTrackingShardHandlerFactory, TestWriterPerf, TestSolrConfigHandlerCloud, MigrateRouteKeyTest, LeaderInitiatedRecoveryOnCommitTest, SolrCloudExampleTest, TestMiniSolrCloudCluster, StatsComponentTest, RecoveryAfterSoftCommitTest, ChaosMonkeySafeLeaderTest, TestConfigReload, TestRandomDVFaceting, TestHashPartitioner, DistributedFacetPivotLongTailTest, OverseerStatusTest, AutoCommitTest, TestManagedSchemaDynamicFieldResource, ExitableDirectoryReaderTest, TestZkChroot, ZkCLITest, TestIntervalFaceting, DistributedExpandComponentTest, DistributedFacetPivotWhiteBoxTest, DistributedQueryElevationComponentTest, TestLazyCores]
   [junit4]   2> NOTE: reproduce with: ant test  -Dtestcase=TestLazyCores -Dtests.seed=D39203B3C85C715F -Dtests.multiplier=2 -Dtests.slow=true -Dtests.locale=ar_DZ -Dtests.timezone=Europe/Zurich -Dtests.asserts=true -Dtests.file.encoding=UTF-8
   [junit4] ERROR   0.00s J0 | TestLazyCores (suite) <<<
   [junit4]    > Throwable #1: java.lang.AssertionError: ERROR: SolrIndexSearcher opens=51 closes=50
   [junit4]    > 	at __randomizedtesting.SeedInfo.seed([D39203B3C85C715F]:0)
   [junit4]    > 	at org.apache.solr.SolrTestCaseJ4.endTrackingSearchers(SolrTestCaseJ4.java:472)
   [junit4]    > 	at org.apache.solr.SolrTestCaseJ4.afterClass(SolrTestCaseJ4.java:232)
   [junit4]    > 	at java.lang.Thread.run(Thread.java:745)Throwable #2: com.carrotsearch.randomizedtesting.ThreadLeakError: 1 thread leaked from SUITE scope at org.apache.solr.core.TestLazyCores: 
   [junit4]    >    1) Thread[id=13683, name=searcherExecutor-5132-thread-1, state=WAITING, group=TGRP-TestLazyCores]
   [junit4]    >         at sun.misc.Unsafe.park(Native Method)
   [junit4]    >         at java.util.concurrent.locks.LockSupport.park(LockSupport.java:186)
   [junit4]    >         at java.util.concurrent.locks.AbstractQueuedSynchronizer$ConditionObject.await(AbstractQueuedSynchronizer.java:2043)
   [junit4]    >         at java.util.concurrent.LinkedBlockingQueue.take(LinkedBlockingQueue.java:442)
   [junit4]    >         at java.util.concurrent.ThreadPoolExecutor.getTask(ThreadPoolExecutor.java:1068)
   [junit4]    >         at java.util.concurrent.ThreadPoolExecutor.runWorker(ThreadPoolExecutor.java:1130)
   [junit4]    >         at java.util.concurrent.ThreadPoolExecutor$Worker.run(ThreadPoolExecutor.java:615)
   [junit4]    >         at java.lang.Thread.run(Thread.java:745)
   [junit4]    > 	at __randomizedtesting.SeedInfo.seed([D39203B3C85C715F]:0)Throwable #3: com.carrotsearch.randomizedtesting.ThreadLeakError: There are still zombie threads that couldn't be terminated:
   [junit4]    >    1) Thread[id=13683, name=searcherExecutor-5132-thread-1, state=WAITING, group=TGRP-TestLazyCores]
   [junit4]    >         at sun.misc.Unsafe.park(Native Method)
   [junit4]    >         at java.util.concurrent.locks.LockSupport.park(LockSupport.java:186)
   [junit4]    >         at java.util.concurrent.locks.AbstractQueuedSynchronizer$ConditionObject.await(AbstractQueuedSynchronizer.java:2043)
   [junit4]    >         at java.util.concurrent.LinkedBlockingQueue.take(LinkedBlockingQueue.java:442)
   [junit4]    >         at java.util.concurrent.ThreadPoolExecutor.getTask(ThreadPoolExecutor.java:1068)
   [junit4]    >         at java.util.concurrent.ThreadPoolExecutor.runWorker(ThreadPoolExecutor.java:1130)
   [junit4]    >         at java.util.concurrent.ThreadPoolExecutor$Worker.run(ThreadPoolExecutor.java:615)
   [junit4]    >         at java.lang.Thread.run(Thread.java:745)
   [junit4]    > 	at __randomizedtesting.SeedInfo.seed([D39203B3C85C715F]:0)
   [junit4] Completed [507/507] on J0 in 149.89s, 7 tests, 1 failure, 2 errors <<< FAILURES!

[...truncated 11 lines...]
BUILD FAILED
/x1/jenkins/jenkins-slave/workspace/Lucene-Solr-Tests-5.x-Java7/build.xml:536: The following error occurred while executing this line:
/x1/jenkins/jenkins-slave/workspace/Lucene-Solr-Tests-5.x-Java7/build.xml:484: The following error occurred while executing this line:
/x1/jenkins/jenkins-slave/workspace/Lucene-Solr-Tests-5.x-Java7/build.xml:61: The following error occurred while executing this line:
/x1/jenkins/jenkins-slave/workspace/Lucene-Solr-Tests-5.x-Java7/extra-targets.xml:39: The following error occurred while executing this line:
/x1/jenkins/jenkins-slave/workspace/Lucene-Solr-Tests-5.x-Java7/solr/build.xml:230: The following error occurred while executing this line:
/x1/jenkins/jenkins-slave/workspace/Lucene-Solr-Tests-5.x-Java7/solr/common-build.xml:512: The following error occurred while executing this line:
/x1/jenkins/jenkins-slave/workspace/Lucene-Solr-Tests-5.x-Java7/lucene/common-build.xml:1444: The following error occurred while executing this line:
/x1/jenkins/jenkins-slave/workspace/Lucene-Solr-Tests-5.x-Java7/lucene/common-build.xml:999: There were test failures: 507 suites, 2009 tests, 3 suite-level errors, 59 ignored (25 assumptions)

Total time: 54 minutes 10 seconds
Build step 'Invoke Ant' marked build as failure
Archiving artifacts
Sending artifact delta relative to Lucene-Solr-Tests-5.x-Java7 #3315
Archived 4 artifacts
Archive block size is 32768
Received 0 blocks and 297000553 bytes
Compression is 0.0%
Took 49 sec
Recording test results
Email was triggered for: Failure
Sending email for trigger: Failure



Mime
View raw message