lucene-dev mailing list archives

Site index · List index
Message view « Date » · « Thread »
Top « Date » · « Thread »
From bu...@elastic.co
Subject [CI] Lucene 5x Linux 64 Test Only - Build # 58031 - Failure!
Date Thu, 06 Aug 2015 04:34:31 GMT
<html><head><style>
BODY, TABLE, TD, TH, P {
  font-family:Verdana,Helvetica,sans serif;
  font-size:11px;
  color:black;
}
h1 { color:black; }
h2 { color:black; }
h3 { color:black; }
TD.bg1 { color:white; background-color:#0000C0; font-size:120% }
TD.bg2 { color:white; background-color:#4040FF; font-size:110% }
TD.bg3 { color:white; background-color:#8080FF; }
TD.test_passed { color:blue; }
TD.test_failed { color:red; }
TD.console { font-family:Courier New; }
</style>
</head><body>

<table>
  <tbody><tr><td colspan="2 align=" left"=""><img src="http://build-eu-00.elastic.co/static/e59dfe28/images/32x32/red.gif"
/>
  <b style="font-size: 200%;">BUILD FAILURE</b></td></tr>
  <tr><td><br /></td></tr>
  <tr><td>Build URL</td><td><a href="http://build-eu-00.elastic.co/job/lucene_linux_java8_64_test_only/58031/">http://build-eu-00.elastic.co/job/lucene_linux_java8_64_test_only/58031/</a></td></tr>
  <tr><td>Project:</td><td>lucene_linux_java8_64_test_only</td></tr>

  <tr><td>Randomization:</td>
<td>
JDK8,network,heap[512m],-server +UseConcMarkSweepGC +UseCompressedOops +AggressiveOpts,assert
off,sec manager on
</td></tr>

  <tr><td>Date of build:</td><td>Thu, 06 Aug 2015 06:25:27 +0200</td></tr>
  <tr><td>Build duration:</td><td>9 min 1 sec</td></tr>
</tbody></table>
<br />

<!-- CHANGE SET -->

	<table width="100%">
    <tbody><tr><td class="bg1" colspan="2"><b>CHANGES</b></td></tr>
	
        <tr><td colspan="2">No Changes</td></tr>

  </tbody></table>
<br />


<!-- ARTIFACTS -->

  <table width="100%">
    <tbody><tr><td class="bg1"><b>BUILD ARTIFACTS</b></td></tr>
    <tr>
      <td>
		
      	  <li>
      	    <a href="http://build-eu-00.elastic.co/job/lucene_linux_java8_64_test_only/58031/artifact/checkout/lucene/build/misc/test/temp/junit4-J0-20150806_063415_040.events">checkout/lucene/build/misc/test/temp/junit4-J0-20150806_063415_040.events</a>
      	  </li>
		
      	  <li>
      	    <a href="http://build-eu-00.elastic.co/job/lucene_linux_java8_64_test_only/58031/artifact/checkout/lucene/build/misc/test/temp/junit4-J1-20150806_063415_040.events">checkout/lucene/build/misc/test/temp/junit4-J1-20150806_063415_040.events</a>
      	  </li>
		
      	  <li>
      	    <a href="http://build-eu-00.elastic.co/job/lucene_linux_java8_64_test_only/58031/artifact/checkout/lucene/build/misc/test/temp/junit4-J2-20150806_063415_040.events">checkout/lucene/build/misc/test/temp/junit4-J2-20150806_063415_040.events</a>
      	  </li>
		
      	  <li>
      	    <a href="http://build-eu-00.elastic.co/job/lucene_linux_java8_64_test_only/58031/artifact/checkout/lucene/build/misc/test/temp/junit4-J3-20150806_063415_040.events">checkout/lucene/build/misc/test/temp/junit4-J3-20150806_063415_040.events</a>
      	  </li>
		
      	  <li>
      	    <a href="http://build-eu-00.elastic.co/job/lucene_linux_java8_64_test_only/58031/artifact/checkout/lucene/build/misc/test/temp/junit4-J4-20150806_063415_040.events">checkout/lucene/build/misc/test/temp/junit4-J4-20150806_063415_040.events</a>
      	  </li>
		
      	  <li>
      	    <a href="http://build-eu-00.elastic.co/job/lucene_linux_java8_64_test_only/58031/artifact/checkout/lucene/build/misc/test/temp/junit4-J5-20150806_063415_040.events">checkout/lucene/build/misc/test/temp/junit4-J5-20150806_063415_040.events</a>
      	  </li>
		
      	  <li>
      	    <a href="http://build-eu-00.elastic.co/job/lucene_linux_java8_64_test_only/58031/artifact/checkout/lucene/build/misc/test/temp/junit4-J6-20150806_063415_041.events">checkout/lucene/build/misc/test/temp/junit4-J6-20150806_063415_041.events</a>
      	  </li>
		
      	  <li>
      	    <a href="http://build-eu-00.elastic.co/job/lucene_linux_java8_64_test_only/58031/artifact/checkout/lucene/build/misc/test/temp/junit4-J7-20150806_063415_041.events">checkout/lucene/build/misc/test/temp/junit4-J7-20150806_063415_041.events</a>
      	  </li>

      </td>
    </tr>
  </tbody></table>
<br />  


<!-- MAVEN ARTIFACTS -->


<!-- JUnit TEMPLATE -->


  <table width="100%">
    <tbody><tr><td class="bg1" colspan="2"><b>FAILED JUNIT TESTS</b></td></tr>
    
           <tr><td class="bg2" colspan="2"> Name: org.apache.lucene.search Failed:
1 test(s), Passed: 802 test(s), Skipped: 2 test(s), Total: 805 test(s)</td></tr>
           
             <tr bgcolor="white"><td class="test_failed" colspan="2"><b><li>Failed:
org.apache.lucene.search.TestEarlyTerminatingSortingCollector.testTerminatedEarly </li></b></td></tr>
           
  </tbody></table>
<br />

<!-- CONSOLE OUTPUT -->
<!-- % if(build.result==hudson.model.Result.FAILURE) { % -->
<table width="100%" cellpadding="0" cellspacing="0">
<tbody><tr><td class="bg1"><b>CONSOLE OUTPUT</b></td></tr>

	<tr><td class="console">[...truncated 9905 lines...]</td></tr>

	<tr><td class="console">   [junit4] </td></tr>

	<tr><td class="console">   [junit4] </td></tr>

	<tr><td class="console">   [junit4] JVM J0:     0.61 ..    12.70 =    12.10s</td></tr>

	<tr><td class="console">   [junit4] JVM J1:     0.86 ..     8.33 =     7.47s</td></tr>

	<tr><td class="console">   [junit4] JVM J2:     0.89 ..     9.92 =     9.03s</td></tr>

	<tr><td class="console">   [junit4] JVM J3:     0.86 ..     8.37 =     7.51s</td></tr>

	<tr><td class="console">   [junit4] JVM J4:     0.86 ..     8.32 =     7.47s</td></tr>

	<tr><td class="console">   [junit4] JVM J5:     0.83 ..    10.04 =     9.21s</td></tr>

	<tr><td class="console">   [junit4] JVM J6:     0.83 ..    12.49 =    11.66s</td></tr>

	<tr><td class="console">   [junit4] JVM J7:     0.92 ..    13.07 =    12.15s</td></tr>

	<tr><td class="console">   [junit4] Execution time total: 13 seconds</td></tr>

	<tr><td class="console">   [junit4] Tests summary: 25 suites, 184 tests, 1 failure,
1 ignored (1 assumption)</td></tr>

	<tr><td class="console"></td></tr>

	<tr><td class="console">BUILD FAILED</td></tr>

	<tr><td class="console">/home/jenkins/workspace/lucene_linux_java8_64_test_only/checkout/lucene/build.xml:470:
The following error occurred while executing this line:</td></tr>

	<tr><td class="console">/home/jenkins/workspace/lucene_linux_java8_64_test_only/checkout/lucene/common-build.xml:2245:
The following error occurred while executing this line:</td></tr>

	<tr><td class="console">/home/jenkins/workspace/lucene_linux_java8_64_test_only/checkout/lucene/module-build.xml:58:
The following error occurred while executing this line:</td></tr>

	<tr><td class="console">/home/jenkins/workspace/lucene_linux_java8_64_test_only/checkout/lucene/common-build.xml:1449:
The following error occurred while executing this line:</td></tr>

	<tr><td class="console">/home/jenkins/workspace/lucene_linux_java8_64_test_only/checkout/lucene/common-build.xml:1003:
There were test failures: 25 suites, 184 tests, 1 failure, 1 ignored (1 assumption)</td></tr>

	<tr><td class="console"></td></tr>

	<tr><td class="console">Total time: 8 minutes 40 seconds</td></tr>

	<tr><td class="console">Build step 'Invoke Ant' marked build as failure</td></tr>

	<tr><td class="console">Archiving artifacts</td></tr>

	<tr><td class="console">Recording test results</td></tr>

	<tr><td class="console">[description-setter] Description set: JDK8,network,heap[512m],-server
+UseConcMarkSweepGC +UseCompressedOops +AggressiveOpts,assert off,sec manager on</td></tr>

	<tr><td class="console">Email was triggered for: Failure - 1st</td></tr>

	<tr><td class="console">Trigger Failure - Any was overridden by another trigger
and will not send an email.</td></tr>

	<tr><td class="console">Trigger Failure - Still was overridden by another trigger
and will not send an email.</td></tr>

	<tr><td class="console">Sending email for trigger: Failure - 1st</td></tr>

</tbody></table>
<br />
<!-- % } % -->


</body></html>

Mime
View raw message