lucene-dev mailing list archives

Site index · List index
Message view « Date » · « Thread »
Top « Date » · « Thread »
From "Uwe Schindler" <...@thetaphi.de>
Subject RE: [JENKINS-EA] Lucene-Solr-trunk-Linux (32bit/jdk1.9.0-ea-b78) - Build # 13972 - Failure!
Date Sun, 23 Aug 2015 19:57:34 GMT
Hi Rory, hi Balchandra,

I set up a quick round trip test (it iterates all available timezones in the JDK, sets them as default, creates a String out of new Date().toString() and tried to parse that afterwards with ENGLISH, US and ROOT locale.

===================================================
import java.text.ParseException;
import java.text.SimpleDateFormat;
import java.util.Date;
import java.util.Locale;
import java.util.TimeZone;

public final class Test {
  
  private static void testParse(Locale locale, String date) {
    try {
      new SimpleDateFormat("EEE MMM d hh:mm:ss z yyyy", locale).parse(date);
      System.out.println(String.format(Locale.ENGLISH, "OK parsing '%s' in locale '%s'", date, locale));
    } catch (ParseException pe) {
      System.out.println(String.format(Locale.ENGLISH, "ERROR parsing '%s' in locale '%s': %s", date, locale, pe.toString()));
    }
  }
  
  public static void main(String[] args) {
    for (String id : TimeZone.getAvailableIDs()) {
      System.out.println("Testing time zone: " + id);
      TimeZone.setDefault(TimeZone.getTimeZone(id));
      
      // some date today:
      String date1 = new Date(1440358930504L).toString();
      testParse(Locale.ENGLISH, date1);
      testParse(Locale.US, date1);
      testParse(Locale.ROOT, date1);
      // half a year back to hit DST difference:
      String date2 = new Date(1440358930504L - 86400000L * 180).toString();
      testParse(Locale.ENGLISH, date2);
      testParse(Locale.US, date2);
      testParse(Locale.ROOT, date2);
    }
  } 
   
}
========================================================

With Java 8 this passes, with Java 9 build 78 it fails for several timezones. The funny thing is: SimpleDateFormat is not even able to parse "UTC" - LOL.

Could you pass this to the issue after reopening? It’s a good test!

-----
Uwe Schindler
H.-H.-Meier-Allee 63, D-28213 Bremen
http://www.thetaphi.de
eMail: uwe@thetaphi.de


> -----Original Message-----
> From: Uwe Schindler [mailto:uwe@thetaphi.de]
> Sent: Sunday, August 23, 2015 9:19 PM
> To: dev@lucene.apache.org
> Cc: rory.odonnell@oracle.com; 'Balchandra Vaidya'
> Subject: RE: [JENKINS-EA] Lucene-Solr-trunk-Linux (32bit/jdk1.9.0-ea-b78) -
> Build # 13972 - Failure!
> 
> Hi Rory, hi Balchandra,
> 
> the fix about https://bugs.openjdk.java.net/browse/JDK-8130845 is still
> incomplete.
> 
> Our test framework found a date string which was created by
> Date#toString(), which is not parseable, neither with ENGLISH, US or ROOT
> locale!
> 
> Here is test program:
> 
> =====================================================
> import java.text.ParseException;
> import java.text.SimpleDateFormat;
> import java.util.Locale;
> 
> public final class Test {
> 
>   private static void testParse(Locale locale) {
>     try {
>       new SimpleDateFormat("EEE MMM d hh:mm:ss z yyyy",
> locale).parse("Sat Jun 23 02:57:58 XJT 2012");
>       System.out.println("OK: " + locale);
>     } catch (ParseException pe) {
>       pe.printStackTrace();
>     }
>   }
> 
>   public static void main(String[] args) {
>     testParse(Locale.ENGLISH);
>     testParse(Locale.US);
>     testParse(Locale.ROOT);
>   }
> 
> }
> =====================================================
> 
> Can you reopen https://bugs.openjdk.java.net/browse/JDK-8130845 and
> attach the above program?
> It passes with Java 8, but fails with Java 9.
> 
> The Date was created by Date#toString(). XJT is Xinjiang Time also known as
> "Asia/Kashgar", used in parts of China
> (https://en.wikipedia.org/wiki/Asia/Kashgar). I would suggest to the
> developer of the Locale updates, that there should be some test that asserts
> the round trip between the above Date format and Date#toString() for all
> Timezones available.
> 
> Uwe
> 
> -----
> Uwe Schindler
> H.-H.-Meier-Allee 63, D-28213 Bremen
> http://www.thetaphi.de
> eMail: uwe@thetaphi.de
> 
> 
> > -----Original Message-----
> > From: Uwe Schindler [mailto:uwe@thetaphi.de]
> > Sent: Sunday, August 23, 2015 8:27 PM
> > To: dev@lucene.apache.org
> > Cc: rory.odonnell@oracle.com; Balchandra Vaidya
> > Subject: RE: [JENKINS-EA] Lucene-Solr-trunk-Linux (32bit/jdk1.9.0-ea-b78) -
> > Build # 13972 - Failure!
> >
> > I am digging, seems to be SOLR-7770 related. The problem with the new
> > Locale Data in the JDK9 is that not all possible Timezone Short identifiers are
> > available... I will try this date and send it back to Rory for addition to
> > https://bugs.openjdk.java.net/browse/JDK-8130845
> >
> > Uwe
> >
> > -----
> > Uwe Schindler
> > H.-H.-Meier-Allee 63, D-28213 Bremen
> > http://www.thetaphi.de
> > eMail: uwe@thetaphi.de
> >
> > > From: Policeman Jenkins Server [mailto:jenkins@thetaphi.de]
> > > Sent: Sunday, August 23, 2015 7:55 PM
> > > To: dev@lucene.apache.org
> > > Subject: [JENKINS-EA] Lucene-Solr-trunk-Linux (32bit/jdk1.9.0-ea-b78)
> > > - Build # 13972 - Failure!
> > > Importance: Low
> > >
> > > Build: http://jenkins.thetaphi.de/job/Lucene-Solr-trunk-Linux/13972/
> > > Java: 32bit/jdk1.9.0-ea-b78 -client -XX:+UseConcMarkSweepGC
> > >
> > > 4 tests failed.
> > > FAILED:
> > > org.apache.solr.handler.extraction.ExtractingRequestHandlerTest.testPa
> > > ssw
> > > ordProtected
> > >
> > > Error Message:
> > > Invalid Date String:'Sat Jun 23 02:57:58 XJT 2012'
> > >
> > > Stack Trace:
> > > org.apache.solr.common.SolrException: Invalid Date String:'Sat Jun 23
> > > 02:57:58 XJT 2012'
> > > 	at
> > >
> >
> __randomizedtesting.SeedInfo.seed([ABCF3FCC3426170F:AD6ABB37CA1F47
> > > D5]:0)
> > > 	at
> > > org.apache.solr.util.DateFormatUtil.parseMath(DateFormatUtil.java:89)
> > > 	at org.apache.solr.schema.TrieField.createField(TrieField.java:695)
> > > 	at org.apache.solr.schema.TrieField.createFields(TrieField.java:732)
> > > 	at
> > >
> >
> org.apache.solr.update.DocumentBuilder.addField(DocumentBuilder.java:4
> > > 8
> > > )
> > > 	at
> > >
> >
> org.apache.solr.update.DocumentBuilder.toDocument(DocumentBuilder.jav
> > > a:123)
> > > 	at
> > >
> >
> org.apache.solr.update.AddUpdateCommand.getLuceneDocument(AddUpd
> > > ateCommand.java:84)
> > > 	at
> > >
> >
> org.apache.solr.update.DirectUpdateHandler2.doNormalUpdate(DirectUpda
> > > teHandler2.java:268)
> > > 	at
> > >
> >
> org.apache.solr.update.DirectUpdateHandler2.addDoc0(DirectUpdateHandle
> > > r2.java:202)
> > > 	at
> > >
> >
> org.apache.solr.update.DirectUpdateHandler2.addDoc(DirectUpdateHandler
> > > 2.java:164)
> > > 	at
> > >
> >
> org.apache.solr.update.processor.RunUpdateProcessor.processAdd(RunUp
> > > dateProcessorFactory.java:69)
> > > 	at
> > >
> >
> org.apache.solr.update.processor.UpdateRequestProcessor.processAdd(Up
> > > dateRequestProcessor.java:51)
> > > 	at
> > >
> org.apache.solr.update.processor.DistributedUpdateProcessor.versionAdd
> > > (
> > > DistributedUpdateProcessor.java:980)
> > > 	at
> > >
> >
> org.apache.solr.update.processor.DistributedUpdateProcessor.processAdd
> > > (
> > > DistributedUpdateProcessor.java:705)
> > > 	at
> > >
> >
> org.apache.solr.update.processor.LogUpdateProcessor.processAdd(LogUpd
> > > ateProcessorFactory.java:104)
> > > 	at
> > >
> org.apache.solr.handler.extraction.ExtractingDocumentLoader.doAdd(Extr
> > > ac
> > > tingDocumentLoader.java:122)
> > > 	at
> > >
> org.apache.solr.handler.extraction.ExtractingDocumentLoader.addDoc(Ext
> > > ra
> > > ctingDocumentLoader.java:127)
> > > 	at
> > > org.apache.solr.handler.extraction.ExtractingDocumentLoader.load(Extra
> > > ctin
> > > gDocumentLoader.java:230)
> > > 	at
> > >
> >
> org.apache.solr.handler.ContentStreamHandlerBase.handleRequestBody(Co
> > > ntentStreamHandlerBase.java:74)
> > > 	at
> > >
> >
> org.apache.solr.handler.RequestHandlerBase.handleRequest(RequestHandl
> > > erBase.java:151)
> > > 	at org.apache.solr.core.SolrCore.execute(SolrCore.java:2079)
> > > 	at
> > >
> >
> org.apache.solr.util.TestHarness.queryAndResponse(TestHarness.java:339)
> > > 	at
> > > org.apache.solr.handler.extraction.ExtractingRequestHandlerTest.loadLo
> > > calF
> > > romHandler(ExtractingRequestHandlerTest.java:737)
> > > 	at
> > > org.apache.solr.handler.extraction.ExtractingRequestHandlerTest.loadLo
> > > cal(
> > > ExtractingRequestHandlerTest.java:744)
> > > 	at
> > > org.apache.solr.handler.extraction.ExtractingRequestHandlerTest.testPa
> > > ssw
> > > ordProtected(ExtractingRequestHandlerTest.java:662)
> > > 	at sun.reflect.NativeMethodAccessorImpl.invoke0(Native Method)
> > > 	at
> > >
> >
> sun.reflect.NativeMethodAccessorImpl.invoke(NativeMethodAccessorImpl.j
> > > ava:62)
> > > 	at
> > >
> >
> sun.reflect.DelegatingMethodAccessorImpl.invoke(DelegatingMethodAcces
> > > sorImpl.java:43)
> > > 	at java.lang.reflect.Method.invoke(Method.java:504)
> > > 	at
> > >
> >
> com.carrotsearch.randomizedtesting.RandomizedRunner.invoke(Randomize
> > > dRunner.java:1627)
> > > 	at
> > >
> >
> com.carrotsearch.randomizedtesting.RandomizedRunner$6.evaluate(Rando
> > > mizedRunner.java:836)
> > > 	at
> > >
> >
> com.carrotsearch.randomizedtesting.RandomizedRunner$7.evaluate(Rando
> > > mizedRunner.java:872)
> > > 	at
> > >
> >
> com.carrotsearch.randomizedtesting.RandomizedRunner$8.evaluate(Rando
> > > mizedRunner.java:886)
> > > 	at
> > >
> >
> com.carrotsearch.randomizedtesting.rules.SystemPropertiesRestoreRule$1.
> > > evaluate(SystemPropertiesRestoreRule.java:57)
> > > 	at
> > >
> >
> org.apache.lucene.util.TestRuleSetupTeardownChained$1.evaluate(TestRul
> > > e
> > > SetupTeardownChained.java:50)
> > > 	at
> > > org.apache.lucene.util.AbstractBeforeAfterRule$1.evaluate(AbstractBefo
> > > reA
> > > fterRule.java:46)
> > > 	at
> > >
> >
> org.apache.lucene.util.TestRuleThreadAndTestName$1.evaluate(TestRuleTh
> > > readAndTestName.java:49)
> > > 	at
> > >
> org.apache.lucene.util.TestRuleIgnoreAfterMaxFailures$1.evaluate(TestR
> > > ule
> > > IgnoreAfterMaxFailures.java:65)
> > > 	at
> > > org.apache.lucene.util.TestRuleMarkFailure$1.evaluate(TestRuleMarkFail
> > > ure
> > > .java:48)
> > > 	at
> > >
> com.carrotsearch.randomizedtesting.rules.StatementAdapter.evaluate(Sta
> > > t
> > > ementAdapter.java:36)
> > > 	at
> > >
> >
> com.carrotsearch.randomizedtesting.ThreadLeakControl$StatementRunner.
> > > run(ThreadLeakControl.java:365)
> > > 	at
> > >
> >
> com.carrotsearch.randomizedtesting.ThreadLeakControl.forkTimeoutingTas
> > > k
> > > (ThreadLeakControl.java:798)
> > > 	at
> > >
> >
> com.carrotsearch.randomizedtesting.ThreadLeakControl$3.evaluate(Thread
> > > L
> > > eakControl.java:458)
> > > 	at
> > >
> >
> com.carrotsearch.randomizedtesting.RandomizedRunner.runSingleTest(Ran
> > > domizedRunner.java:845)
> > > 	at
> > >
> >
> com.carrotsearch.randomizedtesting.RandomizedRunner$3.evaluate(Rando
> > > mizedRunner.java:747)
> > > 	at
> > >
> >
> com.carrotsearch.randomizedtesting.RandomizedRunner$4.evaluate(Rando
> > > mizedRunner.java:781)
> > > 	at
> > >
> >
> com.carrotsearch.randomizedtesting.RandomizedRunner$5.evaluate(Rando
> > > mizedRunner.java:792)
> > > 	at
> > >
> com.carrotsearch.randomizedtesting.rules.StatementAdapter.evaluate(Sta
> > > t
> > > ementAdapter.java:36)
> > > 	at
> > >
> >
> com.carrotsearch.randomizedtesting.rules.SystemPropertiesRestoreRule$1.
> > > evaluate(SystemPropertiesRestoreRule.java:57)
> > > 	at
> > > org.apache.lucene.util.AbstractBeforeAfterRule$1.evaluate(AbstractBefo
> > > reA
> > > fterRule.java:46)
> > > 	at
> > >
> com.carrotsearch.randomizedtesting.rules.StatementAdapter.evaluate(Sta
> > > t
> > > ementAdapter.java:36)
> > > 	at
> > >
> org.apache.lucene.util.TestRuleStoreClassName$1.evaluate(TestRuleStore
> > > Cl
> > > assName.java:42)
> > > 	at
> > >
> >
> com.carrotsearch.randomizedtesting.rules.NoShadowingOrOverridesOnMet
> > > hodsRule$1.evaluate(NoShadowingOrOverridesOnMethodsRule.java:39)
> > > 	at
> > >
> >
> com.carrotsearch.randomizedtesting.rules.NoShadowingOrOverridesOnMet
> > > hodsRule$1.evaluate(NoShadowingOrOverridesOnMethodsRule.java:39)
> > > 	at
> > >
> com.carrotsearch.randomizedtesting.rules.StatementAdapter.evaluate(Sta
> > > t
> > > ementAdapter.java:36)
> > > 	at
> > >
> com.carrotsearch.randomizedtesting.rules.StatementAdapter.evaluate(Sta
> > > t
> > > ementAdapter.java:36)
> > > 	at
> > >
> com.carrotsearch.randomizedtesting.rules.StatementAdapter.evaluate(Sta
> > > t
> > > ementAdapter.java:36)
> > > 	at
> > >
> org.apache.lucene.util.TestRuleAssertionsRequired$1.evaluate(TestRuleA
> > > ss
> > > ertionsRequired.java:54)
> > > 	at
> > > org.apache.lucene.util.TestRuleMarkFailure$1.evaluate(TestRuleMarkFail
> > > ure
> > > .java:48)
> > > 	at
> > >
> org.apache.lucene.util.TestRuleIgnoreAfterMaxFailures$1.evaluate(TestR
> > > ule
> > > IgnoreAfterMaxFailures.java:65)
> > > 	at
> > > org.apache.lucene.util.TestRuleIgnoreTestSuites$1.evaluate(TestRuleIgn
> > > ore
> > > TestSuites.java:55)
> > > 	at
> > >
> com.carrotsearch.randomizedtesting.rules.StatementAdapter.evaluate(Sta
> > > t
> > > ementAdapter.java:36)
> > > 	at
> > >
> >
> com.carrotsearch.randomizedtesting.ThreadLeakControl$StatementRunner.
> > > run(ThreadLeakControl.java:365)
> > > 	at java.lang.Thread.run(Thread.java:746)
> > >
> > >
> > > FAILED:
> > > org.apache.solr.handler.extraction.ExtractingRequestHandlerTest.testAr
> > > abic
> > > PDF
> > >
> > > Error Message:
> > > Invalid Date String:'Tue Mar 09 12:44:49 XJT 2010'
> > >
> > > Stack Trace:
> > > org.apache.solr.common.SolrException: Invalid Date String:'Tue Mar 09
> > > 12:44:49 XJT 2010'
> > > 	at
> > >
> >
> __randomizedtesting.SeedInfo.seed([ABCF3FCC3426170F:C50944C337E3BC5
> > > A]:0)
> > > 	at
> > > org.apache.solr.util.DateFormatUtil.parseMath(DateFormatUtil.java:89)
> > > 	at org.apache.solr.schema.TrieField.createField(TrieField.java:695)
> > > 	at org.apache.solr.schema.TrieField.createFields(TrieField.java:732)
> > > 	at
> > >
> >
> org.apache.solr.update.DocumentBuilder.addField(DocumentBuilder.java:4
> > > 8
> > > )
> > > 	at
> > >
> >
> org.apache.solr.update.DocumentBuilder.toDocument(DocumentBuilder.jav
> > > a:123)
> > > 	at
> > >
> >
> org.apache.solr.update.AddUpdateCommand.getLuceneDocument(AddUpd
> > > ateCommand.java:84)
> > > 	at
> > >
> >
> org.apache.solr.update.DirectUpdateHandler2.doNormalUpdate(DirectUpda
> > > teHandler2.java:268)
> > > 	at
> > >
> >
> org.apache.solr.update.DirectUpdateHandler2.addDoc0(DirectUpdateHandle
> > > r2.java:202)
> > > 	at
> > >
> >
> org.apache.solr.update.DirectUpdateHandler2.addDoc(DirectUpdateHandler
> > > 2.java:164)
> > > 	at
> > >
> >
> org.apache.solr.update.processor.RunUpdateProcessor.processAdd(RunUp
> > > dateProcessorFactory.java:69)
> > > 	at
> > >
> >
> org.apache.solr.update.processor.UpdateRequestProcessor.processAdd(Up
> > > dateRequestProcessor.java:51)
> > > 	at
> > >
> org.apache.solr.update.processor.DistributedUpdateProcessor.versionAdd
> > > (
> > > DistributedUpdateProcessor.java:980)
> > > 	at
> > >
> >
> org.apache.solr.update.processor.DistributedUpdateProcessor.processAdd
> > > (
> > > DistributedUpdateProcessor.java:705)
> > > 	at
> > >
> >
> org.apache.solr.update.processor.LogUpdateProcessor.processAdd(LogUpd
> > > ateProcessorFactory.java:104)
> > > 	at
> > >
> org.apache.solr.handler.extraction.ExtractingDocumentLoader.doAdd(Extr
> > > ac
> > > tingDocumentLoader.java:122)
> > > 	at
> > >
> org.apache.solr.handler.extraction.ExtractingDocumentLoader.addDoc(Ext
> > > ra
> > > ctingDocumentLoader.java:127)
> > > 	at
> > > org.apache.solr.handler.extraction.ExtractingDocumentLoader.load(Extra
> > > ctin
> > > gDocumentLoader.java:230)
> > > 	at
> > >
> >
> org.apache.solr.handler.ContentStreamHandlerBase.handleRequestBody(Co
> > > ntentStreamHandlerBase.java:74)
> > > 	at
> > >
> >
> org.apache.solr.handler.RequestHandlerBase.handleRequest(RequestHandl
> > > erBase.java:151)
> > > 	at org.apache.solr.core.SolrCore.execute(SolrCore.java:2079)
> > > 	at
> > >
> >
> org.apache.solr.util.TestHarness.queryAndResponse(TestHarness.java:339)
> > > 	at
> > > org.apache.solr.handler.extraction.ExtractingRequestHandlerTest.loadLo
> > > calF
> > > romHandler(ExtractingRequestHandlerTest.java:737)
> > > 	at
> > > org.apache.solr.handler.extraction.ExtractingRequestHandlerTest.loadLo
> > > cal(
> > > ExtractingRequestHandlerTest.java:744)
> > > 	at
> > > org.apache.solr.handler.extraction.ExtractingRequestHandlerTest.testAr
> > > abic
> > > PDF(ExtractingRequestHandlerTest.java:526)
> > > 	at sun.reflect.NativeMethodAccessorImpl.invoke0(Native Method)
> > > 	at
> > >
> >
> sun.reflect.NativeMethodAccessorImpl.invoke(NativeMethodAccessorImpl.j
> > > ava:62)
> > > 	at
> > >
> >
> sun.reflect.DelegatingMethodAccessorImpl.invoke(DelegatingMethodAcces
> > > sorImpl.java:43)
> > > 	at java.lang.reflect.Method.invoke(Method.java:504)
> > > 	at
> > >
> >
> com.carrotsearch.randomizedtesting.RandomizedRunner.invoke(Randomize
> > > dRunner.java:1627)
> > > 	at
> > >
> >
> com.carrotsearch.randomizedtesting.RandomizedRunner$6.evaluate(Rando
> > > mizedRunner.java:836)
> > > 	at
> > >
> >
> com.carrotsearch.randomizedtesting.RandomizedRunner$7.evaluate(Rando
> > > mizedRunner.java:872)
> > > 	at
> > >
> >
> com.carrotsearch.randomizedtesting.RandomizedRunner$8.evaluate(Rando
> > > mizedRunner.java:886)
> > > 	at
> > >
> >
> com.carrotsearch.randomizedtesting.rules.SystemPropertiesRestoreRule$1.
> > > evaluate(SystemPropertiesRestoreRule.java:57)
> > > 	at
> > >
> >
> org.apache.lucene.util.TestRuleSetupTeardownChained$1.evaluate(TestRul
> > > e
> > > SetupTeardownChained.java:50)
> > > 	at
> > > org.apache.lucene.util.AbstractBeforeAfterRule$1.evaluate(AbstractBefo
> > > reA
> > > fterRule.java:46)
> > > 	at
> > >
> >
> org.apache.lucene.util.TestRuleThreadAndTestName$1.evaluate(TestRuleTh
> > > readAndTestName.java:49)
> > > 	at
> > >
> org.apache.lucene.util.TestRuleIgnoreAfterMaxFailures$1.evaluate(TestR
> > > ule
> > > IgnoreAfterMaxFailures.java:65)
> > > 	at
> > > org.apache.lucene.util.TestRuleMarkFailure$1.evaluate(TestRuleMarkFail
> > > ure
> > > .java:48)
> > > 	at
> > >
> com.carrotsearch.randomizedtesting.rules.StatementAdapter.evaluate(Sta
> > > t
> > > ementAdapter.java:36)
> > > 	at
> > >
> >
> com.carrotsearch.randomizedtesting.ThreadLeakControl$StatementRunner.
> > > run(ThreadLeakControl.java:365)
> > > 	at
> > >
> >
> com.carrotsearch.randomizedtesting.ThreadLeakControl.forkTimeoutingTas
> > > k
> > > (ThreadLeakControl.java:798)
> > > 	at
> > >
> >
> com.carrotsearch.randomizedtesting.ThreadLeakControl$3.evaluate(Thread
> > > L
> > > eakControl.java:458)
> > > 	at
> > >
> >
> com.carrotsearch.randomizedtesting.RandomizedRunner.runSingleTest(Ran
> > > domizedRunner.java:845)
> > > 	at
> > >
> >
> com.carrotsearch.randomizedtesting.RandomizedRunner$3.evaluate(Rando
> > > mizedRunner.java:747)
> > > 	at
> > >
> >
> com.carrotsearch.randomizedtesting.RandomizedRunner$4.evaluate(Rando
> > > mizedRunner.java:781)
> > > 	at
> > >
> >
> com.carrotsearch.randomizedtesting.RandomizedRunner$5.evaluate(Rando
> > > mizedRunner.java:792)
> > > 	at
> > >
> com.carrotsearch.randomizedtesting.rules.StatementAdapter.evaluate(Sta
> > > t
> > > ementAdapter.java:36)
> > > 	at
> > >
> >
> com.carrotsearch.randomizedtesting.rules.SystemPropertiesRestoreRule$1.
> > > evaluate(SystemPropertiesRestoreRule.java:57)
> > > 	at
> > > org.apache.lucene.util.AbstractBeforeAfterRule$1.evaluate(AbstractBefo
> > > reA
> > > fterRule.java:46)
> > > 	at
> > >
> com.carrotsearch.randomizedtesting.rules.StatementAdapter.evaluate(Sta
> > > t
> > > ementAdapter.java:36)
> > > 	at
> > >
> org.apache.lucene.util.TestRuleStoreClassName$1.evaluate(TestRuleStore
> > > Cl
> > > assName.java:42)
> > > 	at
> > >
> >
> com.carrotsearch.randomizedtesting.rules.NoShadowingOrOverridesOnMet
> > > hodsRule$1.evaluate(NoShadowingOrOverridesOnMethodsRule.java:39)
> > > 	at
> > >
> >
> com.carrotsearch.randomizedtesting.rules.NoShadowingOrOverridesOnMet
> > > hodsRule$1.evaluate(NoShadowingOrOverridesOnMethodsRule.java:39)
> > > 	at
> > >
> com.carrotsearch.randomizedtesting.rules.StatementAdapter.evaluate(Sta
> > > t
> > > ementAdapter.java:36)
> > > 	at
> > >
> com.carrotsearch.randomizedtesting.rules.StatementAdapter.evaluate(Sta
> > > t
> > > ementAdapter.java:36)
> > > 	at
> > >
> com.carrotsearch.randomizedtesting.rules.StatementAdapter.evaluate(Sta
> > > t
> > > ementAdapter.java:36)
> > > 	at
> > >
> org.apache.lucene.util.TestRuleAssertionsRequired$1.evaluate(TestRuleA
> > > ss
> > > ertionsRequired.java:54)
> > > 	at
> > > org.apache.lucene.util.TestRuleMarkFailure$1.evaluate(TestRuleMarkFail
> > > ure
> > > .java:48)
> > > 	at
> > >
> org.apache.lucene.util.TestRuleIgnoreAfterMaxFailures$1.evaluate(TestR
> > > ule
> > > IgnoreAfterMaxFailures.java:65)
> > > 	at
> > > org.apache.lucene.util.TestRuleIgnoreTestSuites$1.evaluate(TestRuleIgn
> > > ore
> > > TestSuites.java:55)
> > > 	at
> > >
> com.carrotsearch.randomizedtesting.rules.StatementAdapter.evaluate(Sta
> > > t
> > > ementAdapter.java:36)
> > > 	at
> > >
> >
> com.carrotsearch.randomizedtesting.ThreadLeakControl$StatementRunner.
> > > run(ThreadLeakControl.java:365)
> > > 	at java.lang.Thread.run(Thread.java:746)
> > >
> > >
> > > FAILED:
> > > org.apache.solr.handler.extraction.ExtractingRequestHandlerTest.testLi
> > > teral
> > > sOverride
> > >
> > > Error Message:
> > > Invalid Date String:'Thu Nov 13 19:35:51 XJT 2008'
> > >
> > > Stack Trace:
> > > org.apache.solr.common.SolrException: Invalid Date String:'Thu Nov 13
> > > 19:35:51 XJT 2008'
> > > 	at
> > >
> >
> __randomizedtesting.SeedInfo.seed([ABCF3FCC3426170F:93A47E22E6697BC
> > > E]:0)
> > > 	at
> > > org.apache.solr.util.DateFormatUtil.parseMath(DateFormatUtil.java:89)
> > > 	at org.apache.solr.schema.TrieField.createField(TrieField.java:695)
> > > 	at org.apache.solr.schema.TrieField.createFields(TrieField.java:732)
> > > 	at
> > >
> >
> org.apache.solr.update.DocumentBuilder.addField(DocumentBuilder.java:4
> > > 8
> > > )
> > > 	at
> > >
> >
> org.apache.solr.update.DocumentBuilder.toDocument(DocumentBuilder.jav
> > > a:123)
> > > 	at
> > >
> >
> org.apache.solr.update.AddUpdateCommand.getLuceneDocument(AddUpd
> > > ateCommand.java:84)
> > > 	at
> > >
> >
> org.apache.solr.update.DirectUpdateHandler2.doNormalUpdate(DirectUpda
> > > teHandler2.java:268)
> > > 	at
> > >
> >
> org.apache.solr.update.DirectUpdateHandler2.addDoc0(DirectUpdateHandle
> > > r2.java:202)
> > > 	at
> > >
> >
> org.apache.solr.update.DirectUpdateHandler2.addDoc(DirectUpdateHandler
> > > 2.java:164)
> > > 	at
> > >
> >
> org.apache.solr.update.processor.RunUpdateProcessor.processAdd(RunUp
> > > dateProcessorFactory.java:69)
> > > 	at
> > >
> >
> org.apache.solr.update.processor.UpdateRequestProcessor.processAdd(Up
> > > dateRequestProcessor.java:51)
> > > 	at
> > >
> org.apache.solr.update.processor.DistributedUpdateProcessor.versionAdd
> > > (
> > > DistributedUpdateProcessor.java:980)
> > > 	at
> > >
> >
> org.apache.solr.update.processor.DistributedUpdateProcessor.processAdd
> > > (
> > > DistributedUpdateProcessor.java:705)
> > > 	at
> > >
> >
> org.apache.solr.update.processor.LogUpdateProcessor.processAdd(LogUpd
> > > ateProcessorFactory.java:104)
> > > 	at
> > >
> org.apache.solr.handler.extraction.ExtractingDocumentLoader.doAdd(Extr
> > > ac
> > > tingDocumentLoader.java:122)
> > > 	at
> > >
> org.apache.solr.handler.extraction.ExtractingDocumentLoader.addDoc(Ext
> > > ra
> > > ctingDocumentLoader.java:127)
> > > 	at
> > > org.apache.solr.handler.extraction.ExtractingDocumentLoader.load(Extra
> > > ctin
> > > gDocumentLoader.java:230)
> > > 	at
> > >
> >
> org.apache.solr.handler.ContentStreamHandlerBase.handleRequestBody(Co
> > > ntentStreamHandlerBase.java:74)
> > > 	at
> > >
> >
> org.apache.solr.handler.RequestHandlerBase.handleRequest(RequestHandl
> > > erBase.java:151)
> > > 	at org.apache.solr.core.SolrCore.execute(SolrCore.java:2079)
> > > 	at
> > >
> >
> org.apache.solr.util.TestHarness.queryAndResponse(TestHarness.java:339)
> > > 	at
> > > org.apache.solr.handler.extraction.ExtractingRequestHandlerTest.loadLo
> > > calF
> > > romHandler(ExtractingRequestHandlerTest.java:737)
> > > 	at
> > > org.apache.solr.handler.extraction.ExtractingRequestHandlerTest.loadLo
> > > cal(
> > > ExtractingRequestHandlerTest.java:744)
> > > 	at
> > > org.apache.solr.handler.extraction.ExtractingRequestHandlerTest.testLi
> > > teral
> > > sOverride(ExtractingRequestHandlerTest.java:605)
> > > 	at sun.reflect.NativeMethodAccessorImpl.invoke0(Native Method)
> > > 	at
> > >
> >
> sun.reflect.NativeMethodAccessorImpl.invoke(NativeMethodAccessorImpl.j
> > > ava:62)
> > > 	at
> > >
> >
> sun.reflect.DelegatingMethodAccessorImpl.invoke(DelegatingMethodAcces
> > > sorImpl.java:43)
> > > 	at java.lang.reflect.Method.invoke(Method.java:504)
> > > 	at
> > >
> >
> com.carrotsearch.randomizedtesting.RandomizedRunner.invoke(Randomize
> > > dRunner.java:1627)
> > > 	at
> > >
> >
> com.carrotsearch.randomizedtesting.RandomizedRunner$6.evaluate(Rando
> > > mizedRunner.java:836)
> > > 	at
> > >
> >
> com.carrotsearch.randomizedtesting.RandomizedRunner$7.evaluate(Rando
> > > mizedRunner.java:872)
> > > 	at
> > >
> >
> com.carrotsearch.randomizedtesting.RandomizedRunner$8.evaluate(Rando
> > > mizedRunner.java:886)
> > > 	at
> > >
> >
> com.carrotsearch.randomizedtesting.rules.SystemPropertiesRestoreRule$1.
> > > evaluate(SystemPropertiesRestoreRule.java:57)
> > > 	at
> > >
> >
> org.apache.lucene.util.TestRuleSetupTeardownChained$1.evaluate(TestRul
> > > e
> > > SetupTeardownChained.java:50)
> > > 	at
> > > org.apache.lucene.util.AbstractBeforeAfterRule$1.evaluate(AbstractBefo
> > > reA
> > > fterRule.java:46)
> > > 	at
> > >
> >
> org.apache.lucene.util.TestRuleThreadAndTestName$1.evaluate(TestRuleTh
> > > readAndTestName.java:49)
> > > 	at
> > >
> org.apache.lucene.util.TestRuleIgnoreAfterMaxFailures$1.evaluate(TestR
> > > ule
> > > IgnoreAfterMaxFailures.java:65)
> > > 	at
> > > org.apache.lucene.util.TestRuleMarkFailure$1.evaluate(TestRuleMarkFail
> > > ure
> > > .java:48)
> > > 	at
> > >
> com.carrotsearch.randomizedtesting.rules.StatementAdapter.evaluate(Sta
> > > t
> > > ementAdapter.java:36)
> > > 	at
> > >
> >
> com.carrotsearch.randomizedtesting.ThreadLeakControl$StatementRunner.
> > > run(ThreadLeakControl.java:365)
> > > 	at
> > >
> >
> com.carrotsearch.randomizedtesting.ThreadLeakControl.forkTimeoutingTas
> > > k
> > > (ThreadLeakControl.java:798)
> > > 	at
> > >
> >
> com.carrotsearch.randomizedtesting.ThreadLeakControl$3.evaluate(Thread
> > > L
> > > eakControl.java:458)
> > > 	at
> > >
> >
> com.carrotsearch.randomizedtesting.RandomizedRunner.runSingleTest(Ran
> > > domizedRunner.java:845)
> > > 	at
> > >
> >
> com.carrotsearch.randomizedtesting.RandomizedRunner$3.evaluate(Rando
> > > mizedRunner.java:747)
> > > 	at
> > >
> >
> com.carrotsearch.randomizedtesting.RandomizedRunner$4.evaluate(Rando
> > > mizedRunner.java:781)
> > > 	at
> > >
> >
> com.carrotsearch.randomizedtesting.RandomizedRunner$5.evaluate(Rando
> > > mizedRunner.java:792)
> > > 	at
> > >
> com.carrotsearch.randomizedtesting.rules.StatementAdapter.evaluate(Sta
> > > t
> > > ementAdapter.java:36)
> > > 	at
> > >
> >
> com.carrotsearch.randomizedtesting.rules.SystemPropertiesRestoreRule$1.
> > > evaluate(SystemPropertiesRestoreRule.java:57)
> > > 	at
> > > org.apache.lucene.util.AbstractBeforeAfterRule$1.evaluate(AbstractBefo
> > > reA
> > > fterRule.java:46)
> > > 	at
> > >
> com.carrotsearch.randomizedtesting.rules.StatementAdapter.evaluate(Sta
> > > t
> > > ementAdapter.java:36)
> > > 	at
> > >
> org.apache.lucene.util.TestRuleStoreClassName$1.evaluate(TestRuleStore
> > > Cl
> > > assName.java:42)
> > > 	at
> > >
> >
> com.carrotsearch.randomizedtesting.rules.NoShadowingOrOverridesOnMet
> > > hodsRule$1.evaluate(NoShadowingOrOverridesOnMethodsRule.java:39)
> > > 	at
> > >
> >
> com.carrotsearch.randomizedtesting.rules.NoShadowingOrOverridesOnMet
> > > hodsRule$1.evaluate(NoShadowingOrOverridesOnMethodsRule.java:39)
> > > 	at
> > >
> com.carrotsearch.randomizedtesting.rules.StatementAdapter.evaluate(Sta
> > > t
> > > ementAdapter.java:36)
> > > 	at
> > >
> com.carrotsearch.randomizedtesting.rules.StatementAdapter.evaluate(Sta
> > > t
> > > ementAdapter.java:36)
> > > 	at
> > >
> com.carrotsearch.randomizedtesting.rules.StatementAdapter.evaluate(Sta
> > > t
> > > ementAdapter.java:36)
> > > 	at
> > >
> org.apache.lucene.util.TestRuleAssertionsRequired$1.evaluate(TestRuleA
> > > ss
> > > ertionsRequired.java:54)
> > > 	at
> > > org.apache.lucene.util.TestRuleMarkFailure$1.evaluate(TestRuleMarkFail
> > > ure
> > > .java:48)
> > > 	at
> > >
> org.apache.lucene.util.TestRuleIgnoreAfterMaxFailures$1.evaluate(TestR
> > > ule
> > > IgnoreAfterMaxFailures.java:65)
> > > 	at
> > > org.apache.lucene.util.TestRuleIgnoreTestSuites$1.evaluate(TestRuleIgn
> > > ore
> > > TestSuites.java:55)
> > > 	at
> > >
> com.carrotsearch.randomizedtesting.rules.StatementAdapter.evaluate(Sta
> > > t
> > > ementAdapter.java:36)
> > > 	at
> > >
> >
> com.carrotsearch.randomizedtesting.ThreadLeakControl$StatementRunner.
> > > run(ThreadLeakControl.java:365)
> > > 	at java.lang.Thread.run(Thread.java:746)
> > >
> > >
> > > FAILED:
> > > org.apache.solr.handler.extraction.ExtractingRequestHandlerTest.testEx
> > > tract
> > > ion
> > >
> > > Error Message:
> > > Invalid Date String:'Thu Nov 13 19:35:51 XJT 2008'
> > >
> > > Stack Trace:
> > > org.apache.solr.common.SolrException: Invalid Date String:'Thu Nov 13
> > > 19:35:51 XJT 2008'
> > > 	at
> > >
> >
> __randomizedtesting.SeedInfo.seed([ABCF3FCC3426170F:12BC4BB2480EC7F
> > > A]:0)
> > > 	at
> > > org.apache.solr.util.DateFormatUtil.parseMath(DateFormatUtil.java:89)
> > > 	at org.apache.solr.schema.TrieField.createField(TrieField.java:695)
> > > 	at org.apache.solr.schema.TrieField.createFields(TrieField.java:732)
> > > 	at
> > >
> >
> org.apache.solr.update.DocumentBuilder.addField(DocumentBuilder.java:4
> > > 8
> > > )
> > > 	at
> > >
> >
> org.apache.solr.update.DocumentBuilder.toDocument(DocumentBuilder.jav
> > > a:123)
> > > 	at
> > >
> >
> org.apache.solr.update.AddUpdateCommand.getLuceneDocument(AddUpd
> > > ateCommand.java:84)
> > > 	at
> > >
> >
> org.apache.solr.update.DirectUpdateHandler2.doNormalUpdate(DirectUpda
> > > teHandler2.java:268)
> > > 	at
> > >
> >
> org.apache.solr.update.DirectUpdateHandler2.addDoc0(DirectUpdateHandle
> > > r2.java:202)
> > > 	at
> > >
> >
> org.apache.solr.update.DirectUpdateHandler2.addDoc(DirectUpdateHandler
> > > 2.java:164)
> > > 	at
> > >
> >
> org.apache.solr.update.processor.RunUpdateProcessor.processAdd(RunUp
> > > dateProcessorFactory.java:69)
> > > 	at
> > >
> >
> org.apache.solr.update.processor.UpdateRequestProcessor.processAdd(Up
> > > dateRequestProcessor.java:51)
> > > 	at
> > >
> org.apache.solr.update.processor.DistributedUpdateProcessor.versionAdd
> > > (
> > > DistributedUpdateProcessor.java:980)
> > > 	at
> > >
> >
> org.apache.solr.update.processor.DistributedUpdateProcessor.processAdd
> > > (
> > > DistributedUpdateProcessor.java:705)
> > > 	at
> > >
> >
> org.apache.solr.update.processor.LogUpdateProcessor.processAdd(LogUpd
> > > ateProcessorFactory.java:104)
> > > 	at
> > >
> org.apache.solr.handler.extraction.ExtractingDocumentLoader.doAdd(Extr
> > > ac
> > > tingDocumentLoader.java:122)
> > > 	at
> > >
> org.apache.solr.handler.extraction.ExtractingDocumentLoader.addDoc(Ext
> > > ra
> > > ctingDocumentLoader.java:127)
> > > 	at
> > > org.apache.solr.handler.extraction.ExtractingDocumentLoader.load(Extra
> > > ctin
> > > gDocumentLoader.java:230)
> > > 	at
> > >
> >
> org.apache.solr.handler.ContentStreamHandlerBase.handleRequestBody(Co
> > > ntentStreamHandlerBase.java:74)
> > > 	at
> > >
> >
> org.apache.solr.handler.RequestHandlerBase.handleRequest(RequestHandl
> > > erBase.java:151)
> > > 	at org.apache.solr.core.SolrCore.execute(SolrCore.java:2079)
> > > 	at
> > >
> >
> org.apache.solr.util.TestHarness.queryAndResponse(TestHarness.java:339)
> > > 	at
> > > org.apache.solr.handler.extraction.ExtractingRequestHandlerTest.loadLo
> > > calF
> > > romHandler(ExtractingRequestHandlerTest.java:737)
> > > 	at
> > > org.apache.solr.handler.extraction.ExtractingRequestHandlerTest.loadLo
> > > cal(
> > > ExtractingRequestHandlerTest.java:744)
> > > 	at
> > > org.apache.solr.handler.extraction.ExtractingRequestHandlerTest.testEx
> > > tract
> > > ion(ExtractingRequestHandlerTest.java:63)
> > > 	at sun.reflect.NativeMethodAccessorImpl.invoke0(Native Method)
> > > 	at
> > >
> >
> sun.reflect.NativeMethodAccessorImpl.invoke(NativeMethodAccessorImpl.j
> > > ava:62)
> > > 	at
> > >
> >
> sun.reflect.DelegatingMethodAccessorImpl.invoke(DelegatingMethodAcces
> > > sorImpl.java:43)
> > > 	at java.lang.reflect.Method.invoke(Method.java:504)
> > > 	at
> > >
> >
> com.carrotsearch.randomizedtesting.RandomizedRunner.invoke(Randomize
> > > dRunner.java:1627)
> > > 	at
> > >
> >
> com.carrotsearch.randomizedtesting.RandomizedRunner$6.evaluate(Rando
> > > mizedRunner.java:836)
> > > 	at
> > >
> >
> com.carrotsearch.randomizedtesting.RandomizedRunner$7.evaluate(Rando
> > > mizedRunner.java:872)
> > > 	at
> > >
> >
> com.carrotsearch.randomizedtesting.RandomizedRunner$8.evaluate(Rando
> > > mizedRunner.java:886)
> > > 	at
> > >
> >
> com.carrotsearch.randomizedtesting.rules.SystemPropertiesRestoreRule$1.
> > > evaluate(SystemPropertiesRestoreRule.java:57)
> > > 	at
> > >
> >
> org.apache.lucene.util.TestRuleSetupTeardownChained$1.evaluate(TestRul
> > > e
> > > SetupTeardownChained.java:50)
> > > 	at
> > > org.apache.lucene.util.AbstractBeforeAfterRule$1.evaluate(AbstractBefo
> > > reA
> > > fterRule.java:46)
> > > 	at
> > >
> >
> org.apache.lucene.util.TestRuleThreadAndTestName$1.evaluate(TestRuleTh
> > > readAndTestName.java:49)
> > > 	at
> > >
> org.apache.lucene.util.TestRuleIgnoreAfterMaxFailures$1.evaluate(TestR
> > > ule
> > > IgnoreAfterMaxFailures.java:65)
> > > 	at
> > > org.apache.lucene.util.TestRuleMarkFailure$1.evaluate(TestRuleMarkFail
> > > ure
> > > .java:48)
> > > 	at
> > >
> com.carrotsearch.randomizedtesting.rules.StatementAdapter.evaluate(Sta
> > > t
> > > ementAdapter.java:36)
> > > 	at
> > >
> >
> com.carrotsearch.randomizedtesting.ThreadLeakControl$StatementRunner.
> > > run(ThreadLeakControl.java:365)
> > > 	at
> > >
> >
> com.carrotsearch.randomizedtesting.ThreadLeakControl.forkTimeoutingTas
> > > k
> > > (ThreadLeakControl.java:798)
> > > 	at
> > >
> >
> com.carrotsearch.randomizedtesting.ThreadLeakControl$3.evaluate(Thread
> > > L
> > > eakControl.java:458)
> > > 	at
> > >
> >
> com.carrotsearch.randomizedtesting.RandomizedRunner.runSingleTest(Ran
> > > domizedRunner.java:845)
> > > 	at
> > >
> >
> com.carrotsearch.randomizedtesting.RandomizedRunner$3.evaluate(Rando
> > > mizedRunner.java:747)
> > > 	at
> > >
> >
> com.carrotsearch.randomizedtesting.RandomizedRunner$4.evaluate(Rando
> > > mizedRunner.java:781)
> > > 	at
> > >
> >
> com.carrotsearch.randomizedtesting.RandomizedRunner$5.evaluate(Rando
> > > mizedRunner.java:792)
> > > 	at
> > >
> com.carrotsearch.randomizedtesting.rules.StatementAdapter.evaluate(Sta
> > > t
> > > ementAdapter.java:36)
> > > 	at
> > >
> >
> com.carrotsearch.randomizedtesting.rules.SystemPropertiesRestoreRule$1.
> > > evaluate(SystemPropertiesRestoreRule.java:57)
> > > 	at
> > > org.apache.lucene.util.AbstractBeforeAfterRule$1.evaluate(AbstractBefo
> > > reA
> > > fterRule.java:46)
> > > 	at
> > >
> com.carrotsearch.randomizedtesting.rules.StatementAdapter.evaluate(Sta
> > > t
> > > ementAdapter.java:36)
> > > 	at
> > >
> org.apache.lucene.util.TestRuleStoreClassName$1.evaluate(TestRuleStore
> > > Cl
> > > assName.java:42)
> > > 	at
> > >
> >
> com.carrotsearch.randomizedtesting.rules.NoShadowingOrOverridesOnMet
> > > hodsRule$1.evaluate(NoShadowingOrOverridesOnMethodsRule.java:39)
> > > 	at
> > >
> >
> com.carrotsearch.randomizedtesting.rules.NoShadowingOrOverridesOnMet
> > > hodsRule$1.evaluate(NoShadowingOrOverridesOnMethodsRule.java:39)
> > > 	at
> > >
> com.carrotsearch.randomizedtesting.rules.StatementAdapter.evaluate(Sta
> > > t
> > > ementAdapter.java:36)
> > > 	at
> > >
> com.carrotsearch.randomizedtesting.rules.StatementAdapter.evaluate(Sta
> > > t
> > > ementAdapter.java:36)
> > > 	at
> > >
> com.carrotsearch.randomizedtesting.rules.StatementAdapter.evaluate(Sta
> > > t
> > > ementAdapter.java:36)
> > > 	at
> > >
> org.apache.lucene.util.TestRuleAssertionsRequired$1.evaluate(TestRuleA
> > > ss
> > > ertionsRequired.java:54)
> > > 	at
> > > org.apache.lucene.util.TestRuleMarkFailure$1.evaluate(TestRuleMarkFail
> > > ure
> > > .java:48)
> > > 	at
> > >
> org.apache.lucene.util.TestRuleIgnoreAfterMaxFailures$1.evaluate(TestR
> > > ule
> > > IgnoreAfterMaxFailures.java:65)
> > > 	at
> > > org.apache.lucene.util.TestRuleIgnoreTestSuites$1.evaluate(TestRuleIgn
> > > ore
> > > TestSuites.java:55)
> > > 	at
> > >
> com.carrotsearch.randomizedtesting.rules.StatementAdapter.evaluate(Sta
> > > t
> > > ementAdapter.java:36)
> > > 	at
> > >
> >
> com.carrotsearch.randomizedtesting.ThreadLeakControl$StatementRunner.
> > > run(ThreadLeakControl.java:365)
> > > 	at java.lang.Thread.run(Thread.java:746)
> > >
> > >
> > >
> > >
> > > Build Log:
> > > [...truncated 14848 lines...]
> > >    [junit4] Suite:
> > > org.apache.solr.handler.extraction.ExtractingRequestHandlerTest
> > >    [junit4]   2> Creating dataDir: /home/jenkins/workspace/Lucene-Solr-
> > > trunk-Linux/solr/build/contrib/solr-
> > > cell/test/J0/temp/solr.handler.extraction.ExtractingRequestHandlerTest
> > > _AB
> > > CF3FCC3426170F-001/init-core-data-001
> > >    [junit4]   2> log4j:WARN No appenders could be found for logger
> > > (org.apache.solr.SolrTestCaseJ4).
> > >    [junit4]   2> log4j:WARN Please initialize the log4j system properly.
> > >    [junit4]   2> log4j:WARN See
> > > http://logging.apache.org/log4j/1.2/faq.html#noconfig for more info.
> > >    [junit4]   2> NOTE: reproduce with: ant test  -
> > > Dtestcase=ExtractingRequestHandlerTest -
> > > Dtests.method=testPasswordProtected -
> Dtests.seed=ABCF3FCC3426170F -
> > > Dtests.multiplier=3 -Dtests.slow=true -Dtests.locale=en_GG -
> > > Dtests.timezone=Asia/Kashgar -Dtests.asserts=true -
> > > Dtests.file.encoding=UTF-8
> > >    [junit4] ERROR   0.71s |
> > > ExtractingRequestHandlerTest.testPasswordProtected <<<
> > >    [junit4]    > Throwable #1: org.apache.solr.common.SolrException:
> Invalid
> > > Date String:'Sat Jun 23 02:57:58 XJT 2012'
> > >    [junit4]    > 	at
> > >
> >
> __randomizedtesting.SeedInfo.seed([ABCF3FCC3426170F:AD6ABB37CA1F47
> > > D5]:0)
> > >    [junit4]    > 	at
> > > org.apache.solr.util.DateFormatUtil.parseMath(DateFormatUtil.java:89)
> > >    [junit4]    > 	at
> > > org.apache.solr.schema.TrieField.createField(TrieField.java:695)
> > >    [junit4]    > 	at
> > > org.apache.solr.schema.TrieField.createFields(TrieField.java:732)
> > >    [junit4]    > 	at
> > >
> >
> org.apache.solr.update.DocumentBuilder.addField(DocumentBuilder.java:4
> > > 8
> > > )
> > >    [junit4]    > 	at
> > >
> >
> org.apache.solr.update.DocumentBuilder.toDocument(DocumentBuilder.jav
> > > a:123)
> > >    [junit4]    > 	at
> > >
> >
> org.apache.solr.update.AddUpdateCommand.getLuceneDocument(AddUpd
> > > ateCommand.java:84)
> > >    [junit4]    > 	at
> > >
> >
> org.apache.solr.update.DirectUpdateHandler2.doNormalUpdate(DirectUpda
> > > teHandler2.java:268)
> > >    [junit4]    > 	at
> > >
> >
> org.apache.solr.update.DirectUpdateHandler2.addDoc0(DirectUpdateHandle
> > > r2.java:202)
> > >    [junit4]    > 	at
> > >
> >
> org.apache.solr.update.DirectUpdateHandler2.addDoc(DirectUpdateHandler
> > > 2.java:164)
> > >    [junit4]    > 	at
> > >
> >
> org.apache.solr.update.processor.RunUpdateProcessor.processAdd(RunUp
> > > dateProcessorFactory.java:69)
> > >    [junit4]    > 	at
> > >
> >
> org.apache.solr.update.processor.UpdateRequestProcessor.processAdd(Up
> > > dateRequestProcessor.java:51)
> > >    [junit4]    > 	at
> > >
> org.apache.solr.update.processor.DistributedUpdateProcessor.versionAdd
> > > (
> > > DistributedUpdateProcessor.java:980)
> > >    [junit4]    > 	at
> > >
> >
> org.apache.solr.update.processor.DistributedUpdateProcessor.processAdd
> > > (
> > > DistributedUpdateProcessor.java:705)
> > >    [junit4]    > 	at
> > >
> >
> org.apache.solr.update.processor.LogUpdateProcessor.processAdd(LogUpd
> > > ateProcessorFactory.java:104)
> > >    [junit4]    > 	at
> > >
> org.apache.solr.handler.extraction.ExtractingDocumentLoader.doAdd(Extr
> > > ac
> > > tingDocumentLoader.java:122)
> > >    [junit4]    > 	at
> > >
> org.apache.solr.handler.extraction.ExtractingDocumentLoader.addDoc(Ext
> > > ra
> > > ctingDocumentLoader.java:127)
> > >    [junit4]    > 	at
> > > org.apache.solr.handler.extraction.ExtractingDocumentLoader.load(Extra
> > > ctin
> > > gDocumentLoader.java:230)
> > >    [junit4]    > 	at
> > >
> >
> org.apache.solr.handler.ContentStreamHandlerBase.handleRequestBody(Co
> > > ntentStreamHandlerBase.java:74)
> > >    [junit4]    > 	at
> > >
> >
> org.apache.solr.handler.RequestHandlerBase.handleRequest(RequestHandl
> > > erBase.java:151)
> > >    [junit4]    > 	at
> org.apache.solr.core.SolrCore.execute(SolrCore.java:2079)
> > >    [junit4]    > 	at
> > >
> >
> org.apache.solr.util.TestHarness.queryAndResponse(TestHarness.java:339)
> > >    [junit4]    > 	at
> > > org.apache.solr.handler.extraction.ExtractingRequestHandlerTest.loadLo
> > > calF
> > > romHandler(ExtractingRequestHandlerTest.java:737)
> > >    [junit4]    > 	at
> > > org.apache.solr.handler.extraction.ExtractingRequestHandlerTest.loadLo
> > > cal(
> > > ExtractingRequestHandlerTest.java:744)
> > >    [junit4]    > 	at
> > > org.apache.solr.handler.extraction.ExtractingRequestHandlerTest.testPa
> > > ssw
> > > ordProtected(ExtractingRequestHandlerTest.java:662)
> > >    [junit4]    > 	at java.lang.Thread.run(Thread.java:746)
> > >    [junit4]   2> NOTE: reproduce with: ant test  -
> > > Dtestcase=ExtractingRequestHandlerTest -Dtests.method=testArabicPDF
> -
> > > Dtests.seed=ABCF3FCC3426170F -Dtests.multiplier=3 -Dtests.slow=true -
> > > Dtests.locale=en_GG -Dtests.timezone=Asia/Kashgar -
> Dtests.asserts=true
> > > -
> > > Dtests.file.encoding=UTF-8
> > >    [junit4] ERROR   0.03s | ExtractingRequestHandlerTest.testArabicPDF
> <<<
> > >    [junit4]    > Throwable #1: org.apache.solr.common.SolrException:
> Invalid
> > > Date String:'Tue Mar 09 12:44:49 XJT 2010'
> > >    [junit4]    > 	at
> > >
> >
> __randomizedtesting.SeedInfo.seed([ABCF3FCC3426170F:C50944C337E3BC5
> > > A]:0)
> > >    [junit4]    > 	at
> > > org.apache.solr.util.DateFormatUtil.parseMath(DateFormatUtil.java:89)
> > >    [junit4]    > 	at
> > > org.apache.solr.schema.TrieField.createField(TrieField.java:695)
> > >    [junit4]    > 	at
> > > org.apache.solr.schema.TrieField.createFields(TrieField.java:732)
> > >    [junit4]    > 	at
> > >
> >
> org.apache.solr.update.DocumentBuilder.addField(DocumentBuilder.java:4
> > > 8
> > > )
> > >    [junit4]    > 	at
> > >
> >
> org.apache.solr.update.DocumentBuilder.toDocument(DocumentBuilder.jav
> > > a:123)
> > >    [junit4]    > 	at
> > >
> >
> org.apache.solr.update.AddUpdateCommand.getLuceneDocument(AddUpd
> > > ateCommand.java:84)
> > >    [junit4]    > 	at
> > >
> >
> org.apache.solr.update.DirectUpdateHandler2.doNormalUpdate(DirectUpda
> > > teHandler2.java:268)
> > >    [junit4]    > 	at
> > >
> >
> org.apache.solr.update.DirectUpdateHandler2.addDoc0(DirectUpdateHandle
> > > r2.java:202)
> > >    [junit4]    > 	at
> > >
> >
> org.apache.solr.update.DirectUpdateHandler2.addDoc(DirectUpdateHandler
> > > 2.java:164)
> > >    [junit4]    > 	at
> > >
> >
> org.apache.solr.update.processor.RunUpdateProcessor.processAdd(RunUp
> > > dateProcessorFactory.java:69)
> > >    [junit4]    > 	at
> > >
> >
> org.apache.solr.update.processor.UpdateRequestProcessor.processAdd(Up
> > > dateRequestProcessor.java:51)
> > >    [junit4]    > 	at
> > >
> org.apache.solr.update.processor.DistributedUpdateProcessor.versionAdd
> > > (
> > > DistributedUpdateProcessor.java:980)
> > >    [junit4]    > 	at
> > >
> >
> org.apache.solr.update.processor.DistributedUpdateProcessor.processAdd
> > > (
> > > DistributedUpdateProcessor.java:705)
> > >    [junit4]    > 	at
> > >
> >
> org.apache.solr.update.processor.LogUpdateProcessor.processAdd(LogUpd
> > > ateProcessorFactory.java:104)
> > >    [junit4]    > 	at
> > >
> org.apache.solr.handler.extraction.ExtractingDocumentLoader.doAdd(Extr
> > > ac
> > > tingDocumentLoader.java:122)
> > >    [junit4]    > 	at
> > >
> org.apache.solr.handler.extraction.ExtractingDocumentLoader.addDoc(Ext
> > > ra
> > > ctingDocumentLoader.java:127)
> > >    [junit4]    > 	at
> > > org.apache.solr.handler.extraction.ExtractingDocumentLoader.load(Extra
> > > ctin
> > > gDocumentLoader.java:230)
> > >    [junit4]    > 	at
> > >
> >
> org.apache.solr.handler.ContentStreamHandlerBase.handleRequestBody(Co
> > > ntentStreamHandlerBase.java:74)
> > >    [junit4]    > 	at
> > >
> >
> org.apache.solr.handler.RequestHandlerBase.handleRequest(RequestHandl
> > > erBase.java:151)
> > >    [junit4]    > 	at
> org.apache.solr.core.SolrCore.execute(SolrCore.java:2079)
> > >    [junit4]    > 	at
> > >
> >
> org.apache.solr.util.TestHarness.queryAndResponse(TestHarness.java:339)
> > >    [junit4]    > 	at
> > > org.apache.solr.handler.extraction.ExtractingRequestHandlerTest.loadLo
> > > calF
> > > romHandler(ExtractingRequestHandlerTest.java:737)
> > >    [junit4]    > 	at
> > > org.apache.solr.handler.extraction.ExtractingRequestHandlerTest.loadLo
> > > cal(
> > > ExtractingRequestHandlerTest.java:744)
> > >    [junit4]    > 	at
> > > org.apache.solr.handler.extraction.ExtractingRequestHandlerTest.testAr
> > > abic
> > > PDF(ExtractingRequestHandlerTest.java:526)
> > >    [junit4]    > 	at java.lang.Thread.run(Thread.java:746)
> > >    [junit4]   2> NOTE: reproduce with: ant test  -
> > > Dtestcase=ExtractingRequestHandlerTest -
> > > Dtests.method=testLiteralsOverride -Dtests.seed=ABCF3FCC3426170F -
> > > Dtests.multiplier=3 -Dtests.slow=true -Dtests.locale=en_GG -
> > > Dtests.timezone=Asia/Kashgar -Dtests.asserts=true -
> > > Dtests.file.encoding=UTF-8
> > >    [junit4] ERROR   0.02s |
> > ExtractingRequestHandlerTest.testLiteralsOverride
> > > <<<
> > >    [junit4]    > Throwable #1: org.apache.solr.common.SolrException:
> Invalid
> > > Date String:'Thu Nov 13 19:35:51 XJT 2008'
> > >    [junit4]    > 	at
> > >
> >
> __randomizedtesting.SeedInfo.seed([ABCF3FCC3426170F:93A47E22E6697BC
> > > E]:0)
> > >    [junit4]    > 	at
> > > org.apache.solr.util.DateFormatUtil.parseMath(DateFormatUtil.java:89)
> > >    [junit4]    > 	at
> > > org.apache.solr.schema.TrieField.createField(TrieField.java:695)
> > >    [junit4]    > 	at
> > > org.apache.solr.schema.TrieField.createFields(TrieField.java:732)
> > >    [junit4]    > 	at
> > >
> >
> org.apache.solr.update.DocumentBuilder.addField(DocumentBuilder.java:4
> > > 8
> > > )
> > >    [junit4]    > 	at
> > >
> >
> org.apache.solr.update.DocumentBuilder.toDocument(DocumentBuilder.jav
> > > a:123)
> > >    [junit4]    > 	at
> > >
> >
> org.apache.solr.update.AddUpdateCommand.getLuceneDocument(AddUpd
> > > ateCommand.java:84)
> > >    [junit4]    > 	at
> > >
> >
> org.apache.solr.update.DirectUpdateHandler2.doNormalUpdate(DirectUpda
> > > teHandler2.java:268)
> > >    [junit4]    > 	at
> > >
> >
> org.apache.solr.update.DirectUpdateHandler2.addDoc0(DirectUpdateHandle
> > > r2.java:202)
> > >    [junit4]    > 	at
> > >
> >
> org.apache.solr.update.DirectUpdateHandler2.addDoc(DirectUpdateHandler
> > > 2.java:164)
> > >    [junit4]    > 	at
> > >
> >
> org.apache.solr.update.processor.RunUpdateProcessor.processAdd(RunUp
> > > dateProcessorFactory.java:69)
> > >    [junit4]    > 	at
> > >
> >
> org.apache.solr.update.processor.UpdateRequestProcessor.processAdd(Up
> > > dateRequestProcessor.java:51)
> > >    [junit4]    > 	at
> > >
> org.apache.solr.update.processor.DistributedUpdateProcessor.versionAdd
> > > (
> > > DistributedUpdateProcessor.java:980)
> > >    [junit4]    > 	at
> > >
> >
> org.apache.solr.update.processor.DistributedUpdateProcessor.processAdd
> > > (
> > > DistributedUpdateProcessor.java:705)
> > >    [junit4]    > 	at
> > >
> >
> org.apache.solr.update.processor.LogUpdateProcessor.processAdd(LogUpd
> > > ateProcessorFactory.java:104)
> > >    [junit4]    > 	at
> > >
> org.apache.solr.handler.extraction.ExtractingDocumentLoader.doAdd(Extr
> > > ac
> > > tingDocumentLoader.java:122)
> > >    [junit4]    > 	at
> > >
> org.apache.solr.handler.extraction.ExtractingDocumentLoader.addDoc(Ext
> > > ra
> > > ctingDocumentLoader.java:127)
> > >    [junit4]    > 	at
> > > org.apache.solr.handler.extraction.ExtractingDocumentLoader.load(Extra
> > > ctin
> > > gDocumentLoader.java:230)
> > >    [junit4]    > 	at
> > >
> >
> org.apache.solr.handler.ContentStreamHandlerBase.handleRequestBody(Co
> > > ntentStreamHandlerBase.java:74)
> > >    [junit4]    > 	at
> > >
> >
> org.apache.solr.handler.RequestHandlerBase.handleRequest(RequestHandl
> > > erBase.java:151)
> > >    [junit4]    > 	at
> org.apache.solr.core.SolrCore.execute(SolrCore.java:2079)
> > >    [junit4]    > 	at
> > >
> >
> org.apache.solr.util.TestHarness.queryAndResponse(TestHarness.java:339)
> > >    [junit4]    > 	at
> > > org.apache.solr.handler.extraction.ExtractingRequestHandlerTest.loadLo
> > > calF
> > > romHandler(ExtractingRequestHandlerTest.java:737)
> > >    [junit4]    > 	at
> > > org.apache.solr.handler.extraction.ExtractingRequestHandlerTest.loadLo
> > > cal(
> > > ExtractingRequestHandlerTest.java:744)
> > >    [junit4]    > 	at
> > > org.apache.solr.handler.extraction.ExtractingRequestHandlerTest.testLi
> > > teral
> > > sOverride(ExtractingRequestHandlerTest.java:605)
> > >    [junit4]    > 	at java.lang.Thread.run(Thread.java:746)
> > >    [junit4]   2> NOTE: reproduce with: ant test  -
> > > Dtestcase=ExtractingRequestHandlerTest -Dtests.method=testExtraction
> -
> > > Dtests.seed=ABCF3FCC3426170F -Dtests.multiplier=3 -Dtests.slow=true -
> > > Dtests.locale=en_GG -Dtests.timezone=Asia/Kashgar -
> Dtests.asserts=true
> > > -
> > > Dtests.file.encoding=UTF-8
> > >    [junit4] ERROR   0.02s | ExtractingRequestHandlerTest.testExtraction
> <<<
> > >    [junit4]    > Throwable #1: org.apache.solr.common.SolrException:
> Invalid
> > > Date String:'Thu Nov 13 19:35:51 XJT 2008'
> > >    [junit4]    > 	at
> > >
> >
> __randomizedtesting.SeedInfo.seed([ABCF3FCC3426170F:12BC4BB2480EC7F
> > > A]:0)
> > >    [junit4]    > 	at
> > > org.apache.solr.util.DateFormatUtil.parseMath(DateFormatUtil.java:89)
> > >    [junit4]    > 	at
> > > org.apache.solr.schema.TrieField.createField(TrieField.java:695)
> > >    [junit4]    > 	at
> > > org.apache.solr.schema.TrieField.createFields(TrieField.java:732)
> > >    [junit4]    > 	at
> > >
> >
> org.apache.solr.update.DocumentBuilder.addField(DocumentBuilder.java:4
> > > 8
> > > )
> > >    [junit4]    > 	at
> > >
> >
> org.apache.solr.update.DocumentBuilder.toDocument(DocumentBuilder.jav
> > > a:123)
> > >    [junit4]    > 	at
> > >
> >
> org.apache.solr.update.AddUpdateCommand.getLuceneDocument(AddUpd
> > > ateCommand.java:84)
> > >    [junit4]    > 	at
> > >
> >
> org.apache.solr.update.DirectUpdateHandler2.doNormalUpdate(DirectUpda
> > > teHandler2.java:268)
> > >    [junit4]    > 	at
> > >
> >
> org.apache.solr.update.DirectUpdateHandler2.addDoc0(DirectUpdateHandle
> > > r2.java:202)
> > >    [junit4]    > 	at
> > >
> >
> org.apache.solr.update.DirectUpdateHandler2.addDoc(DirectUpdateHandler
> > > 2.java:164)
> > >    [junit4]    > 	at
> > >
> >
> org.apache.solr.update.processor.RunUpdateProcessor.processAdd(RunUp
> > > dateProcessorFactory.java:69)
> > >    [junit4]    > 	at
> > >
> >
> org.apache.solr.update.processor.UpdateRequestProcessor.processAdd(Up
> > > dateRequestProcessor.java:51)
> > >    [junit4]    > 	at
> > >
> org.apache.solr.update.processor.DistributedUpdateProcessor.versionAdd
> > > (
> > > DistributedUpdateProcessor.java:980)
> > >    [junit4]    > 	at
> > >
> >
> org.apache.solr.update.processor.DistributedUpdateProcessor.processAdd
> > > (
> > > DistributedUpdateProcessor.java:705)
> > >    [junit4]    > 	at
> > >
> >
> org.apache.solr.update.processor.LogUpdateProcessor.processAdd(LogUpd
> > > ateProcessorFactory.java:104)
> > >    [junit4]    > 	at
> > >
> org.apache.solr.handler.extraction.ExtractingDocumentLoader.doAdd(Extr
> > > ac
> > > tingDocumentLoader.java:122)
> > >    [junit4]    > 	at
> > >
> org.apache.solr.handler.extraction.ExtractingDocumentLoader.addDoc(Ext
> > > ra
> > > ctingDocumentLoader.java:127)
> > >    [junit4]    > 	at
> > > org.apache.solr.handler.extraction.ExtractingDocumentLoader.load(Extra
> > > ctin
> > > gDocumentLoader.java:230)
> > >    [junit4]    > 	at
> > >
> >
> org.apache.solr.handler.ContentStreamHandlerBase.handleRequestBody(Co
> > > ntentStreamHandlerBase.java:74)
> > >    [junit4]    > 	at
> > >
> >
> org.apache.solr.handler.RequestHandlerBase.handleRequest(RequestHandl
> > > erBase.java:151)
> > >    [junit4]    > 	at
> org.apache.solr.core.SolrCore.execute(SolrCore.java:2079)
> > >    [junit4]    > 	at
> > >
> >
> org.apache.solr.util.TestHarness.queryAndResponse(TestHarness.java:339)
> > >    [junit4]    > 	at
> > > org.apache.solr.handler.extraction.ExtractingRequestHandlerTest.loadLo
> > > calF
> > > romHandler(ExtractingRequestHandlerTest.java:737)
> > >    [junit4]    > 	at
> > > org.apache.solr.handler.extraction.ExtractingRequestHandlerTest.loadLo
> > > cal(
> > > ExtractingRequestHandlerTest.java:744)
> > >    [junit4]    > 	at
> > > org.apache.solr.handler.extraction.ExtractingRequestHandlerTest.testEx
> > > tract
> > > ion(ExtractingRequestHandlerTest.java:63)
> > >    [junit4]    > 	at java.lang.Thread.run(Thread.java:746)
> > >    [junit4]   2> NOTE: leaving temporary files on disk at:
> > > /home/jenkins/workspace/Lucene-Solr-trunk-
> Linux/solr/build/contrib/sol
> > > r-
> > > cell/test/J0/temp/solr.handler.extraction.ExtractingRequestHandlerTest
> > > _AB
> > > CF3FCC3426170F-001
> > >    [junit4]   2> NOTE: test params are:
> > >
> >
> codec=FastCompressingStoredFields(storedFieldsFormat=CompressingStore
> > > dFieldsFormat(compressionMode=FAST, chunkSize=4,
> > maxDocsPerChunk=453,
> > > blockSize=275),
> > >
> >
> termVectorsFormat=CompressingTermVectorsFormat(compressionMode=F
> > > AST, chunkSize=4, blockSize=275)),
> > > sim=RandomSimilarityProvider(queryNorm=false,coord=no): {},
> > > locale=en_GG, timezone=Asia/Kashgar
> > >    [junit4]   2> NOTE: Linux 3.19.0-26-generic i386/Oracle Corporation 1.9.0-
> > ea
> > > (32-bit)/cpus=12,threads=1,free=14633360,total=44990464
> > >    [junit4]   2> NOTE: All tests run in this JVM:
> > [ExtractingRequestHandlerTest]
> > >    [junit4] Completed [1/1] in 4.34s, 15 tests, 4 errors <<< FAILURES!
> > >
> > > [...truncated 12 lines...]
> > > BUILD FAILED
> > > /home/jenkins/workspace/Lucene-Solr-trunk-Linux/build.xml:775: The
> > > following error occurred while executing this line:
> > > /home/jenkins/workspace/Lucene-Solr-trunk-Linux/build.xml:719: The
> > > following error occurred while executing this line:
> > > /home/jenkins/workspace/Lucene-Solr-trunk-Linux/build.xml:59: The
> > > following error occurred while executing this line:
> > > /home/jenkins/workspace/Lucene-Solr-trunk-Linux/solr/build.xml:253:
> > > The following error occurred while executing this line:
> > > /home/jenkins/workspace/Lucene-Solr-trunk-Linux/solr/common-
> > > build.xml:457: The following error occurred while executing this line:
> > > /home/jenkins/workspace/Lucene-Solr-trunk-Linux/solr/common-
> > > build.xml:514: The following error occurred while executing this line:
> > > /home/jenkins/workspace/Lucene-Solr-trunk-Linux/lucene/common-
> > > build.xml:1432: The following error occurred while executing this line:
> > > /home/jenkins/workspace/Lucene-Solr-trunk-Linux/lucene/common-
> > > build.xml:987: There were test failures: 1 suite, 15 tests, 4 errors
> > >
> > > Total time: 96 minutes 44 seconds
> > > Build step 'Invoke Ant' marked build as failure Archiving artifacts
> > > [WARNINGS] Skipping publisher since build result is FAILURE Recording
> > > test results Email was triggered for: Failure - Any Sending email for
> > > trigger: Failure
> > > - Any
> > >
> >
> >
> >
> >
> > ---------------------------------------------------------------------
> > To unsubscribe, e-mail: dev-unsubscribe@lucene.apache.org For additional
> > commands, e-mail: dev-help@lucene.apache.org
> 
> 
> ---------------------------------------------------------------------
> To unsubscribe, e-mail: dev-unsubscribe@lucene.apache.org
> For additional commands, e-mail: dev-help@lucene.apache.org


---------------------------------------------------------------------
To unsubscribe, e-mail: dev-unsubscribe@lucene.apache.org
For additional commands, e-mail: dev-help@lucene.apache.org


Mime
View raw message