lucene-dev mailing list archives

Site index · List index
Message view « Date » · « Thread »
Top « Date » · « Thread »
From Policeman Jenkins Server <jenk...@thetaphi.de>
Subject [JENKINS] Lucene-Solr-trunk-Windows (64bit/jdk1.8.0_51) - Build # 5098 - Failure!
Date Mon, 03 Aug 2015 02:53:15 GMT
Build: http://jenkins.thetaphi.de/job/Lucene-Solr-trunk-Windows/5098/
Java: 64bit/jdk1.8.0_51 -XX:-UseCompressedOops -XX:+UseG1GC

1 tests failed.
FAILED:  org.apache.lucene.rangetree.TestRangeTree.testMultiValuedSortedSet

Error Message:
dir=.\temp\RangeTreeWriter2453214844782505478 still has file=.\temp\RangeTreeWriter2453214844782505478\size20382.7946562357398785588

Stack Trace:
java.lang.AssertionError: dir=.\temp\RangeTreeWriter2453214844782505478 still has file=.\temp\RangeTreeWriter2453214844782505478\size20382.7946562357398785588
	at __randomizedtesting.SeedInfo.seed([E796DC58347808A:75003E413103FD44]:0)
	at org.apache.lucene.rangetree.RangeTreeWriter.directoryIsEmpty(RangeTreeWriter.java:402)
	at org.apache.lucene.rangetree.RangeTreeWriter.finish(RangeTreeWriter.java:391)
	at org.apache.lucene.rangetree.RangeTreeDocValuesConsumer.addSortedSetField(RangeTreeDocValuesConsumer.java:144)
	at org.apache.lucene.codecs.perfield.PerFieldDocValuesFormat$FieldsWriter.addSortedSetField(PerFieldDocValuesFormat.java:131)
	at org.apache.lucene.codecs.DocValuesConsumer.mergeSortedSetField(DocValuesConsumer.java:736)
	at org.apache.lucene.codecs.DocValuesConsumer.merge(DocValuesConsumer.java:219)
	at org.apache.lucene.index.SegmentMerger.mergeDocValues(SegmentMerger.java:150)
	at org.apache.lucene.index.SegmentMerger.merge(SegmentMerger.java:105)
	at org.apache.lucene.index.IndexWriter.mergeMiddle(IndexWriter.java:4075)
	at org.apache.lucene.index.IndexWriter.merge(IndexWriter.java:3650)
	at org.apache.lucene.index.SerialMergeScheduler.merge(SerialMergeScheduler.java:40)
	at org.apache.lucene.index.IndexWriter.maybeMerge(IndexWriter.java:1915)
	at org.apache.lucene.index.IndexWriter.forceMerge(IndexWriter.java:1748)
	at org.apache.lucene.index.IndexWriter.forceMerge(IndexWriter.java:1705)
	at org.apache.lucene.index.RandomIndexWriter.forceMerge(RandomIndexWriter.java:408)
	at org.apache.lucene.rangetree.TestRangeTree.testMultiValuedSortedSet(TestRangeTree.java:229)
	at sun.reflect.NativeMethodAccessorImpl.invoke0(Native Method)
	at sun.reflect.NativeMethodAccessorImpl.invoke(NativeMethodAccessorImpl.java:62)
	at sun.reflect.DelegatingMethodAccessorImpl.invoke(DelegatingMethodAccessorImpl.java:43)
	at java.lang.reflect.Method.invoke(Method.java:497)
	at com.carrotsearch.randomizedtesting.RandomizedRunner.invoke(RandomizedRunner.java:1627)
	at com.carrotsearch.randomizedtesting.RandomizedRunner$6.evaluate(RandomizedRunner.java:836)
	at com.carrotsearch.randomizedtesting.RandomizedRunner$7.evaluate(RandomizedRunner.java:872)
	at com.carrotsearch.randomizedtesting.RandomizedRunner$8.evaluate(RandomizedRunner.java:886)
	at org.apache.lucene.util.TestRuleSetupTeardownChained$1.evaluate(TestRuleSetupTeardownChained.java:50)
	at org.apache.lucene.util.AbstractBeforeAfterRule$1.evaluate(AbstractBeforeAfterRule.java:46)
	at org.apache.lucene.util.TestRuleThreadAndTestName$1.evaluate(TestRuleThreadAndTestName.java:49)
	at org.apache.lucene.util.TestRuleIgnoreAfterMaxFailures$1.evaluate(TestRuleIgnoreAfterMaxFailures.java:65)
	at org.apache.lucene.util.TestRuleMarkFailure$1.evaluate(TestRuleMarkFailure.java:48)
	at com.carrotsearch.randomizedtesting.rules.StatementAdapter.evaluate(StatementAdapter.java:36)
	at com.carrotsearch.randomizedtesting.ThreadLeakControl$StatementRunner.run(ThreadLeakControl.java:365)
	at com.carrotsearch.randomizedtesting.ThreadLeakControl.forkTimeoutingTask(ThreadLeakControl.java:798)
	at com.carrotsearch.randomizedtesting.ThreadLeakControl$3.evaluate(ThreadLeakControl.java:458)
	at com.carrotsearch.randomizedtesting.RandomizedRunner.runSingleTest(RandomizedRunner.java:845)
	at com.carrotsearch.randomizedtesting.RandomizedRunner$3.evaluate(RandomizedRunner.java:747)
	at com.carrotsearch.randomizedtesting.RandomizedRunner$4.evaluate(RandomizedRunner.java:781)
	at com.carrotsearch.randomizedtesting.RandomizedRunner$5.evaluate(RandomizedRunner.java:792)
	at org.apache.lucene.util.AbstractBeforeAfterRule$1.evaluate(AbstractBeforeAfterRule.java:46)
	at com.carrotsearch.randomizedtesting.rules.StatementAdapter.evaluate(StatementAdapter.java:36)
	at org.apache.lucene.util.TestRuleStoreClassName$1.evaluate(TestRuleStoreClassName.java:42)
	at com.carrotsearch.randomizedtesting.rules.NoShadowingOrOverridesOnMethodsRule$1.evaluate(NoShadowingOrOverridesOnMethodsRule.java:39)
	at com.carrotsearch.randomizedtesting.rules.NoShadowingOrOverridesOnMethodsRule$1.evaluate(NoShadowingOrOverridesOnMethodsRule.java:39)
	at com.carrotsearch.randomizedtesting.rules.StatementAdapter.evaluate(StatementAdapter.java:36)
	at com.carrotsearch.randomizedtesting.rules.StatementAdapter.evaluate(StatementAdapter.java:36)
	at com.carrotsearch.randomizedtesting.rules.StatementAdapter.evaluate(StatementAdapter.java:36)
	at org.apache.lucene.util.TestRuleAssertionsRequired$1.evaluate(TestRuleAssertionsRequired.java:54)
	at org.apache.lucene.util.TestRuleMarkFailure$1.evaluate(TestRuleMarkFailure.java:48)
	at org.apache.lucene.util.TestRuleIgnoreAfterMaxFailures$1.evaluate(TestRuleIgnoreAfterMaxFailures.java:65)
	at org.apache.lucene.util.TestRuleIgnoreTestSuites$1.evaluate(TestRuleIgnoreTestSuites.java:55)
	at com.carrotsearch.randomizedtesting.rules.StatementAdapter.evaluate(StatementAdapter.java:36)
	at com.carrotsearch.randomizedtesting.ThreadLeakControl$StatementRunner.run(ThreadLeakControl.java:365)
	at java.lang.Thread.run(Thread.java:745)




Build Log:
[...truncated 8143 lines...]
   [junit4] Suite: org.apache.lucene.rangetree.TestRangeTree
   [junit4] IGNOR/A 0.00s J0 | TestRangeTree.testRandomBig
   [junit4]    > Assumption #1: 'nightly' test group is disabled (@Nightly())
   [junit4]   2> NOTE: reproduce with: ant test  -Dtestcase=TestRangeTree -Dtests.method=testMultiValuedSortedSet
-Dtests.seed=E796DC58347808A -Dtests.slow=true -Dtests.locale=zh_HK -Dtests.timezone=Etc/GMT+11
-Dtests.asserts=true -Dtests.file.encoding=UTF-8
   [junit4] FAILURE 0.79s J0 | TestRangeTree.testMultiValuedSortedSet <<<
   [junit4]    > Throwable #1: java.lang.AssertionError: dir=.\temp\RangeTreeWriter2453214844782505478
still has file=.\temp\RangeTreeWriter2453214844782505478\size20382.7946562357398785588
   [junit4]    > 	at __randomizedtesting.SeedInfo.seed([E796DC58347808A:75003E413103FD44]:0)
   [junit4]    > 	at org.apache.lucene.rangetree.RangeTreeWriter.directoryIsEmpty(RangeTreeWriter.java:402)
   [junit4]    > 	at org.apache.lucene.rangetree.RangeTreeWriter.finish(RangeTreeWriter.java:391)
   [junit4]    > 	at org.apache.lucene.rangetree.RangeTreeDocValuesConsumer.addSortedSetField(RangeTreeDocValuesConsumer.java:144)
   [junit4]    > 	at org.apache.lucene.codecs.perfield.PerFieldDocValuesFormat$FieldsWriter.addSortedSetField(PerFieldDocValuesFormat.java:131)
   [junit4]    > 	at org.apache.lucene.codecs.DocValuesConsumer.mergeSortedSetField(DocValuesConsumer.java:736)
   [junit4]    > 	at org.apache.lucene.codecs.DocValuesConsumer.merge(DocValuesConsumer.java:219)
   [junit4]    > 	at org.apache.lucene.index.SegmentMerger.mergeDocValues(SegmentMerger.java:150)
   [junit4]    > 	at org.apache.lucene.index.SegmentMerger.merge(SegmentMerger.java:105)
   [junit4]    > 	at org.apache.lucene.index.IndexWriter.mergeMiddle(IndexWriter.java:4075)
   [junit4]    > 	at org.apache.lucene.index.IndexWriter.merge(IndexWriter.java:3650)
   [junit4]    > 	at org.apache.lucene.index.SerialMergeScheduler.merge(SerialMergeScheduler.java:40)
   [junit4]    > 	at org.apache.lucene.index.IndexWriter.maybeMerge(IndexWriter.java:1915)
   [junit4]    > 	at org.apache.lucene.index.IndexWriter.forceMerge(IndexWriter.java:1748)
   [junit4]    > 	at org.apache.lucene.index.IndexWriter.forceMerge(IndexWriter.java:1705)
   [junit4]    > 	at org.apache.lucene.index.RandomIndexWriter.forceMerge(RandomIndexWriter.java:408)
   [junit4]    > 	at org.apache.lucene.rangetree.TestRangeTree.testMultiValuedSortedSet(TestRangeTree.java:229)
   [junit4]    > 	at java.lang.Thread.run(Thread.java:745)
   [junit4]   2> NOTE: test params are: codec=Asserting(Lucene53): {}, docValues:{}, sim=DefaultSimilarity,
locale=zh_HK, timezone=Etc/GMT+11
   [junit4]   2> NOTE: Windows 7 6.1 amd64/Oracle Corporation 1.8.0_51 (64-bit)/cpus=3,threads=1,free=368141584,total=406847488
   [junit4]   2> NOTE: All tests run in this JVM: [TestBKDTree, TestGeoUtils, TestRangeTree]
   [junit4] Completed [12/16] on J0 in 4.60s, 14 tests, 1 failure, 1 skipped <<<
FAILURES!

[...truncated 26 lines...]
BUILD FAILED
C:\Users\JenkinsSlave\workspace\Lucene-Solr-trunk-Windows\build.xml:716: The following error
occurred while executing this line:
C:\Users\JenkinsSlave\workspace\Lucene-Solr-trunk-Windows\build.xml:660: The following error
occurred while executing this line:
C:\Users\JenkinsSlave\workspace\Lucene-Solr-trunk-Windows\build.xml:59: The following error
occurred while executing this line:
C:\Users\JenkinsSlave\workspace\Lucene-Solr-trunk-Windows\lucene\build.xml:470: The following
error occurred while executing this line:
C:\Users\JenkinsSlave\workspace\Lucene-Solr-trunk-Windows\lucene\common-build.xml:2159: The
following error occurred while executing this line:
C:\Users\JenkinsSlave\workspace\Lucene-Solr-trunk-Windows\lucene\module-build.xml:58: The
following error occurred while executing this line:
C:\Users\JenkinsSlave\workspace\Lucene-Solr-trunk-Windows\lucene\common-build.xml:1429: The
following error occurred while executing this line:
C:\Users\JenkinsSlave\workspace\Lucene-Solr-trunk-Windows\lucene\common-build.xml:984: There
were test failures: 16 suites, 111 tests, 1 failure, 4 ignored (4 assumptions)

Total time: 15 minutes 42 seconds
Build step 'Invoke Ant' marked build as failure
Archiving artifacts
Recording test results
Email was triggered for: Failure - Any
Sending email for trigger: Failure - Any



Mime
View raw message