lucene-dev mailing list archives

Site index · List index
Message view « Date » · « Thread »
Top « Date » · « Thread »
From Apache Jenkins Server <jenk...@builds.apache.org>
Subject [JENKINS] Lucene-Solr-NightlyTests-5.x - Build # 918 - Still Failing
Date Tue, 04 Aug 2015 13:28:01 GMT
Build: https://builds.apache.org/job/Lucene-Solr-NightlyTests-5.x/918/

2 tests failed.
REGRESSION:  org.apache.solr.cloud.FullSolrCloudDistribCmdsTest.test

Error Message:
Captured an uncaught exception in thread: Thread[id=12871, name=Thread-7299, state=RUNNABLE, group=TGRP-FullSolrCloudDistribCmdsTest]

Stack Trace:
com.carrotsearch.randomizedtesting.UncaughtExceptionError: Captured an uncaught exception in thread: Thread[id=12871, name=Thread-7299, state=RUNNABLE, group=TGRP-FullSolrCloudDistribCmdsTest]
	at __randomizedtesting.SeedInfo.seed([ECA2FE4A899C4B36:64F6C190276026CE]:0)
Caused by: java.lang.RuntimeException: org.apache.solr.client.solrj.SolrServerException: org.apache.solr.client.solrj.SolrServerException: IOException occured when talking to server at: http://127.0.0.1:36420/bv/j/collection2_shard2_replica2
	at __randomizedtesting.SeedInfo.seed([ECA2FE4A899C4B36]:0)
	at org.apache.solr.cloud.FullSolrCloudDistribCmdsTest$1IndexThread.run(FullSolrCloudDistribCmdsTest.java:645)
Caused by: org.apache.solr.client.solrj.SolrServerException: org.apache.solr.client.solrj.SolrServerException: IOException occured when talking to server at: http://127.0.0.1:36420/bv/j/collection2_shard2_replica2
	at org.apache.solr.client.solrj.impl.CloudSolrClient.directUpdate(CloudSolrClient.java:641)
	at org.apache.solr.client.solrj.impl.CloudSolrClient.sendRequest(CloudSolrClient.java:967)
	at org.apache.solr.client.solrj.impl.CloudSolrClient.requestWithRetryOnStaleState(CloudSolrClient.java:856)
	at org.apache.solr.client.solrj.impl.CloudSolrClient.request(CloudSolrClient.java:799)
	at org.apache.solr.client.solrj.SolrRequest.process(SolrRequest.java:135)
	at org.apache.solr.client.solrj.SolrRequest.process(SolrRequest.java:152)
	at org.apache.solr.cloud.FullSolrCloudDistribCmdsTest$1IndexThread.run(FullSolrCloudDistribCmdsTest.java:642)
Caused by: org.apache.solr.client.solrj.SolrServerException: IOException occured when talking to server at: http://127.0.0.1:36420/bv/j/collection2_shard2_replica2
	at org.apache.solr.client.solrj.impl.HttpSolrClient.executeMethod(HttpSolrClient.java:574)
	at org.apache.solr.client.solrj.impl.HttpSolrClient.request(HttpSolrClient.java:234)
	at org.apache.solr.client.solrj.impl.HttpSolrClient.request(HttpSolrClient.java:226)
	at org.apache.solr.client.solrj.impl.LBHttpSolrClient.doRequest(LBHttpSolrClient.java:376)
	at org.apache.solr.client.solrj.impl.LBHttpSolrClient.request(LBHttpSolrClient.java:328)
	at org.apache.solr.client.solrj.impl.CloudSolrClient.directUpdate(CloudSolrClient.java:635)
	... 6 more
Caused by: org.apache.http.NoHttpResponseException: 127.0.0.1:36420 failed to respond
	at org.apache.http.impl.conn.DefaultHttpResponseParser.parseHead(DefaultHttpResponseParser.java:143)
	at org.apache.http.impl.conn.DefaultHttpResponseParser.parseHead(DefaultHttpResponseParser.java:57)
	at org.apache.http.impl.io.AbstractMessageParser.parse(AbstractMessageParser.java:261)
	at org.apache.http.impl.AbstractHttpClientConnection.receiveResponseHeader(AbstractHttpClientConnection.java:283)
	at org.apache.http.impl.conn.DefaultClientConnection.receiveResponseHeader(DefaultClientConnection.java:251)
	at org.apache.http.impl.conn.ManagedClientConnectionImpl.receiveResponseHeader(ManagedClientConnectionImpl.java:197)
	at org.apache.http.protocol.HttpRequestExecutor.doReceiveResponse(HttpRequestExecutor.java:272)
	at org.apache.http.protocol.HttpRequestExecutor.execute(HttpRequestExecutor.java:124)
	at org.apache.http.impl.client.DefaultRequestDirector.tryExecute(DefaultRequestDirector.java:685)
	at org.apache.http.impl.client.DefaultRequestDirector.execute(DefaultRequestDirector.java:487)
	at org.apache.http.impl.client.AbstractHttpClient.doExecute(AbstractHttpClient.java:882)
	at org.apache.http.impl.client.CloseableHttpClient.execute(CloseableHttpClient.java:82)
	at org.apache.http.impl.client.CloseableHttpClient.execute(CloseableHttpClient.java:107)
	at org.apache.http.impl.client.CloseableHttpClient.execute(CloseableHttpClient.java:55)
	at org.apache.solr.client.solrj.impl.HttpSolrClient.executeMethod(HttpSolrClient.java:465)
	... 11 more


FAILED:  org.apache.solr.cloud.hdfs.HdfsCollectionsAPIDistributedZkTest.test

Error Message:
Captured an uncaught exception in thread: Thread[id=69881, name=collection3, state=RUNNABLE, group=TGRP-HdfsCollectionsAPIDistributedZkTest]

Stack Trace:
com.carrotsearch.randomizedtesting.UncaughtExceptionError: Captured an uncaught exception in thread: Thread[id=69881, name=collection3, state=RUNNABLE, group=TGRP-HdfsCollectionsAPIDistributedZkTest]
Caused by: org.apache.solr.client.solrj.impl.HttpSolrClient$RemoteSolrException: Error from server at http://127.0.0.1:35400: Could not find collection : awholynewstresscollection_collection3_0
	at __randomizedtesting.SeedInfo.seed([ECA2FE4A899C4B36]:0)
	at org.apache.solr.client.solrj.impl.HttpSolrClient.executeMethod(HttpSolrClient.java:560)
	at org.apache.solr.client.solrj.impl.HttpSolrClient.request(HttpSolrClient.java:234)
	at org.apache.solr.client.solrj.impl.HttpSolrClient.request(HttpSolrClient.java:226)
	at org.apache.solr.client.solrj.impl.LBHttpSolrClient.doRequest(LBHttpSolrClient.java:376)
	at org.apache.solr.client.solrj.impl.LBHttpSolrClient.request(LBHttpSolrClient.java:328)
	at org.apache.solr.client.solrj.impl.CloudSolrClient.sendRequest(CloudSolrClient.java:1086)
	at org.apache.solr.client.solrj.impl.CloudSolrClient.requestWithRetryOnStaleState(CloudSolrClient.java:856)
	at org.apache.solr.client.solrj.impl.CloudSolrClient.request(CloudSolrClient.java:799)
	at org.apache.solr.client.solrj.SolrClient.request(SolrClient.java:1220)
	at org.apache.solr.cloud.CollectionsAPIDistributedZkTest$1CollectionThread.run(CollectionsAPIDistributedZkTest.java:894)




Build Log:
[...truncated 11199 lines...]
   [junit4] Suite: org.apache.solr.cloud.FullSolrCloudDistribCmdsTest
   [junit4]   2> Creating dataDir: /x1/jenkins/jenkins-slave/workspace/Lucene-Solr-NightlyTests-5.x/solr/build/solr-core/test/J2/temp/solr.cloud.FullSolrCloudDistribCmdsTest_ECA2FE4A899C4B36-001/init-core-data-001
   [junit4]   2> 1505654 INFO  (SUITE-FullSolrCloudDistribCmdsTest-seed#[ECA2FE4A899C4B36]-worker) [    ] o.a.s.BaseDistributedSearchTestCase Setting hostContext system property: /bv/j
   [junit4]   2> 1505672 INFO  (TEST-FullSolrCloudDistribCmdsTest.test-seed#[ECA2FE4A899C4B36]) [    ] o.a.s.c.ZkTestServer STARTING ZK TEST SERVER
   [junit4]   2> 1505673 INFO  (Thread-7127) [    ] o.a.s.c.ZkTestServer client port:0.0.0.0/0.0.0.0:0
   [junit4]   2> 1505673 INFO  (Thread-7127) [    ] o.a.s.c.ZkTestServer Starting server
   [junit4]   2> 1505773 INFO  (TEST-FullSolrCloudDistribCmdsTest.test-seed#[ECA2FE4A899C4B36]) [    ] o.a.s.c.ZkTestServer start zk server on port:55464
   [junit4]   2> 1505773 INFO  (TEST-FullSolrCloudDistribCmdsTest.test-seed#[ECA2FE4A899C4B36]) [    ] o.a.s.c.c.SolrZkClient Using default ZkCredentialsProvider
   [junit4]   2> 1505790 INFO  (TEST-FullSolrCloudDistribCmdsTest.test-seed#[ECA2FE4A899C4B36]) [    ] o.a.s.c.c.ConnectionManager Waiting for client to connect to ZooKeeper
   [junit4]   2> 1505809 INFO  (zkCallback-1040-thread-1) [    ] o.a.s.c.c.ConnectionManager Watcher org.apache.solr.common.cloud.ConnectionManager@4123eb67 name:ZooKeeperConnection Watcher:127.0.0.1:55464 got event WatchedEvent state:SyncConnected type:None path:null path:null type:None
   [junit4]   2> 1505809 INFO  (TEST-FullSolrCloudDistribCmdsTest.test-seed#[ECA2FE4A899C4B36]) [    ] o.a.s.c.c.ConnectionManager Client is connected to ZooKeeper
   [junit4]   2> 1505809 INFO  (TEST-FullSolrCloudDistribCmdsTest.test-seed#[ECA2FE4A899C4B36]) [    ] o.a.s.c.c.SolrZkClient Using default ZkACLProvider
   [junit4]   2> 1505810 INFO  (TEST-FullSolrCloudDistribCmdsTest.test-seed#[ECA2FE4A899C4B36]) [    ] o.a.s.c.c.SolrZkClient makePath: /solr
   [junit4]   2> 1505813 INFO  (TEST-FullSolrCloudDistribCmdsTest.test-seed#[ECA2FE4A899C4B36]) [    ] o.a.s.c.c.SolrZkClient Using default ZkCredentialsProvider
   [junit4]   2> 1505829 INFO  (TEST-FullSolrCloudDistribCmdsTest.test-seed#[ECA2FE4A899C4B36]) [    ] o.a.s.c.c.ConnectionManager Waiting for client to connect to ZooKeeper
   [junit4]   2> 1505841 INFO  (zkCallback-1041-thread-1) [    ] o.a.s.c.c.ConnectionManager Watcher org.apache.solr.common.cloud.ConnectionManager@6185a771 name:ZooKeeperConnection Watcher:127.0.0.1:55464/solr got event WatchedEvent state:SyncConnected type:None path:null path:null type:None
   [junit4]   2> 1505841 INFO  (TEST-FullSolrCloudDistribCmdsTest.test-seed#[ECA2FE4A899C4B36]) [    ] o.a.s.c.c.ConnectionManager Client is connected to ZooKeeper
   [junit4]   2> 1505842 INFO  (TEST-FullSolrCloudDistribCmdsTest.test-seed#[ECA2FE4A899C4B36]) [    ] o.a.s.c.c.SolrZkClient Using default ZkACLProvider
   [junit4]   2> 1505842 INFO  (TEST-FullSolrCloudDistribCmdsTest.test-seed#[ECA2FE4A899C4B36]) [    ] o.a.s.c.c.SolrZkClient makePath: /collections/collection1
   [junit4]   2> 1505846 INFO  (TEST-FullSolrCloudDistribCmdsTest.test-seed#[ECA2FE4A899C4B36]) [    ] o.a.s.c.c.SolrZkClient makePath: /collections/collection1/shards
   [junit4]   2> 1505848 INFO  (TEST-FullSolrCloudDistribCmdsTest.test-seed#[ECA2FE4A899C4B36]) [    ] o.a.s.c.c.SolrZkClient makePath: /collections/control_collection
   [junit4]   2> 1505849 INFO  (TEST-FullSolrCloudDistribCmdsTest.test-seed#[ECA2FE4A899C4B36]) [    ] o.a.s.c.c.SolrZkClient makePath: /collections/control_collection/shards
   [junit4]   2> 1505851 INFO  (TEST-FullSolrCloudDistribCmdsTest.test-seed#[ECA2FE4A899C4B36]) [    ] o.a.s.c.AbstractZkTestCase put /x1/jenkins/jenkins-slave/workspace/Lucene-Solr-NightlyTests-5.x/solr/core/src/test-files/solr/collection1/conf/solrconfig-tlog.xml to /configs/conf1/solrconfig.xml
   [junit4]   2> 1505852 INFO  (TEST-FullSolrCloudDistribCmdsTest.test-seed#[ECA2FE4A899C4B36]) [    ] o.a.s.c.c.SolrZkClient makePath: /configs/conf1/solrconfig.xml
   [junit4]   2> 1505856 INFO  (TEST-FullSolrCloudDistribCmdsTest.test-seed#[ECA2FE4A899C4B36]) [    ] o.a.s.c.AbstractZkTestCase put /x1/jenkins/jenkins-slave/workspace/Lucene-Solr-NightlyTests-5.x/solr/core/src/test-files/solr/collection1/conf/schema15.xml to /configs/conf1/schema.xml
   [junit4]   2> 1505857 INFO  (TEST-FullSolrCloudDistribCmdsTest.test-seed#[ECA2FE4A899C4B36]) [    ] o.a.s.c.c.SolrZkClient makePath: /configs/conf1/schema.xml
   [junit4]   2> 1505858 INFO  (TEST-FullSolrCloudDistribCmdsTest.test-seed#[ECA2FE4A899C4B36]) [    ] o.a.s.c.AbstractZkTestCase put /x1/jenkins/jenkins-slave/workspace/Lucene-Solr-NightlyTests-5.x/solr/core/src/test-files/solr/collection1/conf/solrconfig.snippet.randomindexconfig.xml to /configs/conf1/solrconfig.snippet.randomindexconfig.xml
   [junit4]   2> 1505859 INFO  (TEST-FullSolrCloudDistribCmdsTest.test-seed#[ECA2FE4A899C4B36]) [    ] o.a.s.c.c.SolrZkClient makePath: /configs/conf1/solrconfig.snippet.randomindexconfig.xml
   [junit4]   2> 1505860 INFO  (TEST-FullSolrCloudDistribCmdsTest.test-seed#[ECA2FE4A899C4B36]) [    ] o.a.s.c.AbstractZkTestCase put /x1/jenkins/jenkins-slave/workspace/Lucene-Solr-NightlyTests-5.x/solr/core/src/test-files/solr/collection1/conf/stopwords.txt to /configs/conf1/stopwords.txt
   [junit4]   2> 1505860 INFO  (TEST-FullSolrCloudDistribCmdsTest.test-seed#[ECA2FE4A899C4B36]) [    ] o.a.s.c.c.SolrZkClient makePath: /configs/conf1/stopwords.txt
   [junit4]   2> 1505862 INFO  (TEST-FullSolrCloudDistribCmdsTest.test-seed#[ECA2FE4A899C4B36]) [    ] o.a.s.c.AbstractZkTestCase put /x1/jenkins/jenkins-slave/workspace/Lucene-Solr-NightlyTests-5.x/solr/core/src/test-files/solr/collection1/conf/protwords.txt to /configs/conf1/protwords.txt
   [junit4]   2> 1505862 INFO  (TEST-FullSolrCloudDistribCmdsTest.test-seed#[ECA2FE4A899C4B36]) [    ] o.a.s.c.c.SolrZkClient makePath: /configs/conf1/protwords.txt
   [junit4]   2> 1505872 INFO  (TEST-FullSolrCloudDistribCmdsTest.test-seed#[ECA2FE4A899C4B36]) [    ] o.a.s.c.AbstractZkTestCase put /x1/jenkins/jenkins-slave/workspace/Lucene-Solr-NightlyTests-5.x/solr/core/src/test-files/solr/collection1/conf/currency.xml to /configs/conf1/currency.xml
   [junit4]   2> 1505873 INFO  (TEST-FullSolrCloudDistribCmdsTest.test-seed#[ECA2FE4A899C4B36]) [    ] o.a.s.c.c.SolrZkClient makePath: /configs/conf1/currency.xml
   [junit4]   2> 1505875 INFO  (TEST-FullSolrCloudDistribCmdsTest.test-seed#[ECA2FE4A899C4B36]) [    ] o.a.s.c.AbstractZkTestCase put /x1/jenkins/jenkins-slave/workspace/Lucene-Solr-NightlyTests-5.x/solr/core/src/test-files/solr/collection1/conf/enumsConfig.xml to /configs/conf1/enumsConfig.xml
   [junit4]   2> 1505875 INFO  (TEST-FullSolrCloudDistribCmdsTest.test-seed#[ECA2FE4A899C4B36]) [    ] o.a.s.c.c.SolrZkClient makePath: /configs/conf1/enumsConfig.xml
   [junit4]   2> 1505886 INFO  (TEST-FullSolrCloudDistribCmdsTest.test-seed#[ECA2FE4A899C4B36]) [    ] o.a.s.c.AbstractZkTestCase put /x1/jenkins/jenkins-slave/workspace/Lucene-Solr-NightlyTests-5.x/solr/core/src/test-files/solr/collection1/conf/open-exchange-rates.json to /configs/conf1/open-exchange-rates.json
   [junit4]   2> 1505887 INFO  (TEST-FullSolrCloudDistribCmdsTest.test-seed#[ECA2FE4A899C4B36]) [    ] o.a.s.c.c.SolrZkClient makePath: /configs/conf1/open-exchange-rates.json
   [junit4]   2> 1505892 INFO  (TEST-FullSolrCloudDistribCmdsTest.test-seed#[ECA2FE4A899C4B36]) [    ] o.a.s.c.AbstractZkTestCase put /x1/jenkins/jenkins-slave/workspace/Lucene-Solr-NightlyTests-5.x/solr/core/src/test-files/solr/collection1/conf/mapping-ISOLatin1Accent.txt to /configs/conf1/mapping-ISOLatin1Accent.txt
   [junit4]   2> 1505893 INFO  (TEST-FullSolrCloudDistribCmdsTest.test-seed#[ECA2FE4A899C4B36]) [    ] o.a.s.c.c.SolrZkClient makePath: /configs/conf1/mapping-ISOLatin1Accent.txt
   [junit4]   2> 1505895 INFO  (TEST-FullSolrCloudDistribCmdsTest.test-seed#[ECA2FE4A899C4B36]) [    ] o.a.s.c.AbstractZkTestCase put /x1/jenkins/jenkins-slave/workspace/Lucene-Solr-NightlyTests-5.x/solr/core/src/test-files/solr/collection1/conf/old_synonyms.txt to /configs/conf1/old_synonyms.txt
   [junit4]   2> 1505895 INFO  (TEST-FullSolrCloudDistribCmdsTest.test-seed#[ECA2FE4A899C4B36]) [    ] o.a.s.c.c.SolrZkClient makePath: /configs/conf1/old_synonyms.txt
   [junit4]   2> 1505897 INFO  (TEST-FullSolrCloudDistribCmdsTest.test-seed#[ECA2FE4A899C4B36]) [    ] o.a.s.c.AbstractZkTestCase put /x1/jenkins/jenkins-slave/workspace/Lucene-Solr-NightlyTests-5.x/solr/core/src/test-files/solr/collection1/conf/synonyms.txt to /configs/conf1/synonyms.txt
   [junit4]   2> 1505897 INFO  (TEST-FullSolrCloudDistribCmdsTest.test-seed#[ECA2FE4A899C4B36]) [    ] o.a.s.c.c.SolrZkClient makePath: /configs/conf1/synonyms.txt
   [junit4]   2> 1506352 INFO  (TEST-FullSolrCloudDistribCmdsTest.test-seed#[ECA2FE4A899C4B36]) [    ] o.a.s.SolrTestCaseJ4 Writing core.properties file to /x1/jenkins/jenkins-slave/workspace/Lucene-Solr-NightlyTests-5.x/solr/build/solr-core/test/J2/temp/solr.cloud.FullSolrCloudDistribCmdsTest_ECA2FE4A899C4B36-001/control-001/cores/collection1
   [junit4]   2> 1506353 INFO  (TEST-FullSolrCloudDistribCmdsTest.test-seed#[ECA2FE4A899C4B36]) [    ] o.e.j.s.Server jetty-9.2.11.v20150529
   [junit4]   2> 1506357 INFO  (TEST-FullSolrCloudDistribCmdsTest.test-seed#[ECA2FE4A899C4B36]) [    ] o.e.j.s.h.ContextHandler Started o.e.j.s.ServletContextHandler@6c556444{/bv/j,null,AVAILABLE}
   [junit4]   2> 1506358 INFO  (TEST-FullSolrCloudDistribCmdsTest.test-seed#[ECA2FE4A899C4B36]) [    ] o.e.j.s.ServerConnector Started ServerConnector@5a29e3ec{HTTP/1.1}{127.0.0.1:57015}
   [junit4]   2> 1506358 INFO  (TEST-FullSolrCloudDistribCmdsTest.test-seed#[ECA2FE4A899C4B36]) [    ] o.e.j.s.Server Started @1509729ms
   [junit4]   2> 1506358 INFO  (TEST-FullSolrCloudDistribCmdsTest.test-seed#[ECA2FE4A899C4B36]) [    ] o.a.s.c.s.e.JettySolrRunner Jetty properties: {solr.data.dir=/x1/jenkins/jenkins-slave/workspace/Lucene-Solr-NightlyTests-5.x/solr/build/solr-core/test/J2/temp/solr.cloud.FullSolrCloudDistribCmdsTest_ECA2FE4A899C4B36-001/tempDir-001/control/data, coreRootDirectory=/x1/jenkins/jenkins-slave/workspace/Lucene-Solr-NightlyTests-5.x/solr/build/solr-core/test/J2/../../../../../../../../../../x1/jenkins/jenkins-slave/workspace/Lucene-Solr-NightlyTests-5.x/solr/build/solr-core/test/J2/temp/solr.cloud.FullSolrCloudDistribCmdsTest_ECA2FE4A899C4B36-001/control-001/cores, hostContext=/bv/j, hostPort=57015}
   [junit4]   2> 1506358 INFO  (TEST-FullSolrCloudDistribCmdsTest.test-seed#[ECA2FE4A899C4B36]) [    ] o.a.s.s.SolrDispatchFilter SolrDispatchFilter.init(): sun.misc.Launcher$AppClassLoader@1fe91485
   [junit4]   2> 1506359 INFO  (TEST-FullSolrCloudDistribCmdsTest.test-seed#[ECA2FE4A899C4B36]) [    ] o.a.s.c.SolrResourceLoader new SolrResourceLoader for directory: '/x1/jenkins/jenkins-slave/workspace/Lucene-Solr-NightlyTests-5.x/solr/build/solr-core/test/J2/../../../../../../../../../../x1/jenkins/jenkins-slave/workspace/Lucene-Solr-NightlyTests-5.x/solr/build/solr-core/test/J2/temp/solr.cloud.FullSolrCloudDistribCmdsTest_ECA2FE4A899C4B36-001/control-001/'
   [junit4]   2> 1506380 INFO  (TEST-FullSolrCloudDistribCmdsTest.test-seed#[ECA2FE4A899C4B36]) [    ] o.a.s.c.c.SolrZkClient Using default ZkCredentialsProvider
   [junit4]   2> 1506381 INFO  (TEST-FullSolrCloudDistribCmdsTest.test-seed#[ECA2FE4A899C4B36]) [    ] o.a.s.c.c.ConnectionManager Waiting for client to connect to ZooKeeper
   [junit4]   2> 1506383 INFO  (zkCallback-1042-thread-1) [    ] o.a.s.c.c.ConnectionManager Watcher org.apache.solr.common.cloud.ConnectionManager@1e4f6c62 name:ZooKeeperConnection Watcher:127.0.0.1:55464/solr got event WatchedEvent state:SyncConnected type:None path:null path:null type:None
   [junit4]   2> 1506383 INFO  (TEST-FullSolrCloudDistribCmdsTest.test-seed#[ECA2FE4A899C4B36]) [    ] o.a.s.c.c.ConnectionManager Client is connected to ZooKeeper
   [junit4]   2> 1506383 INFO  (TEST-FullSolrCloudDistribCmdsTest.test-seed#[ECA2FE4A899C4B36]) [    ] o.a.s.c.c.SolrZkClient Using default ZkACLProvider
   [junit4]   2> 1506384 INFO  (TEST-FullSolrCloudDistribCmdsTest.test-seed#[ECA2FE4A899C4B36]) [    ] o.a.s.s.SolrDispatchFilter Loading solr.xml from SolrHome (not found in ZooKeeper)
   [junit4]   2> 1506385 INFO  (TEST-FullSolrCloudDistribCmdsTest.test-seed#[ECA2FE4A899C4B36]) [    ] o.a.s.c.SolrXmlConfig Loading container configuration from /x1/jenkins/jenkins-slave/workspace/Lucene-Solr-NightlyTests-5.x/solr/build/solr-core/test/J2/../../../../../../../../../../x1/jenkins/jenkins-slave/workspace/Lucene-Solr-NightlyTests-5.x/solr/build/solr-core/test/J2/temp/solr.cloud.FullSolrCloudDistribCmdsTest_ECA2FE4A899C4B36-001/control-001/solr.xml
   [junit4]   2> 1506410 INFO  (TEST-FullSolrCloudDistribCmdsTest.test-seed#[ECA2FE4A899C4B36]) [    ] o.a.s.c.CoresLocator Config-defined core root directory: /x1/jenkins/jenkins-slave/workspace/Lucene-Solr-NightlyTests-5.x/solr/build/solr-core/test/J2/../../../../../../../../../../x1/jenkins/jenkins-slave/workspace/Lucene-Solr-NightlyTests-5.x/solr/build/solr-core/test/J2/temp/solr.cloud.FullSolrCloudDistribCmdsTest_ECA2FE4A899C4B36-001/control-001/cores
   [junit4]   2> 1506410 INFO  (TEST-FullSolrCloudDistribCmdsTest.test-seed#[ECA2FE4A899C4B36]) [    ] o.a.s.c.CoreContainer New CoreContainer 16536487
   [junit4]   2> 1506410 INFO  (TEST-FullSolrCloudDistribCmdsTest.test-seed#[ECA2FE4A899C4B36]) [    ] o.a.s.c.CoreContainer Loading cores into CoreContainer [instanceDir=/x1/jenkins/jenkins-slave/workspace/Lucene-Solr-NightlyTests-5.x/solr/build/solr-core/test/J2/../../../../../../../../../../x1/jenkins/jenkins-slave/workspace/Lucene-Solr-NightlyTests-5.x/solr/build/solr-core/test/J2/temp/solr.cloud.FullSolrCloudDistribCmdsTest_ECA2FE4A899C4B36-001/control-001/]
   [junit4]   2> 1506410 INFO  (TEST-FullSolrCloudDistribCmdsTest.test-seed#[ECA2FE4A899C4B36]) [    ] o.a.s.c.CoreContainer loading shared library: /x1/jenkins/jenkins-slave/workspace/Lucene-Solr-NightlyTests-5.x/solr/build/solr-core/test/J2/../../../../../../../../../../x1/jenkins/jenkins-slave/workspace/Lucene-Solr-NightlyTests-5.x/solr/build/solr-core/test/J2/temp/solr.cloud.FullSolrCloudDistribCmdsTest_ECA2FE4A899C4B36-001/control-001/lib
   [junit4]   2> 1506411 WARN  (TEST-FullSolrCloudDistribCmdsTest.test-seed#[ECA2FE4A899C4B36]) [    ] o.a.s.c.SolrResourceLoader Can't find (or read) directory to add to classloader: lib (resolved as: /x1/jenkins/jenkins-slave/workspace/Lucene-Solr-NightlyTests-5.x/solr/build/solr-core/test/J2/../../../../../../../../../../x1/jenkins/jenkins-slave/workspace/Lucene-Solr-NightlyTests-5.x/solr/build/solr-core/test/J2/temp/solr.cloud.FullSolrCloudDistribCmdsTest_ECA2FE4A899C4B36-001/control-001/lib).
   [junit4]   2> 1506422 INFO  (TEST-FullSolrCloudDistribCmdsTest.test-seed#[ECA2FE4A899C4B36]) [    ] o.a.s.h.c.HttpShardHandlerFactory created with socketTimeout : 90000,urlScheme : ,connTimeout : 15000,maxConnectionsPerHost : 20,maxConnections : 10000,corePoolSize : 0,maximumPoolSize : 2147483647,maxThreadIdleTime : 5,sizeOfQueue : -1,fairnessPolicy : false,useRetries : false,
   [junit4]   2> 1506424 INFO  (TEST-FullSolrCloudDistribCmdsTest.test-seed#[ECA2FE4A899C4B36]) [    ] o.a.s.u.UpdateShardHandler Creating UpdateShardHandler HTTP client with params: socketTimeout=340000&connTimeout=45000&retry=true
   [junit4]   2> 1506424 INFO  (TEST-FullSolrCloudDistribCmdsTest.test-seed#[ECA2FE4A899C4B36]) [    ] o.a.s.l.LogWatcher SLF4J impl is org.slf4j.impl.Log4jLoggerFactory
   [junit4]   2> 1506424 INFO  (TEST-FullSolrCloudDistribCmdsTest.test-seed#[ECA2FE4A899C4B36]) [    ] o.a.s.l.LogWatcher Registering Log Listener [Log4j (org.slf4j.impl.Log4jLoggerFactory)]
   [junit4]   2> 1506424 INFO  (TEST-FullSolrCloudDistribCmdsTest.test-seed#[ECA2FE4A899C4B36]) [    ] o.a.s.c.ZkContainer Zookeeper client=127.0.0.1:55464/solr
   [junit4]   2> 1506425 INFO  (TEST-FullSolrCloudDistribCmdsTest.test-seed#[ECA2FE4A899C4B36]) [    ] o.a.s.c.ZkController zkHost includes chroot
   [junit4]   2> 1506425 INFO  (TEST-FullSolrCloudDistribCmdsTest.test-seed#[ECA2FE4A899C4B36]) [    ] o.a.s.c.c.SolrZkClient Using default ZkCredentialsProvider
   [junit4]   2> 1506426 INFO  (TEST-FullSolrCloudDistribCmdsTest.test-seed#[ECA2FE4A899C4B36]) [    ] o.a.s.c.c.ConnectionManager Waiting for client to connect to ZooKeeper
   [junit4]   2> 1506428 INFO  (zkCallback-1044-thread-1) [    ] o.a.s.c.c.ConnectionManager Watcher org.apache.solr.common.cloud.ConnectionManager@54761300 name:ZooKeeperConnection Watcher:127.0.0.1:55464 got event WatchedEvent state:SyncConnected type:None path:null path:null type:None
   [junit4]   2> 1506429 INFO  (TEST-FullSolrCloudDistribCmdsTest.test-seed#[ECA2FE4A899C4B36]) [    ] o.a.s.c.c.ConnectionManager Client is connected to ZooKeeper
   [junit4]   2> 1506430 INFO  (TEST-FullSolrCloudDistribCmdsTest.test-seed#[ECA2FE4A899C4B36]) [    ] o.a.s.c.c.SolrZkClient Using default ZkACLProvider
   [junit4]   2> 1506433 INFO  (TEST-FullSolrCloudDistribCmdsTest.test-seed#[ECA2FE4A899C4B36]) [n:127.0.0.1:57015_bv%2Fj    ] o.a.s.c.c.ConnectionManager Waiting for client to connect to ZooKeeper
   [junit4]   2> 1506435 INFO  (zkCallback-1045-thread-1-processing-n:127.0.0.1:57015_bv%2Fj) [n:127.0.0.1:57015_bv%2Fj    ] o.a.s.c.c.ConnectionManager Watcher org.apache.solr.common.cloud.ConnectionManager@19694b4f name:ZooKeeperConnection Watcher:127.0.0.1:55464/solr got event WatchedEvent state:SyncConnected type:None path:null path:null type:None
   [junit4]   2> 1506435 INFO  (TEST-FullSolrCloudDistribCmdsTest.test-seed#[ECA2FE4A899C4B36]) [n:127.0.0.1:57015_bv%2Fj    ] o.a.s.c.c.ConnectionManager Client is connected to ZooKeeper
   [junit4]   2> 1506437 INFO  (TEST-FullSolrCloudDistribCmdsTest.test-seed#[ECA2FE4A899C4B36]) [n:127.0.0.1:57015_bv%2Fj    ] o.a.s.c.c.SolrZkClient makePath: /overseer/queue
   [junit4]   2> 1506439 INFO  (TEST-FullSolrCloudDistribCmdsTest.test-seed#[ECA2FE4A899C4B36]) [n:127.0.0.1:57015_bv%2Fj    ] o.a.s.c.c.SolrZkClient makePath: /overseer/collection-queue-work
   [junit4]   2> 1506441 INFO  (TEST-FullSolrCloudDistribCmdsTest.test-seed#[ECA2FE4A899C4B36]) [n:127.0.0.1:57015_bv%2Fj    ] o.a.s.c.c.SolrZkClient makePath: /overseer/collection-map-running
   [junit4]   2> 1506444 INFO  (TEST-FullSolrCloudDistribCmdsTest.test-seed#[ECA2FE4A899C4B36]) [n:127.0.0.1:57015_bv%2Fj    ] o.a.s.c.c.SolrZkClient makePath: /overseer/collection-map-completed
   [junit4]   2> 1506447 INFO  (TEST-FullSolrCloudDistribCmdsTest.test-seed#[ECA2FE4A899C4B36]) [n:127.0.0.1:57015_bv%2Fj    ] o.a.s.c.c.SolrZkClient makePath: /overseer/collection-map-failure
   [junit4]   2> 1506449 INFO  (TEST-FullSolrCloudDistribCmdsTest.test-seed#[ECA2FE4A899C4B36]) [n:127.0.0.1:57015_bv%2Fj    ] o.a.s.c.c.SolrZkClient makePath: /live_nodes
   [junit4]   2> 1506451 INFO  (TEST-FullSolrCloudDistribCmdsTest.test-seed#[ECA2FE4A899C4B36]) [n:127.0.0.1:57015_bv%2Fj    ] o.a.s.c.c.SolrZkClient makePath: /aliases.json
   [junit4]   2> 1506452 INFO  (TEST-FullSolrCloudDistribCmdsTest.test-seed#[ECA2FE4A899C4B36]) [n:127.0.0.1:57015_bv%2Fj    ] o.a.s.c.c.SolrZkClient makePath: /clusterstate.json
   [junit4]   2> 1506454 INFO  (TEST-FullSolrCloudDistribCmdsTest.test-seed#[ECA2FE4A899C4B36]) [n:127.0.0.1:57015_bv%2Fj    ] o.a.s.c.ZkController Register node as live in ZooKeeper:/live_nodes/127.0.0.1:57015_bv%2Fj
   [junit4]   2> 1506455 INFO  (TEST-FullSolrCloudDistribCmdsTest.test-seed#[ECA2FE4A899C4B36]) [n:127.0.0.1:57015_bv%2Fj    ] o.a.s.c.c.SolrZkClient makePath: /live_nodes/127.0.0.1:57015_bv%2Fj
   [junit4]   2> 1506457 INFO  (TEST-FullSolrCloudDistribCmdsTest.test-seed#[ECA2FE4A899C4B36]) [n:127.0.0.1:57015_bv%2Fj    ] o.a.s.c.c.SolrZkClient makePath: /overseer_elect
   [junit4]   2> 1506459 INFO  (TEST-FullSolrCloudDistribCmdsTest.test-seed#[ECA2FE4A899C4B36]) [n:127.0.0.1:57015_bv%2Fj    ] o.a.s.c.c.SolrZkClient makePath: /overseer_elect/election
   [junit4]   2> 1506460 INFO  (TEST-FullSolrCloudDistribCmdsTest.test-seed#[ECA2FE4A899C4B36]) [n:127.0.0.1:57015_bv%2Fj    ] o.a.s.c.Overseer Overseer (id=null) closing
   [junit4]   2> 1506461 INFO  (TEST-FullSolrCloudDistribCmdsTest.test-seed#[ECA2FE4A899C4B36]) [n:127.0.0.1:57015_bv%2Fj    ] o.a.s.c.LeaderElector Joined leadership election with path: /overseer_elect/election/94286111418023940-127.0.0.1:57015_bv%2Fj-n_0000000000
   [junit4]   2> 1506462 INFO  (TEST-FullSolrCloudDistribCmdsTest.test-seed#[ECA2FE4A899C4B36]) [n:127.0.0.1:57015_bv%2Fj    ] o.a.s.c.OverseerElectionContext I am going to be the leader 127.0.0.1:57015_bv%2Fj
   [junit4]   2> 1506462 INFO  (TEST-FullSolrCloudDistribCmdsTest.test-seed#[ECA2FE4A899C4B36]) [n:127.0.0.1:57015_bv%2Fj    ] o.a.s.c.c.SolrZkClient makePath: /overseer_elect/leader
   [junit4]   2> 1506463 INFO  (TEST-FullSolrCloudDistribCmdsTest.test-seed#[ECA2FE4A899C4B36]) [n:127.0.0.1:57015_bv%2Fj    ] o.a.s.c.Overseer Overseer (id=94286111418023940-127.0.0.1:57015_bv%2Fj-n_0000000000) starting
   [junit4]   2> 1506467 INFO  (TEST-FullSolrCloudDistribCmdsTest.test-seed#[ECA2FE4A899C4B36]) [n:127.0.0.1:57015_bv%2Fj    ] o.a.s.c.c.SolrZkClient makePath: /overseer/queue-work
   [junit4]   2> 1506475 INFO  (TEST-FullSolrCloudDistribCmdsTest.test-seed#[ECA2FE4A899C4B36]) [n:127.0.0.1:57015_bv%2Fj    ] o.a.s.c.OverseerAutoReplicaFailoverThread Starting OverseerAutoReplicaFailoverThread autoReplicaFailoverWorkLoopDelay=10000 autoReplicaFailoverWaitAfterExpiration=30000 autoReplicaFailoverBadNodeExpiration=60000
   [junit4]   2> 1506476 INFO  (OverseerCollectionProcessor-94286111418023940-127.0.0.1:57015_bv%2Fj-n_0000000000) [n:127.0.0.1:57015_bv%2Fj    ] o.a.s.c.OverseerCollectionProcessor Process current queue of collection creations
   [junit4]   2> 1506477 INFO  (TEST-FullSolrCloudDistribCmdsTest.test-seed#[ECA2FE4A899C4B36]) [n:127.0.0.1:57015_bv%2Fj    ] o.a.s.c.c.ZkStateReader Updating cluster state from ZooKeeper... 
   [junit4]   2> 1506478 INFO  (OverseerStateUpdate-94286111418023940-127.0.0.1:57015_bv%2Fj-n_0000000000) [n:127.0.0.1:57015_bv%2Fj    ] o.a.s.c.Overseer Starting to work on the main queue
   [junit4]   2> 1506485 INFO  (TEST-FullSolrCloudDistribCmdsTest.test-seed#[ECA2FE4A899C4B36]) [n:127.0.0.1:57015_bv%2Fj    ] o.a.s.c.CoreContainer No authentication plugin used.
   [junit4]   2> 1506487 INFO  (TEST-FullSolrCloudDistribCmdsTest.test-seed#[ECA2FE4A899C4B36]) [n:127.0.0.1:57015_bv%2Fj    ] o.a.s.c.CoreContainer Security conf doesn't exist. Skipping setup for authorization module.
   [junit4]   2> 1506488 INFO  (TEST-FullSolrCloudDistribCmdsTest.test-seed#[ECA2FE4A899C4B36]) [n:127.0.0.1:57015_bv%2Fj    ] o.a.s.c.CoresLocator Looking for core definitions underneath /x1/jenkins/jenkins-slave/workspace/Lucene-Solr-NightlyTests-5.x/solr/build/solr-core/test/J2/../../../../../../../../../../x1/jenkins/jenkins-slave/workspace/Lucene-Solr-NightlyTests-5.x/solr/build/solr-core/test/J2/temp/solr.cloud.FullSolrCloudDistribCmdsTest_ECA2FE4A899C4B36-001/control-001/cores
   [junit4]   2> 1506489 INFO  (TEST-FullSolrCloudDistribCmdsTest.test-seed#[ECA2FE4A899C4B36]) [n:127.0.0.1:57015_bv%2Fj    ] o.a.s.c.SolrCore Created CoreDescriptor: {shard=, name=collection1, config=solrconfig.xml, collection=control_collection, schema=schema.xml, transient=false, instanceDir=/x1/jenkins/jenkins-slave/workspace/Lucene-Solr-NightlyTests-5.x/solr/build/solr-core/test/J2/../../../../../../../../../../x1/jenkins/jenkins-slave/workspace/Lucene-Solr-NightlyTests-5.x/solr/build/solr-core/test/J2/temp/solr.cloud.FullSolrCloudDistribCmdsTest_ECA2FE4A899C4B36-001/control-001/cores/collection1, dataDir=data/, coreNodeName=, configSetProperties=configsetprops.json, absoluteInstDir=/x1/jenkins/jenkins-slave/workspace/Lucene-Solr-NightlyTests-5.x/solr/build/solr-core/test/J2/../../../../../../../../../../x1/jenkins/jenkins-slave/workspace/Lucene-Solr-NightlyTests-5.x/solr/build/solr-core/test/J2/temp/solr.cloud.FullSolrCloudDistribCmdsTest_ECA2FE4A899C4B36-001/control-001/cores/collection1/, loadOnStartup=true}
   [junit4]   2> 1506489 INFO  (TEST-FullSolrCloudDistribCmdsTest.test-seed#[ECA2FE4A899C4B36]) [n:127.0.0.1:57015_bv%2Fj    ] o.a.s.c.CoresLocator Found core collection1 in /x1/jenkins/jenkins-slave/workspace/Lucene-Solr-NightlyTests-5.x/solr/build/solr-core/test/J2/../../../../../../../../../../x1/jenkins/jenkins-slave/workspace/Lucene-Solr-NightlyTests-5.x/solr/build/solr-core/test/J2/temp/solr.cloud.FullSolrCloudDistribCmdsTest_ECA2FE4A899C4B36-001/control-001/cores/collection1/
   [junit4]   2> 1506490 INFO  (TEST-FullSolrCloudDistribCmdsTest.test-seed#[ECA2FE4A899C4B36]) [n:127.0.0.1:57015_bv%2Fj    ] o.a.s.c.CoresLocator Found 1 core definitions
   [junit4]   2> 1506491 INFO  (coreLoadExecutor-4326-thread-1-processing-n:127.0.0.1:57015_bv%2Fj) [n:127.0.0.1:57015_bv%2Fj c:control_collection   x:collection1] o.a.s.c.ZkController publishing state=down
   [junit4]   2> 1506491 INFO  (coreLoadExecutor-4326-thread-1-processing-n:127.0.0.1:57015_bv%2Fj) [n:127.0.0.1:57015_bv%2Fj c:control_collection   x:collection1] o.a.s.c.ZkController numShards not found on descriptor - reading it from system property
   [junit4]   2> 1506493 INFO  (coreLoadExecutor-4326-thread-1-processing-n:127.0.0.1:57015_bv%2Fj) [n:127.0.0.1:57015_bv%2Fj c:control_collection   x:collection1] o.a.s.c.ZkController look for our core node name
   [junit4]   2> 1506495 INFO  (OverseerStateUpdate-94286111418023940-127.0.0.1:57015_bv%2Fj-n_0000000000) [n:127.0.0.1:57015_bv%2Fj    ] o.a.s.c.Overseer processMessage: queueSize: 1, message = {
   [junit4]   2>   "shard":null,
   [junit4]   2>   "node_name":"127.0.0.1:57015_bv%2Fj",
   [junit4]   2>   "core":"collection1",
   [junit4]   2>   "operation":"state",
   [junit4]   2>   "numShards":"1",
   [junit4]   2>   "collection":"control_collection",
   [junit4]   2>   "base_url":"http://127.0.0.1:57015/bv/j",
   [junit4]   2>   "state":"down",
   [junit4]   2>   "roles":null} current state version: 0
   [junit4]   2> 1506496 INFO  (OverseerStateUpdate-94286111418023940-127.0.0.1:57015_bv%2Fj-n_0000000000) [n:127.0.0.1:57015_bv%2Fj    ] o.a.s.c.o.ReplicaMutator Update state numShards=1 message={
   [junit4]   2>   "shard":null,
   [junit4]   2>   "node_name":"127.0.0.1:57015_bv%2Fj",
   [junit4]   2>   "core":"collection1",
   [junit4]   2>   "operation":"state",
   [junit4]   2>   "numShards":"1",
   [junit4]   2>   "collection":"control_collection",
   [junit4]   2>   "base_url":"http://127.0.0.1:57015/bv/j",
   [junit4]   2>   "state":"down",
   [junit4]   2>   "roles":null}
   [junit4]   2> 1506497 INFO  (OverseerStateUpdate-94286111418023940-127.0.0.1:57015_bv%2Fj-n_0000000000) [n:127.0.0.1:57015_bv%2Fj    ] o.a.s.c.o.ClusterStateMutator building a new cName: control_collection
   [junit4]   2> 1506497 INFO  (OverseerStateUpdate-94286111418023940-127.0.0.1:57015_bv%2Fj-n_0000000000) [n:127.0.0.1:57015_bv%2Fj    ] o.a.s.c.o.ReplicaMutator Assigning new node to shard shard=shard1
   [junit4]   2> 1506498 INFO  (zkCallback-1045-thread-1-processing-n:127.0.0.1:57015_bv%2Fj) [n:127.0.0.1:57015_bv%2Fj    ] o.a.s.c.c.ZkStateReader A cluster state change: WatchedEvent state:SyncConnected type:NodeDataChanged path:/clusterstate.json, has occurred - updating... (live nodes size: 1)
   [junit4]   2> 1506499 INFO  (TEST-FullSolrCloudDistribCmdsTest.test-seed#[ECA2FE4A899C4B36]) [n:127.0.0.1:57015_bv%2Fj    ] o.a.s.s.SolrDispatchFilter user.dir=/x1/jenkins/jenkins-slave/workspace/Lucene-Solr-NightlyTests-5.x/solr/build/solr-core/test/J2
   [junit4]   2> 1506499 INFO  (TEST-FullSolrCloudDistribCmdsTest.test-seed#[ECA2FE4A899C4B36]) [n:127.0.0.1:57015_bv%2Fj    ] o.a.s.s.SolrDispatchFilter SolrDispatchFilter.init() done
   [junit4]   2> 1506505 INFO  (zkCallback-1045-thread-1-processing-n:127.0.0.1:57015_bv%2Fj) [n:127.0.0.1:57015_bv%2Fj    ] o.a.s.c.c.ZkStateReader Updated cluster state version to 1
   [junit4]   2> 1506506 INFO  (zkCallback-1045-thread-1-processing-n:127.0.0.1:57015_bv%2Fj) [n:127.0.0.1:57015_bv%2Fj    ] o.a.s.c.DistributedQueue NodeChildrenChanged fired on path /overseer/queue state SyncConnected
   [junit4]   2> 1507494 INFO  (coreLoadExecutor-4326-thread-1-processing-n:127.0.0.1:57015_bv%2Fj) [n:127.0.0.1:57015_bv%2Fj c:control_collection   x:collection1] o.a.s.c.ZkController waiting to find shard id in clusterstate for collection1
   [junit4]   2> 1507494 INFO  (coreLoadExecutor-4326-thread-1-processing-n:127.0.0.1:57015_bv%2Fj) [n:127.0.0.1:57015_bv%2Fj c:control_collection   x:collection1] o.a.s.c.ZkController Check for collection zkNode:control_collection
   [junit4]   2> 1507495 INFO  (coreLoadExecutor-4326-thread-1-processing-n:127.0.0.1:57015_bv%2Fj) [n:127.0.0.1:57015_bv%2Fj c:control_collection   x:collection1] o.a.s.c.ZkController Collection zkNode exists
   [junit4]   2> 1507495 INFO  (coreLoadExecutor-4326-thread-1-processing-n:127.0.0.1:57015_bv%2Fj) [n:127.0.0.1:57015_bv%2Fj c:control_collection   x:collection1] o.a.s.c.c.ZkStateReader Load collection config from:/collections/control_collection
   [junit4]   2> 1507496 INFO  (coreLoadExecutor-4326-thread-1-processing-n:127.0.0.1:57015_bv%2Fj) [n:127.0.0.1:57015_bv%2Fj c:control_collection   x:collection1] o.a.s.c.c.ZkStateReader path=/collections/control_collection configName=conf1 specified config exists in ZooKeeper
   [junit4]   2> 1507496 INFO  (coreLoadExecutor-4326-thread-1-processing-n:127.0.0.1:57015_bv%2Fj) [n:127.0.0.1:57015_bv%2Fj c:control_collection   x:collection1] o.a.s.c.SolrResourceLoader new SolrResourceLoader for directory: '/x1/jenkins/jenkins-slave/workspace/Lucene-Solr-NightlyTests-5.x/solr/build/solr-core/test/J2/../../../../../../../../../../x1/jenkins/jenkins-slave/workspace/Lucene-Solr-NightlyTests-5.x/solr/build/solr-core/test/J2/temp/solr.cloud.FullSolrCloudDistribCmdsTest_ECA2FE4A899C4B36-001/control-001/cores/collection1/'
   [junit4]   2> 1507521 INFO  (coreLoadExecutor-4326-thread-1-processing-n:127.0.0.1:57015_bv%2Fj) [n:127.0.0.1:57015_bv%2Fj c:control_collection   x:collection1] o.a.s.c.Config loaded config solrconfig.xml with version 0 
   [junit4]   2> 1507537 INFO  (coreLoadExecutor-4326-thread-1-processing-n:127.0.0.1:57015_bv%2Fj) [n:127.0.0.1:57015_bv%2Fj c:control_collection   x:collection1] o.a.s.c.SolrConfig current version of requestparams : -1
   [junit4]   2> 1507563 INFO  (coreLoadExecutor-4326-thread-1-processing-n:127.0.0.1:57015_bv%2Fj) [n:127.0.0.1:57015_bv%2Fj c:control_collection   x:collection1] o.a.s.c.SolrConfig Using Lucene MatchVersion: 5.3.0
   [junit4]   2> 1507659 INFO  (coreLoadExecutor-4326-thread-1-processing-n:127.0.0.1:57015_bv%2Fj) [n:127.0.0.1:57015_bv%2Fj c:control_collection   x:collection1] o.a.s.c.Config Loaded SolrConfig: solrconfig.xml
   [junit4]   2> 1507660 INFO  (coreLoadExecutor-4326-thread-1-processing-n:127.0.0.1:57015_bv%2Fj) [n:127.0.0.1:57015_bv%2Fj c:control_collection   x:collection1] o.a.s.s.IndexSchema Reading Solr Schema from /configs/conf1/schema.xml
   [junit4]   2> 1507668 INFO  (coreLoadExecutor-4326-thread-1-processing-n:127.0.0.1:57015_bv%2Fj) [n:127.0.0.1:57015_bv%2Fj c:control_collection   x:collection1] o.a.s.s.IndexSchema [collection1] Schema name=test
   [junit4]   2> 1508107 INFO  (coreLoadExecutor-4326-thread-1-processing-n:127.0.0.1:57015_bv%2Fj) [n:127.0.0.1:57015_bv%2Fj c:control_collection   x:collection1] o.a.s.s.IndexSchema default search field in schema is text
   [junit4]   2> 1508113 INFO  (coreLoadExecutor-4326-thread-1-processing-n:127.0.0.1:57015_bv%2Fj) [n:127.0.0.1:57015_bv%2Fj c:control_collection   x:collection1] o.a.s.s.IndexSchema unique key field: id
   [junit4]   2> 1508116 INFO  (coreLoadExecutor-4326-thread-1-processing-n:127.0.0.1:57015_bv%2Fj) [n:127.0.0.1:57015_bv%2Fj c:control_collection   x:collection1] o.a.s.s.FileExchangeRateProvider Reloading exchange rates from file currency.xml
   [junit4]   2> 1508122 INFO  (coreLoadExecutor-4326-thread-1-processing-n:127.0.0.1:57015_bv%2Fj) [n:127.0.0.1:57015_bv%2Fj c:control_collection   x:collection1] o.a.s.s.FileExchangeRateProvider Reloading exchange rates from file currency.xml
   [junit4]   2> 1508160 INFO  (coreLoadExecutor-4326-thread-1-processing-n:127.0.0.1:57015_bv%2Fj) [n:127.0.0.1:57015_bv%2Fj c:control_collection   x:collection1] o.a.s.c.ConfigSetProperties Did not find ConfigSet properties, assuming default properties: Can't find resource 'configsetprops.json' in classpath or '/configs/conf1', cwd=/x1/jenkins/jenkins-slave/workspace/Lucene-Solr-NightlyTests-5.x/solr/build/solr-core/test/J2
   [junit4]   2> 1508160 INFO  (coreLoadExecutor-4326-thread-1-processing-n:127.0.0.1:57015_bv%2Fj) [n:127.0.0.1:57015_bv%2Fj c:control_collection   x:collection1] o.a.s.c.CoreContainer Creating SolrCore 'collection1' using configuration from collection control_collection
   [junit4]   2> 1508160 INFO  (coreLoadExecutor-4326-thread-1-processing-n:127.0.0.1:57015_bv%2Fj) [n:127.0.0.1:57015_bv%2Fj c:control_collection s:shard1 r:core_node1 x:collection1] o.a.s.c.SolrCore org.apache.solr.core.MockDirectoryFactory
   [junit4]   2> 1508160 INFO  (coreLoadExecutor-4326-thread-1-processing-n:127.0.0.1:57015_bv%2Fj) [n:127.0.0.1:57015_bv%2Fj c:control_collection s:shard1 r:core_node1 x:collection1] o.a.s.c.SolrCore [[collection1] ] Opening new SolrCore at [/x1/jenkins/jenkins-slave/workspace/Lucene-Solr-NightlyTests-5.x/solr/build/solr-core/test/J2/../../../../../../../../../../x1/jenkins/jenkins-slave/workspace/Lucene-Solr-NightlyTests-5.x/solr/build/solr-core/test/J2/temp/solr.cloud.FullSolrCloudDistribCmdsTest_ECA2FE4A899C4B36-001/control-001/cores/collection1/], dataDir=[null]
   [junit4]   2> 1508161 INFO  (coreLoadExecutor-4326-thread-1-processing-n:127.0.0.1:57015_bv%2Fj) [n:127.0.0.1:57015_bv%2Fj c:control_collection s:shard1 r:core_node1 x:collection1] o.a.s.c.JmxMonitoredMap JMX monitoring is enabled. Adding Solr mbeans to JMX Server: com.sun.jmx.mbeanserver.JmxMBeanServer@40c31593
   [junit4]   2> 1508164 INFO  (coreLoadExecutor-4326-thread-1-processing-n:127.0.0.1:57015_bv%2Fj) [n:127.0.0.1:57015_bv%2Fj c:control_collection s:shard1 r:core_node1 x:collection1] o.a.s.c.CachingDirectoryFactory return new directory for /x1/jenkins/jenkins-slave/workspace/Lucene-Solr-NightlyTests-5.x/solr/build/solr-core/test/J2/../../../../../../../../../../x1/jenkins/jenkins-slave/workspace/Lucene-Solr-NightlyTests-5.x/solr/build/solr-core/test/J2/temp/solr.cloud.FullSolrCloudDistribCmdsTest_ECA2FE4A899C4B36-001/control-001/cores/collection1/data
   [junit4]   2> 1508164 INFO  (coreLoadExecutor-4326-thread-1-processing-n:127.0.0.1:57015_bv%2Fj) [n:127.0.0.1:57015_bv%2Fj c:control_collection s:shard1 r:core_node1 x:collection1] o.a.s.c.SolrCore New index directory detected: old=null new=/x1/jenkins/jenkins-slave/workspace/Lucene-Solr-NightlyTests-5.x/solr/build/solr-core/test/J2/../../../../../../../../../../x1/jenkins/jenkins-slave/workspace/Lucene-Solr-NightlyTests-5.x/solr/build/solr-core/test/J2/temp/solr.cloud.FullSolrCloudDistribCmdsTest_ECA2FE4A899C4B36-001/control-001/cores/collection1/data/index/
   [junit4]   2> 1508164 WARN  (coreLoadExecutor-4326-thread-1-processing-n:127.0.0.1:57015_bv%2Fj) [n:127.0.0.1:57015_bv%2Fj c:control_collection s:shard1 r:core_node1 x:collection1] o.a.s.c.SolrCore [collection1] Solr index directory '/x1/jenkins/jenkins-slave/workspace/Lucene-Solr-NightlyTests-5.x/solr/build/solr-core/test/J2/../../../../../../../../../../x1/jenkins/jenkins-slave/workspace/Lucene-Solr-NightlyTests-5.x/solr/build/solr-core/test/J2/temp/solr.cloud.FullSolrCloudDistribCmdsTest_ECA2FE4A899C4B36-001/control-001/cores/collection1/data/index' doesn't exist. Creating new index...
   [junit4]   2> 1508166 INFO  (coreLoadExecutor-4326-thread-1-processing-n:127.0.0.1:57015_bv%2Fj) [n:127.0.0.1:57015_bv%2Fj c:control_collection s:shard1 r:core_node1 x:collection1] o.a.s.c.CachingDirectoryFactory return new directory for /x1/jenkins/jenkins-slave/workspace/Lucene-Solr-NightlyTests-5.x/solr/build/solr-core/test/J2/../../../../../../../../../../x1/jenkins/jenkins-slave/workspace/Lucene-Solr-NightlyTests-5.x/solr/build/solr-core/test/J2/temp/solr.cloud.FullSolrCloudDistribCmdsTest_ECA2FE4A899C4B36-001/control-001/cores/collection1/data/index
   [junit4]   2> 1508166 INFO  (coreLoadExecutor-4326-thread-1-processing-n:127.0.0.1:57015_bv%2Fj) [n:127.0.0.1:57015_bv%2Fj c:control_collection s:shard1 r:core_node1 x:collection1] o.a.s.u.RandomMergePolicy RandomMergePolicy wrapping class org.apache.lucene.index.TieredMergePolicy: [TieredMergePolicy: maxMergeAtOnce=14, maxMergeAtOnceExplicit=23, maxMergedSegmentMB=97.138671875, floorSegmentMB=0.48046875, forceMergeDeletesPctAllowed=12.020233300651107, segmentsPerTier=30.0, maxCFSSegmentSizeMB=8.796093022207999E12, noCFSRatio=0.4037780296373946
   [junit4]   2> 1508170 INFO  (coreLoadExecutor-4326-thread-1-processing-n:127.0.0.1:57015_bv%2Fj) [n:127.0.0.1:57015_bv%2Fj c:control_collection s:shard1 r:core_node1 x:collection1] o.a.s.c.SolrCore SolrDeletionPolicy.onCommit: commits: num=1
   [junit4]   2> 	commit{dir=MockDirectoryWrapper(SimpleFSDirectory@/x1/jenkins/jenkins-slave/workspace/Lucene-Solr-NightlyTests-5.x/solr/build/solr-core/test/J2/temp/solr.cloud.FullSolrCloudDistribCmdsTest_ECA2FE4A899C4B36-001/index-SimpleFSDirectory-001 lockFactory=org.apache.lucene.store.NativeFSLockFactory@57330c55),segFN=segments_1,generation=1}
   [junit4]   2> 1508170 INFO  (coreLoadExecutor-4326-thread-1-processing-n:127.0.0.1:57015_bv%2Fj) [n:127.0.0.1:57015_bv%2Fj c:control_collection s:shard1 r:core_node1 x:collection1] o.a.s.c.SolrCore newest commit generation = 1
   [junit4]   2> 1508178 INFO  (coreLoadExecutor-4326-thread-1-processing-n:127.0.0.1:57015_bv%2Fj) [n:127.0.0.1:57015_bv%2Fj c:control_collection s:shard1 r:core_node1 x:collection1] o.a.s.u.p.UpdateRequestProcessorChain creating updateRequestProcessorChain "nodistrib"
   [junit4]   2> 1508178 INFO  (coreLoadExecutor-4326-thread-1-processing-n:127.0.0.1:57015_bv%2Fj) [n:127.0.0.1:57015_bv%2Fj c:control_collection s:shard1 r:core_node1 x:collection1] o.a.s.u.p.UpdateRequestProcessorChain creating updateRequestProcessorChain "dedupe"
   [junit4]   2> 1508178 INFO  (coreLoadExecutor-4326-thread-1-processing-n:127.0.0.1:57015_bv%2Fj) [n:127.0.0.1:57015_bv%2Fj c:control_collection s:shard1 r:core_node1 x:collection1] o.a.s.u.p.UpdateRequestProcessorChain inserting DistributedUpdateProcessorFactory into updateRequestProcessorChain "dedupe"
   [junit4]   2> 1508178 INFO  (coreLoadExecutor-4326-thread-1-processing-n:127.0.0.1:57015_bv%2Fj) [n:127.0.0.1:57015_bv%2Fj c:control_collection s:shard1 r:core_node1 x:collection1] o.a.s.u.p.UpdateRequestProcessorChain creating updateRequestProcessorChain "stored_sig"
   [junit4]   2> 1508179 INFO  (coreLoadExecutor-4326-thread-1-processing-n:127.0.0.1:57015_bv%2Fj) [n:127.0.0.1:57015_bv%2Fj c:control_collection s:shard1 r:core_node1 x:collection1] o.a.s.u.p.UpdateRequestProcessorChain inserting DistributedUpdateProcessorFactory into updateRequestProcessorChain "stored_sig"
   [junit4]   2> 1508179 INFO  (coreLoadExecutor-4326-thread-1-processing-n:127.0.0.1:57015_bv%2Fj) [n:127.0.0.1:57015_bv%2Fj c:control_collection s:shard1 r:core_node1 x:collection1] o.a.s.u.p.UpdateRequestProcessorChain creating updateRequestProcessorChain "distrib-dup-test-chain-explicit"
   [junit4]   2> 1508179 INFO  (coreLoadExecutor-4326-thread-1-processing-n:127.0.0.1:57015_bv%2Fj) [n:127.0.0.1:57015_bv%2Fj c:control_collection s:shard1 r:core_node1 x:collection1] o.a.s.u.p.UpdateRequestProcessorChain creating updateRequestProcessorChain "distrib-dup-test-chain-implicit"
   [junit4]   2> 1508179 INFO  (coreLoadExecutor-4326-thread-1-processing-n:127.0.0.1:57015_bv%2Fj) [n:127.0.0.1:57015_bv%2Fj c:control_collection s:shard1 r:core_node1 x:collection1] o.a.s.u.p.UpdateRequestProcessorChain inserting DistributedUpdateProcessorFactory into updateRequestProcessorChain "distrib-dup-test-chain-implicit"
   [junit4]   2> 1508179 INFO  (coreLoadExecutor-4326-thread-1-processing-n:127.0.0.1:57015_bv%2Fj) [n:127.0.0.1:57015_bv%2Fj c:control_collection s:shard1 r:core_node1 x:collection1] o.a.s.c.SolrCore no updateRequestProcessorChain defined as default, creating implicit default
   [junit4]   2> 1508181 INFO  (OldIndexDirectoryCleanupThreadForCore-collection1) [n:127.0.0.1:57015_bv%2Fj c:control_collection s:shard1 r:core_node1 x:collection1] o.a.s.c.SolrCore Looking for old index directories to cleanup for core collection1 in /x1/jenkins/jenkins-slave/workspace/Lucene-Solr-NightlyTests-5.x/solr/build/solr-core/test/J2/../../../../../../../../../../x1/jenkins/jenkins-slave/workspace/Lucene-Solr-NightlyTests-5.x/solr/build/solr-core/test/J2/temp/solr.cloud.FullSolrCloudDistribCmdsTest_ECA2FE4A899C4B36-001/control-001/cores/collection1/data/
   [junit4]   2> 1508181 WARN  (OldIndexDirectoryCleanupThreadForCore-collection1) [n:127.0.0.1:57015_bv%2Fj c:control_collection s:shard1 r:core_node1 x:collection1] o.a.s.c.DirectoryFactory /x1/jenkins/jenkins-slave/workspace/Lucene-Solr-NightlyTests-5.x/solr/build/solr-core/test/J2/../../../../../../../../../../x1/jenkins/jenkins-slave/workspace/Lucene-Solr-NightlyTests-5.x/solr/build/solr-core/test/J2/temp/solr.cloud.FullSolrCloudDistribCmdsTest_ECA2FE4A899C4B36-001/control-001/cores/collection1/data/ does not point to a valid data directory; skipping clean-up of old index directories.
   [junit4]   2> 1508185 INFO  (coreLoadExecutor-4326-thread-1-processing-n:127.0.0.1:57015_bv%2Fj) [n:127.0.0.1:57015_bv%2Fj c:control_collection s:shard1 r:core_node1 x:collection1] o.a.s.h.l.XMLLoader xsltCacheLifetimeSeconds=60
   [junit4]   2> 1508187 INFO  (coreLoadExecutor-4326-thread-1-processing-n:127.0.0.1:57015_bv%2Fj) [n:127.0.0.1:57015_bv%2Fj c:control_collection s:shard1 r:core_node1 x:collection1] o.a.s.h.l.XMLLoader xsltCacheLifetimeSeconds=60
   [junit4]   2> 1508188 INFO  (coreLoadExecutor-4326-thread-1-processing-n:127.0.0.1:57015_bv%2Fj) [n:127.0.0.1:57015_bv%2Fj c:control_collection s:shard1 r:core_node1 x:collection1] o.a.s.h.l.XMLLoader xsltCacheLifetimeSeconds=60
   [junit4]   2> 1508196 INFO  (coreLoadExecutor-4326-thread-1-processing-n:127.0.0.1:57015_bv%2Fj) [n:127.0.0.1:57015_bv%2Fj c:control_collection s:shard1 r:core_node1 x:collection1] o.a.s.h.l.XMLLoader xsltCacheLifetimeSeconds=60
   [junit4]   2> 1508212 INFO  (coreLoadExecutor-4326-thread-1-processing-n:127.0.0.1:57015_bv%2Fj) [n:127.0.0.1:57015_bv%2Fj c:control_collection s:shard1 r:core_node1 x:collection1] o.a.s.c.RequestHandlers Registered paths: /config,/update/csv,/update/json/docs,/update,/admin/ping,/admin/logging,/admin/file,/admin/properties,/admin/luke,/admin/threads,/admin/mbeans,/get,/admin/segments,/admin/plugins,/schema,/replication,/admin/system,/update/json,standard
   [junit4]   2> 1508219 INFO  (coreLoadExecutor-4326-thread-1-processing-n:127.0.0.1:57015_bv%2Fj) [n:127.0.0.1:57015_bv%2Fj c:control_collection s:shard1 r:core_node1 x:collection1] o.a.s.c.SolrCore Using default statsCache cache: org.apache.solr.search.stats.LocalStatsCache
   [junit4]   2> 1508225 INFO  (coreLoadExecutor-4326-thread-1-processing-n:127.0.0.1:57015_bv%2Fj) [n:127.0.0.1:57015_bv%2Fj c:control_collection s:shard1 r:core_node1 x:collection1] o.a.s.u.UpdateHandler Using UpdateLog implementation: org.apache.solr.update.UpdateLog
   [junit4]   2> 1508225 INFO  (coreLoadExecutor-4326-thread-1-processing-n:127.0.0.1:57015_bv%2Fj) [n:127.0.0.1:57015_bv%2Fj c:control_collection s:shard1 r:core_node1 x:collection1] o.a.s.u.UpdateLog Initializing UpdateLog: dataDir= defaultSyncLevel=FLUSH numRecordsToKeep=100 maxNumLogsToKeep=10 numVersionBuckets=65536
   [junit4]   2> 1508227 INFO  (coreLoadExecutor-4326-thread-1-processing-n:127.0.0.1:57015_bv%2Fj) [n:127.0.0.1:57015_bv%2Fj c:control_collection s:shard1 r:core_node1 x:collection1] o.a.s.c.SolrCore Hard AutoCommit: disabled
   [junit4]   2> 1508227 INFO  (coreLoadExecutor-4326-thread-1-processing-n:127.0.0.1:57015_bv%2Fj) [n:127.0.0.1:57015_bv%2Fj c:control_collection s:shard1 r:core_node1 x:collection1] o.a.s.c.SolrCore Soft AutoCommit: disabled
   [junit4]   2> 1508227 INFO  (coreLoadExecutor-4326-thread-1-processing-n:127.0.0.1:57015_bv%2Fj) [n:127.0.0.1:57015_bv%2Fj c:control_collection s:shard1 r:core_node1 x:collection1] o.a.s.u.RandomMergePolicy RandomMergePolicy wrapping class org.apache.lucene.index.TieredMergePolicy: [TieredMergePolicy: maxMergeAtOnce=21, maxMergeAtOnceExplicit=11, maxMergedSegmentMB=40.935546875, floorSegmentMB=1.298828125, forceMergeDeletesPctAllowed=21.197036073493443, segmentsPerTier=18.0, maxCFSSegmentSizeMB=8.796093022207999E12, noCFSRatio=0.0
   [junit4]   2> 1508230 INFO  (coreLoadExecutor-4326-thread-1-processing-n:127.0.0.1:57015_bv%2Fj) [n:127.0.0.1:57015_bv%2Fj c:control_collection s:shard1 r:core_node1 x:collection1] o.a.s.c.SolrCore SolrDeletionPolicy.onInit: commits: num=1
   [junit4]   2> 	commit{dir=MockDirectoryWrapper(SimpleFSDirectory@/x1/jenkins/jenkins-slave/workspace/Lucene-Solr-NightlyTests-5.x/solr/build/solr-core/test/J2/temp/solr.cloud.FullSolrCloudDistribCmdsTest_ECA2FE4A899C4B36-001/index-SimpleFSDirectory-001 lockFactory=org.apache.lucene.store.NativeFSLockFactory@57330c55),segFN=segments_1,generation=1}
   [junit4]   2> 1508230 INFO  (coreLoadExecutor-4326-thread-1-processing-n:127.0.0.1:57015_bv%2Fj) [n:127.0.0.1:57015_bv%2Fj c:control_collection s:shard1 r:core_node1 x:collection1] o.a.s.c.SolrCore newest commit generation = 1
   [junit4]   2> 1508231 INFO  (coreLoadExecutor-4326-thread-1-processing-n:127.0.0.1:57015_bv%2Fj) [n:127.0.0.1:57015_bv%2Fj c:control_collection s:shard1 r:core_node1 x:collection1] o.a.s.s.SolrIndexSearcher Opening Searcher@66c17951[collection1] main
   [junit4]   2> 1508231 INFO  (coreLoadExecutor-4326-thread-1-processing-n:127.0.0.1:57015_bv%2Fj) [n:127.0.0.1:57015_bv%2Fj c:control_collection s:shard1 r:core_node1 x:collection1] o.a.s.c.c.ZkStateReader Load collection config from:/collections/control_collection
   [junit4]   2> 1508233 INFO  (coreLoadExecutor-4326-thread-1-processing-n:127.0.0.1:57015_bv%2Fj) [n:127.0.0.1:57015_bv%2Fj c:control_collection s:shard1 r:core_node1 x:collection1] o.a.s.c.c.ZkStateReader path=/collections/control_collection configName=conf1 specified config exists in ZooKeeper
   [junit4]   2> 1508233 INFO  (coreLoadExecutor-4326-thread-1-processing-n:127.0.0.1:57015_bv%2Fj) [n:127.0.0.1:57015_bv%2Fj c:control_collection s:shard1 r:core_node1 x:collection1] o.a.s.r.ManagedResourceStorage Setting up ZooKeeper-based storage for the RestManager with znodeBase: /configs/conf1
   [junit4]   2> 1508234 INFO  (coreLoadExecutor-4326-thread-1-processing-n:127.0.0.1:57015_bv%2Fj) [n:127.0.0.1:57015_bv%2Fj c:control_collection s:shard1 r:core_node1 x:collection1] o.a.s.r.ManagedResourceStorage Configured ZooKeeperStorageIO with znodeBase: /configs/conf1
   [junit4]   2> 1508234 INFO  (coreLoadExecutor-4326-thread-1-processing-n:127.0.0.1:57015_bv%2Fj) [n:127.0.0.1:57015_bv%2Fj c:control_collection s:shard1 r:core_node1 x:collection1] o.a.s.r.RestManager Initializing RestManager with initArgs: {}
   [junit4]   2> 1508235 INFO  (coreLoadExecutor-4326-thread-1-processing-n:127.0.0.1:57015_bv%2Fj) [n:127.0.0.1:57015_bv%2Fj c:control_collection s:shard1 r:core_node1 x:collection1] o.a.s.r.ManagedResourceStorage Reading _rest_managed.json using ZooKeeperStorageIO:path=/configs/conf1
   [junit4]   2> 1508236 INFO  (coreLoadExecutor-4326-thread-1-processing-n:127.0.0.1:57015_bv%2Fj) [n:127.0.0.1:57015_bv%2Fj c:control_collection s:shard1 r:core_node1 x:collection1] o.a.s.r.ManagedResourceStorage No data found for znode /configs/conf1/_rest_managed.json
   [junit4]   2> 1508237 INFO  (coreLoadExecutor-4326-thread-1-processing-n:127.0.0.1:57015_bv%2Fj) [n:127.0.0.1:57015_bv%2Fj c:control_collection s:shard1 r:core_node1 x:collection1] o.a.s.r.ManagedResourceStorage Loaded null at path _rest_managed.json using ZooKeeperStorageIO:path=/configs/conf1
   [junit4]   2> 1508237 INFO  (coreLoadExecutor-4326-thread-1-processing-n:127.0.0.1:57015_bv%2Fj) [n:127.0.0.1:57015_bv%2Fj c:control_collection s:shard1 r:core_node1 x:collection1] o.a.s.r.RestManager Initializing 0 registered ManagedResources
   [junit4]   2> 1508237 INFO  (coreLoadExecutor-4326-thread-1-processing-n:127.0.0.1:57015_bv%2Fj) [n:127.0.0.1:57015_bv%2Fj c:control_collection s:shard1 r:core_node1 x:collection1] o.a.s.h.ReplicationHandler Commits will be reserved for  10000
   [junit4]   2> 1508239 INFO  (searcherExecutor-4327-thread-1-processing-s:shard1 n:127.0.0.1:57015_bv%2Fj r:core_node1 x:collection1 c:control_collection) [n:127.0.0.1:57015_bv%2Fj c:control_collection s:shard1 r:core_node1 x:collection1] o.a.s.c.SolrCore [collection1] Registered new searcher Searcher@66c17951[collection1] main{ExitableDirectoryReader(UninvertingDirectoryReader())}
   [junit4]   2> 1508248 INFO  (coreLoadExecutor-4326-thread-1-processing-n:127.0.0.1:57015_bv%2Fj) [n:127.0.0.1:57015_bv%2Fj c:control_collection s:shard1 r:core_node1 x:collection1] o.a.s.u.UpdateLog Looking up max value of version field to seed version buckets
   [junit4]   2> 1508248 INFO  (coreLoadExecutor-4326-thread-1-processing-n:127.0.0.1:57015_bv%2Fj) [n:127.0.0.1:57015_bv%2Fj c:control_collection s:shard1 r:core_node1 x:collection1] o.a.s.u.VersionInfo Refreshing highest value of _version_ for 65536 version buckets from index
   [junit4]   2> 1508248 INFO  (coreLoadExecutor-4326-thread-1-processing-n:127.0.0.1:57015_bv%2Fj) [n:127.0.0.1:57015_bv%2Fj c:control_collection s:shard1 r:core_node1 x:collection1] o.a.s.u.VersionInfo No terms found for _version_, cannot seed version bucket highest value from index
   [junit4]   2> 1508249 INFO  (coreLoadExecutor-4326-thread-1-processing-n:127.0.0.1:57015_bv%2Fj) [n:127.0.0.1:57015_bv%2Fj c:control_collection s:shard1 r:core_node1 x:collection1] o.a.s.u.UpdateLog Could not find max version in index or recent updates, using new clock 1508577785382174720
   [junit4]   2> 1508251 INFO  (coreLoadExecutor-4326-thread-1-processing-n:127.0.0.1:57015_bv%2Fj) [n:127.0.0.1:57015_bv%2Fj c:control_collection s:shard1 r:core_node1 x:collection1] o.a.s.u.UpdateLog Took 3 ms to seed version buckets with highest version 1508577785382174720
   [junit4]   2> 1508251 INFO  (coreLoadExecutor-4326-thread-1-processing-n:127.0.0.1:57015_bv%2Fj) [n:127.0.0.1:57015_bv%2Fj c:control_collection s:shard1 r:core_node1 x:collection1] o.a.s.c.ZkController watch zkdir /configs/conf1
   [junit4]   2> 1508252 INFO  (coreLoadExecutor-4326-thread-1-processing-n:127.0.0.1:57015_bv%2Fj) [n:127.0.0.1:57015_bv%2Fj c:control_collection s:shard1 r:core_node1 x:collection1] o.a.s.c.CoreContainer registering core: collection1
   [junit4]   2> 1508253 INFO  (coreZkRegister-4320-thread-1-processing-s:shard1 n:127.0.0.1:57015_bv%2Fj r:core_node1 x:collection1 c:control_collection) [n:127.0.0.1:57015_bv%2Fj c:control_collection s:shard1 r:core_node1 x:collection1] o.a.s.c.ZkController Register replica - core:collection1 address:http://127.0.0.1:57015/bv/j collection:control_collection shard:shard1
   [junit4]   2> 1508255 INFO  (coreZkRegister-4320-thread-1-processing-s:shard1 n:127.0.0.1:57015_bv%2Fj r:core_node1 x:collection1 c:control_collection) [n:127.0.0.1:57015_bv%2Fj c:control_collection s:shard1 r:core_node1 x:collection1] o.a.s.c.c.SolrZkClient makePath: /collections/control_collection/leader_elect/shard1/election
   [junit4]   2> 1508271 INFO  (coreZkRegister-4320-thread-1-processing-s:shard1 n:127.0.0.1:57015_bv%2Fj r:core_node1 x:collection1 c:control_collection) [n:127.0.0.1:57015_bv%2Fj c:control_collection s:shard1 r:core_node1 x:collection1] o.a.s.c.LeaderElector Joined leadership election with path: /collections/control_collection/leader_elect/shard1/election/94286111418023940-core_node1-n_0000000000
   [junit4]   2> 1508272 INFO  (coreZkRegister-4320-thread-1-processing-s:shard1 n:127.0.0.1:57015_bv%2Fj r:core_node1 x:collection1 c:control_collection) [n:127.0.0.1:57015_bv%2Fj c:control_collection s:shard1 r:core_node1 x:collection1] o.a.s.c.ShardLeaderElectionContext Running the leader process for shard shard1
   [junit4]   2> 1508277 INFO  (coreZkRegister-4320-thread-1-processing-s:shard1 n:127.0.0.1:57015_bv%2Fj r:core_node1 x:collection1 c:control_collection) [n:127.0.0.1:57015_bv%2Fj c:control_collection s:shard1 r:core_node1 x:collection1] o.a.s.c.ShardLeaderElectionContext Enough replicas found to continue.
   [junit4]   2> 1508277 INFO  (coreZkRegister-4320-thread-1-processing-s:shard1 n:127.0.0.1:57015_bv%2Fj r:core_node1 x:collection1 c:control_collection) [n:127.0.0.1:57015_bv%2Fj c:control_collection s:shard1 r:core_node1 x:collection1] o.a.s.c.ShardLeaderElectionContext I may be the new leader - try and sync
   [junit4]   2> 1508277 INFO  (coreZkRegister-4320-thread-1-processing-s:shard1 n:127.0.0.1:57015_bv%2Fj r:core_node1 x:collection1 c:control_collection) [n:127.0.0.1:57015_bv%2Fj c:control_collection s:shard1 r:core_node1 x:collection1] o.a.s.c.SyncStrategy Sync replicas to http://127.0.0.1:57015/bv/j/collection1/
   [junit4]   2> 1508278 INFO  (coreZkRegister-4320-thread-1-processing-s:shard1 n:127.0.0.1:57015_bv%2Fj r:core_node1 x:collection1 c:control_collection) [n:127.0.0.1:57015_bv%2Fj c:control_collection s:shard1 r:core_node1 x:collection1] o.a.s.c.SyncStrategy Sync Success - now sync replicas to me
   [junit4]   2> 1508278 INFO  (coreZkRegister-4320-thread-1-processing-s:shard1 n:127.0.0.1:57015_bv%2Fj r:core_node1 x:collection1 c:control_collection) [n:127.0.0.1:57015_bv%2Fj c:control_collection s:shard1 r:core_node1 x:collection1] o.a.s.c.SyncStrategy http://127.0.0.1:57015/bv/j/collection1/ has no replicas
   [junit4]   2> 1508278 INFO  (zkCallback-1045-thread-1-processing-n:127.0.0.1:57015_bv%2Fj) [n:127.0.0.1:57015_bv%2Fj    ] o.a.s.c.DistributedQueue NodeChildrenChanged fired on path /overseer/queue state SyncConnected
   [junit4]   2> 1508279 INFO  (OverseerStateUpdate-94286111418023940-127.0.0.1:57015_bv%2Fj-n_0000000000) [n:127.0.0.1:57015_bv%2Fj    ] o.a.s.c.Overseer processMessage: queueSize: 1, message = {
   [junit4]   2>   "operation":"leader",
   [junit4]   2>   "shard":"shard1",
   [junit4]   2>   "collection":"control_collection"} current state version: 1
   [junit4]   2> 1508280 INFO  (zkCallback-1045-thread-1-processing-n:127.0.0.1:57015_bv%2Fj) [n:127.0.0.1:57015_bv%2Fj    ] o.a.s.c.c.ZkStateReader A cluster state change: WatchedEvent state:SyncConnected type:NodeDataChanged path:/clusterstate.json, has occurred - updating... (live nodes size: 1)
   [junit4]   2> 1508282 INFO  (zkCallback-1045-thread-1-processing-n:127.0.0.1:57015_bv%2Fj) [n:127.0.0.1:57015_bv%2Fj    ] o.a.s.c.c.ZkStateReader Updated cluster state version to 2
   [junit4]   2> 1508278 INFO  (coreZkRegister-4320-thread-1-processing-s:shard1 n:127.0.0.1:57015_bv%2Fj r:core_node1 x:collection1 c:control_collection) [n:127.0.0.1:57015_bv%2Fj c:control_collection s:shard1 r:core_node1 x:collection1] o.a.s.c.ShardLeaderElectionContext I am the new leader: http://127.0.0.1:57015/bv/j/collection1/ shard1
   [junit4]   2> 1508285 INFO  (coreZkRegister-4320-thread-1-processing-s:shard1 n:127.0.0.1:57015_bv%2Fj r:core_node1 x:collection1 c:control_collection) [n:127.0.0.1:57015_bv%2Fj c:control_collection s:shard1 r:core_node1 x:collection1] o.a.s.c.c.SolrZkClient makePath: /collections/control_collection/leaders/shard1
   [junit4]   2> 1508288 INFO  (zkCallback-1045-thread-1-processing-n:127.0.0.1:57015_bv%2Fj) [n:127.0.0.1:57015_bv%2Fj    ] o.a.s.c.DistributedQueue NodeChildrenChanged fired on path /overseer/queue state SyncConnected
   [junit4]   2> 1508289 INFO  (OverseerStateUpdate-94286111418023940-127.0.0.1:57015_bv%2Fj-n_0000000000) [n:127.0.0.1:57015_bv%2Fj    ] o.a.s.c.Overseer processMessage: queueSize: 1, message = {
   [junit4]   2>   "operation":"leader",
   [junit4]   2>   "shard":"shard1",
   [junit4]   2>   "collection":"control_collection",
   [junit4]   2>   "base_url":"http://127.0.0.1:57015/bv/j",
   [junit4]   2>   "core":"collection1",
   [junit4]   2>   "state":"active"} current state version: 2
   [junit4]   2> 1508393 INFO  (zkCallback-1045-thread-1-processing-n:127.0.0.1:57015_bv%2Fj) [n:127.0.0.1:57015_bv%2Fj    ] o.a.s.c.c.ZkStateReader A cluster state change: WatchedEvent state:SyncConnected type:NodeDataChanged path:/clusterstate.json, has occurred - updating... (live nodes size: 1)
   [junit4]   2> 1508395 INFO  (zkCallback-1045-thread-1-processing-n:127.0.0.1:57015_bv%2Fj) [n:127.0.0.1:57015_bv%2Fj    ] o.a.s.c.c.ZkStateReader Updated cluster state version to 3
   [junit4]   2> 1508442 INFO  (coreZkRegister-4320-thread-1-processing-s:shard1 n:127.0.0.1:57015_bv%2Fj r:core_node1 x:collection1 c:control_collection) [n:127.0.0.1:57015_bv%2Fj c:control_collection s:shard1 r:core_node1 x:collection1] o.a.s.c.ZkController We are http://127.0.0.1:57015/bv/j/collection1/ and leader is http://127.0.0.1:57015/bv/j/collection1/
   [junit4]   2> 1508443 INFO  (coreZkRegister-4320-thread-1-processing-s:shard1 n:127.0.0.1:57015_bv%2Fj r:core_node1 x:collection1 c:control_collection) [n:127.0.0.1:57015_bv%2Fj c:control_collection s:shard1 r:core_node1 x:collection1] o.a.s.c.ZkController No LogReplay needed for core=collection1 baseURL=http://127.0.0.1:57015/bv/j
   [junit4]   2> 1508443 INFO  (coreZkRegister-4320-thread-1-processing-s:shard1 n:127.0.0.1:57015_bv%2Fj r:core_node1 x:collection1 c:control_collection) [n:127.0.0.1:57015_bv%2Fj c:control_collection s:shard1 r:core_node1 x:collection1] o.a.s.c.ZkController I am the leader, no recovery necessary
   [junit4]   2> 1508443 INFO  (coreZkRegister-4320-thread-1-processing-s:shard1 n:127.0.0.1:57015_bv%2Fj r:core_node1 x:collection1 c:control_collection) [n:127.0.0.1:57015_bv%2Fj c:control_collection s:shard1 r:core_node1 x:collection1] o.a.s.c.ZkController publishing state=active
   [junit4]   2> 1508443 INFO  (coreZkRegister-4320-thread-1-processing-s:shard1 n:127.0.0.1:57015_bv%2Fj r:core_node1 x:collection1 c:control_collection) [n:127.0.0.1:57015_bv%2Fj c:control_collection s:shard1 r:core_node1 x:collection1] o.a.s.c.ZkController numShards not found on descriptor - reading it from system property
   [junit4]   2> 1508445 INFO  (zkCallback-1045-thread-1-processing-n:127.0.0.1:57015_bv%2Fj) [n:127.0.0.1:57015_bv%2Fj    ] o.a.s.c.DistributedQueue NodeChildrenChanged fired on path /overseer/queue state SyncConnected
   [junit4]   2> 1508447 INFO  (OverseerStateUpdate-94286111418023940-127.0.0.1:57015_bv%2Fj-n_0000000000) [n:127.0.0.1:57015_bv%2Fj    ] o.a.s.c.Overseer processMessage: queueSize: 1, message = {
   [junit4]   2>   "shard":"shard1",
   [junit4]   2>   "node_name":"127.0.0.1:57015_bv%2Fj",
   [junit4]   2>   "core":"collection1",
   [junit4]   2>   "core_node_name":"core_node1",
   [junit4]   2>   "operation":"state",
   [junit4]   2>   "numShards":"1",
   [junit4]   2>   "collection":"control_collection",
   [junit4]   2>   "base_url":"http://127.0.0.1:57015/bv/j",
   [junit4]   2>   "state":"active",
   [junit4]   2>   "roles":null} current state version: 3
   [junit4]   2> 1508449 INFO  (OverseerStateUpdate-94286111418023940-127.0.0.1:57015_bv%2Fj-n_0000000000) [n:127.0.0.1:57015_bv%2Fj    ] o.a.s.c.o.ReplicaMutator Update state numShards=1 message={
   [junit4]   2>   "shard":"shard1",
   [junit4]   2>   "node_name":"127.0.0.1:57015_bv%2Fj",
   [junit4]   2>   "core":"collection1",
   [junit4]   2>   "core_node_name":"core_node1",
   [junit4]   2>   "operation":"state",
   [junit4]   2>   "numShards":"1",
   [junit4]   2>   "collection":"control_collection",
   [junit4]   2>   "base_url":"http://127.0.0.1:57015/bv/j",
   [junit4]   2>   "state":"active",
   [junit4]   2>   "roles":null}
   [junit4]   2> 1508501 INFO  (TEST-FullSolrCloudDistribCmdsTest.test-seed#[ECA2FE4A899C4B36]) [    ] o.a.s.c.c.SolrZkClient Using default ZkCredentialsProvider
   [junit4]   2> 1508508 INFO  (TEST-FullSolrCloudDistribCmdsTest.test-seed#[ECA2FE4A899C4B36]) [    ] o.a.s.c.c.ConnectionManager Waiting for client to connect to ZooKeeper
   [junit4]   2> 1508510 INFO  (zkCallback-1047-thread-1) [    ] o.a.s.c.c.ConnectionManager Watcher org.apache.solr.common.cloud.ConnectionManager@74d9ec3f name:ZooKeeperConnection Watcher:127.0.0.1:55464/solr got event WatchedEvent state:SyncConnected type:None path:null path:null type:None
   [junit4]   2> 1508510 INFO  (TEST-FullSolrCloudDistribCmdsTest.test-seed#[ECA2FE4A899C4B36]) [    ] o.a.s.c.c.ConnectionManager Client is connected to ZooKeeper
   [junit4]   2> 1508510 INFO  (TEST-FullSolrCloudDistribCmdsTest.test-seed#[ECA2FE4A899C4B36]) [    ] o.a.s.c.c.SolrZkClient Using default ZkACLProvider
   [junit4]   2> 1508510 INFO  (TEST-FullSolrCloudDistribCmdsTest.test-seed#[ECA2FE4A899C4B36]) [    ] o.a.s.c.c.ZkStateReader Updating cluster state from ZooKeeper... 
   [junit4]   2> 1508514 INFO  (TEST-FullSolrCloudDistribCmdsTest.test-seed#[ECA2FE4A899C4B36]) [    ] o.a.s.c.ChaosMonkey monkey: init - expire sessions:false cause connection loss:false
   [junit4]   2> 1508552 INFO  (zkCallback-1047-thread-1) [    ] o.a.s.c.c.ZkStateReader A cluster state change: WatchedEvent state:SyncConnected type:NodeDataChanged path:/clusterstate.json, has occurred - updating... (live nodes size: 1)
   [junit4]   2> 1508552 INFO  (zkCallback-1045-thread-1-processing-n:127.0.0.1:57015_bv%2Fj) [n:127.0.0.1:57015_bv%2Fj    ] o.a.s.c.c.ZkStateReader A cluster state change: WatchedEvent state:SyncConnected type:NodeDataChanged path:/clusterstate.json, has occurred - updating... (live nodes size: 1)
   [junit4]   2> 1508554 INFO  (zkCallback-1047-thread-1) [    ] o.a.s.c.c.ZkStateReader Updated cluster state version to 4
   [junit4]   2> 1508555 INFO  (zkCallback-1045-thread-1-processing-n:127.0.0.1:57015_bv%2Fj) [n:127.0.0.1:57015_bv%2Fj    ] o.a.s.c.c.ZkStateReader Updated cluster state version to 4
   [junit4]   2> 1509067 INFO  (TEST-FullSolrCloudDistribCmdsTest.test-seed#[ECA2FE4A899C4B36]) [    ] o.a.s.SolrTestCaseJ4 Writing core.properties file to /x1/jenkins/jenkins-slave/workspace/Lucene-Solr-NightlyTests-5.x/solr/build/solr-core/test/J2/temp/solr.cloud.FullSolrCloudDistribCmdsTest_ECA2FE4A899C4B36-001/shard-1-001/cores/collection1
   [junit4]   2> 1509068 INFO  (TEST-FullSolrCloudDistribCmdsTest.test-seed#[ECA2FE4A899C4B36]) [    ] o.a.s.c.AbstractFullDistribZkTestBase create jetty 1 in directory /x1/jenkins/jenkins-slave/workspace/Lucene-Solr-NightlyTests-5.x/solr/build/solr-core/test/J2/temp/solr.cloud.FullSolrCloudDistribCmdsTest_ECA2FE4A899C4B36-001/shard-1-001
   [junit4]   2> 1509076 INFO  (TEST-FullSolrCloudDistribCmdsTest.test-seed#[ECA2FE4A899C4B36]) [    ] o.e.j.s.Server jetty-9.2.11.v20150529
   [junit4]   2> 1509098 INFO  (TEST-FullSolrCloudDistribCmdsTest.test-seed#[ECA2FE4A899C4B36]) [    ] o.e.j.s.h.ContextHandler Started o.e.j.s.ServletContextHandler@da65d44{/bv/j,null,AVAILABLE}
   [junit4]   2> 1509098 INFO  (TEST-FullSolrCloudDistribCmdsTest.test-seed#[ECA2FE4A899C4B36]) [    ] o.e.j.s.ServerConnector Started ServerConnector@4362d919{HTTP/1.1}{127.0.0.1:59219}
   [junit4]   2> 1509098 INFO  (TEST-FullSolrCloudDistribCmdsTest.test-seed#[ECA2FE4A899C4B36]) [    ] o.e.j.s.Server Started @1512469ms
   [junit4]   2> 1509099 INFO  (TEST-FullSolrCloudDistribCmdsTest.test-seed#[ECA2FE4A899C4B36]) [    ] o.a.s.c.s.e.JettySolrRunner Jetty properties: {hostPort=59219, solr.data.dir=/x1/jenkins/jenkins-slave/workspace/Lucene-Solr-NightlyTests-5.x/solr/build/solr-core/test/J2/temp/solr.cloud.FullSolrCloudDistribCmdsTest_ECA2FE4A899C4B36-001/tempDir-001/jetty1, solrconfig=solrconfig.xml, coreRootDirectory=/x1/jenkins/jenkins-slave/workspace/Lucene-Solr-NightlyTests-5.x/solr/build/solr-core/test/J2/temp/solr.cloud.FullSolrCloudDistribCmdsTest_ECA2FE4A899C4B36-001/shard-1-001/cores, hostContext=/bv/j}
   [junit4]   2> 1509099 INFO  (TEST-FullSolrCloudDistribCmdsTest.test-seed#[ECA2FE4A899C4B36]) [    ] o.a.s.s.SolrDispatchFilter SolrDispatchFilter.init(): sun.misc.Launcher$AppClassLoader@1fe91485
   [junit4]   2> 1509099 INFO  (TEST-FullSolrCloudDistribCmdsTest.test-seed#[ECA2FE4A899C4B36]) [    ] o.a.s.c.SolrResourceLoader new SolrResourceLoader for directory: '/x1/jenkins/jenkins-slave/workspace/Lucene-Solr-NightlyTests-5.x/solr/build/solr-core/test/J2/temp/solr.cloud.FullSolrCloudDistribCmdsTest_ECA2FE4A899C4B36-001/shard-1-001/'
   [junit4]   2> 1509117 INFO  (TEST-FullSolrCloudDistribCmdsTest.test-seed#[ECA2FE4A899C4B36]) [    ] o.a.s.c.c.SolrZkClient Using default ZkCredentialsProvider
   [junit4]   2> 1509119 INFO  (TEST-FullSolrCloudDistribCmdsTest.test-seed#[ECA2FE4A899C4B36]) [    ] o.a.s.c.c.ConnectionManager Waiting for client to connect to ZooKeeper
   [junit4]   2> 1509129 INFO  (zkCallback-1048-thread-1) [    ] o.a.s.c.c.ConnectionManager Watcher org.apache.solr.common.cloud.ConnectionManager@75317318 name:ZooKeeperConnection Watcher:127.0.0.1:55464/solr got event WatchedEvent state:SyncConnected type:None path:null path:null type:None
   [junit4]   2> 1509129 INFO  (TEST-FullSolrCloudDistribCmdsTest.test-seed#[ECA2FE4A899C4B36]) [    ] o.a.s.c.c.ConnectionManager Client is connected to ZooKeeper
   [junit4]   2> 1509130 INFO  (TEST-FullSolrCloudDistribCmdsTest.test-seed#[ECA2FE4A899C4B36]) [    ] o.a.s.c.c.SolrZkClient Using default ZkACLProvider
   [junit4]   2> 1509136 INFO  (TEST-FullSolrCloudDistribCmdsTest.test-seed#[ECA2FE4A899C4B36]) [    ] o.a.s.s.SolrDispatchFilter Loading solr.xml from SolrHome (not found in ZooKeeper)
   [junit4]   2> 1509136 INFO  (TEST-FullSolrCloudDistribCmdsTest.test-seed#[ECA2FE4A899C4B36]) [    ] o.a.s.c.SolrXmlConfig Loading container configuration from /x1/jenkins/jenkins-slave/workspace/Lucene-Solr-NightlyTests-5.x/solr/build/solr-core/test/J2/temp/solr.cloud.FullSolrCloudDistribCmdsTest_ECA2FE4A899C4B36-001/shard-1-001/solr.xml
   [junit4]   2> 1509156 INFO  (TEST-FullSolrCloudDistribCmdsTest.test-seed#[ECA2FE4A899C4B36]) [    ] o.a.s.c.CoresLocator Config-defined core root directory: /x1/jenkins/jenkins-slave/workspace/Lucene-Solr-NightlyTests-5.x/solr/build/solr-core/test/J2/temp/solr.cloud.FullSolrCloudDistribCmdsTest_ECA2FE4A899C4B36-001/shard-1-001/cores
   [junit4]   2> 1509156 INFO  (TEST-FullSolrCloudDistribCmdsTest.test-seed#[ECA2FE4A899C4B36]) [    ] o.a.s.c.CoreContainer New CoreContainer 753145205
   [junit4]   2> 1509156 INFO  (TEST-FullSolrCloudDistribCmdsTest.test-seed#[ECA2FE4A899C4B36]) [    ] o.a.s.c.CoreContainer Loading cores into CoreContainer [instanceDir=/x1/jenkins/jenkins-slave/workspace/Lucene-Solr-NightlyTests-5.x/solr/build/solr-core/test/J2/temp/solr.cloud.FullSolrCloudDistribCmdsTest_ECA2FE4A899C4B36-001/shard-1-001/]
   [junit4]   2> 1509156 INFO  (TEST-FullSolrCloudDistribCmdsTest.test-seed#[ECA2FE4A899C4B36]) [    ] o.a.s.c.CoreContainer loading shared library: /x1/jenkins/jenkins-slave/workspace/Lucene-Solr-NightlyTests-5.x/solr/build/solr-core/test/J2/temp/solr.cloud.FullSolrCloudDistribCmdsTest_ECA2FE4A899C4B36-001/shard-1-001/lib
   [junit4]   2> 1509157 WARN  (TEST-FullSolrCloudDistribCmdsTest.test-seed#[ECA2FE4A899C4B36]) [    ] o.a.s.c.SolrResourceLoader Can't find (or read) directory to add to classloader: lib (resolved as: /x1/jenkins/jenkins-slave/workspace/Lucene-Solr-NightlyTests-5.x/solr/build/solr-core/test/J2/temp/solr.cloud.FullSolrCloudDistribCmdsTest_ECA2FE4A899C4B36-001/shard-1-001/lib).
   [junit4]   2> 1509169 INFO  (TEST-FullSolrCloudDistribCmdsTest.test-seed#[ECA2FE4A899C4B36]) [    ] o.a.s.h.c.HttpShardHandlerFactory created with socketTimeout : 90000,urlScheme : ,connTimeout : 15000,maxConnectionsPerHost : 20,maxConnections : 10000,corePoolSize : 0,maximumPoolSize : 2147483647,maxThreadIdleTime : 5,sizeOfQueue : -1,fairnessPolicy : false,useRetries : false,
   [junit4]   2> 1509170 INFO  (TEST-FullSolrCloudDistribCmdsTest.test-seed#[ECA2FE4A899C4B36]) [    ] o.a.s.u.UpdateShardHandler Creating UpdateShardHandler HTTP client with params: socketTimeout=340000&connTimeout=45000&retry=true
   [junit4]   2> 1509171 INFO  (TEST-FullSolrCloudDistribCmdsTest.test-seed#[ECA2FE4A899C4B36]) [    ] o.a.s.l.LogWatcher SLF4J impl is org.slf4j.impl.Log4jLoggerFactory
   [junit4]   2> 1509171 INFO  (TEST-FullSolrCloudDistribCmdsTest.test-seed#[ECA2FE4A899C4B36]) [    ] o.a.s.l.LogWatcher Registering Log Listener [Log4j (org.slf4j.impl.Log4jLoggerFactory)]
   [junit4]   2> 1509171 INFO  (TEST-FullSolrCloudDistribCmdsTest.test-seed#[ECA2FE4A899C4B36]) [    ] o.a.s.c.ZkContainer Zookeeper client=127.0.0.1:55464/solr
   [junit4]   2> 1509171 INFO  (TEST-FullSolrCloudDistribCmdsTest.test-seed#[ECA2FE4A899C4B36]) [    ] o.a.s.c.ZkController zkHost includes chroot
   [junit4]   2> 1509171 INFO  (TEST-FullSolrCloudDistribCmdsTest.test-seed#[ECA2FE4A899C4B36]) [    ] o.a.s.c.c.SolrZkClient Using default ZkCredentialsProvider
   [junit4]   2> 1509177 INFO  (TEST-FullSolrCloudDistribCmdsTest.test-seed#[ECA2FE4A899C4B36]) [    ] o.a.s.c.c.ConnectionManager Waiting for client to connect to ZooKeeper
   [junit4]   2> 1509177 INFO  (zkCallback-1050-thread-1) [    ] o.a.s.c.c.ConnectionManager Watcher org.apache.solr.common.cloud.ConnectionManager@3e958a2c name:ZooKeeperConnection Watcher:127.0.0.1:55464 got event WatchedEvent state:SyncConnected type:None path:null path:null type:None
   [junit4]   2> 1509178 INFO  (TEST-FullSolrCloudDistribCmdsTest.test-seed#[ECA2FE4A899C4B36]) [    ] o.a.s.c.c.ConnectionManager Client is connected to ZooKeeper
   [junit4]   2> 1509179 INFO  (TEST-FullSolrCloudDistribCmdsTest.test-seed#[ECA2FE4A899C4B36]) [    ] o.a.s.c.c.SolrZkClient Using default ZkACLProvider
   [junit4]   2> 1509182 INFO  (TEST-FullSolrCloudDistribCmdsTest.test-seed#[ECA2FE4A899C4B36]) [n:127.0.0.1:59219_bv%2Fj    ] o.a.s.c.c.ConnectionManager Waiting for client to connect to ZooKeeper
   [junit4]   2> 1509182 INFO  (zkCallback-1051-thread-1-processing-n:127.0.0.1:59219_bv%2Fj) [n:127.0.0.1:59219_bv%2Fj    ] o.a.s.c.c.ConnectionManager Watcher org.apache.solr.common.cloud.ConnectionManager@29f184d8 name:ZooKeeperConnection Watcher:127.0.0.1:55464/solr got event WatchedEvent state:SyncConnected type:None path:null path:null type:None
   [junit4]   2> 1509182 INFO  (TEST-FullSolrCloudDistribCmdsTest.test-seed#[ECA2FE4A899C4B36]) [n:127.0.0.1:59219_bv%2Fj    ] o.a.s.c.c.ConnectionManager Client is connected to ZooKeeper
   [junit4]   2> 1509186 INFO  (TEST-FullSolrCloudDistribCmdsTest.test-seed#[ECA2FE4A899C4B36]) [n:127.0.0.1:59219_bv%2Fj    ] o.a.s.c.c.ZkStateReader Updating cluster state from ZooKeeper... 
   [junit4]   2> 1510190 INFO  (TEST-FullSolrCloudDistribCmdsTest.test-seed#[ECA2FE4A899C4B36]) [n:127.0.0.1:59219_bv%2Fj    ] o.a.s.c.ZkController Register node as live in ZooKeeper:/live_nodes/127.0.0.1:59219_bv%2Fj
   [junit4]   2> 1510191 INFO  (TEST-FullSolrCloudDistribCmdsTest.test-seed#[ECA2FE4A899C4B36]) [n:127.0.0.1:59219_bv%2Fj    ] o.a.s.c.c.SolrZkClient makePath: /live_nodes/127.0.0.1:59219_bv%2Fj
   [junit4]   2> 1510193 INFO  (TEST-FullSolrCloudDistribCmdsTest.test-seed#[ECA2FE4A899C4B36]) [n:127.0.0.1:59219_bv%2Fj    ] o.a.s.c.Overseer Overseer (id=null) closing
   [junit4]   2> 1510194 INFO  (TEST-FullSolrCloudDistribCmdsTest.test-seed#[ECA2FE4A899C4B36]) [n:127.0.0.1:59219_bv%2Fj    ] o.a.s.c.LeaderElector Joined leadership election with path: /overseer_elect/election/94286111418023944-127.0.0.1:59219_bv%2Fj-n_0000000001
   [junit4]   2> 1510195 INFO  (TEST-FullSolrCloudDistribCmdsTest.test-seed#[ECA2FE4A899C4B36]) [n:127.0.0.1:59219_bv%2Fj    ] o.a.s.c.LeaderElector Watching path /overseer_elect/election/94286111418023940-127.0.0.1:57015_bv%2Fj-n_0000000000 to know if I could be the leader
   [junit4]   2> 1510195 INFO  (TEST-FullSolrCloudDistribCmdsTest.test-seed#[ECA2FE4A899C4B36]) [n:127.0.0.1:59219_bv%2Fj    ] o.a.s.c.CoreContainer No authentication plugin used.
   [junit4]   2> 1510196 INFO  (TEST-FullSolrCloudDistribCmdsTest.test-seed#[ECA2FE4A899C4B36]) [n:127.0.0.1:59219_bv%2Fj    ] o.a.s.c.CoreContainer Security conf doesn't exist. Skipping setup for authorization module.
   [junit4]   2> 1510197 INFO  (TEST-FullSolrCloudDistribCmdsTest.test-seed#[ECA2FE4A899C4B36]) [n:127.0.0.1:59219_bv%2Fj    ] o.a.s.c.CoresLocator Looking for core definitions underneath /x1/jenkins/jenkins-slave/workspace/Lucene-Solr-NightlyTests-5.x/solr/build/solr-core/test/J2/temp/solr.cloud.FullSolrCloudDistribCmdsTest_ECA2FE4A899C4B36-001/shard-1-001/cores
   [junit4]   2> 1510197 INFO  (TEST-FullSolrCloudDistribCmdsTest.test-seed#[ECA2FE4A899C4B36]) [n:127.0.0.1:59219_bv%2Fj    ] o.a.s.c.SolrCore Created CoreDescriptor: {config=solrconfig.xml, shard=, absoluteInstDir=/x1/jenkins/jenkins-slave/workspace/Lucene-Solr-NightlyTests-5.x/solr/build/solr-core/test/J2/temp/solr.cloud.FullSolrCloudDistribCmdsTest_ECA2FE4A899C4B36-001/shard-1-001/cores/collection1/, dataDir=data/, schema=schema.xml, transient=false, collection=collection1, loadOnStartup=true, instanceDir=/x1/jenkins/jenkins-slave/workspace/Lucene-Solr-NightlyTests-5.x/solr/build/solr-core/test/J2/temp/solr.cloud.FullSolrCloudDistribCmdsTest_ECA2FE4A899C4B36-001/shard-1-001/cores/collection1, name=collection1, coreNodeName=, configSetProperties=configsetprops.json}
   [junit4]   2> 1510197 INFO  (TEST-FullSolrCloudDistribCmdsTest.test-seed#[ECA2FE4A899C4B36]) [n:127.0.0.1:59219_bv%2Fj    ] o.a.s.c.CoresLocator Found core collection1 in /x1/jenkins/jenkins-slave/workspace/Lucene-Solr-NightlyTests-5.x/solr/build/solr-core/test/J2/temp/solr.cloud.FullSolrCloudDistribCmdsTest_ECA2FE4A899C4B36-001/shard-1-001/cores/collection1/
   [junit4]   2> 1510198 INFO  (TEST-FullSolrCloudDistribCmdsTest.test-seed#[ECA2FE4A899C4B36]) [n:127.0.0.1:59219_bv%2Fj    ] o.a.s.c.CoresLocator Found 1 core definitions
   [junit4]   2> 1510204 INFO  (coreLoadExecutor-4337-thread-1-processing-n:127.0.0.1:59219_bv%2Fj) [n:127.0.0.1:59219_bv%2Fj c:collection1   x:collection1] o.a.s.c.ZkController publishing state=down
   [junit4]   2> 1510205 INFO  (coreLoadExecutor-4337-thread-1-processing-n:127.0.0.1:59219_bv%2Fj) [n:127.0.0.1:59219_bv%2Fj c:collection1   x:collection1] o.a.s.c.ZkController numShards not found on descriptor - reading it from system property
   [junit4]   2> 1510206 INFO  (zkCallback-1045-thread-1-processing-n:127.0.0.1:57015_bv%2Fj) [n:127.0.0.1:57015_bv%2Fj    ] o.a.s.c.DistributedQueue NodeChildrenChanged fired on path /overseer/queue state SyncConnected
   [junit4]   2> 1510206 INFO  (coreLoadExecutor-4337-thread-1-processing-n:127.0.0.1:59219_bv%2Fj) [n:127.0.0.1:59219_bv%2Fj c:collection1   x:collection1] o.a.s.c.ZkController look for our core node name
   [junit4]   2> 1510207 INFO  (OverseerStateUpdate-94286111418023940-127.0.0.1:57015_bv%2Fj-n_0000000000) [n:127.0.0.1:57015_bv%2Fj    ] o.a.s.c.Overseer processMessage: queueSize: 1, message = {
   [junit4]   2>   "shard":null,
   [junit4]   2>   "node_name":"127.0.0.1:59219_bv%2Fj",
   [junit4]   2>   "core":"collection1",
   [junit4]   2>   "operation":"state",
   [junit4]   2>   "numShards":"3",
   [junit4]   2>   "collection":"collection1",
   [junit4]   2>   "base_url":"http://127.0.0.1:59219/bv/j",
   [junit4]   2>   "state":"down",
   [junit4]   2>   "roles":null} current state version: 4
   [junit4]   2> 1510207 INFO  (OverseerStateUpdate-94286111418023940-127.0.0.1:57015_bv%2Fj-n_0000000000) [n:127.0.0.1:57015_bv%2Fj    ] o.a.s.c.o.ReplicaMutator Update state numShards=3 message={
   [junit4]   2>   "shard":null,
   [junit4]   2>   "node_name":"127.0.0.1:59219_bv%2Fj",
   [junit4]   2>   "core":"collection1",
   [junit4]   2>   "operation":"state",
   [junit4]   2>   "numShards":"3",
   [junit4]   2>   "collection":"collection1",
   [junit4]   2>   "base_url":"http://127.0.0.1:59219/bv/j",
   [junit4]   2>   "state":"down",
   [junit4]   2>   "roles":null}
   [junit4]   2> 1510208 INFO  (OverseerStateUpdate-94286111418023940-127.0.0.1:57015_bv%2Fj-n_0000000000) [n:127.0.0.1:57015_bv%2Fj    ] o.a.s.c.o.ClusterStateMutator building a new cName: collection1
   [junit4]   2> 1510208 INFO  (OverseerStateUpdate-94286111418023940-127.0.0.1:57015_bv%2Fj-n_0000000000) [n:127.0.0.1:57015_bv%2Fj    ] o.a.s.c.o.ReplicaMutator Assigning new node to shard shard=shard3
   [junit4]   2> 1510210 INFO  (zkCallback-1047-thread-1) [    ] o.a.s.c.c.ZkStateReader A cluster state change: WatchedEvent state:SyncConnected type:NodeDataChanged path:/clusterstate.json, has occurred - updating... (live nodes size: 2)
   [junit4]   2> 1510210 INFO  (zkCallback-1051-thread-1-processing-n:127.0.0.1:59219_bv%2Fj) [n:127.0.0.1:59219_bv%2Fj    ] o.a.s.c.c.ZkStateReader A cluster state change: WatchedEvent state:SyncConnected type:NodeDataChanged path:/clusterstate.json, has occurred - updating... (live nodes size: 2)
   [junit4]   2> 1510210 INFO  (zkCallback-1045-thread-1-processing-n:127.0.0.1:57015_bv%2Fj) [n:127.0.0.1:57015_bv%2Fj    ] o.a.s.c.c.ZkStateReader A cluster state change: WatchedEvent state:SyncConnected type:NodeDataChanged path:/clusterstate.json, has occurred - updating... (live nodes size: 2)
   [junit4]   2> 1510213 INFO  (zkCallback-1051-thread-1-processing-n:127.0.0.1:59219_bv%2Fj) [n:127.0.0.1:59219_bv%2Fj    ] o.a.s.c.c.ZkStateReader Updated cluster state version to 5
   [junit4]   2> 1510214 INFO  (zkCallback-1045-thread-1-processing-n:127.0.0.1:57015_bv%2Fj) [n:127.0.0.1:57015_bv%2Fj    ] o.a.s.c.c.ZkStateReader Updated cluster state version to 5
   [junit4]   2> 1510215 INFO  (zkCallback-1047-thread-1) [    ] o.a.s.c.c.ZkStateReader Updated cluster state version to 5
   [junit4]   2> 1510222 INFO  (TEST-FullSolrCloudDistribCmdsTest.test-seed#[ECA2FE4A899C4B36]) [n:127.0.0.1:59219_bv%2Fj    ] o.a.s.s.SolrDispatchFilter user.dir=/x1/jenkins/jenkins-slave/workspace/Lucene-Solr-NightlyTests-5.x/solr/build/solr-core/test/J2
   [junit4]   2> 1510222 INFO  (TEST-FullSolrCloudDistribCmdsTest.test-seed#[ECA2FE4A899C4B36]) [n:127.0.0.1:59219_bv%2Fj    ] o.a.s.s.SolrDispatchFilter SolrDispatchFilter.init() done
   [junit4]   2> 1511213 INFO  (coreLoadExecutor-4337-thread-1-processing-n:127.0.0.1:59219_bv%2Fj) [n:127.0.0.1:59219_bv%2Fj c:collection1   x:collection1] o.a.s.c.ZkController waiting to find shard id in clusterstate for collection1
   [junit4]   2> 1511213 INFO  (coreLoadExecutor-4337-thread-1-processing-n:127.0.0.1:59219_bv%2Fj) [n:127.0.0.1:59219_bv%2Fj c:collection1   x:collection1] o.a.s.c.ZkController Check for collection zkNode:collection1
   [junit4]   2> 1511213 INFO  (coreLoadExecutor-4337-thread-1-processing-n:127.0.0.1:59219_bv%2Fj) [n:127.0.0.1:59219_bv%2Fj c:collection1   x:collection1] o.a.s.c.ZkController Collection zkNode exists
   [junit4]   2> 1511214 INFO  (coreLoadExecutor-4337-thread-1-processing-n:127.0.0.1:59219_bv%2Fj) [n:127.0.0.1:59219_bv%2Fj c:collection1   x:collection1] o.a.s.c.c.ZkStateReader Load collection config from:/collections/collection1
   [junit4]   2> 1511214 INFO  (coreLoadExecutor-4337-thread-1-processing-n:127.0.0.1:59219_bv%2Fj) [n:127.0.0.1:59219_bv%2Fj c:collection1   x:collection1] o.a.s.c.c.ZkStateReader path=/collections/collection1 configName=conf1 specified config exists in ZooKeeper
   [junit4]   2> 1511215 INFO  (coreLoadExecutor-4337-thread-1-processing-n:127.0.0.1:59219_bv%2Fj) [n:127.0.0.1:59219_bv%2Fj c:collection1   x:collection1] o.a.s.c.SolrResourceLoader new SolrResourceLoader for directory: '/x1/jenkins/jenkins-slave/workspace/Lucene-Solr-NightlyTests-5.x/solr/build/solr-core/test/J2/temp/solr.cloud.FullSolrCloudDistribCmdsTest_ECA2FE4A899C4B36-001/shard-1-001/cores/collection1/'
   [junit4]   2> 1511242 INFO  (coreLoadExecutor-4337-thread-1-processing-n:127.0.0.1:59219_bv%2Fj) [n:127.0.0.1:59219_bv%2Fj c:collection1   x:collection1] o.a.s.c.Config loaded config solrconfig.xml with version 0 
   [junit4]   2> 1511251 INFO  (coreLoadExecutor-4337-thread-1-processing-n:127.0.0.1:59219_bv%2Fj) [n:127.0.0.1:59219_bv%2Fj c:collection1   x:collection1] o.a.s.c.SolrConfig current version of requestparams : -1
   [junit4]   2> 1511276 INFO  (coreLoadExecutor-4337-thread-1-processing-n:127.0.0.1:59219_bv%2Fj) [n:127.0.0.1:59219_bv%2Fj c:collection1   x:collection1] o.a.s.c.SolrConfig Using Lucene MatchVersion: 5.3.0
   [junit4]   2> 1511351 INFO  (coreLoadExecutor-4337-thread-1-processing-n:127.0.0.1:59219_bv%2Fj) [n:127.0.0.1:59219_bv%2Fj c:collection1   x:collection1] o.a.s.c.Config Loaded SolrConfig: solrconfig.xml
   [junit4]   2> 1511353 INFO  (coreLoadExecutor-4337-thread-1-processing-n:127.0.0.1:59219_bv%2Fj) [n:127.0.0.1:59219_bv%2Fj c:collection1   x:collection1] o.a.s.s.IndexSchema Reading Solr Schema from /configs/conf1/schema.xml
   [junit4]   2> 1511382 INFO  (coreLoadExecutor-4337-thread-1-processing-n:127.0.0.1:59219_bv%2Fj) [n:127.0.0.1:59219_bv%2Fj c:collection1   x:collection1] o.a.s.s.IndexSchema [collection1] Schema name=test
   [junit4]   2> 1511709 INFO  (coreLoadExecutor-4337-thread-1-processing-n:127.0.0.1:59219_bv%2Fj) [n:127.0.0.1:59219_bv%2Fj c:collection1   x:collection1] o.a.s.s.IndexSchema default search field in schema is text
   [junit4]   2> 1511711 INFO  (coreLoadExecutor-4337-thread-1-processing-n:127.0.0.1:59219_bv%2Fj) [n:127.0.0.1:59219_bv%2Fj c:collection1   x:collection1] o.a.s.s.IndexSchema unique key field: id
   [junit4]   2> 1511712 INFO  (coreLoadExecutor-4337-thread-1-processing-n:127.0.0.1:59219_bv%2Fj) [n:127.0.0.1:59219_bv%2Fj c:collection1   x:collection1] o.a.s.s.FileExchangeRateProvider Reloading exchange rates from file currency.xml
   [junit4]   2> 1511715 INFO  (coreLoadExecutor-4337-thread-1-processing-n:127.0.0.1:59219_bv%2Fj) [n:127.0.0.1:59219_bv%2Fj c:collection1   x:collection1] o.a.s.s.FileExchangeRateProvider Reloading exchange rates from file currency.xml
   [junit4]   2> 1511769 INFO  (coreLoadExecutor-4337-thread-1-processing-n:127.0.0.1:59219_bv%2Fj) [n:127.0.0.1:59219_bv%2Fj c:collection1   x:collection1] o.a.s.c.ConfigSetProperties Did not find ConfigSet properties, assuming default properties: Can't find resource 'configsetprops.json' in classpath or '/configs/conf1', cwd=/x1/jenkins/jenkins-slave/workspace/Lucene-Solr-NightlyTests-5.x/solr/build/solr-core/test/J2
   [junit4]   2> 1511770 INFO  (coreLoadExecutor-4337-thread-1-processing-n:127.0.0.1:59219_bv%2Fj) [n:127.0.0.1:59219_bv%2Fj c:collection1   x:collection1] o.a.s.c.CoreContainer Creating SolrCore 'collection1' using configuration from collection collection1
   [junit4]   2> 1511770 INFO  (coreLoadExecutor-4337-thread-1-processing-n:127.0.0.1:59219_bv%2Fj) [n:127.0.0.1:59219_bv%2Fj c:collection1 s:shard3 r:core_node1 x:collection1] o.a.s.c.SolrCore org.apache.solr.core.MockDirectoryFactory
   [junit4]   2> 1511770 INFO  (coreLoadExecutor-4337-thread-1-processing-n:127.0.0.1:59219_bv%2Fj) [n:127.0.0.1:59219_bv%2Fj c:collection1 s:shard3 r:core_node1 x:collection1] o.a.s.c.SolrCore [[collection1] ] Opening new SolrCore at [/x1/jenkins/jenkins-slave/workspace/Lucene-Solr-NightlyTests-5.x/solr/build/solr-core/test/J2/temp/solr.cloud.FullSolrCloudDistribCmdsTest_ECA2FE4A899C4B36-001/shard-1-001/cores/collection1/], dataDir=[null]
   [junit4]   2> 1511770 INFO  (coreLoadExecutor-4337-thread-1-processing-n:127.0.0.1:59219_bv%2Fj) [n:127.0.0.1:59219_bv%2Fj c:collection1 s:shard3 r:core_node1 x:collection1] o.a.s.c.JmxMonitoredMap JMX monitoring is enabled. Adding Solr mbeans to JMX Server: com.sun.jmx.mbeanserver.JmxMBeanServer@40c31593
   [junit4]   2> 1511771 INFO  (coreLoadExecutor-4337-thread-1-processing-n:127.0.0.1:59219_bv%2Fj) [n:127.0.0.1:59219_bv%2Fj c:collection1 s:shard3 r:core_node1 x:collection1] o.a.s.c.CachingDirectoryFactory return new directory for /x1/jenkins/jenkins-slave/workspace/Lucene-Solr-NightlyTests-5.x/solr/build/solr-core/test/J2/temp/solr.cloud.FullSolrCloudDistribCmdsTest_ECA2FE4A899C4B36-001/shard-1-001/cores/collection1/data
   [junit4]   2> 1511771 INFO  (coreLoadExecutor-4337-thread-1-processing-n:127.0.0.1:59219_bv%2Fj)

[...truncated too long message...]

trics2.lib.DefaultMetricsSystem.shutdown(DefaultMetricsSystem.java:68)
   [junit4]   2> 	at org.apache.hadoop.hdfs.server.namenode.metrics.NameNodeMetrics.shutdown(NameNodeMetrics.java:145)
   [junit4]   2> 	at org.apache.hadoop.hdfs.server.namenode.NameNode.stop(NameNode.java:822)
   [junit4]   2> 	at org.apache.hadoop.hdfs.MiniDFSCluster.shutdown(MiniDFSCluster.java:1720)
   [junit4]   2> 	at org.apache.hadoop.hdfs.MiniDFSCluster.shutdown(MiniDFSCluster.java:1699)
   [junit4]   2> 	at org.apache.solr.cloud.hdfs.HdfsTestUtil.teardownClass(HdfsTestUtil.java:197)
   [junit4]   2> 	at org.apache.solr.cloud.hdfs.HdfsCollectionsAPIDistributedZkTest.teardownClass(HdfsCollectionsAPIDistributedZkTest.java:50)
   [junit4]   2> 	at sun.reflect.NativeMethodAccessorImpl.invoke0(Native Method)
   [junit4]   2> 	at sun.reflect.NativeMethodAccessorImpl.invoke(NativeMethodAccessorImpl.java:57)
   [junit4]   2> 	at sun.reflect.DelegatingMethodAccessorImpl.invoke(DelegatingMethodAccessorImpl.java:43)
   [junit4]   2> 	at java.lang.reflect.Method.invoke(Method.java:606)
   [junit4]   2> 	at com.carrotsearch.randomizedtesting.RandomizedRunner.invoke(RandomizedRunner.java:1627)
   [junit4]   2> 	at com.carrotsearch.randomizedtesting.RandomizedRunner$5.evaluate(RandomizedRunner.java:799)
   [junit4]   2> 	at com.carrotsearch.randomizedtesting.rules.StatementAdapter.evaluate(StatementAdapter.java:36)
   [junit4]   2> 	at com.carrotsearch.randomizedtesting.rules.SystemPropertiesRestoreRule$1.evaluate(SystemPropertiesRestoreRule.java:57)
   [junit4]   2> 	at org.apache.lucene.util.AbstractBeforeAfterRule$1.evaluate(AbstractBeforeAfterRule.java:46)
   [junit4]   2> 	at com.carrotsearch.randomizedtesting.rules.StatementAdapter.evaluate(StatementAdapter.java:36)
   [junit4]   2> 	at org.apache.lucene.util.TestRuleStoreClassName$1.evaluate(TestRuleStoreClassName.java:42)
   [junit4]   2> 	at com.carrotsearch.randomizedtesting.rules.NoShadowingOrOverridesOnMethodsRule$1.evaluate(NoShadowingOrOverridesOnMethodsRule.java:39)
   [junit4]   2> 	at com.carrotsearch.randomizedtesting.rules.NoShadowingOrOverridesOnMethodsRule$1.evaluate(NoShadowingOrOverridesOnMethodsRule.java:39)
   [junit4]   2> 	at com.carrotsearch.randomizedtesting.rules.StatementAdapter.evaluate(StatementAdapter.java:36)
   [junit4]   2> 	at com.carrotsearch.randomizedtesting.rules.StatementAdapter.evaluate(StatementAdapter.java:36)
   [junit4]   2> 	at com.carrotsearch.randomizedtesting.rules.StatementAdapter.evaluate(StatementAdapter.java:36)
   [junit4]   2> 	at org.apache.lucene.util.TestRuleAssertionsRequired$1.evaluate(TestRuleAssertionsRequired.java:54)
   [junit4]   2> 	at org.apache.lucene.util.TestRuleMarkFailure$1.evaluate(TestRuleMarkFailure.java:48)
   [junit4]   2> 	at org.apache.lucene.util.TestRuleIgnoreAfterMaxFailures$1.evaluate(TestRuleIgnoreAfterMaxFailures.java:65)
   [junit4]   2> 	at org.apache.lucene.util.TestRuleIgnoreTestSuites$1.evaluate(TestRuleIgnoreTestSuites.java:55)
   [junit4]   2> 	at com.carrotsearch.randomizedtesting.rules.StatementAdapter.evaluate(StatementAdapter.java:36)
   [junit4]   2> 	at com.carrotsearch.randomizedtesting.ThreadLeakControl$StatementRunner.run(ThreadLeakControl.java:365)
   [junit4]   2> 	at java.lang.Thread.run(Thread.java:745)
   [junit4]   2> Caused by: java.lang.NullPointerException
   [junit4]   2> 	at org.apache.hadoop.hdfs.server.blockmanagement.BlocksMap.size(BlocksMap.java:198)
   [junit4]   2> 	at org.apache.hadoop.hdfs.server.blockmanagement.BlockManager.getTotalBlocks(BlockManager.java:3291)
   [junit4]   2> 	at org.apache.hadoop.hdfs.server.namenode.FSNamesystem.getBlocksTotal(FSNamesystem.java:6223)
   [junit4]   2> 	... 53 more
   [junit4]   2> 4179456 INFO  (SUITE-HdfsCollectionsAPIDistributedZkTest-seed#[ECA2FE4A899C4B36]-worker) [n:127.0.0.1:47646_ c:addReplicaColl s:shard1 r:core_node7 x:propertyDotName] o.a.s.SolrTestCaseJ4 ###deleteCore
   [junit4]   2> Aug 04, 2015 9:22:40 AM com.carrotsearch.randomizedtesting.ThreadLeakControl checkThreadLeaks
   [junit4]   2> WARNING: Will linger awaiting termination of 2 leaked thread(s).
   [junit4]   2> NOTE: test params are: codec=Asserting(Lucene53): {range_facet_i_dv=PostingsFormat(name=LuceneVarGapDocFreqInterval), multiDefault=PostingsFormat(name=Direct), _version_=PostingsFormat(name=LuceneVarGapDocFreqInterval), text=PostingsFormat(name=Asserting), intDefault=PostingsFormat(name=LuceneVarGapDocFreqInterval), range_facet_l=PostingsFormat(name=LuceneVarGapDocFreqInterval), id=FST50, a_t=PostingsFormat(name=LuceneVarGapDocFreqInterval), timestamp=PostingsFormat(name=LuceneVarGapDocFreqInterval), range_facet_l_dv=FST50, other_tl1=PostingsFormat(name=LuceneVarGapDocFreqInterval), a_i1=PostingsFormat(name=LuceneVarGapDocFreqInterval)}, docValues:{range_facet_i_dv=DocValuesFormat(name=Asserting), timestamp=DocValuesFormat(name=Asserting), range_facet_l_dv=DocValuesFormat(name=Memory)}, sim=DefaultSimilarity, locale=es_US, timezone=Europe/Chisinau
   [junit4]   2> NOTE: Linux 3.13.0-52-generic amd64/Oracle Corporation 1.7.0_72 (64-bit)/cpus=4,threads=2,free=124236672,total=523763712
   [junit4]   2> NOTE: All tests run in this JVM: [DistribCursorPagingTest, TestDefaultSimilarityFactory, TestIntervalFaceting, PathHierarchyTokenizerFactoryTest, ZkStateWriterTest, PrimUtilsTest, AutoCommitTest, ConcurrentDeleteAndCreateCollectionTest, TestLeaderElectionZkExpiry, DistributedDebugComponentTest, HdfsThreadLeakTest, TestSolrQueryParser, TestCustomSort, HighlighterMaxOffsetTest, TestReplicaProperties, DocValuesTest, TestUniqueKeyFieldResource, TestFieldSortValues, VMParamsZkACLAndCredentialsProvidersTest, SortByFunctionTest, SearchHandlerTest, TestPartialUpdateDeduplication, ConnectionManagerTest, TestPerFieldSimilarity, TestSolrXml, FileBasedSpellCheckerTest, TestTolerantSearch, TestFileDictionaryLookup, TestStressReorder, TestSchemaNameResource, SolrIndexSplitterTest, DistributedIntervalFacetingTest, SolrInfoMBeanTest, TestSchemaVersionResource, TestDefaultSearchFieldResource, DirectUpdateHandlerTest, TestLRUStatsCache, OverseerTest, TestExpandComponent, HardAutoCommitTest, TestCollationField, AddBlockUpdateTest, BlockDirectoryTest, TestPseudoReturnFields, PolyFieldTest, BasicDistributedZk2Test, TestRequestStatusCollectionAPI, HLLSerializationTest, SOLR749Test, TestSystemIdResolver, SimpleCollectionCreateDeleteTest, DirectSolrSpellCheckerTest, DOMUtilTest, TestAuthenticationFramework, LoggingHandlerTest, SolrCloudExampleTest, SuggestComponentTest, TestQueryUtils, ReplicationFactorTest, TestSolrQueryParserDefaultOperatorResource, DataDrivenBlockJoinTest, UnloadDistributedZkTest, TestSurroundQueryParser, TestFieldTypeResource, SoftAutoCommitTest, DistributedQueryElevationComponentTest, TestCloudInspectUtil, XmlUpdateRequestHandlerTest, OverseerCollectionProcessorTest, ExplicitHLLTest, RuleEngineTest, CachingDirectoryFactoryTest, TestConfigSets, LeaderElectionTest, InfoHandlerTest, StatsComponentTest, NotRequiredUniqueKeyTest, TestReload, SuggesterTest, TestQueryTypes, TestXIncludeConfig, AsyncMigrateRouteKeyTest, CollectionsAPIDistributedZkTest, LeaderElectionIntegrationTest, RecoveryZkTest, FullSolrCloudDistribCmdsTest, TestRandomFaceting, TestZkChroot, TestRandomDVFaceting, ZkCLITest, ShardRoutingCustomTest, TestDistributedSearch, CacheHeaderTest, DisMaxRequestHandlerTest, StandardRequestHandlerTest, TestOmitPositions, MoreLikeThisHandlerTest, IndexSchemaRuntimeFieldTest, SolrPluginUtilsTest, TestJmxIntegration, JSONWriterTest, QueryParsingTest, BinaryUpdateRequestHandlerTest, PingRequestHandlerTest, TestBinaryResponseWriter, UpdateParamsTest, TestQuerySenderNoQuery, ResponseLogComponentTest, BadComponentTest, TestStressRecovery, MultiTermTest, SampleTest, TestDocSet, TestBinaryField, TestSearchPerf, NumericFieldsTest, TestConfig, OutputWriterTest, TestFuzzyAnalyzedSuggestions, ExternalFileFieldSortTest, DirectSolrConnectionTest, TestLuceneMatchVersion, SpellPossibilityIteratorTest, TestCharFilters, SynonymTokenizerTest, EchoParamsTest, TestSweetSpotSimilarityFactory, TestLMDirichletSimilarityFactory, TestBM25SimilarityFactory, TestFastOutputStream, OpenExchangeRatesOrgProviderTest, URLClassifyProcessorTest, PluginInfoTest, ChaosMonkeyNothingIsSafeTest, CustomCollectionTest, LeaderFailoverAfterPartitionTest, MultiThreadedOCPTest, SharedFSAutoReplicaFailoverTest, TestRebalanceLeaders, HdfsBasicDistributedZk2Test, HdfsCollectionsAPIDistributedZkTest]
   [junit4] Completed [522/522] on J2 in 1208.06s, 1 test, 1 error <<< FAILURES!

[...truncated 12 lines...]
BUILD FAILED
/x1/jenkins/jenkins-slave/workspace/Lucene-Solr-NightlyTests-5.x/build.xml:733: The following error occurred while executing this line:
/x1/jenkins/jenkins-slave/workspace/Lucene-Solr-NightlyTests-5.x/build.xml:670: The following error occurred while executing this line:
/x1/jenkins/jenkins-slave/workspace/Lucene-Solr-NightlyTests-5.x/build.xml:59: The following error occurred while executing this line:
/x1/jenkins/jenkins-slave/workspace/Lucene-Solr-NightlyTests-5.x/solr/build.xml:230: The following error occurred while executing this line:
/x1/jenkins/jenkins-slave/workspace/Lucene-Solr-NightlyTests-5.x/solr/common-build.xml:524: The following error occurred while executing this line:
/x1/jenkins/jenkins-slave/workspace/Lucene-Solr-NightlyTests-5.x/lucene/common-build.xml:1449: The following error occurred while executing this line:
/x1/jenkins/jenkins-slave/workspace/Lucene-Solr-NightlyTests-5.x/lucene/common-build.xml:1003: There were test failures: 522 suites, 2081 tests, 2 errors, 25 ignored (14 assumptions)

Total time: 194 minutes 12 seconds
Build step 'Invoke Ant' marked build as failure
Archiving artifacts
Sending artifact delta relative to Lucene-Solr-NightlyTests-5.x #911
Archived 4 artifacts
Archive block size is 32768
Received 0 blocks and 1127844587 bytes
Compression is 0.0%
Took 3 min 22 sec
Recording test results
Email was triggered for: Failure
Sending email for trigger: Failure



Mime
View raw message