lucene-dev mailing list archives

Site index · List index
Message view « Date » · « Thread »
Top « Date » · « Thread »
From Apache Jenkins Server <jenk...@builds.apache.org>
Subject [JENKINS] Lucene-Solr-Tests-5.3-Java7 - Build # 24 - Still Failing
Date Thu, 20 Aug 2015 09:12:59 GMT
Build: https://builds.apache.org/job/Lucene-Solr-Tests-5.3-Java7/24/

2 tests failed.
REGRESSION:  org.apache.solr.cloud.TestReplicaProperties.test

Error Message:
No live SolrServers available to handle this request:[https://127.0.0.1:59915, https://127.0.0.1:49239, https://127.0.0.1:34262, https://127.0.0.1:53819, https://127.0.0.1:53201]

Stack Trace:
org.apache.solr.client.solrj.SolrServerException: No live SolrServers available to handle this request:[https://127.0.0.1:59915, https://127.0.0.1:49239, https://127.0.0.1:34262, https://127.0.0.1:53819, https://127.0.0.1:53201]
	at __randomizedtesting.SeedInfo.seed([879F03022915695A:FCB3CD887E904A2]:0)
	at org.apache.solr.client.solrj.impl.LBHttpSolrClient.request(LBHttpSolrClient.java:355)
	at org.apache.solr.client.solrj.impl.CloudSolrClient.sendRequest(CloudSolrClient.java:1085)
	at org.apache.solr.client.solrj.impl.CloudSolrClient.requestWithRetryOnStaleState(CloudSolrClient.java:856)
	at org.apache.solr.client.solrj.impl.CloudSolrClient.request(CloudSolrClient.java:799)
	at org.apache.solr.client.solrj.SolrClient.request(SolrClient.java:1220)
	at org.apache.solr.cloud.ReplicaPropertiesBase.doPropertyAction(ReplicaPropertiesBase.java:51)
	at org.apache.solr.cloud.TestReplicaProperties.clusterAssignPropertyTest(TestReplicaProperties.java:183)
	at org.apache.solr.cloud.TestReplicaProperties.test(TestReplicaProperties.java:70)
	at sun.reflect.NativeMethodAccessorImpl.invoke0(Native Method)
	at sun.reflect.NativeMethodAccessorImpl.invoke(NativeMethodAccessorImpl.java:57)
	at sun.reflect.DelegatingMethodAccessorImpl.invoke(DelegatingMethodAccessorImpl.java:43)
	at java.lang.reflect.Method.invoke(Method.java:606)
	at com.carrotsearch.randomizedtesting.RandomizedRunner.invoke(RandomizedRunner.java:1627)
	at com.carrotsearch.randomizedtesting.RandomizedRunner$6.evaluate(RandomizedRunner.java:836)
	at com.carrotsearch.randomizedtesting.RandomizedRunner$7.evaluate(RandomizedRunner.java:872)
	at com.carrotsearch.randomizedtesting.RandomizedRunner$8.evaluate(RandomizedRunner.java:886)
	at org.apache.solr.BaseDistributedSearchTestCase$ShardsRepeatRule$ShardsFixedStatement.callStatement(BaseDistributedSearchTestCase.java:963)
	at org.apache.solr.BaseDistributedSearchTestCase$ShardsRepeatRule$ShardsStatement.evaluate(BaseDistributedSearchTestCase.java:938)
	at com.carrotsearch.randomizedtesting.rules.SystemPropertiesRestoreRule$1.evaluate(SystemPropertiesRestoreRule.java:57)
	at org.apache.lucene.util.TestRuleSetupTeardownChained$1.evaluate(TestRuleSetupTeardownChained.java:50)
	at org.apache.lucene.util.AbstractBeforeAfterRule$1.evaluate(AbstractBeforeAfterRule.java:46)
	at org.apache.lucene.util.TestRuleThreadAndTestName$1.evaluate(TestRuleThreadAndTestName.java:49)
	at org.apache.lucene.util.TestRuleIgnoreAfterMaxFailures$1.evaluate(TestRuleIgnoreAfterMaxFailures.java:65)
	at org.apache.lucene.util.TestRuleMarkFailure$1.evaluate(TestRuleMarkFailure.java:48)
	at com.carrotsearch.randomizedtesting.rules.StatementAdapter.evaluate(StatementAdapter.java:36)
	at com.carrotsearch.randomizedtesting.ThreadLeakControl$StatementRunner.run(ThreadLeakControl.java:365)
	at com.carrotsearch.randomizedtesting.ThreadLeakControl.forkTimeoutingTask(ThreadLeakControl.java:798)
	at com.carrotsearch.randomizedtesting.ThreadLeakControl$3.evaluate(ThreadLeakControl.java:458)
	at com.carrotsearch.randomizedtesting.RandomizedRunner.runSingleTest(RandomizedRunner.java:845)
	at com.carrotsearch.randomizedtesting.RandomizedRunner$3.evaluate(RandomizedRunner.java:747)
	at com.carrotsearch.randomizedtesting.RandomizedRunner$4.evaluate(RandomizedRunner.java:781)
	at com.carrotsearch.randomizedtesting.RandomizedRunner$5.evaluate(RandomizedRunner.java:792)
	at com.carrotsearch.randomizedtesting.rules.StatementAdapter.evaluate(StatementAdapter.java:36)
	at com.carrotsearch.randomizedtesting.rules.SystemPropertiesRestoreRule$1.evaluate(SystemPropertiesRestoreRule.java:57)
	at org.apache.lucene.util.AbstractBeforeAfterRule$1.evaluate(AbstractBeforeAfterRule.java:46)
	at com.carrotsearch.randomizedtesting.rules.StatementAdapter.evaluate(StatementAdapter.java:36)
	at org.apache.lucene.util.TestRuleStoreClassName$1.evaluate(TestRuleStoreClassName.java:42)
	at com.carrotsearch.randomizedtesting.rules.NoShadowingOrOverridesOnMethodsRule$1.evaluate(NoShadowingOrOverridesOnMethodsRule.java:39)
	at com.carrotsearch.randomizedtesting.rules.NoShadowingOrOverridesOnMethodsRule$1.evaluate(NoShadowingOrOverridesOnMethodsRule.java:39)
	at com.carrotsearch.randomizedtesting.rules.StatementAdapter.evaluate(StatementAdapter.java:36)
	at com.carrotsearch.randomizedtesting.rules.StatementAdapter.evaluate(StatementAdapter.java:36)
	at com.carrotsearch.randomizedtesting.rules.StatementAdapter.evaluate(StatementAdapter.java:36)
	at org.apache.lucene.util.TestRuleAssertionsRequired$1.evaluate(TestRuleAssertionsRequired.java:54)
	at org.apache.lucene.util.TestRuleMarkFailure$1.evaluate(TestRuleMarkFailure.java:48)
	at org.apache.lucene.util.TestRuleIgnoreAfterMaxFailures$1.evaluate(TestRuleIgnoreAfterMaxFailures.java:65)
	at org.apache.lucene.util.TestRuleIgnoreTestSuites$1.evaluate(TestRuleIgnoreTestSuites.java:55)
	at com.carrotsearch.randomizedtesting.rules.StatementAdapter.evaluate(StatementAdapter.java:36)
	at com.carrotsearch.randomizedtesting.ThreadLeakControl$StatementRunner.run(ThreadLeakControl.java:365)
	at java.lang.Thread.run(Thread.java:745)
Caused by: org.apache.solr.client.solrj.impl.HttpSolrClient$RemoteSolrException: Error from server at https://127.0.0.1:53819: Expected mime type application/octet-stream but got text/html. <html>
<head>
<meta http-equiv="Content-Type" content="text/html;charset=ISO-8859-1"/>
<title>Error 500 </title>
</head>
<body>
<h2>HTTP ERROR: 500</h2>
<p>Problem accessing /admin/collections. Reason:
<pre>    {trace=java.lang.AssertionError
	at org.apache.solr.common.util.ByteUtils.UTF8toUTF16(ByteUtils.java:36)
	at org.apache.solr.common.util.ByteUtils.UTF8toUTF16(ByteUtils.java:64)
	at org.apache.solr.common.util.Utils.fromJSON(Utils.java:97)
	at org.apache.solr.common.cloud.ZkNodeProps.load(ZkNodeProps.java:81)
	at org.apache.solr.cloud.DistributedQueue.containsTaskWithRequestId(DistributedQueue.java:127)
	at org.apache.solr.handler.admin.CollectionsHandler.overseerCollectionQueueContains(CollectionsHandler.java:256)
	at org.apache.solr.handler.admin.CollectionsHandler.handleResponse(CollectionsHandler.java:208)
	at org.apache.solr.handler.admin.CollectionsHandler.handleResponse(CollectionsHandler.java:191)
	at org.apache.solr.handler.admin.RebalanceLeaders.rejoinElection(RebalanceLeaders.java:269)
	at org.apache.solr.handler.admin.RebalanceLeaders.insurePreferredIsLeader(RebalanceLeaders.java:184)
	at org.apache.solr.handler.admin.RebalanceLeaders.execute(RebalanceLeaders.java:91)
	at org.apache.solr.handler.admin.CollectionsHandler$CollectionOperation$23.call(CollectionsHandler.java:685)
	at org.apache.solr.handler.admin.CollectionsHandler.handleRequestBody(CollectionsHandler.java:166)
	at org.apache.solr.handler.RequestHandlerBase.handleRequest(RequestHandlerBase.java:143)
	at org.apache.solr.servlet.HttpSolrCall.handleAdminRequest(HttpSolrCall.java:675)
	at org.apache.solr.servlet.HttpSolrCall.call(HttpSolrCall.java:443)
	at org.apache.solr.servlet.SolrDispatchFilter.doFilter(SolrDispatchFilter.java:210)
	at org.apache.solr.servlet.SolrDispatchFilter.doFilter(SolrDispatchFilter.java:179)
	at org.eclipse.jetty.servlet.ServletHandler$CachedChain.doFilter(ServletHandler.java:1652)
	at org.apache.solr.client.solrj.embedded.JettySolrRunner$DebugFilter.doFilter(JettySolrRunner.java:106)
	at org.eclipse.jetty.servlet.ServletHandler$CachedChain.doFilter(ServletHandler.java:1652)
	at org.eclipse.jetty.servlets.UserAgentFilter.doFilter(UserAgentFilter.java:83)
	at org.eclipse.jetty.servlets.GzipFilter.doFilter(GzipFilter.java:364)
	at org.eclipse.jetty.servlet.ServletHandler$CachedChain.doFilter(ServletHandler.java:1652)
	at org.eclipse.jetty.servlet.ServletHandler.doHandle(ServletHandler.java:585)
	at org.eclipse.jetty.server.session.SessionHandler.doHandle(SessionHandler.java:221)
	at org.eclipse.jetty.server.handler.ContextHandler.doHandle(ContextHandler.java:1127)
	at org.eclipse.jetty.servlet.ServletHandler.doScope(ServletHandler.java:515)
	at org.eclipse.jetty.server.session.SessionHandler.doScope(SessionHandler.java:185)
	at org.eclipse.jetty.server.handler.ContextHandler.doScope(ContextHandler.java:1061)
	at org.eclipse.jetty.server.handler.ScopedHandler.handle(ScopedHandler.java:141)
	at org.eclipse.jetty.server.handler.HandlerWrapper.handle(HandlerWrapper.java:97)
	at org.eclipse.jetty.server.Server.handle(Server.java:499)
	at org.eclipse.jetty.server.HttpChannel.handle(HttpChannel.java:310)
	at org.eclipse.jetty.server.HttpConnection.onFillable(HttpConnection.java:257)
	at org.eclipse.jetty.io.AbstractConnection$2.run(AbstractConnection.java:540)
	at org.eclipse.jetty.util.thread.QueuedThreadPool.runJob(QueuedThreadPool.java:635)
	at org.eclipse.jetty.util.thread.QueuedThreadPool$3.run(QueuedThreadPool.java:555)
	at java.lang.Thread.run(Thread.java:745)
,code=500}</pre></p>
<hr /><i><small>Powered by Jetty://</small></i>
</body>
</html>

	at org.apache.solr.client.solrj.impl.HttpSolrClient.executeMethod(HttpSolrClient.java:528)
	at org.apache.solr.client.solrj.impl.HttpSolrClient.request(HttpSolrClient.java:234)
	at org.apache.solr.client.solrj.impl.HttpSolrClient.request(HttpSolrClient.java:226)
	at org.apache.solr.client.solrj.impl.LBHttpSolrClient.doRequest(LBHttpSolrClient.java:376)
	at org.apache.solr.client.solrj.impl.LBHttpSolrClient.request(LBHttpSolrClient.java:344)
	... 48 more


REGRESSION:  org.apache.solr.security.BasicAuthIntegrationTest.testBasics

Error Message:
expected:<200> but was:<403>

Stack Trace:
java.lang.AssertionError: expected:<200> but was:<403>
	at __randomizedtesting.SeedInfo.seed([879F03022915695A:BA47AD2E11FB372A]:0)
	at org.junit.Assert.fail(Assert.java:93)
	at org.junit.Assert.failNotEquals(Assert.java:647)
	at org.junit.Assert.assertEquals(Assert.java:128)
	at org.junit.Assert.assertEquals(Assert.java:472)
	at org.junit.Assert.assertEquals(Assert.java:456)
	at org.apache.solr.security.BasicAuthIntegrationTest.doExtraTests(BasicAuthIntegrationTest.java:132)
	at org.apache.solr.cloud.TestMiniSolrCloudCluster.testCollectionCreateSearchDelete(TestMiniSolrCloudCluster.java:208)
	at org.apache.solr.cloud.TestMiniSolrCloudCluster.testBasics(TestMiniSolrCloudCluster.java:87)
	at sun.reflect.NativeMethodAccessorImpl.invoke0(Native Method)
	at sun.reflect.NativeMethodAccessorImpl.invoke(NativeMethodAccessorImpl.java:57)
	at sun.reflect.DelegatingMethodAccessorImpl.invoke(DelegatingMethodAccessorImpl.java:43)
	at java.lang.reflect.Method.invoke(Method.java:606)
	at com.carrotsearch.randomizedtesting.RandomizedRunner.invoke(RandomizedRunner.java:1627)
	at com.carrotsearch.randomizedtesting.RandomizedRunner$6.evaluate(RandomizedRunner.java:836)
	at com.carrotsearch.randomizedtesting.RandomizedRunner$7.evaluate(RandomizedRunner.java:872)
	at com.carrotsearch.randomizedtesting.RandomizedRunner$8.evaluate(RandomizedRunner.java:886)
	at com.carrotsearch.randomizedtesting.rules.SystemPropertiesRestoreRule$1.evaluate(SystemPropertiesRestoreRule.java:57)
	at org.apache.lucene.util.TestRuleSetupTeardownChained$1.evaluate(TestRuleSetupTeardownChained.java:50)
	at org.apache.lucene.util.AbstractBeforeAfterRule$1.evaluate(AbstractBeforeAfterRule.java:46)
	at org.apache.lucene.util.TestRuleThreadAndTestName$1.evaluate(TestRuleThreadAndTestName.java:49)
	at org.apache.lucene.util.TestRuleIgnoreAfterMaxFailures$1.evaluate(TestRuleIgnoreAfterMaxFailures.java:65)
	at org.apache.lucene.util.TestRuleMarkFailure$1.evaluate(TestRuleMarkFailure.java:48)
	at com.carrotsearch.randomizedtesting.rules.StatementAdapter.evaluate(StatementAdapter.java:36)
	at com.carrotsearch.randomizedtesting.ThreadLeakControl$StatementRunner.run(ThreadLeakControl.java:365)
	at com.carrotsearch.randomizedtesting.ThreadLeakControl.forkTimeoutingTask(ThreadLeakControl.java:798)
	at com.carrotsearch.randomizedtesting.ThreadLeakControl$3.evaluate(ThreadLeakControl.java:458)
	at com.carrotsearch.randomizedtesting.RandomizedRunner.runSingleTest(RandomizedRunner.java:845)
	at com.carrotsearch.randomizedtesting.RandomizedRunner$3.evaluate(RandomizedRunner.java:747)
	at com.carrotsearch.randomizedtesting.RandomizedRunner$4.evaluate(RandomizedRunner.java:781)
	at com.carrotsearch.randomizedtesting.RandomizedRunner$5.evaluate(RandomizedRunner.java:792)
	at com.carrotsearch.randomizedtesting.rules.StatementAdapter.evaluate(StatementAdapter.java:36)
	at com.carrotsearch.randomizedtesting.rules.SystemPropertiesRestoreRule$1.evaluate(SystemPropertiesRestoreRule.java:57)
	at org.apache.lucene.util.AbstractBeforeAfterRule$1.evaluate(AbstractBeforeAfterRule.java:46)
	at com.carrotsearch.randomizedtesting.rules.StatementAdapter.evaluate(StatementAdapter.java:36)
	at org.apache.lucene.util.TestRuleStoreClassName$1.evaluate(TestRuleStoreClassName.java:42)
	at com.carrotsearch.randomizedtesting.rules.NoShadowingOrOverridesOnMethodsRule$1.evaluate(NoShadowingOrOverridesOnMethodsRule.java:39)
	at com.carrotsearch.randomizedtesting.rules.NoShadowingOrOverridesOnMethodsRule$1.evaluate(NoShadowingOrOverridesOnMethodsRule.java:39)
	at com.carrotsearch.randomizedtesting.rules.StatementAdapter.evaluate(StatementAdapter.java:36)
	at com.carrotsearch.randomizedtesting.rules.StatementAdapter.evaluate(StatementAdapter.java:36)
	at com.carrotsearch.randomizedtesting.rules.StatementAdapter.evaluate(StatementAdapter.java:36)
	at org.apache.lucene.util.TestRuleAssertionsRequired$1.evaluate(TestRuleAssertionsRequired.java:54)
	at org.apache.lucene.util.TestRuleMarkFailure$1.evaluate(TestRuleMarkFailure.java:48)
	at org.apache.lucene.util.TestRuleIgnoreAfterMaxFailures$1.evaluate(TestRuleIgnoreAfterMaxFailures.java:65)
	at org.apache.lucene.util.TestRuleIgnoreTestSuites$1.evaluate(TestRuleIgnoreTestSuites.java:55)
	at com.carrotsearch.randomizedtesting.rules.StatementAdapter.evaluate(StatementAdapter.java:36)
	at com.carrotsearch.randomizedtesting.ThreadLeakControl$StatementRunner.run(ThreadLeakControl.java:365)
	at java.lang.Thread.run(Thread.java:745)




Build Log:
[...truncated 11097 lines...]
   [junit4] Suite: org.apache.solr.cloud.TestReplicaProperties
   [junit4]   2> Creating dataDir: /x1/jenkins/jenkins-slave/workspace/Lucene-Solr-Tests-5.3-Java7/solr/build/solr-core/test/J1/temp/solr.cloud.TestReplicaProperties_879F03022915695A-001/init-core-data-001
   [junit4]   2> 1771417 INFO  (SUITE-TestReplicaProperties-seed#[879F03022915695A]-worker) [    ] o.a.s.SolrTestCaseJ4 Randomized ssl (true) and clientAuth (false)
   [junit4]   2> 1771417 INFO  (SUITE-TestReplicaProperties-seed#[879F03022915695A]-worker) [    ] o.a.s.BaseDistributedSearchTestCase Setting hostContext system property: /
   [junit4]   2> 1771421 INFO  (TEST-TestReplicaProperties.test-seed#[879F03022915695A]) [    ] o.a.s.c.ZkTestServer STARTING ZK TEST SERVER
   [junit4]   2> 1771422 INFO  (Thread-4977) [    ] o.a.s.c.ZkTestServer client port:0.0.0.0/0.0.0.0:0
   [junit4]   2> 1771422 INFO  (Thread-4977) [    ] o.a.s.c.ZkTestServer Starting server
   [junit4]   2> 1771522 INFO  (TEST-TestReplicaProperties.test-seed#[879F03022915695A]) [    ] o.a.s.c.ZkTestServer start zk server on port:48425
   [junit4]   2> 1771522 INFO  (TEST-TestReplicaProperties.test-seed#[879F03022915695A]) [    ] o.a.s.c.c.SolrZkClient Using default ZkCredentialsProvider
   [junit4]   2> 1771523 INFO  (TEST-TestReplicaProperties.test-seed#[879F03022915695A]) [    ] o.a.s.c.c.ConnectionManager Waiting for client to connect to ZooKeeper
   [junit4]   2> 1771525 INFO  (zkCallback-1933-thread-1) [    ] o.a.s.c.c.ConnectionManager Watcher org.apache.solr.common.cloud.ConnectionManager@42bbff6b name:ZooKeeperConnection Watcher:127.0.0.1:48425 got event WatchedEvent state:SyncConnected type:None path:null path:null type:None
   [junit4]   2> 1771525 INFO  (TEST-TestReplicaProperties.test-seed#[879F03022915695A]) [    ] o.a.s.c.c.ConnectionManager Client is connected to ZooKeeper
   [junit4]   2> 1771526 INFO  (TEST-TestReplicaProperties.test-seed#[879F03022915695A]) [    ] o.a.s.c.c.SolrZkClient Using default ZkACLProvider
   [junit4]   2> 1771526 INFO  (TEST-TestReplicaProperties.test-seed#[879F03022915695A]) [    ] o.a.s.c.c.SolrZkClient makePath: /solr
   [junit4]   2> 1771528 INFO  (TEST-TestReplicaProperties.test-seed#[879F03022915695A]) [    ] o.a.s.c.c.SolrZkClient Using default ZkCredentialsProvider
   [junit4]   2> 1771529 INFO  (TEST-TestReplicaProperties.test-seed#[879F03022915695A]) [    ] o.a.s.c.c.ConnectionManager Waiting for client to connect to ZooKeeper
   [junit4]   2> 1771530 INFO  (zkCallback-1934-thread-1) [    ] o.a.s.c.c.ConnectionManager Watcher org.apache.solr.common.cloud.ConnectionManager@130c3948 name:ZooKeeperConnection Watcher:127.0.0.1:48425/solr got event WatchedEvent state:SyncConnected type:None path:null path:null type:None
   [junit4]   2> 1771530 INFO  (TEST-TestReplicaProperties.test-seed#[879F03022915695A]) [    ] o.a.s.c.c.ConnectionManager Client is connected to ZooKeeper
   [junit4]   2> 1771531 INFO  (TEST-TestReplicaProperties.test-seed#[879F03022915695A]) [    ] o.a.s.c.c.SolrZkClient Using default ZkACLProvider
   [junit4]   2> 1771531 INFO  (TEST-TestReplicaProperties.test-seed#[879F03022915695A]) [    ] o.a.s.c.c.SolrZkClient makePath: /collections/collection1
   [junit4]   2> 1771533 INFO  (TEST-TestReplicaProperties.test-seed#[879F03022915695A]) [    ] o.a.s.c.c.SolrZkClient makePath: /collections/collection1/shards
   [junit4]   2> 1771535 INFO  (TEST-TestReplicaProperties.test-seed#[879F03022915695A]) [    ] o.a.s.c.c.SolrZkClient makePath: /collections/control_collection
   [junit4]   2> 1771536 INFO  (TEST-TestReplicaProperties.test-seed#[879F03022915695A]) [    ] o.a.s.c.c.SolrZkClient makePath: /collections/control_collection/shards
   [junit4]   2> 1771537 INFO  (TEST-TestReplicaProperties.test-seed#[879F03022915695A]) [    ] o.a.s.c.AbstractZkTestCase put /x1/jenkins/jenkins-slave/workspace/Lucene-Solr-Tests-5.3-Java7/solr/core/src/test-files/solr/collection1/conf/solrconfig-tlog.xml to /configs/conf1/solrconfig.xml
   [junit4]   2> 1771538 INFO  (TEST-TestReplicaProperties.test-seed#[879F03022915695A]) [    ] o.a.s.c.c.SolrZkClient makePath: /configs/conf1/solrconfig.xml
   [junit4]   2> 1771540 INFO  (TEST-TestReplicaProperties.test-seed#[879F03022915695A]) [    ] o.a.s.c.AbstractZkTestCase put /x1/jenkins/jenkins-slave/workspace/Lucene-Solr-Tests-5.3-Java7/solr/core/src/test-files/solr/collection1/conf/schema15.xml to /configs/conf1/schema.xml
   [junit4]   2> 1771540 INFO  (TEST-TestReplicaProperties.test-seed#[879F03022915695A]) [    ] o.a.s.c.c.SolrZkClient makePath: /configs/conf1/schema.xml
   [junit4]   2> 1771542 INFO  (TEST-TestReplicaProperties.test-seed#[879F03022915695A]) [    ] o.a.s.c.AbstractZkTestCase put /x1/jenkins/jenkins-slave/workspace/Lucene-Solr-Tests-5.3-Java7/solr/core/src/test-files/solr/collection1/conf/solrconfig.snippet.randomindexconfig.xml to /configs/conf1/solrconfig.snippet.randomindexconfig.xml
   [junit4]   2> 1771542 INFO  (TEST-TestReplicaProperties.test-seed#[879F03022915695A]) [    ] o.a.s.c.c.SolrZkClient makePath: /configs/conf1/solrconfig.snippet.randomindexconfig.xml
   [junit4]   2> 1771544 INFO  (TEST-TestReplicaProperties.test-seed#[879F03022915695A]) [    ] o.a.s.c.AbstractZkTestCase put /x1/jenkins/jenkins-slave/workspace/Lucene-Solr-Tests-5.3-Java7/solr/core/src/test-files/solr/collection1/conf/stopwords.txt to /configs/conf1/stopwords.txt
   [junit4]   2> 1771544 INFO  (TEST-TestReplicaProperties.test-seed#[879F03022915695A]) [    ] o.a.s.c.c.SolrZkClient makePath: /configs/conf1/stopwords.txt
   [junit4]   2> 1771545 INFO  (TEST-TestReplicaProperties.test-seed#[879F03022915695A]) [    ] o.a.s.c.AbstractZkTestCase put /x1/jenkins/jenkins-slave/workspace/Lucene-Solr-Tests-5.3-Java7/solr/core/src/test-files/solr/collection1/conf/protwords.txt to /configs/conf1/protwords.txt
   [junit4]   2> 1771546 INFO  (TEST-TestReplicaProperties.test-seed#[879F03022915695A]) [    ] o.a.s.c.c.SolrZkClient makePath: /configs/conf1/protwords.txt
   [junit4]   2> 1771547 INFO  (TEST-TestReplicaProperties.test-seed#[879F03022915695A]) [    ] o.a.s.c.AbstractZkTestCase put /x1/jenkins/jenkins-slave/workspace/Lucene-Solr-Tests-5.3-Java7/solr/core/src/test-files/solr/collection1/conf/currency.xml to /configs/conf1/currency.xml
   [junit4]   2> 1771548 INFO  (TEST-TestReplicaProperties.test-seed#[879F03022915695A]) [    ] o.a.s.c.c.SolrZkClient makePath: /configs/conf1/currency.xml
   [junit4]   2> 1771549 INFO  (TEST-TestReplicaProperties.test-seed#[879F03022915695A]) [    ] o.a.s.c.AbstractZkTestCase put /x1/jenkins/jenkins-slave/workspace/Lucene-Solr-Tests-5.3-Java7/solr/core/src/test-files/solr/collection1/conf/enumsConfig.xml to /configs/conf1/enumsConfig.xml
   [junit4]   2> 1771549 INFO  (TEST-TestReplicaProperties.test-seed#[879F03022915695A]) [    ] o.a.s.c.c.SolrZkClient makePath: /configs/conf1/enumsConfig.xml
   [junit4]   2> 1771551 INFO  (TEST-TestReplicaProperties.test-seed#[879F03022915695A]) [    ] o.a.s.c.AbstractZkTestCase put /x1/jenkins/jenkins-slave/workspace/Lucene-Solr-Tests-5.3-Java7/solr/core/src/test-files/solr/collection1/conf/open-exchange-rates.json to /configs/conf1/open-exchange-rates.json
   [junit4]   2> 1771551 INFO  (TEST-TestReplicaProperties.test-seed#[879F03022915695A]) [    ] o.a.s.c.c.SolrZkClient makePath: /configs/conf1/open-exchange-rates.json
   [junit4]   2> 1771553 INFO  (TEST-TestReplicaProperties.test-seed#[879F03022915695A]) [    ] o.a.s.c.AbstractZkTestCase put /x1/jenkins/jenkins-slave/workspace/Lucene-Solr-Tests-5.3-Java7/solr/core/src/test-files/solr/collection1/conf/mapping-ISOLatin1Accent.txt to /configs/conf1/mapping-ISOLatin1Accent.txt
   [junit4]   2> 1771553 INFO  (TEST-TestReplicaProperties.test-seed#[879F03022915695A]) [    ] o.a.s.c.c.SolrZkClient makePath: /configs/conf1/mapping-ISOLatin1Accent.txt
   [junit4]   2> 1771555 INFO  (TEST-TestReplicaProperties.test-seed#[879F03022915695A]) [    ] o.a.s.c.AbstractZkTestCase put /x1/jenkins/jenkins-slave/workspace/Lucene-Solr-Tests-5.3-Java7/solr/core/src/test-files/solr/collection1/conf/old_synonyms.txt to /configs/conf1/old_synonyms.txt
   [junit4]   2> 1771555 INFO  (TEST-TestReplicaProperties.test-seed#[879F03022915695A]) [    ] o.a.s.c.c.SolrZkClient makePath: /configs/conf1/old_synonyms.txt
   [junit4]   2> 1771556 INFO  (TEST-TestReplicaProperties.test-seed#[879F03022915695A]) [    ] o.a.s.c.AbstractZkTestCase put /x1/jenkins/jenkins-slave/workspace/Lucene-Solr-Tests-5.3-Java7/solr/core/src/test-files/solr/collection1/conf/synonyms.txt to /configs/conf1/synonyms.txt
   [junit4]   2> 1771557 INFO  (TEST-TestReplicaProperties.test-seed#[879F03022915695A]) [    ] o.a.s.c.c.SolrZkClient makePath: /configs/conf1/synonyms.txt
   [junit4]   2> 1771559 INFO  (TEST-TestReplicaProperties.test-seed#[879F03022915695A]) [    ] o.a.s.c.c.SolrZkClient Using default ZkCredentialsProvider
   [junit4]   2> 1771559 INFO  (TEST-TestReplicaProperties.test-seed#[879F03022915695A]) [    ] o.a.s.c.c.ConnectionManager Waiting for client to connect to ZooKeeper
   [junit4]   2> 1771561 INFO  (zkCallback-1935-thread-1) [    ] o.a.s.c.c.ConnectionManager Watcher org.apache.solr.common.cloud.ConnectionManager@75b25c73 name:ZooKeeperConnection Watcher:127.0.0.1:48425/solr got event WatchedEvent state:SyncConnected type:None path:null path:null type:None
   [junit4]   2> 1771561 INFO  (TEST-TestReplicaProperties.test-seed#[879F03022915695A]) [    ] o.a.s.c.c.ConnectionManager Client is connected to ZooKeeper
   [junit4]   2> 1771561 INFO  (TEST-TestReplicaProperties.test-seed#[879F03022915695A]) [    ] o.a.s.c.c.SolrZkClient Using default ZkACLProvider
   [junit4]   2> 1771851 INFO  (TEST-TestReplicaProperties.test-seed#[879F03022915695A]) [    ] o.a.s.SolrTestCaseJ4 Writing core.properties file to /x1/jenkins/jenkins-slave/workspace/Lucene-Solr-Tests-5.3-Java7/solr/build/solr-core/test/J1/temp/solr.cloud.TestReplicaProperties_879F03022915695A-001/control-001/cores/collection1
   [junit4]   2> 1771853 INFO  (TEST-TestReplicaProperties.test-seed#[879F03022915695A]) [    ] o.e.j.s.Server jetty-9.2.11.v20150529
   [junit4]   2> 1771855 INFO  (TEST-TestReplicaProperties.test-seed#[879F03022915695A]) [    ] o.e.j.s.h.ContextHandler Started o.e.j.s.ServletContextHandler@36c2d9f9{/,null,AVAILABLE}
   [junit4]   2> 1771863 INFO  (TEST-TestReplicaProperties.test-seed#[879F03022915695A]) [    ] o.e.j.s.ServerConnector Started ServerConnector@2b9fa4{SSL-http/1.1}{127.0.0.1:53201}
   [junit4]   2> 1771863 INFO  (TEST-TestReplicaProperties.test-seed#[879F03022915695A]) [    ] o.e.j.s.Server Started @1776319ms
   [junit4]   2> 1771863 INFO  (TEST-TestReplicaProperties.test-seed#[879F03022915695A]) [    ] o.a.s.c.s.e.JettySolrRunner Jetty properties: {coreRootDirectory=/x1/jenkins/jenkins-slave/workspace/Lucene-Solr-Tests-5.3-Java7/solr/build/solr-core/test/J1/temp/solr.cloud.TestReplicaProperties_879F03022915695A-001/control-001/cores, hostPort=53201, hostContext=/, solr.data.dir=/x1/jenkins/jenkins-slave/workspace/Lucene-Solr-Tests-5.3-Java7/solr/build/solr-core/test/J1/temp/solr.cloud.TestReplicaProperties_879F03022915695A-001/tempDir-001/control/data}
   [junit4]   2> 1771864 INFO  (TEST-TestReplicaProperties.test-seed#[879F03022915695A]) [    ] o.a.s.s.SolrDispatchFilter SolrDispatchFilter.init(): sun.misc.Launcher$AppClassLoader@7f423820
   [junit4]   2> 1771864 INFO  (TEST-TestReplicaProperties.test-seed#[879F03022915695A]) [    ] o.a.s.c.SolrResourceLoader new SolrResourceLoader for directory: '/x1/jenkins/jenkins-slave/workspace/Lucene-Solr-Tests-5.3-Java7/solr/build/solr-core/test/J1/temp/solr.cloud.TestReplicaProperties_879F03022915695A-001/control-001/'
   [junit4]   2> 1771882 INFO  (TEST-TestReplicaProperties.test-seed#[879F03022915695A]) [    ] o.a.s.c.c.SolrZkClient Using default ZkCredentialsProvider
   [junit4]   2> 1771888 INFO  (TEST-TestReplicaProperties.test-seed#[879F03022915695A]) [    ] o.a.s.c.c.ConnectionManager Waiting for client to connect to ZooKeeper
   [junit4]   2> 1771904 INFO  (zkCallback-1936-thread-1) [    ] o.a.s.c.c.ConnectionManager Watcher org.apache.solr.common.cloud.ConnectionManager@4195e040 name:ZooKeeperConnection Watcher:127.0.0.1:48425/solr got event WatchedEvent state:SyncConnected type:None path:null path:null type:None
   [junit4]   2> 1771908 INFO  (TEST-TestReplicaProperties.test-seed#[879F03022915695A]) [    ] o.a.s.c.c.ConnectionManager Client is connected to ZooKeeper
   [junit4]   2> 1771908 INFO  (TEST-TestReplicaProperties.test-seed#[879F03022915695A]) [    ] o.a.s.c.c.SolrZkClient Using default ZkACLProvider
   [junit4]   2> 1771913 INFO  (TEST-TestReplicaProperties.test-seed#[879F03022915695A]) [    ] o.a.s.s.SolrDispatchFilter Loading solr.xml from SolrHome (not found in ZooKeeper)
   [junit4]   2> 1771914 INFO  (TEST-TestReplicaProperties.test-seed#[879F03022915695A]) [    ] o.a.s.c.SolrXmlConfig Loading container configuration from /x1/jenkins/jenkins-slave/workspace/Lucene-Solr-Tests-5.3-Java7/solr/build/solr-core/test/J1/temp/solr.cloud.TestReplicaProperties_879F03022915695A-001/control-001/solr.xml
   [junit4]   2> 1771930 INFO  (TEST-TestReplicaProperties.test-seed#[879F03022915695A]) [    ] o.a.s.c.CoresLocator Config-defined core root directory: /x1/jenkins/jenkins-slave/workspace/Lucene-Solr-Tests-5.3-Java7/solr/build/solr-core/test/J1/temp/solr.cloud.TestReplicaProperties_879F03022915695A-001/control-001/cores
   [junit4]   2> 1771930 INFO  (TEST-TestReplicaProperties.test-seed#[879F03022915695A]) [    ] o.a.s.c.CoreContainer New CoreContainer 677602556
   [junit4]   2> 1771930 INFO  (TEST-TestReplicaProperties.test-seed#[879F03022915695A]) [    ] o.a.s.c.CoreContainer Loading cores into CoreContainer [instanceDir=/x1/jenkins/jenkins-slave/workspace/Lucene-Solr-Tests-5.3-Java7/solr/build/solr-core/test/J1/temp/solr.cloud.TestReplicaProperties_879F03022915695A-001/control-001/]
   [junit4]   2> 1771930 INFO  (TEST-TestReplicaProperties.test-seed#[879F03022915695A]) [    ] o.a.s.c.CoreContainer loading shared library: /x1/jenkins/jenkins-slave/workspace/Lucene-Solr-Tests-5.3-Java7/solr/build/solr-core/test/J1/temp/solr.cloud.TestReplicaProperties_879F03022915695A-001/control-001/lib
   [junit4]   2> 1771931 WARN  (TEST-TestReplicaProperties.test-seed#[879F03022915695A]) [    ] o.a.s.c.SolrResourceLoader Can't find (or read) directory to add to classloader: lib (resolved as: /x1/jenkins/jenkins-slave/workspace/Lucene-Solr-Tests-5.3-Java7/solr/build/solr-core/test/J1/temp/solr.cloud.TestReplicaProperties_879F03022915695A-001/control-001/lib).
   [junit4]   2> 1771941 INFO  (TEST-TestReplicaProperties.test-seed#[879F03022915695A]) [    ] o.a.s.h.c.HttpShardHandlerFactory created with socketTimeout : 90000,urlScheme : ,connTimeout : 15000,maxConnectionsPerHost : 20,maxConnections : 10000,corePoolSize : 0,maximumPoolSize : 2147483647,maxThreadIdleTime : 5,sizeOfQueue : -1,fairnessPolicy : false,useRetries : false,
   [junit4]   2> 1771944 INFO  (TEST-TestReplicaProperties.test-seed#[879F03022915695A]) [    ] o.a.s.u.UpdateShardHandler Creating UpdateShardHandler HTTP client with params: socketTimeout=340000&connTimeout=45000&retry=true
   [junit4]   2> 1771945 INFO  (TEST-TestReplicaProperties.test-seed#[879F03022915695A]) [    ] o.a.s.l.LogWatcher SLF4J impl is org.slf4j.impl.Log4jLoggerFactory
   [junit4]   2> 1771945 INFO  (TEST-TestReplicaProperties.test-seed#[879F03022915695A]) [    ] o.a.s.l.LogWatcher Registering Log Listener [Log4j (org.slf4j.impl.Log4jLoggerFactory)]
   [junit4]   2> 1771946 INFO  (TEST-TestReplicaProperties.test-seed#[879F03022915695A]) [    ] o.a.s.c.ZkContainer Zookeeper client=127.0.0.1:48425/solr
   [junit4]   2> 1771946 INFO  (TEST-TestReplicaProperties.test-seed#[879F03022915695A]) [    ] o.a.s.c.ZkController zkHost includes chroot
   [junit4]   2> 1771946 INFO  (TEST-TestReplicaProperties.test-seed#[879F03022915695A]) [    ] o.a.s.c.c.SolrZkClient Using default ZkCredentialsProvider
   [junit4]   2> 1771946 INFO  (TEST-TestReplicaProperties.test-seed#[879F03022915695A]) [    ] o.a.s.c.c.ConnectionManager Waiting for client to connect to ZooKeeper
   [junit4]   2> 1771948 INFO  (zkCallback-1938-thread-1) [    ] o.a.s.c.c.ConnectionManager Watcher org.apache.solr.common.cloud.ConnectionManager@4e0c71dd name:ZooKeeperConnection Watcher:127.0.0.1:48425 got event WatchedEvent state:SyncConnected type:None path:null path:null type:None
   [junit4]   2> 1771948 INFO  (TEST-TestReplicaProperties.test-seed#[879F03022915695A]) [    ] o.a.s.c.c.ConnectionManager Client is connected to ZooKeeper
   [junit4]   2> 1771949 INFO  (TEST-TestReplicaProperties.test-seed#[879F03022915695A]) [    ] o.a.s.c.c.SolrZkClient Using default ZkACLProvider
   [junit4]   2> 1771951 INFO  (TEST-TestReplicaProperties.test-seed#[879F03022915695A]) [n:127.0.0.1:53201_    ] o.a.s.c.c.ConnectionManager Waiting for client to connect to ZooKeeper
   [junit4]   2> 1771955 INFO  (zkCallback-1939-thread-1-processing-n:127.0.0.1:53201_) [n:127.0.0.1:53201_    ] o.a.s.c.c.ConnectionManager Watcher org.apache.solr.common.cloud.ConnectionManager@2ef3dd81 name:ZooKeeperConnection Watcher:127.0.0.1:48425/solr got event WatchedEvent state:SyncConnected type:None path:null path:null type:None
   [junit4]   2> 1771955 INFO  (TEST-TestReplicaProperties.test-seed#[879F03022915695A]) [n:127.0.0.1:53201_    ] o.a.s.c.c.ConnectionManager Client is connected to ZooKeeper
   [junit4]   2> 1771956 INFO  (TEST-TestReplicaProperties.test-seed#[879F03022915695A]) [n:127.0.0.1:53201_    ] o.a.s.c.c.SolrZkClient makePath: /overseer/queue
   [junit4]   2> 1771958 INFO  (TEST-TestReplicaProperties.test-seed#[879F03022915695A]) [n:127.0.0.1:53201_    ] o.a.s.c.c.SolrZkClient makePath: /overseer/collection-queue-work
   [junit4]   2> 1771960 INFO  (TEST-TestReplicaProperties.test-seed#[879F03022915695A]) [n:127.0.0.1:53201_    ] o.a.s.c.c.SolrZkClient makePath: /overseer/collection-map-running
   [junit4]   2> 1771965 INFO  (TEST-TestReplicaProperties.test-seed#[879F03022915695A]) [n:127.0.0.1:53201_    ] o.a.s.c.c.SolrZkClient makePath: /overseer/collection-map-completed
   [junit4]   2> 1771969 INFO  (TEST-TestReplicaProperties.test-seed#[879F03022915695A]) [n:127.0.0.1:53201_    ] o.a.s.c.c.SolrZkClient makePath: /overseer/collection-map-failure
   [junit4]   2> 1771972 INFO  (TEST-TestReplicaProperties.test-seed#[879F03022915695A]) [n:127.0.0.1:53201_    ] o.a.s.c.c.SolrZkClient makePath: /live_nodes
   [junit4]   2> 1771973 INFO  (TEST-TestReplicaProperties.test-seed#[879F03022915695A]) [n:127.0.0.1:53201_    ] o.a.s.c.c.SolrZkClient makePath: /aliases.json
   [junit4]   2> 1771975 INFO  (TEST-TestReplicaProperties.test-seed#[879F03022915695A]) [n:127.0.0.1:53201_    ] o.a.s.c.c.SolrZkClient makePath: /clusterstate.json
   [junit4]   2> 1771976 INFO  (TEST-TestReplicaProperties.test-seed#[879F03022915695A]) [n:127.0.0.1:53201_    ] o.a.s.c.c.SolrZkClient makePath: /security.json
   [junit4]   2> 1771977 INFO  (TEST-TestReplicaProperties.test-seed#[879F03022915695A]) [n:127.0.0.1:53201_    ] o.a.s.c.ZkController Register node as live in ZooKeeper:/live_nodes/127.0.0.1:53201_
   [junit4]   2> 1771977 INFO  (TEST-TestReplicaProperties.test-seed#[879F03022915695A]) [n:127.0.0.1:53201_    ] o.a.s.c.c.SolrZkClient makePath: /live_nodes/127.0.0.1:53201_
   [junit4]   2> 1771979 INFO  (TEST-TestReplicaProperties.test-seed#[879F03022915695A]) [n:127.0.0.1:53201_    ] o.a.s.c.c.SolrZkClient makePath: /overseer_elect
   [junit4]   2> 1771980 INFO  (TEST-TestReplicaProperties.test-seed#[879F03022915695A]) [n:127.0.0.1:53201_    ] o.a.s.c.c.SolrZkClient makePath: /overseer_elect/election
   [junit4]   2> 1771982 INFO  (TEST-TestReplicaProperties.test-seed#[879F03022915695A]) [n:127.0.0.1:53201_    ] o.a.s.c.Overseer Overseer (id=null) closing
   [junit4]   2> 1771982 INFO  (TEST-TestReplicaProperties.test-seed#[879F03022915695A]) [n:127.0.0.1:53201_    ] o.a.s.c.LeaderElector Joined leadership election with path: /overseer_elect/election/94375864727699461-127.0.0.1:53201_-n_0000000000
   [junit4]   2> 1771983 INFO  (TEST-TestReplicaProperties.test-seed#[879F03022915695A]) [n:127.0.0.1:53201_    ] o.a.s.c.OverseerElectionContext I am going to be the leader 127.0.0.1:53201_
   [junit4]   2> 1771983 INFO  (TEST-TestReplicaProperties.test-seed#[879F03022915695A]) [n:127.0.0.1:53201_    ] o.a.s.c.c.SolrZkClient makePath: /overseer_elect/leader
   [junit4]   2> 1771985 INFO  (TEST-TestReplicaProperties.test-seed#[879F03022915695A]) [n:127.0.0.1:53201_    ] o.a.s.c.Overseer Overseer (id=94375864727699461-127.0.0.1:53201_-n_0000000000) starting
   [junit4]   2> 1771986 INFO  (TEST-TestReplicaProperties.test-seed#[879F03022915695A]) [n:127.0.0.1:53201_    ] o.a.s.c.c.SolrZkClient makePath: /overseer/queue-work
   [junit4]   2> 1771992 INFO  (TEST-TestReplicaProperties.test-seed#[879F03022915695A]) [n:127.0.0.1:53201_    ] o.a.s.c.OverseerAutoReplicaFailoverThread Starting OverseerAutoReplicaFailoverThread autoReplicaFailoverWorkLoopDelay=10000 autoReplicaFailoverWaitAfterExpiration=30000 autoReplicaFailoverBadNodeExpiration=60000
   [junit4]   2> 1771993 INFO  (OverseerStateUpdate-94375864727699461-127.0.0.1:53201_-n_0000000000) [n:127.0.0.1:53201_    ] o.a.s.c.Overseer Starting to work on the main queue
   [junit4]   2> 1771996 INFO  (OverseerCollectionProcessor-94375864727699461-127.0.0.1:53201_-n_0000000000) [n:127.0.0.1:53201_    ] o.a.s.c.OverseerCollectionProcessor Process current queue of collection creations
   [junit4]   2> 1772001 INFO  (TEST-TestReplicaProperties.test-seed#[879F03022915695A]) [n:127.0.0.1:53201_    ] o.a.s.c.c.ZkStateReader Updating cluster state from ZooKeeper... 
   [junit4]   2> 1772013 INFO  (TEST-TestReplicaProperties.test-seed#[879F03022915695A]) [n:127.0.0.1:53201_    ] o.a.s.c.CoreContainer Security conf doesn't exist. Skipping setup for authorization module.
   [junit4]   2> 1772014 INFO  (TEST-TestReplicaProperties.test-seed#[879F03022915695A]) [n:127.0.0.1:53201_    ] o.a.s.c.CoreContainer No authentication plugin used.
   [junit4]   2> 1772014 INFO  (TEST-TestReplicaProperties.test-seed#[879F03022915695A]) [n:127.0.0.1:53201_    ] o.a.s.c.CoresLocator Looking for core definitions underneath /x1/jenkins/jenkins-slave/workspace/Lucene-Solr-Tests-5.3-Java7/solr/build/solr-core/test/J1/temp/solr.cloud.TestReplicaProperties_879F03022915695A-001/control-001/cores
   [junit4]   2> 1772015 INFO  (TEST-TestReplicaProperties.test-seed#[879F03022915695A]) [n:127.0.0.1:53201_    ] o.a.s.c.SolrCore Created CoreDescriptor: {schema=schema.xml, configSetProperties=configsetprops.json, collection=control_collection, absoluteInstDir=/x1/jenkins/jenkins-slave/workspace/Lucene-Solr-Tests-5.3-Java7/solr/build/solr-core/test/J1/temp/solr.cloud.TestReplicaProperties_879F03022915695A-001/control-001/cores/collection1/, config=solrconfig.xml, name=collection1, coreNodeName=, instanceDir=/x1/jenkins/jenkins-slave/workspace/Lucene-Solr-Tests-5.3-Java7/solr/build/solr-core/test/J1/temp/solr.cloud.TestReplicaProperties_879F03022915695A-001/control-001/cores/collection1, transient=false, dataDir=data/, loadOnStartup=true, shard=}
   [junit4]   2> 1772015 INFO  (TEST-TestReplicaProperties.test-seed#[879F03022915695A]) [n:127.0.0.1:53201_    ] o.a.s.c.CoresLocator Found core collection1 in /x1/jenkins/jenkins-slave/workspace/Lucene-Solr-Tests-5.3-Java7/solr/build/solr-core/test/J1/temp/solr.cloud.TestReplicaProperties_879F03022915695A-001/control-001/cores/collection1/
   [junit4]   2> 1772016 INFO  (TEST-TestReplicaProperties.test-seed#[879F03022915695A]) [n:127.0.0.1:53201_    ] o.a.s.c.CoresLocator Found 1 core definitions
   [junit4]   2> 1772022 INFO  (TEST-TestReplicaProperties.test-seed#[879F03022915695A]) [n:127.0.0.1:53201_    ] o.a.s.s.SolrDispatchFilter user.dir=/x1/jenkins/jenkins-slave/workspace/Lucene-Solr-Tests-5.3-Java7/solr/build/solr-core/test/J1
   [junit4]   2> 1772022 INFO  (TEST-TestReplicaProperties.test-seed#[879F03022915695A]) [n:127.0.0.1:53201_    ] o.a.s.s.SolrDispatchFilter SolrDispatchFilter.init() done
   [junit4]   2> 1772022 INFO  (coreLoadExecutor-5730-thread-1-processing-n:127.0.0.1:53201_) [n:127.0.0.1:53201_ c:control_collection   x:collection1] o.a.s.c.ZkController publishing state=down
   [junit4]   2> 1772022 INFO  (coreLoadExecutor-5730-thread-1-processing-n:127.0.0.1:53201_) [n:127.0.0.1:53201_ c:control_collection   x:collection1] o.a.s.c.ZkController numShards not found on descriptor - reading it from system property
   [junit4]   2> 1772023 INFO  (coreLoadExecutor-5730-thread-1-processing-n:127.0.0.1:53201_) [n:127.0.0.1:53201_ c:control_collection   x:collection1] o.a.s.c.ZkController look for our core node name
   [junit4]   2> 1772023 INFO  (zkCallback-1939-thread-1-processing-n:127.0.0.1:53201_) [n:127.0.0.1:53201_    ] o.a.s.c.DistributedQueue NodeChildrenChanged fired on path /overseer/queue state SyncConnected
   [junit4]   2> 1772024 INFO  (OverseerStateUpdate-94375864727699461-127.0.0.1:53201_-n_0000000000) [n:127.0.0.1:53201_    ] o.a.s.c.Overseer processMessage: queueSize: 1, message = {
   [junit4]   2>   "roles":null,
   [junit4]   2>   "node_name":"127.0.0.1:53201_",
   [junit4]   2>   "shard":null,
   [junit4]   2>   "core":"collection1",
   [junit4]   2>   "state":"down",
   [junit4]   2>   "numShards":"1",
   [junit4]   2>   "collection":"control_collection",
   [junit4]   2>   "operation":"state",
   [junit4]   2>   "base_url":"https://127.0.0.1:53201"} current state version: 0
   [junit4]   2> 1772025 INFO  (OverseerStateUpdate-94375864727699461-127.0.0.1:53201_-n_0000000000) [n:127.0.0.1:53201_    ] o.a.s.c.o.ReplicaMutator Update state numShards=1 message={
   [junit4]   2>   "roles":null,
   [junit4]   2>   "node_name":"127.0.0.1:53201_",
   [junit4]   2>   "shard":null,
   [junit4]   2>   "core":"collection1",
   [junit4]   2>   "state":"down",
   [junit4]   2>   "numShards":"1",
   [junit4]   2>   "collection":"control_collection",
   [junit4]   2>   "operation":"state",
   [junit4]   2>   "base_url":"https://127.0.0.1:53201"}
   [junit4]   2> 1772025 INFO  (OverseerStateUpdate-94375864727699461-127.0.0.1:53201_-n_0000000000) [n:127.0.0.1:53201_    ] o.a.s.c.o.ClusterStateMutator building a new cName: control_collection
   [junit4]   2> 1772025 INFO  (OverseerStateUpdate-94375864727699461-127.0.0.1:53201_-n_0000000000) [n:127.0.0.1:53201_    ] o.a.s.c.o.ReplicaMutator Assigning new node to shard shard=shard1
   [junit4]   2> 1772027 INFO  (zkCallback-1939-thread-1-processing-n:127.0.0.1:53201_) [n:127.0.0.1:53201_    ] o.a.s.c.c.ZkStateReader A cluster state change: WatchedEvent state:SyncConnected type:NodeDataChanged path:/clusterstate.json, has occurred - updating... (live nodes size: 1)
   [junit4]   2> 1772028 INFO  (zkCallback-1939-thread-1-processing-n:127.0.0.1:53201_) [n:127.0.0.1:53201_    ] o.a.s.c.c.ZkStateReader Updated cluster state version to 1
   [junit4]   2> 1773023 INFO  (coreLoadExecutor-5730-thread-1-processing-n:127.0.0.1:53201_) [n:127.0.0.1:53201_ c:control_collection   x:collection1] o.a.s.c.ZkController waiting to find shard id in clusterstate for collection1
   [junit4]   2> 1773024 INFO  (coreLoadExecutor-5730-thread-1-processing-n:127.0.0.1:53201_) [n:127.0.0.1:53201_ c:control_collection   x:collection1] o.a.s.c.ZkController Check for collection zkNode:control_collection
   [junit4]   2> 1773024 INFO  (coreLoadExecutor-5730-thread-1-processing-n:127.0.0.1:53201_) [n:127.0.0.1:53201_ c:control_collection   x:collection1] o.a.s.c.ZkController Collection zkNode exists
   [junit4]   2> 1773024 INFO  (coreLoadExecutor-5730-thread-1-processing-n:127.0.0.1:53201_) [n:127.0.0.1:53201_ c:control_collection   x:collection1] o.a.s.c.c.ZkStateReader Load collection config from:/collections/control_collection
   [junit4]   2> 1773025 INFO  (coreLoadExecutor-5730-thread-1-processing-n:127.0.0.1:53201_) [n:127.0.0.1:53201_ c:control_collection   x:collection1] o.a.s.c.c.ZkStateReader path=/collections/control_collection configName=conf1 specified config exists in ZooKeeper
   [junit4]   2> 1773025 INFO  (coreLoadExecutor-5730-thread-1-processing-n:127.0.0.1:53201_) [n:127.0.0.1:53201_ c:control_collection   x:collection1] o.a.s.c.SolrResourceLoader new SolrResourceLoader for directory: '/x1/jenkins/jenkins-slave/workspace/Lucene-Solr-Tests-5.3-Java7/solr/build/solr-core/test/J1/temp/solr.cloud.TestReplicaProperties_879F03022915695A-001/control-001/cores/collection1/'
   [junit4]   2> 1773041 INFO  (coreLoadExecutor-5730-thread-1-processing-n:127.0.0.1:53201_) [n:127.0.0.1:53201_ c:control_collection   x:collection1] o.a.s.c.Config loaded config solrconfig.xml with version 0 
   [junit4]   2> 1773047 INFO  (coreLoadExecutor-5730-thread-1-processing-n:127.0.0.1:53201_) [n:127.0.0.1:53201_ c:control_collection   x:collection1] o.a.s.c.SolrConfig current version of requestparams : -1
   [junit4]   2> 1773060 INFO  (coreLoadExecutor-5730-thread-1-processing-n:127.0.0.1:53201_) [n:127.0.0.1:53201_ c:control_collection   x:collection1] o.a.s.c.SolrConfig Using Lucene MatchVersion: 5.3.0
   [junit4]   2> 1773106 INFO  (coreLoadExecutor-5730-thread-1-processing-n:127.0.0.1:53201_) [n:127.0.0.1:53201_ c:control_collection   x:collection1] o.a.s.c.Config Loaded SolrConfig: solrconfig.xml
   [junit4]   2> 1773107 INFO  (coreLoadExecutor-5730-thread-1-processing-n:127.0.0.1:53201_) [n:127.0.0.1:53201_ c:control_collection   x:collection1] o.a.s.s.IndexSchema Reading Solr Schema from /configs/conf1/schema.xml
   [junit4]   2> 1773114 INFO  (coreLoadExecutor-5730-thread-1-processing-n:127.0.0.1:53201_) [n:127.0.0.1:53201_ c:control_collection   x:collection1] o.a.s.s.IndexSchema [collection1] Schema name=test
   [junit4]   2> 1773332 INFO  (coreLoadExecutor-5730-thread-1-processing-n:127.0.0.1:53201_) [n:127.0.0.1:53201_ c:control_collection   x:collection1] o.a.s.s.IndexSchema default search field in schema is text
   [junit4]   2> 1773334 INFO  (coreLoadExecutor-5730-thread-1-processing-n:127.0.0.1:53201_) [n:127.0.0.1:53201_ c:control_collection   x:collection1] o.a.s.s.IndexSchema unique key field: id
   [junit4]   2> 1773335 INFO  (coreLoadExecutor-5730-thread-1-processing-n:127.0.0.1:53201_) [n:127.0.0.1:53201_ c:control_collection   x:collection1] o.a.s.s.FileExchangeRateProvider Reloading exchange rates from file currency.xml
   [junit4]   2> 1773338 INFO  (coreLoadExecutor-5730-thread-1-processing-n:127.0.0.1:53201_) [n:127.0.0.1:53201_ c:control_collection   x:collection1] o.a.s.s.FileExchangeRateProvider Reloading exchange rates from file currency.xml
   [junit4]   2> 1773355 INFO  (coreLoadExecutor-5730-thread-1-processing-n:127.0.0.1:53201_) [n:127.0.0.1:53201_ c:control_collection   x:collection1] o.a.s.c.ConfigSetProperties Did not find ConfigSet properties, assuming default properties: Can't find resource 'configsetprops.json' in classpath or '/configs/conf1', cwd=/x1/jenkins/jenkins-slave/workspace/Lucene-Solr-Tests-5.3-Java7/solr/build/solr-core/test/J1
   [junit4]   2> 1773355 INFO  (coreLoadExecutor-5730-thread-1-processing-n:127.0.0.1:53201_) [n:127.0.0.1:53201_ c:control_collection   x:collection1] o.a.s.c.CoreContainer Creating SolrCore 'collection1' using configuration from collection control_collection
   [junit4]   2> 1773355 INFO  (coreLoadExecutor-5730-thread-1-processing-n:127.0.0.1:53201_) [n:127.0.0.1:53201_ c:control_collection s:shard1 r:core_node1 x:collection1] o.a.s.c.SolrCore org.apache.solr.core.MockDirectoryFactory
   [junit4]   2> 1773356 INFO  (coreLoadExecutor-5730-thread-1-processing-n:127.0.0.1:53201_) [n:127.0.0.1:53201_ c:control_collection s:shard1 r:core_node1 x:collection1] o.a.s.c.SolrCore [[collection1] ] Opening new SolrCore at [/x1/jenkins/jenkins-slave/workspace/Lucene-Solr-Tests-5.3-Java7/solr/build/solr-core/test/J1/temp/solr.cloud.TestReplicaProperties_879F03022915695A-001/control-001/cores/collection1/], dataDir=[null]
   [junit4]   2> 1773356 INFO  (coreLoadExecutor-5730-thread-1-processing-n:127.0.0.1:53201_) [n:127.0.0.1:53201_ c:control_collection s:shard1 r:core_node1 x:collection1] o.a.s.c.JmxMonitoredMap JMX monitoring is enabled. Adding Solr mbeans to JMX Server: com.sun.jmx.mbeanserver.JmxMBeanServer@29d2e740
   [junit4]   2> 1773357 INFO  (coreLoadExecutor-5730-thread-1-processing-n:127.0.0.1:53201_) [n:127.0.0.1:53201_ c:control_collection s:shard1 r:core_node1 x:collection1] o.a.s.c.CachingDirectoryFactory return new directory for /x1/jenkins/jenkins-slave/workspace/Lucene-Solr-Tests-5.3-Java7/solr/build/solr-core/test/J1/temp/solr.cloud.TestReplicaProperties_879F03022915695A-001/control-001/cores/collection1/data
   [junit4]   2> 1773357 INFO  (coreLoadExecutor-5730-thread-1-processing-n:127.0.0.1:53201_) [n:127.0.0.1:53201_ c:control_collection s:shard1 r:core_node1 x:collection1] o.a.s.c.SolrCore New index directory detected: old=null new=/x1/jenkins/jenkins-slave/workspace/Lucene-Solr-Tests-5.3-Java7/solr/build/solr-core/test/J1/temp/solr.cloud.TestReplicaProperties_879F03022915695A-001/control-001/cores/collection1/data/index/
   [junit4]   2> 1773357 WARN  (coreLoadExecutor-5730-thread-1-processing-n:127.0.0.1:53201_) [n:127.0.0.1:53201_ c:control_collection s:shard1 r:core_node1 x:collection1] o.a.s.c.SolrCore [collection1] Solr index directory '/x1/jenkins/jenkins-slave/workspace/Lucene-Solr-Tests-5.3-Java7/solr/build/solr-core/test/J1/temp/solr.cloud.TestReplicaProperties_879F03022915695A-001/control-001/cores/collection1/data/index' doesn't exist. Creating new index...
   [junit4]   2> 1773357 INFO  (coreLoadExecutor-5730-thread-1-processing-n:127.0.0.1:53201_) [n:127.0.0.1:53201_ c:control_collection s:shard1 r:core_node1 x:collection1] o.a.s.c.CachingDirectoryFactory return new directory for /x1/jenkins/jenkins-slave/workspace/Lucene-Solr-Tests-5.3-Java7/solr/build/solr-core/test/J1/temp/solr.cloud.TestReplicaProperties_879F03022915695A-001/control-001/cores/collection1/data/index
   [junit4]   2> 1773358 INFO  (coreLoadExecutor-5730-thread-1-processing-n:127.0.0.1:53201_) [n:127.0.0.1:53201_ c:control_collection s:shard1 r:core_node1 x:collection1] o.a.s.u.RandomMergePolicy RandomMergePolicy wrapping class org.apache.lucene.index.TieredMergePolicy: [TieredMergePolicy: maxMergeAtOnce=38, maxMergeAtOnceExplicit=33, maxMergedSegmentMB=66.185546875, floorSegmentMB=1.5625, forceMergeDeletesPctAllowed=23.169742446552416, segmentsPerTier=12.0, maxCFSSegmentSizeMB=8.796093022207999E12, noCFSRatio=0.0
   [junit4]   2> 1773358 INFO  (coreLoadExecutor-5730-thread-1-processing-n:127.0.0.1:53201_) [n:127.0.0.1:53201_ c:control_collection s:shard1 r:core_node1 x:collection1] o.a.s.c.SolrCore SolrDeletionPolicy.onCommit: commits: num=1
   [junit4]   2> 	commit{dir=MockDirectoryWrapper(RAMDirectory@3c38115 lockFactory=org.apache.lucene.store.SingleInstanceLockFactory@184f8ba1),segFN=segments_1,generation=1}
   [junit4]   2> 1773358 INFO  (coreLoadExecutor-5730-thread-1-processing-n:127.0.0.1:53201_) [n:127.0.0.1:53201_ c:control_collection s:shard1 r:core_node1 x:collection1] o.a.s.c.SolrCore newest commit generation = 1
   [junit4]   2> 1773359 INFO  (OldIndexDirectoryCleanupThreadForCore-collection1) [n:127.0.0.1:53201_ c:control_collection s:shard1 r:core_node1 x:collection1] o.a.s.c.SolrCore Looking for old index directories to cleanup for core collection1 in /x1/jenkins/jenkins-slave/workspace/Lucene-Solr-Tests-5.3-Java7/solr/build/solr-core/test/J1/temp/solr.cloud.TestReplicaProperties_879F03022915695A-001/control-001/cores/collection1/data/
   [junit4]   2> 1773359 WARN  (OldIndexDirectoryCleanupThreadForCore-collection1) [n:127.0.0.1:53201_ c:control_collection s:shard1 r:core_node1 x:collection1] o.a.s.c.DirectoryFactory /x1/jenkins/jenkins-slave/workspace/Lucene-Solr-Tests-5.3-Java7/solr/build/solr-core/test/J1/temp/solr.cloud.TestReplicaProperties_879F03022915695A-001/control-001/cores/collection1/data/ does not point to a valid data directory; skipping clean-up of old index directories.
   [junit4]   2> 1773363 INFO  (coreLoadExecutor-5730-thread-1-processing-n:127.0.0.1:53201_) [n:127.0.0.1:53201_ c:control_collection s:shard1 r:core_node1 x:collection1] o.a.s.u.p.UpdateRequestProcessorChain creating updateRequestProcessorChain "nodistrib"
   [junit4]   2> 1773364 INFO  (coreLoadExecutor-5730-thread-1-processing-n:127.0.0.1:53201_) [n:127.0.0.1:53201_ c:control_collection s:shard1 r:core_node1 x:collection1] o.a.s.u.p.UpdateRequestProcessorChain creating updateRequestProcessorChain "dedupe"
   [junit4]   2> 1773364 INFO  (coreLoadExecutor-5730-thread-1-processing-n:127.0.0.1:53201_) [n:127.0.0.1:53201_ c:control_collection s:shard1 r:core_node1 x:collection1] o.a.s.u.p.UpdateRequestProcessorChain inserting DistributedUpdateProcessorFactory into updateRequestProcessorChain "dedupe"
   [junit4]   2> 1773364 INFO  (coreLoadExecutor-5730-thread-1-processing-n:127.0.0.1:53201_) [n:127.0.0.1:53201_ c:control_collection s:shard1 r:core_node1 x:collection1] o.a.s.u.p.UpdateRequestProcessorChain creating updateRequestProcessorChain "stored_sig"
   [junit4]   2> 1773364 INFO  (coreLoadExecutor-5730-thread-1-processing-n:127.0.0.1:53201_) [n:127.0.0.1:53201_ c:control_collection s:shard1 r:core_node1 x:collection1] o.a.s.u.p.UpdateRequestProcessorChain inserting DistributedUpdateProcessorFactory into updateRequestProcessorChain "stored_sig"
   [junit4]   2> 1773364 INFO  (coreLoadExecutor-5730-thread-1-processing-n:127.0.0.1:53201_) [n:127.0.0.1:53201_ c:control_collection s:shard1 r:core_node1 x:collection1] o.a.s.u.p.UpdateRequestProcessorChain creating updateRequestProcessorChain "distrib-dup-test-chain-explicit"
   [junit4]   2> 1773365 INFO  (coreLoadExecutor-5730-thread-1-processing-n:127.0.0.1:53201_) [n:127.0.0.1:53201_ c:control_collection s:shard1 r:core_node1 x:collection1] o.a.s.u.p.UpdateRequestProcessorChain creating updateRequestProcessorChain "distrib-dup-test-chain-implicit"
   [junit4]   2> 1773365 INFO  (coreLoadExecutor-5730-thread-1-processing-n:127.0.0.1:53201_) [n:127.0.0.1:53201_ c:control_collection s:shard1 r:core_node1 x:collection1] o.a.s.u.p.UpdateRequestProcessorChain inserting DistributedUpdateProcessorFactory into updateRequestProcessorChain "distrib-dup-test-chain-implicit"
   [junit4]   2> 1773365 INFO  (coreLoadExecutor-5730-thread-1-processing-n:127.0.0.1:53201_) [n:127.0.0.1:53201_ c:control_collection s:shard1 r:core_node1 x:collection1] o.a.s.c.SolrCore no updateRequestProcessorChain defined as default, creating implicit default
   [junit4]   2> 1773368 INFO  (coreLoadExecutor-5730-thread-1-processing-n:127.0.0.1:53201_) [n:127.0.0.1:53201_ c:control_collection s:shard1 r:core_node1 x:collection1] o.a.s.h.l.XMLLoader xsltCacheLifetimeSeconds=60
   [junit4]   2> 1773369 INFO  (coreLoadExecutor-5730-thread-1-processing-n:127.0.0.1:53201_) [n:127.0.0.1:53201_ c:control_collection s:shard1 r:core_node1 x:collection1] o.a.s.h.l.XMLLoader xsltCacheLifetimeSeconds=60
   [junit4]   2> 1773371 INFO  (coreLoadExecutor-5730-thread-1-processing-n:127.0.0.1:53201_) [n:127.0.0.1:53201_ c:control_collection s:shard1 r:core_node1 x:collection1] o.a.s.h.l.XMLLoader xsltCacheLifetimeSeconds=60
   [junit4]   2> 1773372 INFO  (coreLoadExecutor-5730-thread-1-processing-n:127.0.0.1:53201_) [n:127.0.0.1:53201_ c:control_collection s:shard1 r:core_node1 x:collection1] o.a.s.h.l.XMLLoader xsltCacheLifetimeSeconds=60
   [junit4]   2> 1773376 INFO  (coreLoadExecutor-5730-thread-1-processing-n:127.0.0.1:53201_) [n:127.0.0.1:53201_ c:control_collection s:shard1 r:core_node1 x:collection1] o.a.s.c.RequestHandlers Registered paths: /admin/mbeans,/schema,/replication,/admin/system,/update/json/docs,/admin/file,/get,/config,/admin/segments,/admin/logging,/update/json,/admin/ping,/admin/properties,/update,standard,/admin/plugins,/admin/threads,/update/csv,/admin/luke
   [junit4]   2> 1773378 INFO  (coreLoadExecutor-5730-thread-1-processing-n:127.0.0.1:53201_) [n:127.0.0.1:53201_ c:control_collection s:shard1 r:core_node1 x:collection1] o.a.s.c.SolrCore Using default statsCache cache: org.apache.solr.search.stats.LocalStatsCache
   [junit4]   2> 1773378 INFO  (coreLoadExecutor-5730-thread-1-processing-n:127.0.0.1:53201_) [n:127.0.0.1:53201_ c:control_collection s:shard1 r:core_node1 x:collection1] o.a.s.u.UpdateHandler Using UpdateLog implementation: org.apache.solr.update.UpdateLog
   [junit4]   2> 1773378 INFO  (coreLoadExecutor-5730-thread-1-processing-n:127.0.0.1:53201_) [n:127.0.0.1:53201_ c:control_collection s:shard1 r:core_node1 x:collection1] o.a.s.u.UpdateLog Initializing UpdateLog: dataDir= defaultSyncLevel=FLUSH numRecordsToKeep=100 maxNumLogsToKeep=10 numVersionBuckets=65536
   [junit4]   2> 1773379 INFO  (coreLoadExecutor-5730-thread-1-processing-n:127.0.0.1:53201_) [n:127.0.0.1:53201_ c:control_collection s:shard1 r:core_node1 x:collection1] o.a.s.c.SolrCore Hard AutoCommit: disabled
   [junit4]   2> 1773379 INFO  (coreLoadExecutor-5730-thread-1-processing-n:127.0.0.1:53201_) [n:127.0.0.1:53201_ c:control_collection s:shard1 r:core_node1 x:collection1] o.a.s.c.SolrCore Soft AutoCommit: disabled
   [junit4]   2> 1773380 INFO  (coreLoadExecutor-5730-thread-1-processing-n:127.0.0.1:53201_) [n:127.0.0.1:53201_ c:control_collection s:shard1 r:core_node1 x:collection1] o.a.s.u.RandomMergePolicy RandomMergePolicy wrapping class org.apache.lucene.index.LogDocMergePolicy: [LogDocMergePolicy: minMergeSize=1000, mergeFactor=50, maxMergeSize=9223372036854775807, maxMergeSizeForForcedMerge=9223372036854775807, calibrateSizeByDeletes=true, maxMergeDocs=2147483647, maxCFSSegmentSizeMB=8.796093022207999E12, noCFSRatio=0.0]
   [junit4]   2> 1773380 INFO  (coreLoadExecutor-5730-thread-1-processing-n:127.0.0.1:53201_) [n:127.0.0.1:53201_ c:control_collection s:shard1 r:core_node1 x:collection1] o.a.s.c.SolrCore SolrDeletionPolicy.onInit: commits: num=1
   [junit4]   2> 	commit{dir=MockDirectoryWrapper(RAMDirectory@3c38115 lockFactory=org.apache.lucene.store.SingleInstanceLockFactory@184f8ba1),segFN=segments_1,generation=1}
   [junit4]   2> 1773380 INFO  (coreLoadExecutor-5730-thread-1-processing-n:127.0.0.1:53201_) [n:127.0.0.1:53201_ c:control_collection s:shard1 r:core_node1 x:collection1] o.a.s.c.SolrCore newest commit generation = 1
   [junit4]   2> 1773381 INFO  (coreLoadExecutor-5730-thread-1-processing-n:127.0.0.1:53201_) [n:127.0.0.1:53201_ c:control_collection s:shard1 r:core_node1 x:collection1] o.a.s.s.SolrIndexSearcher Opening Searcher@25d8b8ba[collection1] main
   [junit4]   2> 1773381 INFO  (coreLoadExecutor-5730-thread-1-processing-n:127.0.0.1:53201_) [n:127.0.0.1:53201_ c:control_collection s:shard1 r:core_node1 x:collection1] o.a.s.c.c.ZkStateReader Load collection config from:/collections/control_collection
   [junit4]   2> 1773382 INFO  (coreLoadExecutor-5730-thread-1-processing-n:127.0.0.1:53201_) [n:127.0.0.1:53201_ c:control_collection s:shard1 r:core_node1 x:collection1] o.a.s.c.c.ZkStateReader path=/collections/control_collection configName=conf1 specified config exists in ZooKeeper
   [junit4]   2> 1773382 INFO  (coreLoadExecutor-5730-thread-1-processing-n:127.0.0.1:53201_) [n:127.0.0.1:53201_ c:control_collection s:shard1 r:core_node1 x:collection1] o.a.s.r.ManagedResourceStorage Setting up ZooKeeper-based storage for the RestManager with znodeBase: /configs/conf1
   [junit4]   2> 1773382 INFO  (coreLoadExecutor-5730-thread-1-processing-n:127.0.0.1:53201_) [n:127.0.0.1:53201_ c:control_collection s:shard1 r:core_node1 x:collection1] o.a.s.r.ManagedResourceStorage Configured ZooKeeperStorageIO with znodeBase: /configs/conf1
   [junit4]   2> 1773382 INFO  (coreLoadExecutor-5730-thread-1-processing-n:127.0.0.1:53201_) [n:127.0.0.1:53201_ c:control_collection s:shard1 r:core_node1 x:collection1] o.a.s.r.RestManager Initializing RestManager with initArgs: {}
   [junit4]   2> 1773382 INFO  (coreLoadExecutor-5730-thread-1-processing-n:127.0.0.1:53201_) [n:127.0.0.1:53201_ c:control_collection s:shard1 r:core_node1 x:collection1] o.a.s.r.ManagedResourceStorage Reading _rest_managed.json using ZooKeeperStorageIO:path=/configs/conf1
   [junit4]   2> 1773383 INFO  (coreLoadExecutor-5730-thread-1-processing-n:127.0.0.1:53201_) [n:127.0.0.1:53201_ c:control_collection s:shard1 r:core_node1 x:collection1] o.a.s.r.ManagedResourceStorage No data found for znode /configs/conf1/_rest_managed.json
   [junit4]   2> 1773383 INFO  (coreLoadExecutor-5730-thread-1-processing-n:127.0.0.1:53201_) [n:127.0.0.1:53201_ c:control_collection s:shard1 r:core_node1 x:collection1] o.a.s.r.ManagedResourceStorage Loaded null at path _rest_managed.json using ZooKeeperStorageIO:path=/configs/conf1
   [junit4]   2> 1773383 INFO  (coreLoadExecutor-5730-thread-1-processing-n:127.0.0.1:53201_) [n:127.0.0.1:53201_ c:control_collection s:shard1 r:core_node1 x:collection1] o.a.s.r.RestManager Initializing 0 registered ManagedResources
   [junit4]   2> 1773383 INFO  (coreLoadExecutor-5730-thread-1-processing-n:127.0.0.1:53201_) [n:127.0.0.1:53201_ c:control_collection s:shard1 r:core_node1 x:collection1] o.a.s.h.ReplicationHandler Commits will be reserved for  10000
   [junit4]   2> 1773384 INFO  (searcherExecutor-5731-thread-1-processing-r:core_node1 n:127.0.0.1:53201_ s:shard1 x:collection1 c:control_collection) [n:127.0.0.1:53201_ c:control_collection s:shard1 r:core_node1 x:collection1] o.a.s.c.SolrCore [collection1] Registered new searcher Searcher@25d8b8ba[collection1] main{ExitableDirectoryReader(UninvertingDirectoryReader())}
   [junit4]   2> 1773384 INFO  (coreLoadExecutor-5730-thread-1-processing-n:127.0.0.1:53201_) [n:127.0.0.1:53201_ c:control_collection s:shard1 r:core_node1 x:collection1] o.a.s.u.UpdateLog Looking up max value of version field to seed version buckets
   [junit4]   2> 1773384 INFO  (coreLoadExecutor-5730-thread-1-processing-n:127.0.0.1:53201_) [n:127.0.0.1:53201_ c:control_collection s:shard1 r:core_node1 x:collection1] o.a.s.u.VersionInfo Refreshing highest value of _version_ for 65536 version buckets from index
   [junit4]   2> 1773385 INFO  (coreLoadExecutor-5730-thread-1-processing-n:127.0.0.1:53201_) [n:127.0.0.1:53201_ c:control_collection s:shard1 r:core_node1 x:collection1] o.a.s.u.VersionInfo No terms found for _version_, cannot seed version bucket highest value from index
   [junit4]   2> 1773385 INFO  (coreLoadExecutor-5730-thread-1-processing-n:127.0.0.1:53201_) [n:127.0.0.1:53201_ c:control_collection s:shard1 r:core_node1 x:collection1] o.a.s.u.UpdateLog Could not find max version in index or recent updates, using new clock 1510013837700497408
   [junit4]   2> 1773387 INFO  (coreLoadExecutor-5730-thread-1-processing-n:127.0.0.1:53201_) [n:127.0.0.1:53201_ c:control_collection s:shard1 r:core_node1 x:collection1] o.a.s.u.UpdateLog Took 3 ms to seed version buckets with highest version 1510013837700497408
   [junit4]   2> 1773387 INFO  (coreLoadExecutor-5730-thread-1-processing-n:127.0.0.1:53201_) [n:127.0.0.1:53201_ c:control_collection s:shard1 r:core_node1 x:collection1] o.a.s.c.ZkController watch zkdir /configs/conf1
   [junit4]   2> 1773388 INFO  (coreLoadExecutor-5730-thread-1-processing-n:127.0.0.1:53201_) [n:127.0.0.1:53201_ c:control_collection s:shard1 r:core_node1 x:collection1] o.a.s.c.CoreContainer registering core: collection1
   [junit4]   2> 1773389 INFO  (coreZkRegister-5724-thread-1-processing-r:core_node1 n:127.0.0.1:53201_ s:shard1 x:collection1 c:control_collection) [n:127.0.0.1:53201_ c:control_collection s:shard1 r:core_node1 x:collection1] o.a.s.c.ZkController Register replica - core:collection1 address:https://127.0.0.1:53201 collection:control_collection shard:shard1
   [junit4]   2> 1773390 INFO  (coreZkRegister-5724-thread-1-processing-r:core_node1 n:127.0.0.1:53201_ s:shard1 x:collection1 c:control_collection) [n:127.0.0.1:53201_ c:control_collection s:shard1 r:core_node1 x:collection1] o.a.s.c.c.SolrZkClient makePath: /collections/control_collection/leader_elect/shard1/election
   [junit4]   2> 1773393 INFO  (coreZkRegister-5724-thread-1-processing-r:core_node1 n:127.0.0.1:53201_ s:shard1 x:collection1 c:control_collection) [n:127.0.0.1:53201_ c:control_collection s:shard1 r:core_node1 x:collection1] o.a.s.c.LeaderElector Joined leadership election with path: /collections/control_collection/leader_elect/shard1/election/94375864727699461-core_node1-n_0000000000
   [junit4]   2> 1773394 INFO  (coreZkRegister-5724-thread-1-processing-r:core_node1 n:127.0.0.1:53201_ s:shard1 x:collection1 c:control_collection) [n:127.0.0.1:53201_ c:control_collection s:shard1 r:core_node1 x:collection1] o.a.s.c.ShardLeaderElectionContext Running the leader process for shard shard1
   [junit4]   2> 1773395 INFO  (zkCallback-1939-thread-1-processing-n:127.0.0.1:53201_) [n:127.0.0.1:53201_    ] o.a.s.c.DistributedQueue NodeChildrenChanged fired on path /overseer/queue state SyncConnected
   [junit4]   2> 1773396 INFO  (coreZkRegister-5724-thread-1-processing-r:core_node1 n:127.0.0.1:53201_ s:shard1 x:collection1 c:control_collection) [n:127.0.0.1:53201_ c:control_collection s:shard1 r:core_node1 x:collection1] o.a.s.c.ShardLeaderElectionContext Enough replicas found to continue.
   [junit4]   2> 1773396 INFO  (coreZkRegister-5724-thread-1-processing-r:core_node1 n:127.0.0.1:53201_ s:shard1 x:collection1 c:control_collection) [n:127.0.0.1:53201_ c:control_collection s:shard1 r:core_node1 x:collection1] o.a.s.c.ShardLeaderElectionContext I may be the new leader - try and sync
   [junit4]   2> 1773396 INFO  (coreZkRegister-5724-thread-1-processing-r:core_node1 n:127.0.0.1:53201_ s:shard1 x:collection1 c:control_collection) [n:127.0.0.1:53201_ c:control_collection s:shard1 r:core_node1 x:collection1] o.a.s.c.SyncStrategy Sync replicas to https://127.0.0.1:53201/collection1/
   [junit4]   2> 1773396 INFO  (coreZkRegister-5724-thread-1-processing-r:core_node1 n:127.0.0.1:53201_ s:shard1 x:collection1 c:control_collection) [n:127.0.0.1:53201_ c:control_collection s:shard1 r:core_node1 x:collection1] o.a.s.c.SyncStrategy Sync Success - now sync replicas to me
   [junit4]   2> 1773396 INFO  (OverseerStateUpdate-94375864727699461-127.0.0.1:53201_-n_0000000000) [n:127.0.0.1:53201_    ] o.a.s.c.Overseer processMessage: queueSize: 1, message = {
   [junit4]   2>   "operation":"leader",
   [junit4]   2>   "shard":"shard1",
   [junit4]   2>   "collection":"control_collection"} current state version: 1
   [junit4]   2> 1773396 INFO  (coreZkRegister-5724-thread-1-processing-r:core_node1 n:127.0.0.1:53201_ s:shard1 x:collection1 c:control_collection) [n:127.0.0.1:53201_ c:control_collection s:shard1 r:core_node1 x:collection1] o.a.s.c.SyncStrategy https://127.0.0.1:53201/collection1/ has no replicas
   [junit4]   2> 1773396 INFO  (coreZkRegister-5724-thread-1-processing-r:core_node1 n:127.0.0.1:53201_ s:shard1 x:collection1 c:control_collection) [n:127.0.0.1:53201_ c:control_collection s:shard1 r:core_node1 x:collection1] o.a.s.c.ShardLeaderElectionContext I am the new leader: https://127.0.0.1:53201/collection1/ shard1
   [junit4]   2> 1773397 INFO  (coreZkRegister-5724-thread-1-processing-r:core_node1 n:127.0.0.1:53201_ s:shard1 x:collection1 c:control_collection) [n:127.0.0.1:53201_ c:control_collection s:shard1 r:core_node1 x:collection1] o.a.s.c.c.SolrZkClient makePath: /collections/control_collection/leaders/shard1
   [junit4]   2> 1773400 INFO  (zkCallback-1939-thread-1-processing-n:127.0.0.1:53201_) [n:127.0.0.1:53201_    ] o.a.s.c.DistributedQueue NodeChildrenChanged fired on path /overseer/queue state SyncConnected
   [junit4]   2> 1773401 INFO  (OverseerStateUpdate-94375864727699461-127.0.0.1:53201_-n_0000000000) [n:127.0.0.1:53201_    ] o.a.s.c.Overseer processMessage: queueSize: 1, message = {
   [junit4]   2>   "operation":"leader",
   [junit4]   2>   "shard":"shard1",
   [junit4]   2>   "collection":"control_collection",
   [junit4]   2>   "base_url":"https://127.0.0.1:53201",
   [junit4]   2>   "core":"collection1",
   [junit4]   2>   "state":"active"} current state version: 1
   [junit4]   2> 1773504 INFO  (zkCallback-1939-thread-1-processing-n:127.0.0.1:53201_) [n:127.0.0.1:53201_    ] o.a.s.c.c.ZkStateReader A cluster state change: WatchedEvent state:SyncConnected type:NodeDataChanged path:/clusterstate.json, has occurred - updating... (live nodes size: 1)
   [junit4]   2> 1773505 INFO  (zkCallback-1939-thread-1-processing-n:127.0.0.1:53201_) [n:127.0.0.1:53201_    ] o.a.s.c.c.ZkStateReader Updated cluster state version to 2
   [junit4]   2> 1773526 INFO  (TEST-TestReplicaProperties.test-seed#[879F03022915695A]) [    ] o.a.s.c.c.SolrZkClient Using default ZkCredentialsProvider
   [junit4]   2> 1773527 INFO  (TEST-TestReplicaProperties.test-seed#[879F03022915695A]) [    ] o.a.s.c.c.ConnectionManager Waiting for client to connect to ZooKeeper
   [junit4]   2> 1773528 INFO  (zkCallback-1941-thread-1) [    ] o.a.s.c.c.ConnectionManager Watcher org.apache.solr.common.cloud.ConnectionManager@16c82a29 name:ZooKeeperConnection Watcher:127.0.0.1:48425/solr got event WatchedEvent state:SyncConnected type:None path:null path:null type:None
   [junit4]   2> 1773528 INFO  (TEST-TestReplicaProperties.test-seed#[879F03022915695A]) [    ] o.a.s.c.c.ConnectionManager Client is connected to ZooKeeper
   [junit4]   2> 1773529 INFO  (TEST-TestReplicaProperties.test-seed#[879F03022915695A]) [    ] o.a.s.c.c.SolrZkClient Using default ZkACLProvider
   [junit4]   2> 1773529 INFO  (TEST-TestReplicaProperties.test-seed#[879F03022915695A]) [    ] o.a.s.c.c.ZkStateReader Updating cluster state from ZooKeeper... 
   [junit4]   2> 1773531 INFO  (TEST-TestReplicaProperties.test-seed#[879F03022915695A]) [    ] o.a.s.c.ChaosMonkey monkey: init - expire sessions:false cause connection loss:false
   [junit4]   2> 1773551 INFO  (coreZkRegister-5724-thread-1-processing-r:core_node1 n:127.0.0.1:53201_ s:shard1 x:collection1 c:control_collection) [n:127.0.0.1:53201_ c:control_collection s:shard1 r:core_node1 x:collection1] o.a.s.c.ZkController We are https://127.0.0.1:53201/collection1/ and leader is https://127.0.0.1:53201/collection1/
   [junit4]   2> 1773552 INFO  (coreZkRegister-5724-thread-1-processing-r:core_node1 n:127.0.0.1:53201_ s:shard1 x:collection1 c:control_collection) [n:127.0.0.1:53201_ c:control_collection s:shard1 r:core_node1 x:collection1] o.a.s.c.ZkController No LogReplay needed for core=collection1 baseURL=https://127.0.0.1:53201
   [junit4]   2> 1773552 INFO  (coreZkRegister-5724-thread-1-processing-r:core_node1 n:127.0.0.1:53201_ s:shard1 x:collection1 c:control_collection) [n:127.0.0.1:53201_ c:control_collection s:shard1 r:core_node1 x:collection1] o.a.s.c.ZkController I am the leader, no recovery necessary
   [junit4]   2> 1773552 INFO  (coreZkRegister-5724-thread-1-processing-r:core_node1 n:127.0.0.1:53201_ s:shard1 x:collection1 c:control_collection) [n:127.0.0.1:53201_ c:control_collection s:shard1 r:core_node1 x:collection1] o.a.s.c.ZkController publishing state=active
   [junit4]   2> 1773552 INFO  (coreZkRegister-5724-thread-1-processing-r:core_node1 n:127.0.0.1:53201_ s:shard1 x:collection1 c:control_collection) [n:127.0.0.1:53201_ c:control_collection s:shard1 r:core_node1 x:collection1] o.a.s.c.ZkController numShards not found on descriptor - reading it from system property
   [junit4]   2> 1773553 INFO  (zkCallback-1939-thread-1-processing-n:127.0.0.1:53201_) [n:127.0.0.1:53201_    ] o.a.s.c.DistributedQueue NodeChildrenChanged fired on path /overseer/queue state SyncConnected
   [junit4]   2> 1773554 INFO  (OverseerStateUpdate-94375864727699461-127.0.0.1:53201_-n_0000000000) [n:127.0.0.1:53201_    ] o.a.s.c.Overseer processMessage: queueSize: 1, message = {
   [junit4]   2>   "roles":null,
   [junit4]   2>   "core_node_name":"core_node1",
   [junit4]   2>   "node_name":"127.0.0.1:53201_",
   [junit4]   2>   "shard":"shard1",
   [junit4]   2>   "core":"collection1",
   [junit4]   2>   "state":"active",
   [junit4]   2>   "numShards":"2",
   [junit4]   2>   "collection":"control_collection",
   [junit4]   2>   "operation":"state",
   [junit4]   2>   "base_url":"https://127.0.0.1:53201"} current state version: 2
   [junit4]   2> 1773555 INFO  (OverseerStateUpdate-94375864727699461-127.0.0.1:53201_-n_0000000000) [n:127.0.0.1:53201_    ] o.a.s.c.o.ReplicaMutator Update state numShards=2 message={
   [junit4]   2>   "roles":null,
   [junit4]   2>   "core_node_name":"core_node1",
   [junit4]   2>   "node_name":"127.0.0.1:53201_",
   [junit4]   2>   "shard":"shard1",
   [junit4]   2>   "core":"collection1",
   [junit4]   2>   "state":"active",
   [junit4]   2>   "numShards":"2",
   [junit4]   2>   "collection":"control_collection",
   [junit4]   2>   "operation":"state",
   [junit4]   2>   "base_url":"https://127.0.0.1:53201"}
   [junit4]   2> 1773658 INFO  (zkCallback-1939-thread-1-processing-n:127.0.0.1:53201_) [n:127.0.0.1:53201_    ] o.a.s.c.c.ZkStateReader A cluster state change: WatchedEvent state:SyncConnected type:NodeDataChanged path:/clusterstate.json, has occurred - updating... (live nodes size: 1)
   [junit4]   2> 1773660 INFO  (zkCallback-1939-thread-1-processing-n:127.0.0.1:53201_) [n:127.0.0.1:53201_    ] o.a.s.c.c.ZkStateReader Updated cluster state version to 3
   [junit4]   2> 1773660 INFO  (zkCallback-1941-thread-1) [    ] o.a.s.c.c.ZkStateReader A cluster state change: WatchedEvent state:SyncConnected type:NodeDataChanged path:/clusterstate.json, has occurred - updating... (live nodes size: 1)
   [junit4]   2> 1773662 INFO  (zkCallback-1941-thread-1) [    ] o.a.s.c.c.ZkStateReader Updated cluster state version to 3
   [junit4]   2> 1773871 INFO  (TEST-TestReplicaProperties.test-seed#[879F03022915695A]) [    ] o.a.s.SolrTestCaseJ4 Writing core.properties file to /x1/jenkins/jenkins-slave/workspace/Lucene-Solr-Tests-5.3-Java7/solr/build/solr-core/test/J1/temp/solr.cloud.TestReplicaProperties_879F03022915695A-001/shard-1-001/cores/collection1
   [junit4]   2> 1773872 INFO  (TEST-TestReplicaProperties.test-seed#[879F03022915695A]) [    ] o.a.s.c.AbstractFullDistribZkTestBase create jetty 1 in directory /x1/jenkins/jenkins-slave/workspace/Lucene-Solr-Tests-5.3-Java7/solr/build/solr-core/test/J1/temp/solr.cloud.TestReplicaProperties_879F03022915695A-001/shard-1-001
   [junit4]   2> 1773873 INFO  (TEST-TestReplicaProperties.test-seed#[879F03022915695A]) [    ] o.e.j.s.Server jetty-9.2.11.v20150529
   [junit4]   2> 1773875 INFO  (TEST-TestReplicaProperties.test-seed#[879F03022915695A]) [    ] o.e.j.s.h.ContextHandler Started o.e.j.s.ServletContextHandler@7a16edd0{/,null,AVAILABLE}
   [junit4]   2> 1773878 INFO  (TEST-TestReplicaProperties.test-seed#[879F03022915695A]) [    ] o.e.j.s.ServerConnector Started ServerConnector@7d663517{SSL-http/1.1}{127.0.0.1:49239}
   [junit4]   2> 1773878 INFO  (TEST-TestReplicaProperties.test-seed#[879F03022915695A]) [    ] o.e.j.s.Server Started @1778334ms
   [junit4]   2> 1773878 INFO  (TEST-TestReplicaProperties.test-seed#[879F03022915695A]) [    ] o.a.s.c.s.e.JettySolrRunner Jetty properties: {solrconfig=solrconfig.xml, coreRootDirectory=/x1/jenkins/jenkins-slave/workspace/Lucene-Solr-Tests-5.3-Java7/solr/build/solr-core/test/J1/../../../../../../../../../../x1/jenkins/jenkins-slave/workspace/Lucene-Solr-Tests-5.3-Java7/solr/build/solr-core/test/J1/temp/solr.cloud.TestReplicaProperties_879F03022915695A-001/shard-1-001/cores, hostContext=/, solr.data.dir=/x1/jenkins/jenkins-slave/workspace/Lucene-Solr-Tests-5.3-Java7/solr/build/solr-core/test/J1/temp/solr.cloud.TestReplicaProperties_879F03022915695A-001/tempDir-001/jetty1, hostPort=49239}
   [junit4]   2> 1773878 INFO  (TEST-TestReplicaProperties.test-seed#[879F03022915695A]) [    ] o.a.s.s.SolrDispatchFilter SolrDispatchFilter.init(): sun.misc.Launcher$AppClassLoader@7f423820
   [junit4]   2> 1773879 INFO  (TEST-TestReplicaProperties.test-seed#[879F03022915695A]) [    ] o.a.s.c.SolrResourceLoader new SolrResourceLoader for directory: '/x1/jenkins/jenkins-slave/workspace/Lucene-Solr-Tests-5.3-Java7/solr/build/solr-core/test/J1/../../../../../../../../../../x1/jenkins/jenkins-slave/workspace/Lucene-Solr-Tests-5.3-Java7/solr/build/solr-core/test/J1/temp/solr.cloud.TestReplicaProperties_879F03022915695A-001/shard-1-001/'
   [junit4]   2> 1773896 INFO  (TEST-TestReplicaProperties.test-seed#[879F03022915695A]) [    ] o.a.s.c.c.SolrZkClient Using default ZkCredentialsProvider
   [junit4]   2> 1773897 INFO  (TEST-TestReplicaProperties.test-seed#[879F03022915695A]) [    ] o.a.s.c.c.ConnectionManager Waiting for client to connect to ZooKeeper
   [junit4]   2> 1773899 INFO  (zkCallback-1942-thread-1) [    ] o.a.s.c.c.ConnectionManager Watcher org.apache.solr.common.cloud.ConnectionManager@199f6bb5 name:ZooKeeperConnection Watcher:127.0.0.1:48425/solr got event WatchedEvent state:SyncConnected type:None path:null path:null type:None
   [junit4]   2> 1773899 INFO  (TEST-TestReplicaProperties.test-seed#[879F03022915695A]) [    ] o.a.s.c.c.ConnectionManager Client is connected to ZooKeeper
   [junit4]   2> 1773899 INFO  (TEST-TestReplicaProperties.test-seed#[879F03022915695A]) [    ] o.a.s.c.c.SolrZkClient Using default ZkACLProvider
   [junit4]   2> 1773900 INFO  (TEST-TestReplicaProperties.test-seed#[879F03022915695A]) [    ] o.a.s.s.SolrDispatchFilter Loading solr.xml from SolrHome (not found in ZooKeeper)
   [junit4]   2> 1773901 INFO  (TEST-TestReplicaProperties.test-seed#[879F03022915695A]) [    ] o.a.s.c.SolrXmlConfig Loading container configuration from /x1/jenkins/jenkins-slave/workspace/Lucene-Solr-Tests-5.3-Java7/solr/build/solr-core/test/J1/../../../../../../../../../../x1/jenkins/jenkins-slave/workspace/Lucene-Solr-Tests-5.3-Java7/solr/build/solr-core/test/J1/temp/solr.cloud.TestReplicaProperties_879F03022915695A-001/shard-1-001/solr.xml
   [junit4]   2> 1773916 INFO  (TEST-TestReplicaProperties.test-seed#[879F03022915695A]) [    ] o.a.s.c.CoresLocator Config-defined core root directory: /x1/jenkins/jenkins-slave/workspace/Lucene-Solr-Tests-5.3-Java7/solr/build/solr-core/test/J1/../../../../../../../../../../x1/jenkins/jenkins-slave/workspace/Lucene-Solr-Tests-5.3-Java7/solr/build/solr-core/test/J1/temp/solr.cloud.TestReplicaProperties_879F03022915695A-001/shard-1-001/cores
   [junit4]   2> 1773916 INFO  (TEST-TestReplicaProperties.test-seed#[879F03022915695A]) [    ] o.a.s.c.CoreContainer New CoreContainer 1109934374
   [junit4]   2> 1773916 INFO  (TEST-TestReplicaProperties.test-seed#[879F03022915695A]) [    ] o.a.s.c.CoreContainer Loading cores into CoreContainer [instanceDir=/x1/jenkins/jenkins-slave/workspace/Lucene-Solr-Tests-5.3-Java7/solr/build/solr-core/test/J1/../../../../../../../../../../x1/jenkins/jenkins-slave/workspace/Lucene-Solr-Tests-5.3-Java7/solr/build/solr-core/test/J1/temp/solr.cloud.TestReplicaProperties_879F03022915695A-001/shard-1-001/]
   [junit4]   2> 1773916 INFO  (TEST-TestReplicaProperties.test-seed#[879F03022915695A]) [    ] o.a.s.c.CoreContainer loading shared library: /x1/jenkins/jenkins-slave/workspace/Lucene-Solr-Tests-5.3-Java7/solr/build/solr-core/test/J1/../../../../../../../../../../x1/jenkins/jenkins-slave/workspace/Lucene-Solr-Tests-5.3-Java7/solr/build/solr-core/test/J1/temp/solr.cloud.TestReplicaProperties_879F03022915695A-001/shard-1-001/lib
   [junit4]   2> 1773917 WARN  (TEST-TestReplicaProperties.test-seed#[879F03022915695A]) [    ] o.a.s.c.SolrResourceLoader Can't find (or read) directory to add to classloader: lib (resolved as: /x1/jenkins/jenkins-slave/workspace/Lucene-Solr-Tests-5.3-Java7/solr/build/solr-core/test/J1/../../../../../../../../../../x1/jenkins/jenkins-slave/workspace/Lucene-Solr-Tests-5.3-Java7/solr/build/solr-core/test/J1/temp/solr.cloud.TestReplicaProperties_879F03022915695A-001/shard-1-001/lib).
   [junit4]   2> 1773925 INFO  (TEST-TestReplicaProperties.test-seed#[879F03022915695A]) [    ] o.a.s.h.c.HttpShardHandlerFactory created with socketTimeout : 90000,urlScheme : ,connTimeout : 15000,maxConnectionsPerHost : 20,maxConnections : 10000,corePoolSize : 0,maximumPoolSize : 2147483647,maxThreadIdleTime : 5,sizeOfQueue : -1,fairnessPolicy : false,useRetries : false,
   [junit4]   2> 1773928 INFO  (TEST-TestReplicaProperties.test-seed#[879F03022915695A]) [    ] o.a.s.u.UpdateShardHandler Creating UpdateShardHandler HTTP client with params: socketTimeout=340000&connTimeout=45000&retry=true
   [junit4]   2> 1773929 INFO  (TEST-TestReplicaProperties.test-seed#[879F03022915695A]) [    ] o.a.s.l.LogWatcher SLF4J impl is org.slf4j.impl.Log4jLoggerFactory
   [junit4]   2> 1773930 INFO  (TEST-TestReplicaProperties.test-seed#[879F03022915695A]) [    ] o.a.s.l.LogWatcher Registering Log Listener [Log4j (org.slf4j.impl.Log4jLoggerFactory)]
   [junit4]   2> 1773930 INFO  (TEST-TestReplicaProperties.test-seed#[879F03022915695A]) [    ] o.a.s.c.ZkContainer Zookeeper client=127.0.0.1:48425/solr
   [junit4]   2> 1773930 INFO  (TEST-TestReplicaProperties.test-seed#[879F03022915695A]) [    ] o.a.s.c.ZkController zkHost includes chroot
   [junit4]   2> 1773930 INFO  (TEST-TestReplicaProperties.test-seed#[879F03022915695A]) [    ] o.a.s.c.c.SolrZkClient Using default ZkCredentialsProvider
   [junit4]   2> 1773932 INFO  (TEST-TestReplicaProperties.test-seed#[879F03022915695A]) [    ] o.a.s.c.c.ConnectionManager Waiting for client to connect to ZooKeeper
   [junit4]   2> 1773932 INFO  (zkCallback-1944-thread-1) [    ] o.a.s.c.c.ConnectionManager Watcher org.apache.solr.common.cloud.ConnectionManager@111ecfc9 name:ZooKeeperConnection Watcher:127.0.0.1:48425 got event WatchedEvent state:SyncConnected type:None path:null path:null type:None
   [junit4]   2> 1773933 INFO  (TEST-TestReplicaProperties.test-seed#[879F03022915695A]) [    ] o.a.s.c.c.ConnectionManager Client is connected to ZooKeeper
   [junit4]   2> 1773933 INFO  (TEST-TestReplicaProperties.test-seed#[879F03022915695A]) [    ] o.a.s.c.c.SolrZkClient Using default ZkACLProvider
   [junit4]   2> 1773934 INFO  (TEST-TestReplicaProperties.test-seed#[879F03022915695A]) [n:127.0.0.1:49239_    ] o.a.s.c.c.ConnectionManager Waiting for client to connect to ZooKeeper
   [junit4]   2> 1773936 INFO  (zkCallback-1945-thread-1-processing-n:127.0.0.1:49239_) [n:127.0.0.1:49239_    ] o.a.s.c.c.ConnectionManager Watcher org.apache.solr.common.cloud.ConnectionManager@4bb4badc name:ZooKeeperConnection Watcher:127.0.0.1:48425/solr got event WatchedEvent state:SyncConnected type:None path:null path:null type:None
   [junit4]   2> 1773936 INFO  (TEST-TestReplicaProperties.test-seed#[879F03022915695A]) [n:127.0.0.1:49239_    ] o.a.s.c.c.ConnectionManager Client is connected to ZooKeeper
   [junit4]   2> 1773940 INFO  (TEST-TestReplicaProperties.test-seed#[879F03022915695A]) [n:127.0.0.1:49239_    ] o.a.s.c.c.ZkStateReader Updating cluster state from ZooKeeper... 
   [junit4]   2> 1774944 INFO  (TEST-TestReplicaProperties.test-seed#[879F03022915695A]) [n:127.0.0.1:49239_    ] o.a.s.c.ZkController Register node as live in ZooKeeper:/live_nodes/127.0.0.1:49239_
   [junit4]   2> 1774945 INFO  (TEST-TestReplicaProperties.test-seed#[879F03022915695A]) [n:127.0.0.1:49239_    ] o.a.s.c.c.SolrZkClient makePath: /live_nodes/127.0.0.1:49239_
   [junit4]   2> 1774948 INFO  (TEST-TestReplicaProperties.test-seed#[879F03022915695A]) [n:127.0.0.1:49239_    ] o.a.s.c.Overseer Overseer (id=null) closing
   [junit4]   2> 1774949 INFO  (TEST-TestReplicaProperties.test-seed#[879F03022915695A]) [n:127.0.0.1:49239_    ] o.a.s.c.LeaderElector Joined leadership election with path: /overseer_elect/election/94375864727699465-127.0.0.1:49239_-n_0000000001
   [junit4]   2> 1774950 INFO  (TEST-TestReplicaProperties.test-seed#[879F03022915695A]) [n:127.0.0.1:49239_    ] o.a.s.c.LeaderElector Watching path /overseer_elect/election/94375864727699461-127.0.0.1:53201_-n_0000000000 to know if I could be the leader
   [junit4]   2> 1774963 INFO  (TEST-TestReplicaProperties.test-seed#[879F03022915695A]) [n:127.0.0.1:49239_    ] o.a.s.c.CoreContainer Security conf doesn't exist. Skipping setup for authorization module.
   [junit4]   2> 1774963 INFO  (TEST-TestReplicaProperties.test-seed#[879F03022915695A]) [n:127.0.0.1:49239_    ] o.a.s.c.CoreContainer No authentication plugin used.
   [junit4]   2> 1774964 INFO  (TEST-TestReplicaProperties.test-seed#[879F03022915695A]) [n:127.0.0.1:49239_    ] o.a.s.c.CoresLocator Looking for core definitions underneath /x1/jenkins/jenkins-slave/workspace/Lucene-Solr-Tests-5.3-Java7/solr/build/solr-core/test/J1/../../../../../../../../../../x1/jenkins/jenkins-slave/workspace/Lucene-Solr-Tests-5.3-Java7/solr/build/solr-core/test/J1/temp/solr.cloud.TestReplicaProperties_879F03022915695A-001/shard-1-001/cores
   [junit4]   2> 1774965 INFO  (TEST-TestReplicaProperties.test-seed#[879F03022915695A]) [n:127.0.0.1:49239_    ] o.a.s.c.SolrCore Created CoreDescriptor: {transient=false, absoluteInstDir=/x1/jenkins/jenkins-slave/workspace/Lucene-Solr-Tests-5.3-Java7/solr/build/solr-core/test/J1/../../../../../../../../../../x1/jenkins/jenkins-slave/workspace/Lucene-Solr-Tests-5.3-Java7/solr/build/solr-core/test/J1/temp/solr.cloud.TestReplicaProperties_879F03022915695A-001/shard-1-001/cores/collection1/, dataDir=data/, coreNodeName=, config=solrconfig.xml, schema=schema.xml, instanceDir=/x1/jenkins/jenkins-slave/workspace/Lucene-Solr-Tests-5.3-Java7/solr/build/solr-core/test/J1/../../../../../../../../../../x1/jenkins/jenkins-slave/workspace/Lucene-Solr-Tests-5.3-Java7/solr/build/solr-core/test/J1/temp/solr.cloud.TestReplicaProperties_879F03022915695A-001/shard-1-001/cores/collection1, loadOnStartup=true, collection=collection1, configSetProperties=configsetprops.json, shard=, name=collection1}
   [junit4]   2> 1774965 INFO  (TEST-TestReplicaProperties.test-seed#[879F03022915695A]) [n:127.0.0.1:49239_    ] o.a.s.c.CoresLocator Found core collection1 in /x1/jenkins/jenkins-slave/workspace/Lucene-Solr-Tests-5.3-Java7/solr/build/solr-core/test/J1/../../../../../../../../../../x1/jenkins/jenkins-slave/workspace/Lucene-Solr-Tests-5.3-Java7/solr/build/solr-core/test/J1/temp/solr.cloud.TestReplicaProperties_879F03022915695A-001/shard-1-001/cores/collection1/
   [junit4]   2> 1774965 INFO  (TEST-TestReplicaProperties.test-seed#[879F03022915695A]) [n:127.0.0.1:49239_    ] o.a.s.c.CoresLocator Found 1 core definitions
   [junit4]   2> 1774966 INFO  (coreLoadExecutor-5741-thread-1-processing-n:127.0.0.1:49239_) [n:127.0.0.1:49239_ c:collection1   x:collection1] o.a.s.c.ZkController publishing state=down
   [junit4]   2> 1774967 INFO  (coreLoadExecutor-5741-thread-1-processing-n:127.0.0.1:49239_) [n:127.0.0.1:49239_ c:collection1   x:collection1] o.a.s.c.ZkController numShards not found on descriptor - reading it from system property
   [junit4]   2> 1774967 INFO  (coreLoadExecutor-5741-thread-1-processing-n:127.0.0.1:49239_) [n:127.0.0.1:49239_ c:collection1   x:collection1] o.a.s.c.ZkController look for our core node name
   [junit4]   2> 1774968 INFO  (zkCallback-1939-thread-1-processing-n:127.0.0.1:53201_) [n:127.0.0.1:53201_    ] o.a.s.c.DistributedQueue NodeChildrenChanged fired on path /overseer/queue state SyncConnected
   [junit4]   2> 1774969 INFO  (OverseerStateUpdate-94375864727699461-127.0.0.1:53201_-n_0000000000) [n:127.0.0.1:53201_    ] o.a.s.c.Overseer processMessage: queueSize: 1, message = {
   [junit4]   2>   "roles":null,
   [junit4]   2>   "node_name":"127.0.0.1:49239_",
   [junit4]   2>   "shard":null,
   [junit4]   2>   "core":"collection1",
   [junit4]   2>   "state":"down",
   [junit4]   2>   "numShards":"2",
   [junit4]   2>   "collection":"collection1",
   [junit4]   2>   "operation":"state",
   [junit4]   2>   "base_url":"https://127.0.0.1:49239"} current state version: 3
   [junit4]   2> 1774970 INFO  (OverseerStateUpdate-94375864727699461-127.0.0.1:53201_-n_0000000000) [n:127.0.0.1:53201_    ] o.a.s.c.o.ReplicaMutator Update state numShards=2 message={
   [junit4]   2>   "roles":null,
   [junit4]   2>   "node_name":"127.0.0.1:49239_",
   [junit4]   2>   "shard":null,
   [junit4]   2>   "core":"collection1",
   [junit4]   2>   "state":"down",
   [junit4]   2>   "numShards":"2",
   [junit4]   2>   "collection":"collection1",
   [junit4]   2>   "operation":"state",
   [junit4]   2>   "base_url":"https://127.0.0.1:49239"}
   [junit4]   2> 1774970 INFO  (OverseerStateUpdate-94375864727699461-127.0.0.1:53201_-n_0000000000) [n:127.0.0.1:53201_    ] o.a.s.c.o.ClusterStateMutator building a new cName: collection1
   [junit4]   2> 1774970 INFO  (OverseerStateUpdate-94375864727699461-127.0.0.1:53201_-n_0000000000) [n:127.0.0.1:53201_    ] o.a.s.c.o.ReplicaMutator Assigning new node to shard shard=shard2
   [junit4]   2> 1774970 INFO  (TEST-TestReplicaProperties.test-seed#[879F03022915695A]) [n:127.0.0.1:49239_    ] o.a.s.s.SolrDispatchFilter user.dir=/x1/jenkins/jenkins-slave/workspace/Lucene-Solr-Tests-5.3-Java7/solr/build/solr-core/test/J1
   [junit4]   2> 1774971 INFO  (TEST-TestReplicaProperties.test-seed#[879F03022915695A]) [n:127.0.0.1:49239_    ] o.a.s.s.SolrDispatchFilter SolrDispatchFilter.init() done
   [junit4]   2> 1775077 INFO  (zkCallback-1941-thread-1) [    ] o.a.s.c.c.ZkStateReader A cluster state change: WatchedEvent state:SyncConnected type:NodeDataChanged path:/clusterstate.json, has occurred - updating... (live nodes size: 2)
   [junit4]   2> 1775078 INFO  (zkCallback-1945-thread-1-processing-n:127.0.0.1:49239_) [n:127.0.0.1:49239_    ] o.a.s.c.c.ZkStateReader A cluster state change: WatchedEvent state:SyncConnected type:NodeDataChanged path:/clusterstate.json, has occurred - updating... (live nodes size: 2)
   [junit4]   2> 1775077 INFO  (zkCallback-1939-thread-1-processing-n:127.0.0.1:53201_) [n:127.0.0.1:53201_    ] o.a.s.c.c.ZkStateReader A cluster state change: WatchedEvent state:SyncConnected type:NodeDataChanged path:/clusterstate.json, has occurred - updating... (live nodes size: 2)
   [junit4]   2> 1775079 INFO  (zkCallback-1941-thread-1) [    ] o.a.s.c.c.ZkStateReader Updated cluster state version to 4
   [junit4]   2> 1775080 INFO  (zkCallback-1945-thread-1-processing-n:127.0.0.1:49239_) [n:127.0.0.1:49239_    ] o.a.s.c.c.ZkStateReader Updated cluster state version to 4
   [junit4]   2> 1775080 INFO  (zkCallback-1939-thread-1-processing-n:127.0.0.1:53201_) [n:127.0.0.1:53201_    ] o.a.s.c.c.ZkStateReader Updated cluster state version to 4
   [junit4]   2> 1775968 INFO  (coreLoadExecutor-5741-thread-1-processing-n:127.0.0.1:49239_) [n:127.0.0.1:49239_ c:collection1   x:collection1] o.a.s.c.ZkController waiting to find shard id in clusterstate for collection1
   [junit4]   2> 1775968 INFO  (coreLoadExecutor-5741-thread-1-processing-n:127.0.0.1:49239_) [n:127.0.0.1:49239_ c:collection1   x:collection1] o.a.s.c.ZkController Check for collection zkNode:collection1
   [junit4]   2> 1775969 INFO  (coreLoadExecutor-5741-thread-1-processing-n:127.0.0.1:49239_) [n:127.0.0.1:49239_ c:collection1   x:collection1] o.a.s.c.ZkController Collection zkNode exists
   [junit4]   2> 1775969 INFO  (coreLoadExecutor-5741-thread-1-processing-n:127.0.0.1:49239_) [n:127.0.0.1:49239_ c:collection1   x:collection1] o.a.s.c.c.ZkStateReader Load collection config from:/collections/collection1
   [junit4]   2> 1775969 INFO  (coreLoadExecutor-5741-thread-1-processing-n:127.0.0.1:49239_) [n:127.0.0.1:49239_ c:collection1   x:collection1] o.a.s.c.c.ZkStateReader path=/collections/collection1 configName=conf1 specified config exists in ZooKeeper
   [junit4]   2> 1775970 INFO  (coreLoadExecutor-5741-thread-1-processing-n:127.0.0.1:49239_) [n:127.0.0.1:49239_ c:collection1   x:collection1] o.a.s.c.SolrResourceLoader new SolrResourceLoader f

[...truncated too long message...]

) closing
   [junit4]   2> 2086746 INFO  (OverseerStateUpdate-94375885024985099-127.0.0.1:59428_solr-n_0000000000) [n:127.0.0.1:59428_solr    ] o.a.s.c.Overseer Overseer Loop exiting : 127.0.0.1:59428_solr
   [junit4]   2> 2086748 WARN  (zkCallback-1978-thread-1-processing-n:127.0.0.1:59428_solr) [n:127.0.0.1:59428_solr    ] o.a.s.c.c.ZkStateReader ZooKeeper watch triggered, but Solr cannot talk to ZK
   [junit4]   2> 2086749 INFO  (jetty-launcher-1961-thread-3) [    ] o.e.j.s.h.ContextHandler Stopped o.e.j.s.ServletContextHandler@21925798{/solr,null,UNAVAILABLE}
   [junit4]   2> 2088228 WARN  (zkCallback-1982-thread-1-processing-n:127.0.0.1:57896_solr) [n:127.0.0.1:57896_solr    ] o.a.s.c.c.ZkStateReader ZooKeeper watch triggered, but Solr cannot talk to ZK
   [junit4]   2> 2088229 INFO  (jetty-launcher-1961-thread-1) [    ] o.e.j.s.h.ContextHandler Stopped o.e.j.s.ServletContextHandler@703cb52b{/solr,null,UNAVAILABLE}
   [junit4]   2> 2088242 WARN  (zkCallback-1979-thread-1-processing-n:127.0.0.1:54905_solr) [n:127.0.0.1:54905_solr    ] o.a.s.c.c.ZkStateReader ZooKeeper watch triggered, but Solr cannot talk to ZK
   [junit4]   2> 2088247 WARN  (zkCallback-1980-thread-2-processing-n:127.0.0.1:49108_solr) [n:127.0.0.1:49108_solr    ] o.a.s.c.c.ZkStateReader ZooKeeper watch triggered, but Solr cannot talk to ZK
   [junit4]   2> 2088248 WARN  (zkCallback-1980-thread-1-processing-n:127.0.0.1:49108_solr) [n:127.0.0.1:49108_solr    ] o.a.s.c.LeaderElector 
   [junit4]   2> org.apache.zookeeper.KeeperException$SessionExpiredException: KeeperErrorCode = Session expired for /overseer_elect/election/94375885024985099-127.0.0.1:59428_solr-n_0000000000
   [junit4]   2> 	at org.apache.zookeeper.KeeperException.create(KeeperException.java:127)
   [junit4]   2> 	at org.apache.zookeeper.KeeperException.create(KeeperException.java:51)
   [junit4]   2> 	at org.apache.zookeeper.ZooKeeper.getData(ZooKeeper.java:1155)
   [junit4]   2> 	at org.apache.solr.common.cloud.SolrZkClient$7.execute(SolrZkClient.java:345)
   [junit4]   2> 	at org.apache.solr.common.cloud.SolrZkClient$7.execute(SolrZkClient.java:342)
   [junit4]   2> 	at org.apache.solr.common.cloud.ZkCmdExecutor.retryOperation(ZkCmdExecutor.java:61)
   [junit4]   2> 	at org.apache.solr.common.cloud.SolrZkClient.getData(SolrZkClient.java:342)
   [junit4]   2> 	at org.apache.solr.cloud.LeaderElector.checkIfIamLeader(LeaderElector.java:183)
   [junit4]   2> 	at org.apache.solr.cloud.LeaderElector.access$200(LeaderElector.java:56)
   [junit4]   2> 	at org.apache.solr.cloud.LeaderElector$ElectionWatcher.process(LeaderElector.java:390)
   [junit4]   2> 	at org.apache.solr.common.cloud.SolrZkClient$3$1.run(SolrZkClient.java:264)
   [junit4]   2> 	at java.util.concurrent.Executors$RunnableAdapter.call(Executors.java:471)
   [junit4]   2> 	at java.util.concurrent.FutureTask.run(FutureTask.java:262)
   [junit4]   2> 	at org.apache.solr.common.util.ExecutorUtil$MDCAwareThreadPoolExecutor$1.run(ExecutorUtil.java:210)
   [junit4]   2> 	at java.util.concurrent.ThreadPoolExecutor.runWorker(ThreadPoolExecutor.java:1145)
   [junit4]   2> 	at java.util.concurrent.ThreadPoolExecutor$Worker.run(ThreadPoolExecutor.java:615)
   [junit4]   2> 	at java.lang.Thread.run(Thread.java:745)
   [junit4]   2> 2088251 INFO  (jetty-launcher-1961-thread-5) [    ] o.e.j.s.h.ContextHandler Stopped o.e.j.s.ServletContextHandler@12704197{/solr,null,UNAVAILABLE}
   [junit4]   2> 2088251 INFO  (jetty-launcher-1961-thread-4) [    ] o.e.j.s.h.ContextHandler Stopped o.e.j.s.ServletContextHandler@903d88e{/solr,null,UNAVAILABLE}
   [junit4]   2> 2088254 INFO  (TEST-BasicAuthIntegrationTest.testCollectionCreateWithoutCoresThenDelete-seed#[879F03022915695A]) [    ] o.a.s.c.ZkTestServer connecting to 127.0.0.1:41497 41497
   [junit4]   2> 2088447 INFO  (Thread-8323) [    ] o.a.s.c.ZkTestServer connecting to 127.0.0.1:41497 41497
   [junit4]   2> 2088448 WARN  (Thread-8323) [    ] o.a.s.c.ZkTestServer Watch limit violations: 
   [junit4]   2> Maximum concurrent create/delete watches above limit:
   [junit4]   2> 
   [junit4]   2> 	6	/solr/aliases.json
   [junit4]   2> 	6	/solr/clusterstate.json
   [junit4]   2> 	5	/solr/security.json
   [junit4]   2> 
   [junit4]   2> Maximum concurrent children watches above limit:
   [junit4]   2> 
   [junit4]   2> 	6	/solr/live_nodes
   [junit4]   2> 
   [junit4]   2> NOTE: leaving temporary files on disk at: /x1/jenkins/jenkins-slave/workspace/Lucene-Solr-Tests-5.3-Java7/solr/build/solr-core/test/J0/temp/solr.security.BasicAuthIntegrationTest_879F03022915695A-001
   [junit4]   2> Aug 20, 2015 5:08:49 AM com.carrotsearch.randomizedtesting.ThreadLeakControl checkThreadLeaks
   [junit4]   2> WARNING: Will linger awaiting termination of 1 leaked thread(s).
   [junit4]   2> NOTE: test params are: codec=FastCompressingStoredFields(storedFieldsFormat=CompressingStoredFieldsFormat(compressionMode=FAST, chunkSize=31295, maxDocsPerChunk=458, blockSize=10), termVectorsFormat=CompressingTermVectorsFormat(compressionMode=FAST, chunkSize=31295, blockSize=10)), sim=RandomSimilarityProvider(queryNorm=true,coord=crazy): {}, locale=mt_MT, timezone=America/Menominee
   [junit4]   2> NOTE: Linux 3.13.0-52-generic amd64/Oracle Corporation 1.7.0_72 (64-bit)/cpus=4,threads=1,free=288923328,total=525860864
   [junit4]   2> NOTE: All tests run in this JVM: [TestSolrConfigHandler, TestRawResponseWriter, SolrCoreTest, TestDocBasedVersionConstraints, SuggestComponentTest, MinimalSchemaTest, TestDocumentBuilder, PrimitiveFieldTypeTest, MBeansHandlerTest, TestSolr4Spatial, DeleteInactiveReplicaTest, HdfsSyncSliceTest, AddBlockUpdateTest, TestJmxIntegration, TestConfigOverlay, UniqFieldsUpdateProcessorFactoryTest, TestReversedWildcardFilterFactory, TestIBSimilarityFactory, HdfsDirectoryTest, SolrRequestParserTest, HighlighterConfigTest, DateFieldTest, CloudExitableDirectoryReaderTest, TestPivotHelperCode, SignatureUpdateProcessorFactoryTest, QueryElevationComponentTest, ChaosMonkeyNothingIsSafeTest, TestReplicationHandler, TestMergePolicyConfig, TestHdfsUpdateLog, TestUniqueKeyFieldResource, ClusterStateTest, TestCloudInspectUtil, ConnectionManagerTest, SaslZkACLProviderTest, BasicDistributedZkTest, TestSolrConfigHandlerCloud, TestBinaryField, TestRangeQuery, HdfsThreadLeakTest, DeleteReplicaTest, UUIDFieldTest, TestFaceting, HdfsDirectoryFactoryTest, TestReqParamsAPI, RequestHandlersTest, TestFieldResource, TestFieldCollectionResource, TestUpdate, TestEmbeddedSolrServerConstructors, DistributedFacetPivotSmallAdvancedTest, BasicZkTest, StressHdfsTest, TestDynamicFieldCollectionResource, TestDFRSimilarityFactory, TermVectorComponentTest, DocValuesMissingTest, TestCodecSupport, TestDistributedSearch, ParsingFieldUpdateProcessorsTest, TestRandomFaceting, LeaderFailoverAfterPartitionTest, RankQueryTest, BigEndianAscendingWordDeserializerTest, CoreMergeIndexesAdminHandlerTest, FastVectorHighlighterTest, LeaderInitiatedRecoveryOnCommitTest, TestBlendedInfixSuggestions, HdfsCollectionsAPIDistributedZkTest, TestRecoveryHdfs, TestHighFrequencyDictionaryFactory, TestManagedSynonymFilterFactory, TestSolrIndexConfig, TermsComponentTest, CoreAdminRequestStatusTest, TestSchemaSimilarityResource, AnalysisErrorHandlingTest, CollectionsAPIAsyncDistributedZkTest, ExternalFileFieldSortTest, DistribJoinFromCollectionTest, ConcurrentDeleteAndCreateCollectionTest, TestWordDelimiterFilterFactory, TestCursorMarkWithoutUniqueKey, AnalyticsMergeStrategyTest, EnumFieldTest, TestRebalanceLeaders, TestFieldSortValues, CleanupOldIndexTest, CollectionTooManyReplicasTest, DistributedQueueTest, DistributedVersionInfoTest, MultiThreadedOCPTest, ShardSplitTest, TestRequestStatusCollectionAPI, VMParamsZkACLAndCredentialsProvidersTest, HdfsBasicDistributedZkTest, HdfsChaosMonkeySafeLeaderTest, HdfsRecoverLeaseTest, TestConfigSetProperties, TestConfigSets, TestImplicitCoreProperties, TestNRTOpen, TestSolrConfigHandlerConcurrent, DistributedSuggestComponentTest, TestIntervalFaceting, TestClassNameShortening, TestCopyFieldCollectionResource, TestFieldTypeCollectionResource, TestFieldTypeResource, TestManagedSchemaFieldResource, TestCloudManagedSchema, TestCollationFieldDocValues, TestManagedSchema, TestSchemaManager, AnalyticsQueryTest, TestCollapseQParserPlugin, TestCustomSort, TestMaxScoreQueryParser, TestStressUserVersions, TestMinMaxOnMultiValuedField, TestScoreJoinQPScore, TestJsonRequest, CloudMLTQParserTest, BasicAuthIntegrationTest]
   [junit4] Completed [520/531] on J0 in 53.50s, 7 tests, 1 failure <<< FAILURES!

[...truncated 49 lines...]
BUILD FAILED
/x1/jenkins/jenkins-slave/workspace/Lucene-Solr-Tests-5.3-Java7/build.xml:726: The following error occurred while executing this line:
/x1/jenkins/jenkins-slave/workspace/Lucene-Solr-Tests-5.3-Java7/build.xml:670: The following error occurred while executing this line:
/x1/jenkins/jenkins-slave/workspace/Lucene-Solr-Tests-5.3-Java7/build.xml:59: The following error occurred while executing this line:
/x1/jenkins/jenkins-slave/workspace/Lucene-Solr-Tests-5.3-Java7/solr/build.xml:230: The following error occurred while executing this line:
/x1/jenkins/jenkins-slave/workspace/Lucene-Solr-Tests-5.3-Java7/solr/common-build.xml:524: The following error occurred while executing this line:
/x1/jenkins/jenkins-slave/workspace/Lucene-Solr-Tests-5.3-Java7/lucene/common-build.xml:1449: The following error occurred while executing this line:
/x1/jenkins/jenkins-slave/workspace/Lucene-Solr-Tests-5.3-Java7/lucene/common-build.xml:1003: There were test failures: 531 suites, 2104 tests, 1 error, 1 failure, 42 ignored (30 assumptions)

Total time: 79 minutes 42 seconds
Build step 'Invoke Ant' marked build as failure
Archiving artifacts
Sending artifact delta relative to Lucene-Solr-Tests-5.3-Java7 #21
Archived 4 artifacts
Archive block size is 32768
Received 0 blocks and 339496033 bytes
Compression is 0.0%
Took 1 min 9 sec
Recording test results
Email was triggered for: Failure
Sending email for trigger: Failure



Mime
View raw message