lucene-dev mailing list archives

Site index · List index
Message view « Date » · « Thread »
Top « Date » · « Thread »
From Apache Jenkins Server <jenk...@builds.apache.org>
Subject [JENKINS] Lucene-Solr-Tests-trunk-Java8 - Build # 295 - Failure
Date Wed, 19 Aug 2015 15:05:57 GMT
Build: https://builds.apache.org/job/Lucene-Solr-Tests-trunk-Java8/295/

2 tests failed.
REGRESSION:  org.apache.solr.cloud.BasicDistributedZkTest.test

Error Message:
commitWithin did not work on node: http://127.0.0.1:54057/collection1 expected:<68> but was:<67>

Stack Trace:
java.lang.AssertionError: commitWithin did not work on node: http://127.0.0.1:54057/collection1 expected:<68> but was:<67>
	at __randomizedtesting.SeedInfo.seed([C42F9429DE77AD4D:4C7BABF3708BC0B5]:0)
	at org.junit.Assert.fail(Assert.java:93)
	at org.junit.Assert.failNotEquals(Assert.java:647)
	at org.junit.Assert.assertEquals(Assert.java:128)
	at org.junit.Assert.assertEquals(Assert.java:472)
	at org.apache.solr.cloud.BasicDistributedZkTest.test(BasicDistributedZkTest.java:333)
	at sun.reflect.NativeMethodAccessorImpl.invoke0(Native Method)
	at sun.reflect.NativeMethodAccessorImpl.invoke(NativeMethodAccessorImpl.java:62)
	at sun.reflect.DelegatingMethodAccessorImpl.invoke(DelegatingMethodAccessorImpl.java:43)
	at java.lang.reflect.Method.invoke(Method.java:497)
	at com.carrotsearch.randomizedtesting.RandomizedRunner.invoke(RandomizedRunner.java:1627)
	at com.carrotsearch.randomizedtesting.RandomizedRunner$6.evaluate(RandomizedRunner.java:836)
	at com.carrotsearch.randomizedtesting.RandomizedRunner$7.evaluate(RandomizedRunner.java:872)
	at com.carrotsearch.randomizedtesting.RandomizedRunner$8.evaluate(RandomizedRunner.java:886)
	at org.apache.solr.BaseDistributedSearchTestCase$ShardsRepeatRule$ShardsFixedStatement.callStatement(BaseDistributedSearchTestCase.java:963)
	at org.apache.solr.BaseDistributedSearchTestCase$ShardsRepeatRule$ShardsStatement.evaluate(BaseDistributedSearchTestCase.java:938)
	at com.carrotsearch.randomizedtesting.rules.SystemPropertiesRestoreRule$1.evaluate(SystemPropertiesRestoreRule.java:57)
	at org.apache.lucene.util.TestRuleSetupTeardownChained$1.evaluate(TestRuleSetupTeardownChained.java:50)
	at org.apache.lucene.util.AbstractBeforeAfterRule$1.evaluate(AbstractBeforeAfterRule.java:46)
	at org.apache.lucene.util.TestRuleThreadAndTestName$1.evaluate(TestRuleThreadAndTestName.java:49)
	at org.apache.lucene.util.TestRuleIgnoreAfterMaxFailures$1.evaluate(TestRuleIgnoreAfterMaxFailures.java:65)
	at org.apache.lucene.util.TestRuleMarkFailure$1.evaluate(TestRuleMarkFailure.java:48)
	at com.carrotsearch.randomizedtesting.rules.StatementAdapter.evaluate(StatementAdapter.java:36)
	at com.carrotsearch.randomizedtesting.ThreadLeakControl$StatementRunner.run(ThreadLeakControl.java:365)
	at com.carrotsearch.randomizedtesting.ThreadLeakControl.forkTimeoutingTask(ThreadLeakControl.java:798)
	at com.carrotsearch.randomizedtesting.ThreadLeakControl$3.evaluate(ThreadLeakControl.java:458)
	at com.carrotsearch.randomizedtesting.RandomizedRunner.runSingleTest(RandomizedRunner.java:845)
	at com.carrotsearch.randomizedtesting.RandomizedRunner$3.evaluate(RandomizedRunner.java:747)
	at com.carrotsearch.randomizedtesting.RandomizedRunner$4.evaluate(RandomizedRunner.java:781)
	at com.carrotsearch.randomizedtesting.RandomizedRunner$5.evaluate(RandomizedRunner.java:792)
	at com.carrotsearch.randomizedtesting.rules.StatementAdapter.evaluate(StatementAdapter.java:36)
	at com.carrotsearch.randomizedtesting.rules.SystemPropertiesRestoreRule$1.evaluate(SystemPropertiesRestoreRule.java:57)
	at org.apache.lucene.util.AbstractBeforeAfterRule$1.evaluate(AbstractBeforeAfterRule.java:46)
	at com.carrotsearch.randomizedtesting.rules.StatementAdapter.evaluate(StatementAdapter.java:36)
	at org.apache.lucene.util.TestRuleStoreClassName$1.evaluate(TestRuleStoreClassName.java:42)
	at com.carrotsearch.randomizedtesting.rules.NoShadowingOrOverridesOnMethodsRule$1.evaluate(NoShadowingOrOverridesOnMethodsRule.java:39)
	at com.carrotsearch.randomizedtesting.rules.NoShadowingOrOverridesOnMethodsRule$1.evaluate(NoShadowingOrOverridesOnMethodsRule.java:39)
	at com.carrotsearch.randomizedtesting.rules.StatementAdapter.evaluate(StatementAdapter.java:36)
	at com.carrotsearch.randomizedtesting.rules.StatementAdapter.evaluate(StatementAdapter.java:36)
	at com.carrotsearch.randomizedtesting.rules.StatementAdapter.evaluate(StatementAdapter.java:36)
	at org.apache.lucene.util.TestRuleAssertionsRequired$1.evaluate(TestRuleAssertionsRequired.java:54)
	at org.apache.lucene.util.TestRuleMarkFailure$1.evaluate(TestRuleMarkFailure.java:48)
	at org.apache.lucene.util.TestRuleIgnoreAfterMaxFailures$1.evaluate(TestRuleIgnoreAfterMaxFailures.java:65)
	at org.apache.lucene.util.TestRuleIgnoreTestSuites$1.evaluate(TestRuleIgnoreTestSuites.java:55)
	at com.carrotsearch.randomizedtesting.rules.StatementAdapter.evaluate(StatementAdapter.java:36)
	at com.carrotsearch.randomizedtesting.ThreadLeakControl$StatementRunner.run(ThreadLeakControl.java:365)
	at java.lang.Thread.run(Thread.java:745)


REGRESSION:  org.apache.solr.handler.TestReplicationHandler.doTestIndexAndConfigAliasReplication

Error Message:
[/x1/jenkins/jenkins-slave/workspace/Lucene-Solr-Tests-trunk-Java8/solr/build/solr-core/test/J1/temp/solr.handler.TestReplicationHandler_C42F9429DE77AD4D-001/solr-instance-017/./collection1/data/index.20150819094721218, /x1/jenkins/jenkins-slave/workspace/Lucene-Solr-Tests-trunk-Java8/solr/build/solr-core/test/J1/temp/solr.handler.TestReplicationHandler_C42F9429DE77AD4D-001/solr-instance-017/./collection1/data/index.20150819094721120, /x1/jenkins/jenkins-slave/workspace/Lucene-Solr-Tests-trunk-Java8/solr/build/solr-core/test/J1/temp/solr.handler.TestReplicationHandler_C42F9429DE77AD4D-001/solr-instance-017/./collection1/data] expected:<2> but was:<3>

Stack Trace:
java.lang.AssertionError: [/x1/jenkins/jenkins-slave/workspace/Lucene-Solr-Tests-trunk-Java8/solr/build/solr-core/test/J1/temp/solr.handler.TestReplicationHandler_C42F9429DE77AD4D-001/solr-instance-017/./collection1/data/index.20150819094721218, /x1/jenkins/jenkins-slave/workspace/Lucene-Solr-Tests-trunk-Java8/solr/build/solr-core/test/J1/temp/solr.handler.TestReplicationHandler_C42F9429DE77AD4D-001/solr-instance-017/./collection1/data/index.20150819094721120, /x1/jenkins/jenkins-slave/workspace/Lucene-Solr-Tests-trunk-Java8/solr/build/solr-core/test/J1/temp/solr.handler.TestReplicationHandler_C42F9429DE77AD4D-001/solr-instance-017/./collection1/data] expected:<2> but was:<3>
	at __randomizedtesting.SeedInfo.seed([C42F9429DE77AD4D:335C7A71189F02AB]:0)
	at org.junit.Assert.fail(Assert.java:93)
	at org.junit.Assert.failNotEquals(Assert.java:647)
	at org.junit.Assert.assertEquals(Assert.java:128)
	at org.junit.Assert.assertEquals(Assert.java:472)
	at org.apache.solr.handler.TestReplicationHandler.checkForSingleIndex(TestReplicationHandler.java:813)
	at org.apache.solr.handler.TestReplicationHandler.doTestIndexAndConfigAliasReplication(TestReplicationHandler.java:1243)
	at sun.reflect.NativeMethodAccessorImpl.invoke0(Native Method)
	at sun.reflect.NativeMethodAccessorImpl.invoke(NativeMethodAccessorImpl.java:62)
	at sun.reflect.DelegatingMethodAccessorImpl.invoke(DelegatingMethodAccessorImpl.java:43)
	at java.lang.reflect.Method.invoke(Method.java:497)
	at com.carrotsearch.randomizedtesting.RandomizedRunner.invoke(RandomizedRunner.java:1627)
	at com.carrotsearch.randomizedtesting.RandomizedRunner$6.evaluate(RandomizedRunner.java:836)
	at com.carrotsearch.randomizedtesting.RandomizedRunner$7.evaluate(RandomizedRunner.java:872)
	at com.carrotsearch.randomizedtesting.RandomizedRunner$8.evaluate(RandomizedRunner.java:886)
	at com.carrotsearch.randomizedtesting.rules.SystemPropertiesRestoreRule$1.evaluate(SystemPropertiesRestoreRule.java:57)
	at org.apache.lucene.util.TestRuleSetupTeardownChained$1.evaluate(TestRuleSetupTeardownChained.java:50)
	at org.apache.lucene.util.AbstractBeforeAfterRule$1.evaluate(AbstractBeforeAfterRule.java:46)
	at org.apache.lucene.util.TestRuleThreadAndTestName$1.evaluate(TestRuleThreadAndTestName.java:49)
	at org.apache.lucene.util.TestRuleIgnoreAfterMaxFailures$1.evaluate(TestRuleIgnoreAfterMaxFailures.java:65)
	at org.apache.lucene.util.TestRuleMarkFailure$1.evaluate(TestRuleMarkFailure.java:48)
	at com.carrotsearch.randomizedtesting.rules.StatementAdapter.evaluate(StatementAdapter.java:36)
	at com.carrotsearch.randomizedtesting.ThreadLeakControl$StatementRunner.run(ThreadLeakControl.java:365)
	at com.carrotsearch.randomizedtesting.ThreadLeakControl.forkTimeoutingTask(ThreadLeakControl.java:798)
	at com.carrotsearch.randomizedtesting.ThreadLeakControl$3.evaluate(ThreadLeakControl.java:458)
	at com.carrotsearch.randomizedtesting.RandomizedRunner.runSingleTest(RandomizedRunner.java:845)
	at com.carrotsearch.randomizedtesting.RandomizedRunner$3.evaluate(RandomizedRunner.java:747)
	at com.carrotsearch.randomizedtesting.RandomizedRunner$4.evaluate(RandomizedRunner.java:781)
	at com.carrotsearch.randomizedtesting.RandomizedRunner$5.evaluate(RandomizedRunner.java:792)
	at com.carrotsearch.randomizedtesting.rules.StatementAdapter.evaluate(StatementAdapter.java:36)
	at com.carrotsearch.randomizedtesting.rules.SystemPropertiesRestoreRule$1.evaluate(SystemPropertiesRestoreRule.java:57)
	at org.apache.lucene.util.AbstractBeforeAfterRule$1.evaluate(AbstractBeforeAfterRule.java:46)
	at com.carrotsearch.randomizedtesting.rules.StatementAdapter.evaluate(StatementAdapter.java:36)
	at org.apache.lucene.util.TestRuleStoreClassName$1.evaluate(TestRuleStoreClassName.java:42)
	at com.carrotsearch.randomizedtesting.rules.NoShadowingOrOverridesOnMethodsRule$1.evaluate(NoShadowingOrOverridesOnMethodsRule.java:39)
	at com.carrotsearch.randomizedtesting.rules.NoShadowingOrOverridesOnMethodsRule$1.evaluate(NoShadowingOrOverridesOnMethodsRule.java:39)
	at com.carrotsearch.randomizedtesting.rules.StatementAdapter.evaluate(StatementAdapter.java:36)
	at com.carrotsearch.randomizedtesting.rules.StatementAdapter.evaluate(StatementAdapter.java:36)
	at com.carrotsearch.randomizedtesting.rules.StatementAdapter.evaluate(StatementAdapter.java:36)
	at org.apache.lucene.util.TestRuleAssertionsRequired$1.evaluate(TestRuleAssertionsRequired.java:54)
	at org.apache.lucene.util.TestRuleMarkFailure$1.evaluate(TestRuleMarkFailure.java:48)
	at org.apache.lucene.util.TestRuleIgnoreAfterMaxFailures$1.evaluate(TestRuleIgnoreAfterMaxFailures.java:65)
	at org.apache.lucene.util.TestRuleIgnoreTestSuites$1.evaluate(TestRuleIgnoreTestSuites.java:55)
	at com.carrotsearch.randomizedtesting.rules.StatementAdapter.evaluate(StatementAdapter.java:36)
	at com.carrotsearch.randomizedtesting.ThreadLeakControl$StatementRunner.run(ThreadLeakControl.java:365)
	at java.lang.Thread.run(Thread.java:745)




Build Log:
[...truncated 10045 lines...]
   [junit4] Suite: org.apache.solr.cloud.BasicDistributedZkTest
   [junit4]   2> Creating dataDir: /x1/jenkins/jenkins-slave/workspace/Lucene-Solr-Tests-trunk-Java8/solr/build/solr-core/test/J0/temp/solr.cloud.BasicDistributedZkTest_C42F9429DE77AD4D-001/init-core-data-001
   [junit4]   2> 977978 INFO  (SUITE-BasicDistributedZkTest-seed#[C42F9429DE77AD4D]-worker) [    ] o.a.s.BaseDistributedSearchTestCase Setting hostContext system property: /
   [junit4]   2> 977989 INFO  (TEST-BasicDistributedZkTest.test-seed#[C42F9429DE77AD4D]) [    ] o.a.s.c.ZkTestServer STARTING ZK TEST SERVER
   [junit4]   2> 977992 INFO  (Thread-2363) [    ] o.a.s.c.ZkTestServer client port:0.0.0.0/0.0.0.0:0
   [junit4]   2> 977993 INFO  (Thread-2363) [    ] o.a.s.c.ZkTestServer Starting server
   [junit4]   2> 978093 INFO  (TEST-BasicDistributedZkTest.test-seed#[C42F9429DE77AD4D]) [    ] o.a.s.c.ZkTestServer start zk server on port:54685
   [junit4]   2> 978093 INFO  (TEST-BasicDistributedZkTest.test-seed#[C42F9429DE77AD4D]) [    ] o.a.s.c.c.SolrZkClient Using default ZkCredentialsProvider
   [junit4]   2> 978114 INFO  (TEST-BasicDistributedZkTest.test-seed#[C42F9429DE77AD4D]) [    ] o.a.s.c.c.ConnectionManager Waiting for client to connect to ZooKeeper
   [junit4]   2> 978266 INFO  (zkCallback-765-thread-1) [    ] o.a.s.c.c.ConnectionManager Watcher org.apache.solr.common.cloud.ConnectionManager@6d02a851 name:ZooKeeperConnection Watcher:127.0.0.1:54685 got event WatchedEvent state:SyncConnected type:None path:null path:null type:None
   [junit4]   2> 978266 INFO  (TEST-BasicDistributedZkTest.test-seed#[C42F9429DE77AD4D]) [    ] o.a.s.c.c.ConnectionManager Client is connected to ZooKeeper
   [junit4]   2> 978267 INFO  (TEST-BasicDistributedZkTest.test-seed#[C42F9429DE77AD4D]) [    ] o.a.s.c.c.SolrZkClient Using default ZkACLProvider
   [junit4]   2> 978267 INFO  (TEST-BasicDistributedZkTest.test-seed#[C42F9429DE77AD4D]) [    ] o.a.s.c.c.SolrZkClient makePath: /solr
   [junit4]   2> 978269 INFO  (TEST-BasicDistributedZkTest.test-seed#[C42F9429DE77AD4D]) [    ] o.a.s.c.c.SolrZkClient Using default ZkCredentialsProvider
   [junit4]   2> 978306 INFO  (TEST-BasicDistributedZkTest.test-seed#[C42F9429DE77AD4D]) [    ] o.a.s.c.c.ConnectionManager Waiting for client to connect to ZooKeeper
   [junit4]   2> 978318 INFO  (zkCallback-766-thread-1) [    ] o.a.s.c.c.ConnectionManager Watcher org.apache.solr.common.cloud.ConnectionManager@198511c3 name:ZooKeeperConnection Watcher:127.0.0.1:54685/solr got event WatchedEvent state:SyncConnected type:None path:null path:null type:None
   [junit4]   2> 978318 INFO  (TEST-BasicDistributedZkTest.test-seed#[C42F9429DE77AD4D]) [    ] o.a.s.c.c.ConnectionManager Client is connected to ZooKeeper
   [junit4]   2> 978319 INFO  (TEST-BasicDistributedZkTest.test-seed#[C42F9429DE77AD4D]) [    ] o.a.s.c.c.SolrZkClient Using default ZkACLProvider
   [junit4]   2> 978319 INFO  (TEST-BasicDistributedZkTest.test-seed#[C42F9429DE77AD4D]) [    ] o.a.s.c.c.SolrZkClient makePath: /collections/collection1
   [junit4]   2> 978320 INFO  (TEST-BasicDistributedZkTest.test-seed#[C42F9429DE77AD4D]) [    ] o.a.s.c.c.SolrZkClient makePath: /collections/collection1/shards
   [junit4]   2> 978321 INFO  (TEST-BasicDistributedZkTest.test-seed#[C42F9429DE77AD4D]) [    ] o.a.s.c.c.SolrZkClient makePath: /collections/control_collection
   [junit4]   2> 978322 INFO  (TEST-BasicDistributedZkTest.test-seed#[C42F9429DE77AD4D]) [    ] o.a.s.c.c.SolrZkClient makePath: /collections/control_collection/shards
   [junit4]   2> 978331 INFO  (TEST-BasicDistributedZkTest.test-seed#[C42F9429DE77AD4D]) [    ] o.a.s.c.AbstractZkTestCase put /x1/jenkins/jenkins-slave/workspace/Lucene-Solr-Tests-trunk-Java8/solr/core/src/test-files/solr/collection1/conf/solrconfig-tlog.xml to /configs/conf1/solrconfig.xml
   [junit4]   2> 978331 INFO  (TEST-BasicDistributedZkTest.test-seed#[C42F9429DE77AD4D]) [    ] o.a.s.c.c.SolrZkClient makePath: /configs/conf1/solrconfig.xml
   [junit4]   2> 978333 INFO  (TEST-BasicDistributedZkTest.test-seed#[C42F9429DE77AD4D]) [    ] o.a.s.c.AbstractZkTestCase put /x1/jenkins/jenkins-slave/workspace/Lucene-Solr-Tests-trunk-Java8/solr/core/src/test-files/solr/collection1/conf/schema.xml to /configs/conf1/schema.xml
   [junit4]   2> 978333 INFO  (TEST-BasicDistributedZkTest.test-seed#[C42F9429DE77AD4D]) [    ] o.a.s.c.c.SolrZkClient makePath: /configs/conf1/schema.xml
   [junit4]   2> 978335 INFO  (TEST-BasicDistributedZkTest.test-seed#[C42F9429DE77AD4D]) [    ] o.a.s.c.AbstractZkTestCase put /x1/jenkins/jenkins-slave/workspace/Lucene-Solr-Tests-trunk-Java8/solr/core/src/test-files/solr/collection1/conf/solrconfig.snippet.randomindexconfig.xml to /configs/conf1/solrconfig.snippet.randomindexconfig.xml
   [junit4]   2> 978335 INFO  (TEST-BasicDistributedZkTest.test-seed#[C42F9429DE77AD4D]) [    ] o.a.s.c.c.SolrZkClient makePath: /configs/conf1/solrconfig.snippet.randomindexconfig.xml
   [junit4]   2> 978336 INFO  (TEST-BasicDistributedZkTest.test-seed#[C42F9429DE77AD4D]) [    ] o.a.s.c.AbstractZkTestCase put /x1/jenkins/jenkins-slave/workspace/Lucene-Solr-Tests-trunk-Java8/solr/core/src/test-files/solr/collection1/conf/stopwords.txt to /configs/conf1/stopwords.txt
   [junit4]   2> 978337 INFO  (TEST-BasicDistributedZkTest.test-seed#[C42F9429DE77AD4D]) [    ] o.a.s.c.c.SolrZkClient makePath: /configs/conf1/stopwords.txt
   [junit4]   2> 978338 INFO  (TEST-BasicDistributedZkTest.test-seed#[C42F9429DE77AD4D]) [    ] o.a.s.c.AbstractZkTestCase put /x1/jenkins/jenkins-slave/workspace/Lucene-Solr-Tests-trunk-Java8/solr/core/src/test-files/solr/collection1/conf/protwords.txt to /configs/conf1/protwords.txt
   [junit4]   2> 978338 INFO  (TEST-BasicDistributedZkTest.test-seed#[C42F9429DE77AD4D]) [    ] o.a.s.c.c.SolrZkClient makePath: /configs/conf1/protwords.txt
   [junit4]   2> 978339 INFO  (TEST-BasicDistributedZkTest.test-seed#[C42F9429DE77AD4D]) [    ] o.a.s.c.AbstractZkTestCase put /x1/jenkins/jenkins-slave/workspace/Lucene-Solr-Tests-trunk-Java8/solr/core/src/test-files/solr/collection1/conf/currency.xml to /configs/conf1/currency.xml
   [junit4]   2> 978340 INFO  (TEST-BasicDistributedZkTest.test-seed#[C42F9429DE77AD4D]) [    ] o.a.s.c.c.SolrZkClient makePath: /configs/conf1/currency.xml
   [junit4]   2> 978341 INFO  (TEST-BasicDistributedZkTest.test-seed#[C42F9429DE77AD4D]) [    ] o.a.s.c.AbstractZkTestCase put /x1/jenkins/jenkins-slave/workspace/Lucene-Solr-Tests-trunk-Java8/solr/core/src/test-files/solr/collection1/conf/enumsConfig.xml to /configs/conf1/enumsConfig.xml
   [junit4]   2> 978341 INFO  (TEST-BasicDistributedZkTest.test-seed#[C42F9429DE77AD4D]) [    ] o.a.s.c.c.SolrZkClient makePath: /configs/conf1/enumsConfig.xml
   [junit4]   2> 978342 INFO  (TEST-BasicDistributedZkTest.test-seed#[C42F9429DE77AD4D]) [    ] o.a.s.c.AbstractZkTestCase put /x1/jenkins/jenkins-slave/workspace/Lucene-Solr-Tests-trunk-Java8/solr/core/src/test-files/solr/collection1/conf/open-exchange-rates.json to /configs/conf1/open-exchange-rates.json
   [junit4]   2> 978343 INFO  (TEST-BasicDistributedZkTest.test-seed#[C42F9429DE77AD4D]) [    ] o.a.s.c.c.SolrZkClient makePath: /configs/conf1/open-exchange-rates.json
   [junit4]   2> 978344 INFO  (TEST-BasicDistributedZkTest.test-seed#[C42F9429DE77AD4D]) [    ] o.a.s.c.AbstractZkTestCase put /x1/jenkins/jenkins-slave/workspace/Lucene-Solr-Tests-trunk-Java8/solr/core/src/test-files/solr/collection1/conf/mapping-ISOLatin1Accent.txt to /configs/conf1/mapping-ISOLatin1Accent.txt
   [junit4]   2> 978344 INFO  (TEST-BasicDistributedZkTest.test-seed#[C42F9429DE77AD4D]) [    ] o.a.s.c.c.SolrZkClient makePath: /configs/conf1/mapping-ISOLatin1Accent.txt
   [junit4]   2> 978346 INFO  (TEST-BasicDistributedZkTest.test-seed#[C42F9429DE77AD4D]) [    ] o.a.s.c.AbstractZkTestCase put /x1/jenkins/jenkins-slave/workspace/Lucene-Solr-Tests-trunk-Java8/solr/core/src/test-files/solr/collection1/conf/old_synonyms.txt to /configs/conf1/old_synonyms.txt
   [junit4]   2> 978346 INFO  (TEST-BasicDistributedZkTest.test-seed#[C42F9429DE77AD4D]) [    ] o.a.s.c.c.SolrZkClient makePath: /configs/conf1/old_synonyms.txt
   [junit4]   2> 978347 INFO  (TEST-BasicDistributedZkTest.test-seed#[C42F9429DE77AD4D]) [    ] o.a.s.c.AbstractZkTestCase put /x1/jenkins/jenkins-slave/workspace/Lucene-Solr-Tests-trunk-Java8/solr/core/src/test-files/solr/collection1/conf/synonyms.txt to /configs/conf1/synonyms.txt
   [junit4]   2> 978347 INFO  (TEST-BasicDistributedZkTest.test-seed#[C42F9429DE77AD4D]) [    ] o.a.s.c.c.SolrZkClient makePath: /configs/conf1/synonyms.txt
   [junit4]   2> 979529 INFO  (TEST-BasicDistributedZkTest.test-seed#[C42F9429DE77AD4D]) [    ] o.a.s.SolrTestCaseJ4 Writing core.properties file to /x1/jenkins/jenkins-slave/workspace/Lucene-Solr-Tests-trunk-Java8/solr/build/solr-core/test/J0/temp/solr.cloud.BasicDistributedZkTest_C42F9429DE77AD4D-001/control-001/cores/collection1
   [junit4]   2> 979533 INFO  (TEST-BasicDistributedZkTest.test-seed#[C42F9429DE77AD4D]) [    ] o.e.j.s.Server jetty-9.2.13.v20150730
   [junit4]   2> 979634 INFO  (TEST-BasicDistributedZkTest.test-seed#[C42F9429DE77AD4D]) [    ] o.e.j.s.h.ContextHandler Started o.e.j.s.ServletContextHandler@3adfbcd{/,null,AVAILABLE}
   [junit4]   2> 979648 INFO  (TEST-BasicDistributedZkTest.test-seed#[C42F9429DE77AD4D]) [    ] o.e.j.s.ServerConnector Started ServerConnector@1965c972{HTTP/1.1}{127.0.0.1:41147}
   [junit4]   2> 979648 INFO  (TEST-BasicDistributedZkTest.test-seed#[C42F9429DE77AD4D]) [    ] o.e.j.s.Server Started @984249ms
   [junit4]   2> 979648 INFO  (TEST-BasicDistributedZkTest.test-seed#[C42F9429DE77AD4D]) [    ] o.a.s.c.s.e.JettySolrRunner Jetty properties: {solr.data.dir=/x1/jenkins/jenkins-slave/workspace/Lucene-Solr-Tests-trunk-Java8/solr/build/solr-core/test/J0/temp/solr.cloud.BasicDistributedZkTest_C42F9429DE77AD4D-001/tempDir-001/control/data, hostContext=/, hostPort=41147, coreRootDirectory=/x1/jenkins/jenkins-slave/workspace/Lucene-Solr-Tests-trunk-Java8/solr/build/solr-core/test/J0/temp/solr.cloud.BasicDistributedZkTest_C42F9429DE77AD4D-001/control-001/cores}
   [junit4]   2> 979648 INFO  (TEST-BasicDistributedZkTest.test-seed#[C42F9429DE77AD4D]) [    ] o.a.s.s.SolrDispatchFilter SolrDispatchFilter.init(): sun.misc.Launcher$AppClassLoader@4e0e2f2a
   [junit4]   2> 979649 INFO  (TEST-BasicDistributedZkTest.test-seed#[C42F9429DE77AD4D]) [    ] o.a.s.c.SolrResourceLoader new SolrResourceLoader for directory: '/x1/jenkins/jenkins-slave/workspace/Lucene-Solr-Tests-trunk-Java8/solr/build/solr-core/test/J0/temp/solr.cloud.BasicDistributedZkTest_C42F9429DE77AD4D-001/control-001/'
   [junit4]   2> 979666 INFO  (TEST-BasicDistributedZkTest.test-seed#[C42F9429DE77AD4D]) [    ] o.a.s.c.c.SolrZkClient Using default ZkCredentialsProvider
   [junit4]   2> 979702 INFO  (TEST-BasicDistributedZkTest.test-seed#[C42F9429DE77AD4D]) [    ] o.a.s.c.c.ConnectionManager Waiting for client to connect to ZooKeeper
   [junit4]   2> 979718 INFO  (zkCallback-767-thread-1) [    ] o.a.s.c.c.ConnectionManager Watcher org.apache.solr.common.cloud.ConnectionManager@22780935 name:ZooKeeperConnection Watcher:127.0.0.1:54685/solr got event WatchedEvent state:SyncConnected type:None path:null path:null type:None
   [junit4]   2> 979718 INFO  (TEST-BasicDistributedZkTest.test-seed#[C42F9429DE77AD4D]) [    ] o.a.s.c.c.ConnectionManager Client is connected to ZooKeeper
   [junit4]   2> 979719 INFO  (TEST-BasicDistributedZkTest.test-seed#[C42F9429DE77AD4D]) [    ] o.a.s.c.c.SolrZkClient Using default ZkACLProvider
   [junit4]   2> 979730 INFO  (TEST-BasicDistributedZkTest.test-seed#[C42F9429DE77AD4D]) [    ] o.a.s.s.SolrDispatchFilter Loading solr.xml from SolrHome (not found in ZooKeeper)
   [junit4]   2> 979730 INFO  (TEST-BasicDistributedZkTest.test-seed#[C42F9429DE77AD4D]) [    ] o.a.s.c.SolrXmlConfig Loading container configuration from /x1/jenkins/jenkins-slave/workspace/Lucene-Solr-Tests-trunk-Java8/solr/build/solr-core/test/J0/temp/solr.cloud.BasicDistributedZkTest_C42F9429DE77AD4D-001/control-001/solr.xml
   [junit4]   2> 979735 INFO  (TEST-BasicDistributedZkTest.test-seed#[C42F9429DE77AD4D]) [    ] o.a.s.c.CoresLocator Config-defined core root directory: /x1/jenkins/jenkins-slave/workspace/Lucene-Solr-Tests-trunk-Java8/solr/build/solr-core/test/J0/temp/solr.cloud.BasicDistributedZkTest_C42F9429DE77AD4D-001/control-001/cores
   [junit4]   2> 979736 INFO  (TEST-BasicDistributedZkTest.test-seed#[C42F9429DE77AD4D]) [    ] o.a.s.c.CoreContainer New CoreContainer 1338678613
   [junit4]   2> 979736 INFO  (TEST-BasicDistributedZkTest.test-seed#[C42F9429DE77AD4D]) [    ] o.a.s.c.CoreContainer Loading cores into CoreContainer [instanceDir=/x1/jenkins/jenkins-slave/workspace/Lucene-Solr-Tests-trunk-Java8/solr/build/solr-core/test/J0/temp/solr.cloud.BasicDistributedZkTest_C42F9429DE77AD4D-001/control-001/]
   [junit4]   2> 979736 INFO  (TEST-BasicDistributedZkTest.test-seed#[C42F9429DE77AD4D]) [    ] o.a.s.c.CoreContainer loading shared library: /x1/jenkins/jenkins-slave/workspace/Lucene-Solr-Tests-trunk-Java8/solr/build/solr-core/test/J0/temp/solr.cloud.BasicDistributedZkTest_C42F9429DE77AD4D-001/control-001/lib
   [junit4]   2> 979736 WARN  (TEST-BasicDistributedZkTest.test-seed#[C42F9429DE77AD4D]) [    ] o.a.s.c.SolrResourceLoader Can't find (or read) directory to add to classloader: lib (resolved as: /x1/jenkins/jenkins-slave/workspace/Lucene-Solr-Tests-trunk-Java8/solr/build/solr-core/test/J0/temp/solr.cloud.BasicDistributedZkTest_C42F9429DE77AD4D-001/control-001/lib).
   [junit4]   2> 979749 INFO  (TEST-BasicDistributedZkTest.test-seed#[C42F9429DE77AD4D]) [    ] o.a.s.h.c.HttpShardHandlerFactory created with socketTimeout : 90000,urlScheme : ,connTimeout : 15000,maxConnectionsPerHost : 20,maxConnections : 10000,corePoolSize : 0,maximumPoolSize : 2147483647,maxThreadIdleTime : 5,sizeOfQueue : -1,fairnessPolicy : false,useRetries : false,
   [junit4]   2> 979760 INFO  (TEST-BasicDistributedZkTest.test-seed#[C42F9429DE77AD4D]) [    ] o.a.s.u.UpdateShardHandler Creating UpdateShardHandler HTTP client with params: socketTimeout=340000&connTimeout=45000&retry=true
   [junit4]   2> 979760 INFO  (TEST-BasicDistributedZkTest.test-seed#[C42F9429DE77AD4D]) [    ] o.a.s.l.LogWatcher SLF4J impl is org.slf4j.impl.Log4jLoggerFactory
   [junit4]   2> 979760 INFO  (TEST-BasicDistributedZkTest.test-seed#[C42F9429DE77AD4D]) [    ] o.a.s.l.LogWatcher Registering Log Listener [Log4j (org.slf4j.impl.Log4jLoggerFactory)]
   [junit4]   2> 979761 INFO  (TEST-BasicDistributedZkTest.test-seed#[C42F9429DE77AD4D]) [    ] o.a.s.c.ZkContainer Zookeeper client=127.0.0.1:54685/solr
   [junit4]   2> 979761 INFO  (TEST-BasicDistributedZkTest.test-seed#[C42F9429DE77AD4D]) [    ] o.a.s.c.ZkController zkHost includes chroot
   [junit4]   2> 979761 INFO  (TEST-BasicDistributedZkTest.test-seed#[C42F9429DE77AD4D]) [    ] o.a.s.c.c.SolrZkClient Using default ZkCredentialsProvider
   [junit4]   2> 979785 INFO  (TEST-BasicDistributedZkTest.test-seed#[C42F9429DE77AD4D]) [    ] o.a.s.c.c.ConnectionManager Waiting for client to connect to ZooKeeper
   [junit4]   2> 979802 INFO  (zkCallback-769-thread-1) [    ] o.a.s.c.c.ConnectionManager Watcher org.apache.solr.common.cloud.ConnectionManager@3b25cc7 name:ZooKeeperConnection Watcher:127.0.0.1:54685 got event WatchedEvent state:SyncConnected type:None path:null path:null type:None
   [junit4]   2> 979802 INFO  (TEST-BasicDistributedZkTest.test-seed#[C42F9429DE77AD4D]) [    ] o.a.s.c.c.ConnectionManager Client is connected to ZooKeeper
   [junit4]   2> 979803 INFO  (TEST-BasicDistributedZkTest.test-seed#[C42F9429DE77AD4D]) [    ] o.a.s.c.c.SolrZkClient Using default ZkACLProvider
   [junit4]   2> 979828 INFO  (TEST-BasicDistributedZkTest.test-seed#[C42F9429DE77AD4D]) [n:127.0.0.1:41147_    ] o.a.s.c.c.ConnectionManager Waiting for client to connect to ZooKeeper
   [junit4]   2> 979841 INFO  (zkCallback-770-thread-1-processing-n:127.0.0.1:41147_) [n:127.0.0.1:41147_    ] o.a.s.c.c.ConnectionManager Watcher org.apache.solr.common.cloud.ConnectionManager@110714f6 name:ZooKeeperConnection Watcher:127.0.0.1:54685/solr got event WatchedEvent state:SyncConnected type:None path:null path:null type:None
   [junit4]   2> 979847 INFO  (TEST-BasicDistributedZkTest.test-seed#[C42F9429DE77AD4D]) [n:127.0.0.1:41147_    ] o.a.s.c.c.ConnectionManager Client is connected to ZooKeeper
   [junit4]   2> 979855 INFO  (TEST-BasicDistributedZkTest.test-seed#[C42F9429DE77AD4D]) [n:127.0.0.1:41147_    ] o.a.s.c.c.SolrZkClient makePath: /overseer/queue
   [junit4]   2> 979864 INFO  (TEST-BasicDistributedZkTest.test-seed#[C42F9429DE77AD4D]) [n:127.0.0.1:41147_    ] o.a.s.c.c.SolrZkClient makePath: /overseer/collection-queue-work
   [junit4]   2> 979865 INFO  (TEST-BasicDistributedZkTest.test-seed#[C42F9429DE77AD4D]) [n:127.0.0.1:41147_    ] o.a.s.c.c.SolrZkClient makePath: /overseer/collection-map-running
   [junit4]   2> 979867 INFO  (TEST-BasicDistributedZkTest.test-seed#[C42F9429DE77AD4D]) [n:127.0.0.1:41147_    ] o.a.s.c.c.SolrZkClient makePath: /overseer/collection-map-completed
   [junit4]   2> 979870 INFO  (TEST-BasicDistributedZkTest.test-seed#[C42F9429DE77AD4D]) [n:127.0.0.1:41147_    ] o.a.s.c.c.SolrZkClient makePath: /overseer/collection-map-failure
   [junit4]   2> 979871 INFO  (TEST-BasicDistributedZkTest.test-seed#[C42F9429DE77AD4D]) [n:127.0.0.1:41147_    ] o.a.s.c.c.SolrZkClient makePath: /live_nodes
   [junit4]   2> 979872 INFO  (TEST-BasicDistributedZkTest.test-seed#[C42F9429DE77AD4D]) [n:127.0.0.1:41147_    ] o.a.s.c.c.SolrZkClient makePath: /aliases.json
   [junit4]   2> 979873 INFO  (TEST-BasicDistributedZkTest.test-seed#[C42F9429DE77AD4D]) [n:127.0.0.1:41147_    ] o.a.s.c.c.SolrZkClient makePath: /clusterstate.json
   [junit4]   2> 979877 INFO  (TEST-BasicDistributedZkTest.test-seed#[C42F9429DE77AD4D]) [n:127.0.0.1:41147_    ] o.a.s.c.c.SolrZkClient makePath: /security.json
   [junit4]   2> 979877 INFO  (TEST-BasicDistributedZkTest.test-seed#[C42F9429DE77AD4D]) [n:127.0.0.1:41147_    ] o.a.s.c.ZkController Register node as live in ZooKeeper:/live_nodes/127.0.0.1:41147_
   [junit4]   2> 979878 INFO  (TEST-BasicDistributedZkTest.test-seed#[C42F9429DE77AD4D]) [n:127.0.0.1:41147_    ] o.a.s.c.c.SolrZkClient makePath: /live_nodes/127.0.0.1:41147_
   [junit4]   2> 979879 INFO  (TEST-BasicDistributedZkTest.test-seed#[C42F9429DE77AD4D]) [n:127.0.0.1:41147_    ] o.a.s.c.c.SolrZkClient makePath: /overseer_elect
   [junit4]   2> 979880 INFO  (TEST-BasicDistributedZkTest.test-seed#[C42F9429DE77AD4D]) [n:127.0.0.1:41147_    ] o.a.s.c.c.SolrZkClient makePath: /overseer_elect/election
   [junit4]   2> 979881 INFO  (TEST-BasicDistributedZkTest.test-seed#[C42F9429DE77AD4D]) [n:127.0.0.1:41147_    ] o.a.s.c.Overseer Overseer (id=null) closing
   [junit4]   2> 979882 INFO  (TEST-BasicDistributedZkTest.test-seed#[C42F9429DE77AD4D]) [n:127.0.0.1:41147_    ] o.a.s.c.LeaderElector Joined leadership election with path: /overseer_elect/election/94371539431981060-127.0.0.1:41147_-n_0000000000
   [junit4]   2> 979882 INFO  (TEST-BasicDistributedZkTest.test-seed#[C42F9429DE77AD4D]) [n:127.0.0.1:41147_    ] o.a.s.c.OverseerElectionContext I am going to be the leader 127.0.0.1:41147_
   [junit4]   2> 979882 INFO  (TEST-BasicDistributedZkTest.test-seed#[C42F9429DE77AD4D]) [n:127.0.0.1:41147_    ] o.a.s.c.c.SolrZkClient makePath: /overseer_elect/leader
   [junit4]   2> 979883 INFO  (TEST-BasicDistributedZkTest.test-seed#[C42F9429DE77AD4D]) [n:127.0.0.1:41147_    ] o.a.s.c.Overseer Overseer (id=94371539431981060-127.0.0.1:41147_-n_0000000000) starting
   [junit4]   2> 979885 INFO  (TEST-BasicDistributedZkTest.test-seed#[C42F9429DE77AD4D]) [n:127.0.0.1:41147_    ] o.a.s.c.c.SolrZkClient makePath: /overseer/queue-work
   [junit4]   2> 979890 INFO  (TEST-BasicDistributedZkTest.test-seed#[C42F9429DE77AD4D]) [n:127.0.0.1:41147_    ] o.a.s.c.OverseerAutoReplicaFailoverThread Starting OverseerAutoReplicaFailoverThread autoReplicaFailoverWorkLoopDelay=10000 autoReplicaFailoverWaitAfterExpiration=30000 autoReplicaFailoverBadNodeExpiration=60000
   [junit4]   2> 979913 INFO  (OverseerCollectionProcessor-94371539431981060-127.0.0.1:41147_-n_0000000000) [n:127.0.0.1:41147_    ] o.a.s.c.OverseerProcessor Process current queue of overseer operations
   [junit4]   2> 979915 INFO  (OverseerStateUpdate-94371539431981060-127.0.0.1:41147_-n_0000000000) [n:127.0.0.1:41147_    ] o.a.s.c.Overseer Starting to work on the main queue
   [junit4]   2> 979919 INFO  (OverseerStateUpdate-94371539431981060-127.0.0.1:41147_-n_0000000000) [n:127.0.0.1:41147_    ] o.a.s.c.c.ZkStateReader Updating cluster state from ZooKeeper... 
   [junit4]   2> 979935 INFO  (TEST-BasicDistributedZkTest.test-seed#[C42F9429DE77AD4D]) [n:127.0.0.1:41147_    ] o.a.s.c.c.ZkStateReader Updating cluster state from ZooKeeper... 
   [junit4]   2> 979976 INFO  (TEST-BasicDistributedZkTest.test-seed#[C42F9429DE77AD4D]) [n:127.0.0.1:41147_    ] o.a.s.c.CoreContainer Security conf doesn't exist. Skipping setup for authorization module.
   [junit4]   2> 979976 INFO  (TEST-BasicDistributedZkTest.test-seed#[C42F9429DE77AD4D]) [n:127.0.0.1:41147_    ] o.a.s.c.CoreContainer No authentication plugin used.
   [junit4]   2> 979977 INFO  (TEST-BasicDistributedZkTest.test-seed#[C42F9429DE77AD4D]) [n:127.0.0.1:41147_    ] o.a.s.c.CoresLocator Looking for core definitions underneath /x1/jenkins/jenkins-slave/workspace/Lucene-Solr-Tests-trunk-Java8/solr/build/solr-core/test/J0/temp/solr.cloud.BasicDistributedZkTest_C42F9429DE77AD4D-001/control-001/cores
   [junit4]   2> 979985 INFO  (TEST-BasicDistributedZkTest.test-seed#[C42F9429DE77AD4D]) [n:127.0.0.1:41147_    ] o.a.s.c.SolrCore Created CoreDescriptor: {name=collection1, config=solrconfig.xml, transient=false, schema=schema.xml, loadOnStartup=true, configSetProperties=configsetprops.json, instanceDir=/x1/jenkins/jenkins-slave/workspace/Lucene-Solr-Tests-trunk-Java8/solr/build/solr-core/test/J0/temp/solr.cloud.BasicDistributedZkTest_C42F9429DE77AD4D-001/control-001/cores/collection1, collection=control_collection, absoluteInstDir=/x1/jenkins/jenkins-slave/workspace/Lucene-Solr-Tests-trunk-Java8/solr/build/solr-core/test/J0/temp/solr.cloud.BasicDistributedZkTest_C42F9429DE77AD4D-001/control-001/cores/collection1/, coreNodeName=, dataDir=data/, shard=}
   [junit4]   2> 979986 INFO  (TEST-BasicDistributedZkTest.test-seed#[C42F9429DE77AD4D]) [n:127.0.0.1:41147_    ] o.a.s.c.CoresLocator Found core collection1 in /x1/jenkins/jenkins-slave/workspace/Lucene-Solr-Tests-trunk-Java8/solr/build/solr-core/test/J0/temp/solr.cloud.BasicDistributedZkTest_C42F9429DE77AD4D-001/control-001/cores/collection1/
   [junit4]   2> 979986 INFO  (TEST-BasicDistributedZkTest.test-seed#[C42F9429DE77AD4D]) [n:127.0.0.1:41147_    ] o.a.s.c.CoresLocator Found 1 core definitions
   [junit4]   2> 980003 INFO  (coreLoadExecutor-2399-thread-1-processing-n:127.0.0.1:41147_) [n:127.0.0.1:41147_ c:control_collection   x:collection1] o.a.s.c.ZkController publishing state=down
   [junit4]   2> 980004 INFO  (coreLoadExecutor-2399-thread-1-processing-n:127.0.0.1:41147_) [n:127.0.0.1:41147_ c:control_collection   x:collection1] o.a.s.c.ZkController numShards not found on descriptor - reading it from system property
   [junit4]   2> 980005 INFO  (coreLoadExecutor-2399-thread-1-processing-n:127.0.0.1:41147_) [n:127.0.0.1:41147_ c:control_collection   x:collection1] o.a.s.c.ZkController look for our core node name
   [junit4]   2> 980010 INFO  (zkCallback-770-thread-1-processing-n:127.0.0.1:41147_) [n:127.0.0.1:41147_    ] o.a.s.c.DistributedQueue NodeChildrenChanged fired on path /overseer/queue state SyncConnected
   [junit4]   2> 980010 INFO  (TEST-BasicDistributedZkTest.test-seed#[C42F9429DE77AD4D]) [n:127.0.0.1:41147_    ] o.a.s.s.SolrDispatchFilter user.dir=/x1/jenkins/jenkins-slave/workspace/Lucene-Solr-Tests-trunk-Java8/solr/build/solr-core/test/J0
   [junit4]   2> 980010 INFO  (TEST-BasicDistributedZkTest.test-seed#[C42F9429DE77AD4D]) [n:127.0.0.1:41147_    ] o.a.s.s.SolrDispatchFilter SolrDispatchFilter.init() done
   [junit4]   2> 980011 INFO  (OverseerStateUpdate-94371539431981060-127.0.0.1:41147_-n_0000000000) [n:127.0.0.1:41147_    ] o.a.s.c.Overseer processMessage: queueSize: 1, message = {
   [junit4]   2>   "core":"collection1",
   [junit4]   2>   "roles":null,
   [junit4]   2>   "base_url":"http://127.0.0.1:41147",
   [junit4]   2>   "node_name":"127.0.0.1:41147_",
   [junit4]   2>   "numShards":"1",
   [junit4]   2>   "state":"down",
   [junit4]   2>   "shard":null,
   [junit4]   2>   "collection":"control_collection",
   [junit4]   2>   "operation":"state"} current state version: 0
   [junit4]   2> 980011 INFO  (OverseerStateUpdate-94371539431981060-127.0.0.1:41147_-n_0000000000) [n:127.0.0.1:41147_    ] o.a.s.c.o.ReplicaMutator Update state numShards=1 message={
   [junit4]   2>   "core":"collection1",
   [junit4]   2>   "roles":null,
   [junit4]   2>   "base_url":"http://127.0.0.1:41147",
   [junit4]   2>   "node_name":"127.0.0.1:41147_",
   [junit4]   2>   "numShards":"1",
   [junit4]   2>   "state":"down",
   [junit4]   2>   "shard":null,
   [junit4]   2>   "collection":"control_collection",
   [junit4]   2>   "operation":"state"}
   [junit4]   2> 980012 INFO  (OverseerStateUpdate-94371539431981060-127.0.0.1:41147_-n_0000000000) [n:127.0.0.1:41147_    ] o.a.s.c.o.ClusterStateMutator building a new cName: control_collection
   [junit4]   2> 980012 INFO  (OverseerStateUpdate-94371539431981060-127.0.0.1:41147_-n_0000000000) [n:127.0.0.1:41147_    ] o.a.s.c.o.ReplicaMutator Assigning new node to shard shard=shard1
   [junit4]   2> 980013 INFO  (zkCallback-770-thread-1-processing-n:127.0.0.1:41147_) [n:127.0.0.1:41147_    ] o.a.s.c.c.ZkStateReader A cluster state change: WatchedEvent state:SyncConnected type:NodeDataChanged path:/clusterstate.json, has occurred - updating... (live nodes size: 1)
   [junit4]   2> 980021 INFO  (zkCallback-770-thread-2-processing-n:127.0.0.1:41147_) [n:127.0.0.1:41147_    ] o.a.s.c.c.ZkStateReader A cluster state change: WatchedEvent state:SyncConnected type:NodeDataChanged path:/clusterstate.json, has occurred - updating... (live nodes size: 1)
   [junit4]   2> 981005 INFO  (coreLoadExecutor-2399-thread-1-processing-n:127.0.0.1:41147_) [n:127.0.0.1:41147_ c:control_collection   x:collection1] o.a.s.c.ZkController waiting to find shard id in clusterstate for collection1
   [junit4]   2> 981005 INFO  (coreLoadExecutor-2399-thread-1-processing-n:127.0.0.1:41147_) [n:127.0.0.1:41147_ c:control_collection   x:collection1] o.a.s.c.ZkController Check for collection zkNode:control_collection
   [junit4]   2> 981006 INFO  (coreLoadExecutor-2399-thread-1-processing-n:127.0.0.1:41147_) [n:127.0.0.1:41147_ c:control_collection   x:collection1] o.a.s.c.ZkController Collection zkNode exists
   [junit4]   2> 981006 INFO  (coreLoadExecutor-2399-thread-1-processing-n:127.0.0.1:41147_) [n:127.0.0.1:41147_ c:control_collection   x:collection1] o.a.s.c.c.ZkStateReader Load collection config from:/collections/control_collection
   [junit4]   2> 981006 INFO  (coreLoadExecutor-2399-thread-1-processing-n:127.0.0.1:41147_) [n:127.0.0.1:41147_ c:control_collection   x:collection1] o.a.s.c.c.ZkStateReader path=/collections/control_collection configName=conf1 specified config exists in ZooKeeper
   [junit4]   2> 981006 INFO  (coreLoadExecutor-2399-thread-1-processing-n:127.0.0.1:41147_) [n:127.0.0.1:41147_ c:control_collection   x:collection1] o.a.s.c.SolrResourceLoader new SolrResourceLoader for directory: '/x1/jenkins/jenkins-slave/workspace/Lucene-Solr-Tests-trunk-Java8/solr/build/solr-core/test/J0/temp/solr.cloud.BasicDistributedZkTest_C42F9429DE77AD4D-001/control-001/cores/collection1/'
   [junit4]   2> 981038 INFO  (coreLoadExecutor-2399-thread-1-processing-n:127.0.0.1:41147_) [n:127.0.0.1:41147_ c:control_collection   x:collection1] o.a.s.c.Config loaded config solrconfig.xml with version 0 
   [junit4]   2> 981054 INFO  (coreLoadExecutor-2399-thread-1-processing-n:127.0.0.1:41147_) [n:127.0.0.1:41147_ c:control_collection   x:collection1] o.a.s.c.SolrConfig current version of requestparams : -1
   [junit4]   2> 981060 INFO  (coreLoadExecutor-2399-thread-1-processing-n:127.0.0.1:41147_) [n:127.0.0.1:41147_ c:control_collection   x:collection1] o.a.s.c.SolrConfig Using Lucene MatchVersion: 6.0.0
   [junit4]   2> 981087 INFO  (coreLoadExecutor-2399-thread-1-processing-n:127.0.0.1:41147_) [n:127.0.0.1:41147_ c:control_collection   x:collection1] o.a.s.c.Config Loaded SolrConfig: solrconfig.xml
   [junit4]   2> 981091 INFO  (coreLoadExecutor-2399-thread-1-processing-n:127.0.0.1:41147_) [n:127.0.0.1:41147_ c:control_collection   x:collection1] o.a.s.s.IndexSchema Reading Solr Schema from /configs/conf1/schema.xml
   [junit4]   2> 981103 INFO  (coreLoadExecutor-2399-thread-1-processing-n:127.0.0.1:41147_) [n:127.0.0.1:41147_ c:control_collection   x:collection1] o.a.s.s.IndexSchema [collection1] Schema name=test
   [junit4]   2> 981657 INFO  (coreLoadExecutor-2399-thread-1-processing-n:127.0.0.1:41147_) [n:127.0.0.1:41147_ c:control_collection   x:collection1] o.a.s.s.OpenExchangeRatesOrgProvider Initialized with rates=open-exchange-rates.json, refreshInterval=1440.
   [junit4]   2> 981812 INFO  (coreLoadExecutor-2399-thread-1-processing-n:127.0.0.1:41147_) [n:127.0.0.1:41147_ c:control_collection   x:collection1] o.a.s.s.IndexSchema default search field in schema is text
   [junit4]   2> 981813 INFO  (coreLoadExecutor-2399-thread-1-processing-n:127.0.0.1:41147_) [n:127.0.0.1:41147_ c:control_collection   x:collection1] o.a.s.s.IndexSchema unique key field: id
   [junit4]   2> 981842 INFO  (coreLoadExecutor-2399-thread-1-processing-n:127.0.0.1:41147_) [n:127.0.0.1:41147_ c:control_collection   x:collection1] o.a.s.s.FileExchangeRateProvider Reloading exchange rates from file currency.xml
   [junit4]   2> 981845 INFO  (coreLoadExecutor-2399-thread-1-processing-n:127.0.0.1:41147_) [n:127.0.0.1:41147_ c:control_collection   x:collection1] o.a.s.s.FileExchangeRateProvider Reloading exchange rates from file currency.xml
   [junit4]   2> 981862 INFO  (coreLoadExecutor-2399-thread-1-processing-n:127.0.0.1:41147_) [n:127.0.0.1:41147_ c:control_collection   x:collection1] o.a.s.s.OpenExchangeRatesOrgProvider Reloading exchange rates from open-exchange-rates.json
   [junit4]   2> 981864 WARN  (coreLoadExecutor-2399-thread-1-processing-n:127.0.0.1:41147_) [n:127.0.0.1:41147_ c:control_collection   x:collection1] o.a.s.s.OpenExchangeRatesOrgProvider Unknown key IMPORTANT NOTE
   [junit4]   2> 981864 WARN  (coreLoadExecutor-2399-thread-1-processing-n:127.0.0.1:41147_) [n:127.0.0.1:41147_ c:control_collection   x:collection1] o.a.s.s.OpenExchangeRatesOrgProvider Expected key, got STRING
   [junit4]   2> 981864 INFO  (coreLoadExecutor-2399-thread-1-processing-n:127.0.0.1:41147_) [n:127.0.0.1:41147_ c:control_collection   x:collection1] o.a.s.s.OpenExchangeRatesOrgProvider Reloading exchange rates from open-exchange-rates.json
   [junit4]   2> 981866 WARN  (coreLoadExecutor-2399-thread-1-processing-n:127.0.0.1:41147_) [n:127.0.0.1:41147_ c:control_collection   x:collection1] o.a.s.s.OpenExchangeRatesOrgProvider Unknown key IMPORTANT NOTE
   [junit4]   2> 981866 WARN  (coreLoadExecutor-2399-thread-1-processing-n:127.0.0.1:41147_) [n:127.0.0.1:41147_ c:control_collection   x:collection1] o.a.s.s.OpenExchangeRatesOrgProvider Expected key, got STRING
   [junit4]   2> 981867 INFO  (coreLoadExecutor-2399-thread-1-processing-n:127.0.0.1:41147_) [n:127.0.0.1:41147_ c:control_collection   x:collection1] o.a.s.c.ConfigSetProperties Did not find ConfigSet properties, assuming default properties: Can't find resource 'configsetprops.json' in classpath or '/configs/conf1', cwd=/x1/jenkins/jenkins-slave/workspace/Lucene-Solr-Tests-trunk-Java8/solr/build/solr-core/test/J0
   [junit4]   2> 981867 INFO  (coreLoadExecutor-2399-thread-1-processing-n:127.0.0.1:41147_) [n:127.0.0.1:41147_ c:control_collection   x:collection1] o.a.s.c.CoreContainer Creating SolrCore 'collection1' using configuration from collection control_collection
   [junit4]   2> 981867 INFO  (coreLoadExecutor-2399-thread-1-processing-n:127.0.0.1:41147_) [n:127.0.0.1:41147_ c:control_collection s:shard1 r:core_node1 x:collection1] o.a.s.c.SolrCore org.apache.solr.core.MockDirectoryFactory
   [junit4]   2> 981868 INFO  (coreLoadExecutor-2399-thread-1-processing-n:127.0.0.1:41147_) [n:127.0.0.1:41147_ c:control_collection s:shard1 r:core_node1 x:collection1] o.a.s.c.SolrCore [[collection1] ] Opening new SolrCore at [/x1/jenkins/jenkins-slave/workspace/Lucene-Solr-Tests-trunk-Java8/solr/build/solr-core/test/J0/temp/solr.cloud.BasicDistributedZkTest_C42F9429DE77AD4D-001/control-001/cores/collection1/], dataDir=[null]
   [junit4]   2> 981868 INFO  (coreLoadExecutor-2399-thread-1-processing-n:127.0.0.1:41147_) [n:127.0.0.1:41147_ c:control_collection s:shard1 r:core_node1 x:collection1] o.a.s.c.JmxMonitoredMap JMX monitoring is enabled. Adding Solr mbeans to JMX Server: com.sun.jmx.mbeanserver.JmxMBeanServer@64b71e55
   [junit4]   2> 981869 INFO  (coreLoadExecutor-2399-thread-1-processing-n:127.0.0.1:41147_) [n:127.0.0.1:41147_ c:control_collection s:shard1 r:core_node1 x:collection1] o.a.s.c.CachingDirectoryFactory return new directory for /x1/jenkins/jenkins-slave/workspace/Lucene-Solr-Tests-trunk-Java8/solr/build/solr-core/test/J0/temp/solr.cloud.BasicDistributedZkTest_C42F9429DE77AD4D-001/control-001/cores/collection1/data
   [junit4]   2> 981874 INFO  (coreLoadExecutor-2399-thread-1-processing-n:127.0.0.1:41147_) [n:127.0.0.1:41147_ c:control_collection s:shard1 r:core_node1 x:collection1] o.a.s.c.SolrCore New index directory detected: old=null new=/x1/jenkins/jenkins-slave/workspace/Lucene-Solr-Tests-trunk-Java8/solr/build/solr-core/test/J0/temp/solr.cloud.BasicDistributedZkTest_C42F9429DE77AD4D-001/control-001/cores/collection1/data/index/
   [junit4]   2> 981874 WARN  (coreLoadExecutor-2399-thread-1-processing-n:127.0.0.1:41147_) [n:127.0.0.1:41147_ c:control_collection s:shard1 r:core_node1 x:collection1] o.a.s.c.SolrCore [collection1] Solr index directory '/x1/jenkins/jenkins-slave/workspace/Lucene-Solr-Tests-trunk-Java8/solr/build/solr-core/test/J0/temp/solr.cloud.BasicDistributedZkTest_C42F9429DE77AD4D-001/control-001/cores/collection1/data/index' doesn't exist. Creating new index...
   [junit4]   2> 981874 INFO  (coreLoadExecutor-2399-thread-1-processing-n:127.0.0.1:41147_) [n:127.0.0.1:41147_ c:control_collection s:shard1 r:core_node1 x:collection1] o.a.s.c.CachingDirectoryFactory return new directory for /x1/jenkins/jenkins-slave/workspace/Lucene-Solr-Tests-trunk-Java8/solr/build/solr-core/test/J0/temp/solr.cloud.BasicDistributedZkTest_C42F9429DE77AD4D-001/control-001/cores/collection1/data/index
   [junit4]   2> 981875 INFO  (coreLoadExecutor-2399-thread-1-processing-n:127.0.0.1:41147_) [n:127.0.0.1:41147_ c:control_collection s:shard1 r:core_node1 x:collection1] o.a.s.u.RandomMergePolicy RandomMergePolicy wrapping class org.apache.lucene.index.TieredMergePolicy: [TieredMergePolicy: maxMergeAtOnce=34, maxMergeAtOnceExplicit=18, maxMergedSegmentMB=19.0625, floorSegmentMB=1.541015625, forceMergeDeletesPctAllowed=4.73461188819999, segmentsPerTier=37.0, maxCFSSegmentSizeMB=8.796093022207999E12, noCFSRatio=0.0
   [junit4]   2> 981876 INFO  (coreLoadExecutor-2399-thread-1-processing-n:127.0.0.1:41147_) [n:127.0.0.1:41147_ c:control_collection s:shard1 r:core_node1 x:collection1] o.a.s.c.SolrCore SolrDeletionPolicy.onCommit: commits: num=1
   [junit4]   2> 	commit{dir=MockDirectoryWrapper(RAMDirectory@31f843ec lockFactory=org.apache.lucene.store.SingleInstanceLockFactory@5bf6bb8a),segFN=segments_1,generation=1}
   [junit4]   2> 981877 INFO  (coreLoadExecutor-2399-thread-1-processing-n:127.0.0.1:41147_) [n:127.0.0.1:41147_ c:control_collection s:shard1 r:core_node1 x:collection1] o.a.s.c.SolrCore newest commit generation = 1
   [junit4]   2> 981897 INFO  (coreLoadExecutor-2399-thread-1-processing-n:127.0.0.1:41147_) [n:127.0.0.1:41147_ c:control_collection s:shard1 r:core_node1 x:collection1] o.a.s.u.p.UpdateRequestProcessorChain creating updateRequestProcessorChain "nodistrib"
   [junit4]   2> 981897 INFO  (coreLoadExecutor-2399-thread-1-processing-n:127.0.0.1:41147_) [n:127.0.0.1:41147_ c:control_collection s:shard1 r:core_node1 x:collection1] o.a.s.u.p.UpdateRequestProcessorChain creating updateRequestProcessorChain "dedupe"
   [junit4]   2> 981898 INFO  (coreLoadExecutor-2399-thread-1-processing-n:127.0.0.1:41147_) [n:127.0.0.1:41147_ c:control_collection s:shard1 r:core_node1 x:collection1] o.a.s.u.p.UpdateRequestProcessorChain inserting DistributedUpdateProcessorFactory into updateRequestProcessorChain "dedupe"
   [junit4]   2> 981898 INFO  (coreLoadExecutor-2399-thread-1-processing-n:127.0.0.1:41147_) [n:127.0.0.1:41147_ c:control_collection s:shard1 r:core_node1 x:collection1] o.a.s.u.p.UpdateRequestProcessorChain creating updateRequestProcessorChain "stored_sig"
   [junit4]   2> 981898 INFO  (coreLoadExecutor-2399-thread-1-processing-n:127.0.0.1:41147_) [n:127.0.0.1:41147_ c:control_collection s:shard1 r:core_node1 x:collection1] o.a.s.u.p.UpdateRequestProcessorChain inserting DistributedUpdateProcessorFactory into updateRequestProcessorChain "stored_sig"
   [junit4]   2> 981898 INFO  (coreLoadExecutor-2399-thread-1-processing-n:127.0.0.1:41147_) [n:127.0.0.1:41147_ c:control_collection s:shard1 r:core_node1 x:collection1] o.a.s.u.p.UpdateRequestProcessorChain creating updateRequestProcessorChain "distrib-dup-test-chain-explicit"
   [junit4]   2> 981898 INFO  (coreLoadExecutor-2399-thread-1-processing-n:127.0.0.1:41147_) [n:127.0.0.1:41147_ c:control_collection s:shard1 r:core_node1 x:collection1] o.a.s.u.p.UpdateRequestProcessorChain creating updateRequestProcessorChain "distrib-dup-test-chain-implicit"
   [junit4]   2> 981899 INFO  (coreLoadExecutor-2399-thread-1-processing-n:127.0.0.1:41147_) [n:127.0.0.1:41147_ c:control_collection s:shard1 r:core_node1 x:collection1] o.a.s.u.p.UpdateRequestProcessorChain inserting DistributedUpdateProcessorFactory into updateRequestProcessorChain "distrib-dup-test-chain-implicit"
   [junit4]   2> 981899 INFO  (coreLoadExecutor-2399-thread-1-processing-n:127.0.0.1:41147_) [n:127.0.0.1:41147_ c:control_collection s:shard1 r:core_node1 x:collection1] o.a.s.c.SolrCore no updateRequestProcessorChain defined as default, creating implicit default
   [junit4]   2> 981901 INFO  (coreLoadExecutor-2399-thread-1-processing-n:127.0.0.1:41147_) [n:127.0.0.1:41147_ c:control_collection s:shard1 r:core_node1 x:collection1] o.a.s.h.l.XMLLoader xsltCacheLifetimeSeconds=60
   [junit4]   2> 981911 INFO  (coreLoadExecutor-2399-thread-1-processing-n:127.0.0.1:41147_) [n:127.0.0.1:41147_ c:control_collection s:shard1 r:core_node1 x:collection1] o.a.s.h.l.XMLLoader xsltCacheLifetimeSeconds=60
   [junit4]   2> 981912 INFO  (coreLoadExecutor-2399-thread-1-processing-n:127.0.0.1:41147_) [n:127.0.0.1:41147_ c:control_collection s:shard1 r:core_node1 x:collection1] o.a.s.h.l.XMLLoader xsltCacheLifetimeSeconds=60
   [junit4]   2> 981913 INFO  (coreLoadExecutor-2399-thread-1-processing-n:127.0.0.1:41147_) [n:127.0.0.1:41147_ c:control_collection s:shard1 r:core_node1 x:collection1] o.a.s.h.l.XMLLoader xsltCacheLifetimeSeconds=60
   [junit4]   2> 981914 INFO  (OldIndexDirectoryCleanupThreadForCore-collection1) [n:127.0.0.1:41147_ c:control_collection s:shard1 r:core_node1 x:collection1] o.a.s.c.SolrCore Looking for old index directories to cleanup for core collection1 in /x1/jenkins/jenkins-slave/workspace/Lucene-Solr-Tests-trunk-Java8/solr/build/solr-core/test/J0/temp/solr.cloud.BasicDistributedZkTest_C42F9429DE77AD4D-001/control-001/cores/collection1/data/
   [junit4]   2> 981915 WARN  (OldIndexDirectoryCleanupThreadForCore-collection1) [n:127.0.0.1:41147_ c:control_collection s:shard1 r:core_node1 x:collection1] o.a.s.c.DirectoryFactory /x1/jenkins/jenkins-slave/workspace/Lucene-Solr-Tests-trunk-Java8/solr/build/solr-core/test/J0/temp/solr.cloud.BasicDistributedZkTest_C42F9429DE77AD4D-001/control-001/cores/collection1/data/ does not point to a valid data directory; skipping clean-up of old index directories.
   [junit4]   2> 981944 INFO  (coreLoadExecutor-2399-thread-1-processing-n:127.0.0.1:41147_) [n:127.0.0.1:41147_ c:control_collection s:shard1 r:core_node1 x:collection1] o.a.s.c.RequestHandlers Registered paths: /admin/mbeans,standard,/update/csv,/update/json/docs,/admin/luke,/admin/segments,/get,/admin/system,/replication,/admin/properties,/config,/schema,/admin/plugins,/admin/logging,/update/json,/admin/threads,/admin/ping,/update,/admin/file
   [junit4]   2> 981944 INFO  (coreLoadExecutor-2399-thread-1-processing-n:127.0.0.1:41147_) [n:127.0.0.1:41147_ c:control_collection s:shard1 r:core_node1 x:collection1] o.a.s.c.SolrCore Using default statsCache cache: org.apache.solr.search.stats.LocalStatsCache
   [junit4]   2> 981956 INFO  (coreLoadExecutor-2399-thread-1-processing-n:127.0.0.1:41147_) [n:127.0.0.1:41147_ c:control_collection s:shard1 r:core_node1 x:collection1] o.a.s.u.UpdateHandler Using UpdateLog implementation: org.apache.solr.update.UpdateLog
   [junit4]   2> 981956 INFO  (coreLoadExecutor-2399-thread-1-processing-n:127.0.0.1:41147_) [n:127.0.0.1:41147_ c:control_collection s:shard1 r:core_node1 x:collection1] o.a.s.u.UpdateLog Initializing UpdateLog: dataDir= defaultSyncLevel=FLUSH numRecordsToKeep=100 maxNumLogsToKeep=10 numVersionBuckets=65536
   [junit4]   2> 981957 INFO  (coreLoadExecutor-2399-thread-1-processing-n:127.0.0.1:41147_) [n:127.0.0.1:41147_ c:control_collection s:shard1 r:core_node1 x:collection1] o.a.s.c.SolrCore Hard AutoCommit: disabled
   [junit4]   2> 981957 INFO  (coreLoadExecutor-2399-thread-1-processing-n:127.0.0.1:41147_) [n:127.0.0.1:41147_ c:control_collection s:shard1 r:core_node1 x:collection1] o.a.s.c.SolrCore Soft AutoCommit: disabled
   [junit4]   2> 981958 INFO  (coreLoadExecutor-2399-thread-1-processing-n:127.0.0.1:41147_) [n:127.0.0.1:41147_ c:control_collection s:shard1 r:core_node1 x:collection1] o.a.s.u.RandomMergePolicy RandomMergePolicy wrapping class org.apache.lucene.index.TieredMergePolicy: [TieredMergePolicy: maxMergeAtOnce=23, maxMergeAtOnceExplicit=47, maxMergedSegmentMB=18.607421875, floorSegmentMB=0.9794921875, forceMergeDeletesPctAllowed=12.550571852037416, segmentsPerTier=31.0, maxCFSSegmentSizeMB=8.796093022207999E12, noCFSRatio=1.0
   [junit4]   2> 981958 INFO  (coreLoadExecutor-2399-thread-1-processing-n:127.0.0.1:41147_) [n:127.0.0.1:41147_ c:control_collection s:shard1 r:core_node1 x:collection1] o.a.s.c.SolrCore SolrDeletionPolicy.onInit: commits: num=1
   [junit4]   2> 	commit{dir=MockDirectoryWrapper(RAMDirectory@31f843ec lockFactory=org.apache.lucene.store.SingleInstanceLockFactory@5bf6bb8a),segFN=segments_1,generation=1}
   [junit4]   2> 981958 INFO  (coreLoadExecutor-2399-thread-1-processing-n:127.0.0.1:41147_) [n:127.0.0.1:41147_ c:control_collection s:shard1 r:core_node1 x:collection1] o.a.s.c.SolrCore newest commit generation = 1
   [junit4]   2> 981958 INFO  (coreLoadExecutor-2399-thread-1-processing-n:127.0.0.1:41147_) [n:127.0.0.1:41147_ c:control_collection s:shard1 r:core_node1 x:collection1] o.a.s.s.SolrIndexSearcher Opening Searcher@1dd8c406[collection1] main
   [junit4]   2> 981958 INFO  (coreLoadExecutor-2399-thread-1-processing-n:127.0.0.1:41147_) [n:127.0.0.1:41147_ c:control_collection s:shard1 r:core_node1 x:collection1] o.a.s.c.c.ZkStateReader Load collection config from:/collections/control_collection
   [junit4]   2> 981959 INFO  (coreLoadExecutor-2399-thread-1-processing-n:127.0.0.1:41147_) [n:127.0.0.1:41147_ c:control_collection s:shard1 r:core_node1 x:collection1] o.a.s.c.c.ZkStateReader path=/collections/control_collection configName=conf1 specified config exists in ZooKeeper
   [junit4]   2> 981960 INFO  (coreLoadExecutor-2399-thread-1-processing-n:127.0.0.1:41147_) [n:127.0.0.1:41147_ c:control_collection s:shard1 r:core_node1 x:collection1] o.a.s.r.ManagedResourceStorage Setting up ZooKeeper-based storage for the RestManager with znodeBase: /configs/conf1
   [junit4]   2> 981960 INFO  (coreLoadExecutor-2399-thread-1-processing-n:127.0.0.1:41147_) [n:127.0.0.1:41147_ c:control_collection s:shard1 r:core_node1 x:collection1] o.a.s.r.ManagedResourceStorage Configured ZooKeeperStorageIO with znodeBase: /configs/conf1
   [junit4]   2> 981960 INFO  (coreLoadExecutor-2399-thread-1-processing-n:127.0.0.1:41147_) [n:127.0.0.1:41147_ c:control_collection s:shard1 r:core_node1 x:collection1] o.a.s.r.RestManager Initializing RestManager with initArgs: {}
   [junit4]   2> 981960 INFO  (coreLoadExecutor-2399-thread-1-processing-n:127.0.0.1:41147_) [n:127.0.0.1:41147_ c:control_collection s:shard1 r:core_node1 x:collection1] o.a.s.r.ManagedResourceStorage Reading _rest_managed.json using ZooKeeperStorageIO:path=/configs/conf1
   [junit4]   2> 981961 INFO  (coreLoadExecutor-2399-thread-1-processing-n:127.0.0.1:41147_) [n:127.0.0.1:41147_ c:control_collection s:shard1 r:core_node1 x:collection1] o.a.s.r.ManagedResourceStorage No data found for znode /configs/conf1/_rest_managed.json
   [junit4]   2> 981961 INFO  (coreLoadExecutor-2399-thread-1-processing-n:127.0.0.1:41147_) [n:127.0.0.1:41147_ c:control_collection s:shard1 r:core_node1 x:collection1] o.a.s.r.ManagedResourceStorage Loaded null at path _rest_managed.json using ZooKeeperStorageIO:path=/configs/conf1
   [junit4]   2> 981961 INFO  (coreLoadExecutor-2399-thread-1-processing-n:127.0.0.1:41147_) [n:127.0.0.1:41147_ c:control_collection s:shard1 r:core_node1 x:collection1] o.a.s.r.RestManager Initializing 0 registered ManagedResources
   [junit4]   2> 981961 INFO  (coreLoadExecutor-2399-thread-1-processing-n:127.0.0.1:41147_) [n:127.0.0.1:41147_ c:control_collection s:shard1 r:core_node1 x:collection1] o.a.s.h.ReplicationHandler Commits will be reserved for  10000
   [junit4]   2> 981962 INFO  (coreLoadExecutor-2399-thread-1-processing-n:127.0.0.1:41147_) [n:127.0.0.1:41147_ c:control_collection s:shard1 r:core_node1 x:collection1] o.a.s.u.UpdateLog Looking up max value of version field to seed version buckets
   [junit4]   2> 981962 INFO  (coreLoadExecutor-2399-thread-1-processing-n:127.0.0.1:41147_) [n:127.0.0.1:41147_ c:control_collection s:shard1 r:core_node1 x:collection1] o.a.s.u.VersionInfo Refreshing highest value of _version_ for 65536 version buckets from index
   [junit4]   2> 981962 INFO  (coreLoadExecutor-2399-thread-1-processing-n:127.0.0.1:41147_) [n:127.0.0.1:41147_ c:control_collection s:shard1 r:core_node1 x:collection1] o.a.s.u.VersionInfo No terms found for _version_, cannot seed version bucket highest value from index
   [junit4]   2> 981962 INFO  (coreLoadExecutor-2399-thread-1-processing-n:127.0.0.1:41147_) [n:127.0.0.1:41147_ c:control_collection s:shard1 r:core_node1 x:collection1] o.a.s.u.UpdateLog Could not find max version in index or recent updates, using new clock 1509944635064057856
   [junit4]   2> 981964 INFO  (coreLoadExecutor-2399-thread-1-processing-n:127.0.0.1:41147_) [n:127.0.0.1:41147_ c:control_collection s:shard1 r:core_node1 x:collection1] o.a.s.u.UpdateLog Took 2.0ms to seed version buckets with highest version 1509944635064057856
   [junit4]   2> 981965 INFO  (coreLoadExecutor-2399-thread-1-processing-n:127.0.0.1:41147_) [n:127.0.0.1:41147_ c:control_collection s:shard1 r:core_node1 x:collection1] o.a.s.c.ZkController watch zkdir /configs/conf1
   [junit4]   2> 981965 INFO  (searcherExecutor-2400-thread-1-processing-n:127.0.0.1:41147_ x:collection1 s:shard1 c:control_collection r:core_node1) [n:127.0.0.1:41147_ c:control_collection s:shard1 r:core_node1 x:collection1] o.a.s.c.SolrCore [collection1] Registered new searcher Searcher@1dd8c406[collection1] main{ExitableDirectoryReader(UninvertingDirectoryReader())}
   [junit4]   2> 981970 INFO  (coreLoadExecutor-2399-thread-1-processing-n:127.0.0.1:41147_) [n:127.0.0.1:41147_ c:control_collection s:shard1 r:core_node1 x:collection1] o.a.s.c.CoreContainer registering core: collection1
   [junit4]   2> 981981 INFO  (coreZkRegister-2393-thread-1-processing-n:127.0.0.1:41147_ x:collection1 s:shard1 c:control_collection r:core_node1) [n:127.0.0.1:41147_ c:control_collection s:shard1 r:core_node1 x:collection1] o.a.s.c.ZkController Register replica - core:collection1 address:http://127.0.0.1:41147 collection:control_collection shard:shard1
   [junit4]   2> 981983 INFO  (coreZkRegister-2393-thread-1-processing-n:127.0.0.1:41147_ x:collection1 s:shard1 c:control_collection r:core_node1) [n:127.0.0.1:41147_ c:control_collection s:shard1 r:core_node1 x:collection1] o.a.s.c.c.SolrZkClient makePath: /collections/control_collection/leader_elect/shard1/election
   [junit4]   2> 981987 INFO  (coreZkRegister-2393-thread-1-processing-n:127.0.0.1:41147_ x:collection1 s:shard1 c:control_collection r:core_node1) [n:127.0.0.1:41147_ c:control_collection s:shard1 r:core_node1 x:collection1] o.a.s.c.LeaderElector Joined leadership election with path: /collections/control_collection/leader_elect/shard1/election/94371539431981060-core_node1-n_0000000000
   [junit4]   2> 981988 INFO  (coreZkRegister-2393-thread-1-processing-n:127.0.0.1:41147_ x:collection1 s:shard1 c:control_collection r:core_node1) [n:127.0.0.1:41147_ c:control_collection s:shard1 r:core_node1 x:collection1] o.a.s.c.ShardLeaderElectionContext Running the leader process for shard shard1
   [junit4]   2> 981990 INFO  (zkCallback-770-thread-2-processing-n:127.0.0.1:41147_) [n:127.0.0.1:41147_    ] o.a.s.c.DistributedQueue NodeChildrenChanged fired on path /overseer/queue state SyncConnected
   [junit4]   2> 981990 INFO  (OverseerStateUpdate-94371539431981060-127.0.0.1:41147_-n_0000000000) [n:127.0.0.1:41147_    ] o.a.s.c.Overseer processMessage: queueSize: 1, message = {
   [junit4]   2>   "operation":"leader",
   [junit4]   2>   "shard":"shard1",
   [junit4]   2>   "collection":"control_collection"} current state version: 1
   [junit4]   2> 981991 INFO  (zkCallback-770-thread-1-processing-n:127.0.0.1:41147_) [n:127.0.0.1:41147_    ] o.a.s.c.c.ZkStateReader A cluster state change: WatchedEvent state:SyncConnected type:NodeDataChanged path:/clusterstate.json, has occurred - updating... (live nodes size: 1)
   [junit4]   2> 981992 INFO  (zkCallback-770-thread-2-processing-n:127.0.0.1:41147_) [n:127.0.0.1:41147_    ] o.a.s.c.c.ZkStateReader A cluster state change: WatchedEvent state:SyncConnected type:NodeDataChanged path:/clusterstate.json, has occurred - updating... (live nodes size: 1)
   [junit4]   2> 981995 INFO  (coreZkRegister-2393-thread-1-processing-n:127.0.0.1:41147_ x:collection1 s:shard1 c:control_collection r:core_node1) [n:127.0.0.1:41147_ c:control_collection s:shard1 r:core_node1 x:collection1] o.a.s.c.ShardLeaderElectionContext Enough replicas found to continue.
   [junit4]   2> 981995 INFO  (coreZkRegister-2393-thread-1-processing-n:127.0.0.1:41147_ x:collection1 s:shard1 c:control_collection r:core_node1) [n:127.0.0.1:41147_ c:control_collection s:shard1 r:core_node1 x:collection1] o.a.s.c.ShardLeaderElectionContext I may be the new leader - try and sync
   [junit4]   2> 981995 INFO  (coreZkRegister-2393-thread-1-processing-n:127.0.0.1:41147_ x:collection1 s:shard1 c:control_collection r:core_node1) [n:127.0.0.1:41147_ c:control_collection s:shard1 r:core_node1 x:collection1] o.a.s.c.SyncStrategy Sync replicas to http://127.0.0.1:41147/collection1/
   [junit4]   2> 981996 INFO  (coreZkRegister-2393-thread-1-processing-n:127.0.0.1:41147_ x:collection1 s:shard1 c:control_collection r:core_node1) [n:127.0.0.1:41147_ c:control_collection s:shard1 r:core_node1 x:collection1] o.a.s.c.SyncStrategy Sync Success - now sync replicas to me
   [junit4]   2> 981996 INFO  (coreZkRegister-2393-thread-1-processing-n:127.0.0.1:41147_ x:collection1 s:shard1 c:control_collection r:core_node1) [n:127.0.0.1:41147_ c:control_collection s:shard1 r:core_node1 x:collection1] o.a.s.c.SyncStrategy http://127.0.0.1:41147/collection1/ has no replicas
   [junit4]   2> 981996 INFO  (coreZkRegister-2393-thread-1-processing-n:127.0.0.1:41147_ x:collection1 s:shard1 c:control_collection r:core_node1) [n:127.0.0.1:41147_ c:control_collection s:shard1 r:core_node1 x:collection1] o.a.s.c.ShardLeaderElectionContext I am the new leader: http://127.0.0.1:41147/collection1/ shard1
   [junit4]   2> 981996 INFO  (coreZkRegister-2393-thread-1-processing-n:127.0.0.1:41147_ x:collection1 s:shard1 c:control_collection r:core_node1) [n:127.0.0.1:41147_ c:control_collection s:shard1 r:core_node1 x:collection1] o.a.s.c.c.SolrZkClient makePath: /collections/control_collection/leaders/shard1
   [junit4]   2> 982001 INFO  (zkCallback-770-thread-2-processing-n:127.0.0.1:41147_) [n:127.0.0.1:41147_    ] o.a.s.c.DistributedQueue NodeChildrenChanged fired on path /overseer/queue state SyncConnected
   [junit4]   2> 982002 INFO  (OverseerStateUpdate-94371539431981060-127.0.0.1:41147_-n_0000000000) [n:127.0.0.1:41147_    ] o.a.s.c.Overseer processMessage: queueSize: 1, message = {
   [junit4]   2>   "operation":"leader",
   [junit4]   2>   "shard":"shard1",
   [junit4]   2>   "collection":"control_collection",
   [junit4]   2>   "base_url":"http://127.0.0.1:41147",
   [junit4]   2>   "core":"collection1",
   [junit4]   2>   "state":"active"} current state version: 2
   [junit4]   2> 982012 INFO  (TEST-BasicDistributedZkTest.test-seed#[C42F9429DE77AD4D]) [    ] o.a.s.c.c.SolrZkClient Using default ZkCredentialsProvider
   [junit4]   2> 982014 INFO  (TEST-BasicDistributedZkTest.test-seed#[C42F9429DE77AD4D]) [    ] o.a.s.c.c.ConnectionManager Waiting for client to connect to ZooKeeper
   [junit4]   2> 982017 INFO  (zkCallback-772-thread-1) [    ] o.a.s.c.c.ConnectionManager Watcher org.apache.solr.common.cloud.ConnectionManager@7f44d171 name:ZooKeeperConnection Watcher:127.0.0.1:54685/solr got event WatchedEvent state:SyncConnected type:None path:null path:null type:None
   [junit4]   2> 982020 INFO  (TEST-BasicDistributedZkTest.test-seed#[C42F9429DE77AD4D]) [    ] o.a.s.c.c.ConnectionManager Client is connected to ZooKeeper
   [junit4]   2> 982020 INFO  (TEST-BasicDistributedZkTest.test-seed#[C42F9429DE77AD4D]) [    ] o.a.s.c.c.SolrZkClient Using default ZkACLProvider
   [junit4]   2> 982020 INFO  (TEST-BasicDistributedZkTest.test-seed#[C42F9429DE77AD4D]) [    ] o.a.s.c.c.ZkStateReader Updating cluster state from ZooKeeper... 
   [junit4]   2> 982022 INFO  (TEST-BasicDistributedZkTest.test-seed#[C42F9429DE77AD4D]) [    ] o.a.s.c.ChaosMonkey monkey: init - expire sessions:false cause connection loss:false
   [junit4]   2> 982022 INFO  (TEST-BasicDistributedZkTest.test-seed#[C42F9429DE77AD4D]) [    ] o.a.s.c.AbstractFullDistribZkTestBase Creating collection1 with stateFormat=2
   [junit4]   2> 982022 INFO  (TEST-BasicDistributedZkTest.test-seed#[C42F9429DE77AD4D]) [    ] o.a.s.c.c.SolrZkClient Using default ZkCredentialsProvider
   [junit4]   2> 982038 INFO  (TEST-BasicDistributedZkTest.test-seed#[C42F9429DE77AD4D]) [    ] o.a.s.c.c.ConnectionManager Waiting for client to connect to ZooKeeper
   [junit4]   2> 982038 INFO  (zkCallback-773-thread-1) [    ] o.a.s.c.c.ConnectionManager Watcher org.apache.solr.common.cloud.ConnectionManager@74b5d9a3 name:ZooKeeperConnection Watcher:127.0.0.1:54685/solr got event WatchedEvent state:SyncConnected type:None path:null path:null type:None
   [junit4]   2> 982038 INFO  (TEST-BasicDistributedZkTest.test-seed#[C42F9429DE77AD4D]) [    ] o.a.s.c.c.ConnectionManager Client is connected to ZooKeeper
   [junit4]   2> 982039 INFO  (TEST-BasicDistributedZkTest.test-seed#[C42F9429DE77AD4D]) [    ] o.a.s.c.c.SolrZkClient Using default ZkACLProvider
   [junit4]   2> 982040 INFO  (zkCallback-770-thread-2-processing-n:127.0.0.1:41147_) [n:127.0.0.1:41147_    ] o.a.s.c.DistributedQueue NodeChildrenChanged fired on path /overseer/queue state SyncConnected
   [junit4]   2> 982041 INFO  (OverseerStateUpdate-94371539431981060-127.0.0.1:41147_-n_0000000000) [n:127.0.0.1:41147_    ] o.a.s.c.Overseer processMessage: queueSize: 1, message = {
   [junit4]   2>   "operation":"create",
   [junit4]   2>   "name":"collection1",
   [junit4]   2>   "numShards":"2",
   [junit4]   2>   "stateFormat":"2"} current state version: 2
   [junit4]   2> 982041 INFO  (OverseerStateUpdate-94371539431981060-127.0.0.1:41147_-n_0000000000) [n:127.0.0.1:41147_    ] o.a.s.c.o.ClusterStateMutator building a new cName: collection1
   [junit4]   2> 982044 INFO  (zkCallback-770-thread-1-processing-n:127.0.0.1:41147_) [n:127.0.0.1:41147_    ] o.a.s.c.c.ZkStateReader A cluster state change: WatchedEvent state:SyncConnected type:NodeDataChanged path:/clusterstate.json, has occurred - updating... (live nodes size: 1)
   [junit4]   2> 982044 INFO  (zkCallback-772-thread-1) [    ] o.a.s.c.c.ZkStateReader A cluster state change: WatchedEvent state:SyncConnected type:NodeDataChanged path:/clusterstate.json, has occurred - updating... (live nodes size: 1)
   [junit4]   2> 982044 INFO  (zkCallback-770-thread-2-processing-n:127.0.0.1:41147_) [n:127.0.0.1:41147_    ] o.a.s.c.c.ZkStateReader A cluster state change: WatchedEvent state:SyncConnected type:NodeDataChanged path:/clusterstate.json, has occurred - updating... (live nodes size: 1)
   [junit4]   2> 982104 INFO  (coreZkRegister-2393-thread-1-processing-n:127.0.0.1:41147_ x:collection1 s:shard1 c:control_collection r:core_node1) [n:127.0.0.1:41147_ c:control_collection s:shard1 r:core_node1 x:collection1] o.a.s.c.ZkController We are http://127.0.0.1:41147/collection1/ and leader is http://127.0.0.1:41147/collection1/
   [junit4]   2> 982105 INFO  (coreZkRegister-2393-thread-1-processing-n:127.0.0.1:41147_ x:collection1 s:shard1 c:control_collection r:core_node1) [n:127.0.0.1:41147_ c:control_collection s:shard1 r:core_node1 x:collection1] o.a.s.c.ZkController No LogReplay needed for core=collection1 baseURL=http://127.0.0.1:41147
   [junit4]   2> 982105 INFO  (coreZkRegister-2393-thread-1-processing-n:127.0.0.1:41147_ x:collection1 s:shard1 c:control_collection r:core_node1) [n:127.0.0.1:41147_ c:control_collection s:shard1 r:core_node1 x:collection1] o.a.s.c.ZkController I am the leader, no recovery necessary
   [junit4]   2> 982105 INFO  (coreZkRegister-2393-thread-1-processing-n:127.0.0.1:41147_ x:collection1 s:shard1 c:control_collection r:core_node1) [n:127.0.0.1:41147_ c:control_collection s:shard1 r:core_node1 x:collection1] o.a.s.c.ZkController publishing state=active
   [junit4]   2> 982105 INFO  (coreZkRegister-2393-thread-1-processing-n:127.0.0.1:41147_ x:collection1 s:shard1 c:control_collection r:core_node1) [n:127.0.0.1:41147_ c:control_collection s:shard1 r:core_node1 x:collection1] o.a.s.c.ZkController numShards not found on descriptor - reading it from system property
   [junit4]   2> 982107 INFO  (zkCallback-770-thread-1-processing-n:127.0.0.1:41147_) [n:127.0.0.1:41147_    ] o.a.s.c.DistributedQueue NodeChildrenChanged fired on path /overseer/queue state SyncConnected
   [junit4]   2> 982108 INFO  (OverseerStateUpdate-94371539431981060-127.0.0.1:41147_-n_0000000000) [n:127.0.0.1:41147_    ] o.a.s.c.Overseer processMessage: queueSize: 1, message = {
   [junit4]   2>   "core":"collection1",
   [junit4]   2>   "core_node_name":"core_node1",
   [junit4]   2>   "roles":null,
   [junit4]   2>   "base_url":"http://127.0.0.1:41147",
   [junit4]   2>   "node_name":"127.0.0.1:41147_",
   [junit4]   2>   "numShards":"2",
   [junit4]   2>   "state":"active",
   [junit4]   2>   "shard":"shard1",
   [junit4]   2>   "collection":"control_collection",
   [junit4]   2>   "operation":"state"} current state version: 3
   [junit4]   2> 982108 INFO  (OverseerStateUpdate-94371539431981060-127.0.0.1:41147_-n_0000000000) [n:127.0.0.1:41147_    ] o.a.s.c.o.ReplicaMutator Update state numShards=2 message={
   [junit4]   2>   "core":"collection1",
   [junit4]   2>   "core_node_name":"core_node1",
   [junit4]   2>   "roles":null,
   [junit4]   2>   "base_url":"http://127.0.0.1:41147",
   [junit4]   2>   "node_name":"127.0.0.1:41147_",
   [junit4]   2>   "numShards":"2",
   [junit4]   2>   "state":"active",
   [junit4]   2>   "shard":"shard1",
   [junit4]   2>   "collection":"control_collection",
   [junit4]   2>   "operation":"state"}
   [junit4]   2> 982109 INFO  (OverseerStateUpdate-94371539431981060-127.0.0.1:41147_-n_0000000000) [n:127.0.0.1:41147_    ] o.a.s.c.o.ZkStateWriter going to create_collection /collections/collection1/state.json
   [junit4]   2> 982110 INFO  (zkCallback-772-thread-1) [    ] o.a.s.c.c.ZkStateReader A cluster state change: WatchedEvent state:SyncConnected type:NodeDataChanged path:/clusterstate.json, has occurred - updating... (live nodes size: 1)
   [junit4]   2> 982110 INFO  (zkCallback-770-thread-1-processing-n:127.0.0.1:41147_) [n:127.0.0.1:41147_    ] o.a.s.c.c.ZkStateReader A cluster state change: WatchedEvent state:SyncConnected type:NodeDataChanged path:/clusterstate.json, has occurred - updating... (live nodes size: 1)
   [junit4]   2> 982111 INFO  (zkCallback-770-thread-2-processing-n:127.0.0.1:41147_) [n:127.0.0.1:41147_    ] o.a.s.c.c.ZkStateReader A cluster state change: WatchedEvent state:SyncConnected type:NodeDataChanged path:/clusterstate.json, has occurred - updating... (live nodes size: 1)
   [junit4]   2> 982225 INFO  (zkCallback-772-thread-1) [    ] o.a.s.c.c.ZkStateReader A cluster state change: WatchedEvent state:SyncConnected type:NodeDataChanged path:/clusterstate.json, has occurred - updating... (live nodes size: 1)
   [junit4]   2> 982225 INFO  (zkCallback-770-thread-1-processing-n:127.0.0.1:41147_) [n:127.0.0.1:41147_    ] o.a.s.c.c.ZkStateReader A cluster state change: WatchedEvent state:SyncConnected type:NodeDataChanged path:/clusterstate.json, has occurred - updating... (live nodes size: 1)
   [junit4]   2> 982225 INFO  (zkCallback-770-thread-2-processing-n:127.0.0.1:41147_) [n:127.0.0.1:41147_    ] o.a.s.c.c.ZkStateReader A cluster state change: WatchedEvent state:SyncConnected type:NodeDataChanged path:/clusterstate.json, has occurred - updating... (live nodes size: 1)
   [junit4]   2> 982974 INFO  (TEST-BasicDistributedZkTest.test-seed#[C42F9429DE77AD4D]) [    ] o.a.s.SolrTestCaseJ4 Writing core.properties file to /x1/jenkins/jenkins-slave/workspace/Lucene-Solr-Tests-trunk-Java8/solr/build/solr-core/test/J0/temp/solr.cloud.BasicDistributedZkTest_C42F9429DE77AD4D-001/shard-1-001/cores/collection1
   [junit4]   2> 982975 INFO  (TEST-BasicDistributedZkTest.test-seed#[C42F9429DE77AD4D]) [    ] o.a.s.c.AbstractFullDistribZkTestBase create jetty 1 in directory /x1/jenkins/jenkins-slave/workspace/Lucene-Solr-Tests-trunk-Java8/solr/build/solr-core/test/J0/temp/solr.cloud.BasicDistributedZkTest_C42F9429DE77AD4D-001/shard-1-001
   [junit4]   2> 982978 INFO  (TEST-BasicDistributedZkTest.test-seed#[C42F9429DE77AD4D]) [    ] o.e.j.s.Server jetty-9.2.13.v20150730
   [junit4]   2> 983062 INFO  (TEST-BasicDistributedZkTest.test-seed#[C42F9429DE77AD4D]) [    ] o.e.j.s.h.ContextHandler Started o.e.j.s.ServletContextHandler@62f371d0{/,null,AVAILABLE}
   [junit4]   2> 983063 INFO  (TEST-BasicDistributedZkTest.test-seed#[C42F9429DE77AD4D]) [    ] o.e.j.s.ServerConnector Started ServerConnector@4a3d52ef{HTTP/1.1}{127.0.0.1:54057}
   [junit4]   2> 983063 INFO  (TEST-BasicDistributedZkTest.test-seed#[C42F9429DE77AD4D]) [    ] o.e.j.s.Server Started @987664ms
   [junit4]   2> 983063 INFO  (TEST-BasicDistributedZkTest.test-seed#[C42F9429DE77AD4D]) [    ] o.a.s.c.s.e.JettySolrRunner Jetty properties: {solr.data.dir=/x1/jenkins/jenkins-slave/workspace/Lucene-Solr-Tests-trunk-Java8/solr/build/solr-core/test/J0/temp/solr.cloud.BasicDistributedZkTest_C42F9429DE77AD4D-001/tempDir-001/jetty1, solrconfig=solrconfig.xml, hostContext=/, hostPort=54057, coreRootDirectory=/x1/jenkins/jenkins-slave/workspace/Lucene-Solr-Tests-trunk-Java8/solr/build/solr-core/test/J0/temp/solr.cloud.BasicDistributedZkTest_C42F9429DE77AD4D-001/shard-1-001/cores}
   [junit4]   2> 983064 INFO  (TEST-BasicDistributedZkTest.test-seed#[C42F9429DE77AD4D]) [    ] o.a.s.s.SolrDispatchFilter SolrDispatchFilter.init(): sun.misc.Launcher$AppClassLoader@4e0e2f2a
   [junit4]   2> 983064 INFO  (TEST-BasicDistributedZkTest.test-seed#[C42F9429DE77AD4D]) [    ] o.a.s.c.SolrResourceLoader new SolrResourceLoader for directory: '/x1/jenkins/jenkins-slave/workspace/Lucene-Solr-Tests-trunk-Java8/solr/build/solr-core/test/J0/temp/solr.cloud.BasicDistributedZkTest_C42F9429DE77AD4D-001/shard-1-001/'
   [junit4]   2> 983097 INFO  (TEST-BasicDistributedZkTest.test-seed#[C42F9429DE77AD4D]) [    ] o.a.s.c.c.SolrZkClient Using default ZkCredentialsProvider
   [junit4]   2> 983117 INFO  (TEST-BasicDistributedZkTest.test-seed#[C42F9429DE77AD4D]) [    ] o.a.s.c.c.ConnectionManager Waiting for client to connect to ZooKeeper
   [junit4]   2> 983242 INFO  (zkCallback-774-thread-1) [    ] o.a.s.c.c.ConnectionManager Watcher org.apache.solr.common.cloud.ConnectionManager@31547318 name:ZooKeeperConnection Watcher:127.0.0.1:54685/solr got event WatchedEvent state:SyncConnected type:None path:null path:null type:None
   [junit4]   2> 983242 INFO  (TEST-BasicDistributedZkTest.test-seed#[C42F9429DE77AD4D]) [    ] o.a.s.c.c.ConnectionManager Client is connected to ZooKeeper
   [junit4]   2> 983243 INFO  (TEST-BasicDistributedZkTest.test-seed#[C42F9429DE77AD4D]) [    ] o.a.s.c.c.SolrZkClient Using default ZkACLProvider
   [junit4]   2> 983244 INFO  (TEST-BasicDistributedZkTest.test-seed#[C42F9429DE77AD4D]) [    ] o.a.s.s.SolrDispatchFilter Loading solr.xml from SolrHome (not found in ZooKeeper)
   [junit4]   2> 983244 INFO  (TEST-BasicDistributedZkTest.test-seed#[C42F9429DE77AD4D]) [    ] o.a.s.c.SolrXmlConfig Loading container configuration from /x1/jenkins/jenkins-slave/workspace/Lucene-Solr-Tests-trunk-Java8/solr/build/solr-core/test/J0/temp/solr.cloud.BasicDistributedZkTest_C42F9429DE77AD4D-001/shard-1-001/solr.xml
   [junit4]   2> 983249 INFO  (TEST-BasicDistributedZkTest.test-seed#[C42F9429DE77AD4D]) [    ] o.a.s.c.CoresLocator Config-defined core root directory: /x1/jenkins/jenkins-slave/workspace/Lucene-Solr-Tests-trunk-Java8/solr/build/solr-core/test/J0/temp/solr.cloud.BasicDistributedZkTest_C42F9429DE77AD4D-001/shard-1-001/cores
   [junit4]   2> 983249 INFO  (TEST-BasicDistributedZkTest.test-seed#[C42F9429DE77AD4D]) [    ] o.a.s.c.CoreContainer New CoreContainer 1720037789
   [junit4]   2> 983249 INFO  (TEST-BasicDistributedZkTest.test-seed#[C42F9429DE77AD4D]) [    ] o.a.s.c.CoreContainer Loading cores into CoreContainer [instanceDir=/x1/jenkins/jenkins-slave/workspace/Lucene-Solr-Tests-trunk-Java8/solr/build/solr-core/test/J0/temp/solr.cloud.BasicDistributedZkTest_C42F9429DE77AD4D-001/shard-1-001/]
   [junit4]   2> 983249 INFO  (TEST-BasicDistributedZkTest.test-seed#[C42F9429DE77AD4D]) [    ] o.a.s.c.CoreContainer loading shared library: /x1/jenkins/jenkins-slave/workspace/Lucene-Solr-Tests-trunk-Java8/solr/build/solr-core/test/J0/temp/solr.cloud.BasicDistributedZkTest_C42F9429DE77AD4D-001/shard-1-001/lib
   [junit4]   2> 983250 WARN  (TEST-BasicDistributedZkTest.test-seed#[C42F9429DE77AD4D]) [    ] o.a.s.c.SolrResourceLoader Can't find (or read) directory to add to classloader: lib (resolved as: /x1/jenkins/jenkins-slave/workspace/Lucene-Solr-Tests-trunk-Java8/solr/build/solr-core/test/J0/temp/solr.cloud.BasicDistributedZkTest_C42F9429DE77AD4D-001/shard-1-001/lib).
   [junit4]   2> 983257 INFO  (TEST-BasicDistributedZkTest.test-seed#[C42F9429DE77AD4D]) [    ] o.a.s.h.c.HttpShardHandlerFactory created with socketTimeout : 90000,urlScheme : ,connTimeout : 15000,maxConnectionsPerHost : 20,maxConnections : 10000,corePoolSize : 0,maximumPoolSize : 2147483647,maxThreadIdleTime : 5,sizeOfQueue : -1,fairnessPolicy : false,useRetries : false,
   [junit4]   2> 983259 INFO  (TEST-BasicDistributedZkTest.test-seed#[C42F9429DE77AD4D]) [    ] o.a.s.u.UpdateShardHandler Creating UpdateShardHandler HTTP client with params: socketTimeout=340000&connTimeout=45000&retry=true
   [junit4]   2> 983259 INFO  (TEST-BasicDistributedZkTest.test-seed#[C42F9429DE77AD4D]) [    ] o.a.s.l.LogWatcher SLF4J impl is org.slf4j.impl.Log4jLoggerFactory
   [junit4]   2> 983259 INFO  (TEST-BasicDistributedZkTest.test-seed#[C42F9429DE77AD4D]) [    ] o.a.s.l.LogWatcher Registering Log Listener [Log4j (org.slf4j.impl.Log4jLoggerFactory)]
   [junit4]   2> 983259 INFO  (TEST-BasicDistributedZkTest.test-seed#[C42F9429DE77AD4D]) [    ] o.a.s.c.ZkContainer Zookeeper client=127.0.0.1:54685/solr
   [junit4]   2> 983260 INFO  (TEST-BasicDistributedZkTest.test-seed#[C42F9429DE77AD4D]) [    ] o.a.s.c.ZkController zkHost includes chroot
   [junit4]   2> 983260 INFO  (TEST-BasicDistributedZkTest.test-seed#[C42F9429DE77AD4D]) [    ] o.a.s.c.c.SolrZkClient Using default ZkCredentialsProvider
   [junit4]   2> 983291 INFO  (TEST-BasicDistributedZkTest.test-seed#[C42F9429DE77AD4D]) [    ] o.a.s.c.c.ConnectionManager Waiting for client to connect to ZooKeeper
   [junit4]   2> 983292 INFO  (zkCallback-776-thread-1) [    ] o.a.s.c.c.ConnectionManager Watcher org.apache.solr.common.cloud.ConnectionManager@2bb90898 name:ZooKeeperConnection Watcher:127.0.0.1:54685 got event WatchedEvent state:SyncConnected type:None path:null path:null type:None
   [junit4]   2> 983292 INFO  (TEST-BasicDistributedZkTest.test-seed#[C42F9429DE77AD4D]) [    ] o.a.s.c.c.ConnectionManager Client is connected to ZooKeeper
   [junit4]   2> 983293 INFO  (TEST-BasicDistributedZkTest.test-seed#[C42F9429DE77AD4D]) [    ] o.a.s.c.c.SolrZkClient Using default ZkACLProvider
   [junit4]   2> 983339 INFO  (TEST-BasicDistributedZkTest.test-seed#[C42F9429DE77AD4D]) [n:127.0.0.1:54057_    ] o.a.s.c.c.ConnectionManager Waiting for client to connect to ZooKeeper
   [junit4]   2> 983351 INFO  (zkCallback-777-thread-1-processing-n:127.0.0.1:54057_) [n:127.0.0.1:54057_    ] o.a.s.c.c.ConnectionManager Watcher org.apache.solr.common.cloud.ConnectionManager@6ca8f3fe name:ZooKeeperConnection Watcher:127.0.0.1:54685/solr got event WatchedEvent state:SyncConnected type:None path:null path:null type:None
   [junit4]   2> 983351 INFO  (TEST-BasicDistributedZkTest.test-seed#[C42F9429DE77AD4D]) [n:127.0.0.1:54057_    ] o.a.s.c.c.ConnectionManager Client is connected to ZooKeeper
   [junit4]   2> 983355 INFO  (TEST-BasicDistributedZkTest.test-seed#[C42F9429DE77AD4D]) [n:127.0.0.1:54057_    ] o.a.s.c.c.ZkStateReader Updating cluster state from ZooKeeper... 
   [junit4]   2> 984358 INFO  (TEST-BasicDistributedZkTest.test-seed#[C42F9429DE77AD4D]) [n:127.0.0.1:54057_    ] o.a.s.c.ZkController Register node as live in ZooKeeper:/live_nodes/127.0.0.1:54057_
   [junit4]   2> 984359 INFO  (TEST-BasicDistributedZkTest.test-seed#[C42F9429DE77AD4D]) [n:127.0.0.1:54057_    ] o.a.s.c.c.SolrZkClient makePath: /live_nodes/127.0.0.1:54057_
   [junit4]   2> 984360 INFO  (zkCallback-772-thread-1) [    ] o.a.s.c.c.ZkStateReader A live node change: WatchedEvent state:SyncConnected type:NodeChildrenChanged path:/live_nodes, has occurred - updating... (live nodes size: 1)
   [junit4]   2> 984360 INFO  (zkCallback-770-thread-1-processing-n:127.0.0.1:41147_) [n:127.0.0.1:41147_    ] o.a.s.c.c.ZkStateReader A live node change: WatchedEvent state:SyncConnected type:NodeChildrenChanged path:/live_nodes, has occurred - updating... (live nodes size: 1)
   [junit4]   2> 984360 INFO  (zkCallback-770-thread-2-processing-n:127.0.0.1:41147_) [n:127.0.0.1:41147_    ] o.a.s.c.c.ZkStateReader A live node change: WatchedEvent state:SyncConnected type:NodeChildrenChanged path:/live_nodes, has occurred - updating... (live nodes size: 1)
   [junit4]   2> 984361 INFO  (zkCallback-777-thread-1-processing-n:127.0.0.1:54057_) [n:127.0.0.1:54057_    ] o.a.s.c.c.ZkStateReader A live node change: WatchedEvent state:SyncConnected type:NodeChildrenChanged path:/live_nodes, has occurred - updating... (live nodes size: 1)
   [junit4]   2> 984362 INFO  (TEST-BasicDistributedZkTest.test-seed#[C42F9429DE77AD4D]) [n:127.0.0.1:54057_    ] o.a.s.c.Overseer Overseer (id=null) closing
   [junit4]   2> 984363 INFO  (TEST-BasicDistributedZkTest.test-seed#[C42F9429DE77AD4D]) [n:127.0.0.1:54057_    ] o.a.s.c.LeaderElector Joined leadership election with path: /overseer_elect/election/94371539431981065-127.0.0.1:54057_-n_0000000001
   [junit4]   2> 984363 INFO  (TEST-BasicDistributedZkTest.test-seed#[C42F9429DE77AD4D]) [n:127.0.0.1:54057_    ] o.a.s.c.LeaderElector Watching path /overseer_elect/election/94371539431981060-127.0.0.1:41147_-n_0000000000 to know if I could be the leader
   [junit4]   2> 984388 INFO  (TEST-BasicDistributedZkTest.test-seed#[C42F9429DE77AD4D]) [n:127.0.0.1:54057_    ] o.a.s.c.CoreContainer Security conf doesn't exist. Skipping setup for authorization module.
   [junit4]   2> 984389 INFO  (TEST-BasicDistributedZkTest.test-seed#[C42F9429DE77AD4D]) [n:127.0.0.1:54057_    ] o.a.s.c.CoreContainer No authentication plugin used.
   [junit4]   2> 984389 INFO  (TEST-BasicDistributedZkTest.test-seed#[C42F9429DE77AD4D]) [n:127.0.0.1:54057_    ] o.a.s.c.CoresLocator Looking for core definitions underneath /x1/jenkins/jenkins-slave/workspace/Lucene-Solr-Tests-trunk-Java8/solr/build/solr-core/test/J0/temp/solr.cloud.BasicDistributedZkTest_C42F9429DE77AD4D-001/shard-1-001/cores
   [junit4]   2> 984390 INFO  (TEST-BasicDistributedZkTest.test-seed#[C42F9429DE77AD4D]) [n:127.0.0.1:54057_    ] o.a.s.c.SolrCore Created CoreDescriptor: {name=collection1, config=solrconfig.xml, transient=false, schema=schema.xml, loadOnStartup=true, configSetProperties=configsetprops.json, instanceDir=/x1/jenkins/jenkins-slave/workspace/Lucene-Solr-Tests-trunk-Java8/solr/build/solr-core/test/J0/temp/solr.cloud.BasicDistributedZkTest_C42F9429DE77AD4D-001/shard-1-001/cores/collection1, collection=collection1, absoluteInstDir=/x1/jenkins/jenkins-slave/workspace/Lucene-Solr-Tests-trunk-Java8/solr/build/solr-core/test/J0/temp/solr.cloud.BasicDistributedZkTest_C42F9429DE77AD4D-001/shard-1-001/cores/collection1/, coreNodeName=, dataDir=data/, shard=}
   [junit4]   2> 984390 INFO  (TEST-BasicDistributedZkTest.test-seed#[C42F9429DE77AD4D]) [n:127.0.0.1:54057_    ] o.a.s.c.CoresLocator Found core collection1 in /x1/jenkins/jenkins-slave/workspace/Lucene-Solr-Tests-trunk-Java8/solr/build/solr-core/test/J0/temp/solr.cloud.BasicDistributedZkTest_C42F9429DE77AD4D-001/shard-1-001/cores/collection1/
   [junit4]   2> 984391 INFO  (TEST-BasicDistributedZkTest.test-seed#[C42F9429DE77AD4D]) [n:127.0.0.1:54057_    ] o.a.s.c.CoresLocator Found 1 core definitions
   [junit4]   2> 984407 INFO  (coreLoadExecutor-2410-thread-1-processing-n:127.0.0.1:54057_) [n:127.0.0.1:54057_ c:collection1   x:collection1] o.a.s.c.ZkController publishing state=down
   [junit4]   2> 984407 INFO  (coreLoadExecutor-2410-thread-1-processing-n:127.0.0.1:54057_) [n:127.0.0.1:54057_ c:collection1   x:collection1] o.a.s.c.ZkController numShards not found on descriptor - reading it from system property
   [junit4]   2> 984408 INFO  (zkCallback-770-thread-1-processing-n:127.0.0.1:41147_) [n:127.0.0.1:41147_    ] o.a.s.c.DistributedQueue NodeChildrenChanged fired on path /overseer/queue state SyncConnected
   [junit4]   2> 984409 INFO  (coreLoadExecutor-2410-thread-1-processing-n:127.0.0.1:54057_) [n:127.0.0.1:54057_ c:collection1   x:collection1] o.a.s.c.ZkController Registering watch for collection collection1
   [junit4]   2> 984409 INFO  (coreLoadExecutor-2410-thread-1-processing-n:127.0.0.1:54057_) [n:127.0.0.1:54057_ c:collection1   x:collection1] o.a.s.c.c.ZkStateReader addZkWatch collection1
   [junit4]   2> 984409 INFO  (OverseerStateUpdate-94371539431981060-127.0.0.1:41147_-n_0000000000) [n:127.0.0.1:41147_    ] o.a.s.c.Overseer processMessage: queueSize: 1, message = {
   [junit4]   2>   "core":"collection1",
   [junit4]   2>   "roles":null,
   [junit4]   2>   "base_url":"http://127.0.0.1:54057",
   [junit4]   2>   "node_name":"127.0.0.1:54057_",
   [junit4]   2>   "numShards":"2",
   [junit4]   2>   "state":"down",
   [junit4]   2>   "shard":null,
   [junit4]   2>   "collection":"collection1",
   [junit4]   2>   "operation":"state"} current state version: 5
   [junit4]   2> 984409 INFO  (coreLoadExecutor-2410-thread-1-processing-n:127.0.0.1:54057_) [n:127.0.0.1:54057_ c:collection1   x:collection1] o.a.s.c.c.ZkStateReader Add data for collection1 ver 0 
   [junit4]   2> 984409 INFO  (coreLoadExecutor-2410-thread-1-processing-n:127.0.0.1:54057_) [n:127.0.0.1:54057_ c:collection1   x:collection1] o.a.s.c.ZkController look for our core node name
   [junit4]   2> 984410 INFO  (OverseerStateUpdate-94371539431981060-127.0.0.1:41147_-n_0000000000) [n:127.0.0.1:41147_    ] o.a.s.c.o.ReplicaMutator Update state numShards=2 message={
   [junit4]   2>   "core":"collection1",
   [junit4]   2>   "roles":null,
   [junit4]   2>   "base_url":"http://127.0.0.1:54057",
   [junit4]   2>   "node_name":"127.0.0.1:54057_",
   [junit4]   2>   "numShards":"2",
   [junit4]   2>   "state":"down",
   [junit4]   2>   "shard":null,
   [junit4]   2>   "collection":"collection1",
   [junit4]   2>   "operation":"state"}
   [junit4]   2> 984410 INFO  (OverseerStateUpdate-94371539431981060-127.0.0.1:41147_-n_0000000000) [n:127.0.0.1:41147_    ] o.a.s.c.o.ReplicaMutator Collection already exists with numShards=2
   [junit4]   2> 984410 INFO  (OverseerStateUpdate-94371539431981060-127.0.0.1:41147_-n_0000000000) [n:127.0.0.1:41147_    ] o.a.s.c.o.ReplicaMutator Assigning new node to shard shard=shard2
   [junit4]   2> 984411 INFO  (OverseerStateUpdate-94371539431981060-127.0.0.1:41147_-n_0000000000) [n:127.0.0.1:41147_    ] o.a.s.c.o.ZkStateWriter going to update_collection /collections/collection1/state.json version: 0
   [junit4]   2> 984412 INFO  (zkCallback-777-thread-1-processing-n:127.0.0.1:54057_) [n:127.0.0.1:54057_    ] o.a.s.c.c.ZkStateReader A cluster state change: WatchedEvent state:SyncConnected type:NodeDataChanged path:/collections/collection1/state.json for collection collection1 has occurred - updating... (live nodes size: 2)
   [junit4]   2> 984412 INFO  (zkCallback-777-thread-1-processing-n:127.0.0.1:54057_) [n:127.0.0.1:54057_    ] o.a.s.c.c.ZkStateReader Updating data for collection1 from 0 to 1 
   [junit4]   2> 984426 INFO  (TEST-BasicDistributedZkTest.test-seed#[C42F9429DE77AD4D]) [n:127.0.0.1:54057_    ] o.a.s.s.SolrDispatchFilter user.dir=/x1/jenkins/jenkins-slave/workspace/Lucene-Solr-Tests-trunk-Java8/solr/build/solr-core/test/J0
   [junit4]   2> 984426 INFO  (TEST-BasicDistributedZkTest.test-seed#[C42F9429DE77AD4D]) [n:127.0.0.1:54057_    ] o.a.s.s.SolrDispatchFilter SolrDispatchFilter.init() done
   [junit4]   2> 985410 INFO  (coreLoadExecutor-2410-thread-1-processing-n:127.0.0.1:54057_) [n:127.0.0.1:54057_ c:collection1   x:collection1] o.a.s.c.ZkController waiting to find shard id in clusterstate for collection1
   [junit4]   2> 985410 INFO  (coreLoadExecutor-2410-thread-1-processing-n:127.0.0.1:54057_) [n:127.0.0.1:54057_ c:collection1   x:collection1] o.a.s.c.ZkController Check for collection zkNode:collection1
   [junit4]   2> 985410 INFO  (coreLoadExecutor-2410-thread-1-processing-n:127.0.0.1:54057_) [n:127.0.0.1:54057_ c:collection1   x:collection1] o.a.s.c.ZkController Collection zkNode exists
   [junit4]   2> 985411 INFO  (coreLoadExecutor-2410-thread-1-processing-n:127.0.0.1:54

[...truncated too long message...]

DE77AD4D]) [    x:collection1] o.a.s.c.CachingDirectoryFactory Closing directory: /x1/jenkins/jenkins-slave/workspace/Lucene-Solr-Tests-trunk-Java8/solr/build/solr-core/test/J1/temp/solr.handler.TestReplicationHandler_C42F9429DE77AD4D-001/solr-instance-026/./collection1/data/index
   [junit4]   2> 1248049 INFO  (TEST-TestReplicationHandler.doTestDetails-seed#[C42F9429DE77AD4D]) [    x:collection1] o.a.s.c.CachingDirectoryFactory looking to close /x1/jenkins/jenkins-slave/workspace/Lucene-Solr-Tests-trunk-Java8/solr/build/solr-core/test/J1/temp/solr.handler.TestReplicationHandler_C42F9429DE77AD4D-001/solr-instance-026/./collection1/data [CachedDir<<refCount=0;path=/x1/jenkins/jenkins-slave/workspace/Lucene-Solr-Tests-trunk-Java8/solr/build/solr-core/test/J1/temp/solr.handler.TestReplicationHandler_C42F9429DE77AD4D-001/solr-instance-026/./collection1/data;done=false>>]
   [junit4]   2> 1248049 INFO  (TEST-TestReplicationHandler.doTestDetails-seed#[C42F9429DE77AD4D]) [    x:collection1] o.a.s.c.CachingDirectoryFactory Closing directory: /x1/jenkins/jenkins-slave/workspace/Lucene-Solr-Tests-trunk-Java8/solr/build/solr-core/test/J1/temp/solr.handler.TestReplicationHandler_C42F9429DE77AD4D-001/solr-instance-026/./collection1/data
   [junit4]   2> 1248049 INFO  (TEST-TestReplicationHandler.doTestDetails-seed#[C42F9429DE77AD4D]) [    x:collection1] o.e.j.s.h.ContextHandler Stopped o.e.j.s.ServletContextHandler@6fb27b89{/solr,null,UNAVAILABLE}
   [junit4]   2> 1248051 INFO  (TEST-TestReplicationHandler.doTestDetails-seed#[C42F9429DE77AD4D]) [    ] o.e.j.s.ServerConnector Stopped ServerConnector@461e6590{HTTP/1.1}{127.0.0.1:0}
   [junit4]   2> 1248051 INFO  (TEST-TestReplicationHandler.doTestDetails-seed#[C42F9429DE77AD4D]) [    ] o.a.s.c.CoreContainer Shutting down CoreContainer instance=2091193118
   [junit4]   2> 1248051 INFO  (TEST-TestReplicationHandler.doTestDetails-seed#[C42F9429DE77AD4D]) [    x:collection1] o.a.s.c.SolrCore [collection1]  CLOSING SolrCore org.apache.solr.core.SolrCore@1abc0e0b
   [junit4]   2> 1248052 INFO  (TEST-TestReplicationHandler.doTestDetails-seed#[C42F9429DE77AD4D]) [    x:collection1] o.a.s.u.UpdateHandler closing DirectUpdateHandler2{commits=0,autocommits=0,soft autocommits=0,optimizes=0,rollbacks=0,expungeDeletes=0,docsPending=0,adds=0,deletesById=0,deletesByQuery=0,errors=0,cumulative_adds=0,cumulative_deletesById=0,cumulative_deletesByQuery=0,cumulative_errors=0}
   [junit4]   2> 1248052 INFO  (TEST-TestReplicationHandler.doTestDetails-seed#[C42F9429DE77AD4D]) [    x:collection1] o.a.s.u.SolrCoreState Closing SolrCoreState
   [junit4]   2> 1248052 INFO  (TEST-TestReplicationHandler.doTestDetails-seed#[C42F9429DE77AD4D]) [    x:collection1] o.a.s.u.DefaultSolrCoreState SolrCoreState ref count has reached 0 - closing IndexWriter
   [junit4]   2> 1248052 INFO  (TEST-TestReplicationHandler.doTestDetails-seed#[C42F9429DE77AD4D]) [    x:collection1] o.a.s.u.DefaultSolrCoreState closing IndexWriter with IndexWriterCloser
   [junit4]   2> 1248053 INFO  (TEST-TestReplicationHandler.doTestDetails-seed#[C42F9429DE77AD4D]) [    x:collection1] o.a.s.c.SolrCore [collection1] Closing main searcher on request.
   [junit4]   2> 1248053 INFO  (TEST-TestReplicationHandler.doTestDetails-seed#[C42F9429DE77AD4D]) [    x:collection1] o.a.s.c.CachingDirectoryFactory Closing MockDirectoryFactory - 2 directories currently being tracked
   [junit4]   2> 1248053 INFO  (TEST-TestReplicationHandler.doTestDetails-seed#[C42F9429DE77AD4D]) [    x:collection1] o.a.s.c.CachingDirectoryFactory looking to close /x1/jenkins/jenkins-slave/workspace/Lucene-Solr-Tests-trunk-Java8/solr/build/solr-core/test/J1/temp/solr.handler.TestReplicationHandler_C42F9429DE77AD4D-001/solr-instance-027/./collection1/data/index [CachedDir<<refCount=0;path=/x1/jenkins/jenkins-slave/workspace/Lucene-Solr-Tests-trunk-Java8/solr/build/solr-core/test/J1/temp/solr.handler.TestReplicationHandler_C42F9429DE77AD4D-001/solr-instance-027/./collection1/data/index;done=false>>]
   [junit4]   2> 1248053 INFO  (TEST-TestReplicationHandler.doTestDetails-seed#[C42F9429DE77AD4D]) [    x:collection1] o.a.s.c.CachingDirectoryFactory Closing directory: /x1/jenkins/jenkins-slave/workspace/Lucene-Solr-Tests-trunk-Java8/solr/build/solr-core/test/J1/temp/solr.handler.TestReplicationHandler_C42F9429DE77AD4D-001/solr-instance-027/./collection1/data/index
   [junit4]   2> 1248054 INFO  (TEST-TestReplicationHandler.doTestDetails-seed#[C42F9429DE77AD4D]) [    x:collection1] o.a.s.c.CachingDirectoryFactory looking to close /x1/jenkins/jenkins-slave/workspace/Lucene-Solr-Tests-trunk-Java8/solr/build/solr-core/test/J1/temp/solr.handler.TestReplicationHandler_C42F9429DE77AD4D-001/solr-instance-027/./collection1/data [CachedDir<<refCount=0;path=/x1/jenkins/jenkins-slave/workspace/Lucene-Solr-Tests-trunk-Java8/solr/build/solr-core/test/J1/temp/solr.handler.TestReplicationHandler_C42F9429DE77AD4D-001/solr-instance-027/./collection1/data;done=false>>]
   [junit4]   2> 1248054 INFO  (TEST-TestReplicationHandler.doTestDetails-seed#[C42F9429DE77AD4D]) [    x:collection1] o.a.s.c.CachingDirectoryFactory Closing directory: /x1/jenkins/jenkins-slave/workspace/Lucene-Solr-Tests-trunk-Java8/solr/build/solr-core/test/J1/temp/solr.handler.TestReplicationHandler_C42F9429DE77AD4D-001/solr-instance-027/./collection1/data
   [junit4]   2> 1248055 INFO  (TEST-TestReplicationHandler.doTestDetails-seed#[C42F9429DE77AD4D]) [    x:collection1] o.e.j.s.h.ContextHandler Stopped o.e.j.s.ServletContextHandler@6f4edf83{/solr,null,UNAVAILABLE}
   [junit4]   2> 1248056 INFO  (SUITE-TestReplicationHandler-seed#[C42F9429DE77AD4D]-worker) [    ] o.a.s.SolrTestCaseJ4 ###deleteCore
   [junit4]   2> NOTE: leaving temporary files on disk at: /x1/jenkins/jenkins-slave/workspace/Lucene-Solr-Tests-trunk-Java8/solr/build/solr-core/test/J1/temp/solr.handler.TestReplicationHandler_C42F9429DE77AD4D-001
   [junit4]   2> NOTE: test params are: codec=Lucene53, sim=RandomSimilarityProvider(queryNorm=false,coord=no): {}, locale=sr_ME_#Latn, timezone=Pacific/Easter
   [junit4]   2> NOTE: Linux 3.13.0-52-generic amd64/Oracle Corporation 1.8.0_45 (64-bit)/cpus=4,threads=1,free=167735296,total=525860864
   [junit4]   2> NOTE: All tests run in this JVM: [TestObjectReleaseTracker, TestFieldCollectionResource, TestBlendedInfixSuggestions, ClusterStateUpdateTest, OutOfBoxZkACLAndCredentialsProvidersTest, AliasIntegrationTest, TestAddFieldRealTimeGet, DisMaxRequestHandlerTest, DeleteShardTest, AnalysisAfterCoreReloadTest, TestCollectionAPI, TestStressUserVersions, SystemInfoHandlerTest, SolrXmlInZkTest, CachingDirectoryFactoryTest, ShardRoutingCustomTest, SolrCmdDistributorTest, TestNRTOpen, BadComponentTest, OpenCloseCoreStressTest, DistribDocExpirationUpdateProcessorTest, CopyFieldTest, SegmentsInfoRequestHandlerTest, TestSearchPerf, TestSolrDynamicMBean, TestExpandComponent, TestMissingGroups, FacetPivotSmallTest, TestReRankQParserPlugin, TestComponentsName, MigrateRouteKeyTest, TestCharFilters, TestSimpleQParserPlugin, TestInitQParser, TestCollapseQParserPlugin, TestRTimerTree, BasicFunctionalityTest, TestAnalyzedSuggestions, ChaosMonkeySafeLeaderTest, TestSolrDeletionPolicy2, ShardSplitTest, SpellPossibilityIteratorTest, TestCoreDiscovery, TestWriterPerf, TestStressVersions, TestAtomicUpdateErrorCases, FieldAnalysisRequestHandlerTest, DistributedMLTComponentTest, SecurityConfHandlerTest, DistributedTermsComponentTest, MultiThreadedOCPTest, BlockDirectoryTest, DocValuesMultiTest, SolrTestCaseJ4Test, TestSchemaManager, TestManagedSynonymFilterFactory, TestReloadDeadlock, RemoteQueryErrorTest, ShowFileRequestHandlerTest, TestSolrCloudWithKerberosAlt, TestRTGBase, HdfsChaosMonkeySafeLeaderTest, NoCacheHeaderTest, UUIDUpdateProcessorFallbackTest, TestExceedMaxTermLength, DistribCursorPagingTest, TestSolrConfigHandlerConcurrent, SolrCloudExampleTest, TestConfigSets, ShardRoutingTest, EchoParamsTest, TestDistributedGrouping, ZkControllerTest, ConcurrentDeleteAndCreateCollectionTest, SpatialFilterTest, ResourceLoaderTest, TestFuzzyAnalyzedSuggestions, TestHighFrequencyDictionaryFactory, FieldMutatingUpdateProcessorTest, HLLUtilTest, TestPHPSerializedResponseWriter, TestFiltering, IndexSchemaRuntimeFieldTest, ConvertedLegacyTest, JsonLoaderTest, TestSortByMinMaxFunction, DistributedExpandComponentTest, TestElisionMultitermQuery, TestLFUCache, OverseerTest, BasicZkTest, RecoveryZkTest, TestReplicationHandler]
   [junit4] Completed [279/540] on J1 in 82.17s, 13 tests, 1 failure <<< FAILURES!

[...truncated 819 lines...]
BUILD FAILED
/x1/jenkins/jenkins-slave/workspace/Lucene-Solr-Tests-trunk-Java8/build.xml:775: The following error occurred while executing this line:
/x1/jenkins/jenkins-slave/workspace/Lucene-Solr-Tests-trunk-Java8/build.xml:719: The following error occurred while executing this line:
/x1/jenkins/jenkins-slave/workspace/Lucene-Solr-Tests-trunk-Java8/build.xml:59: The following error occurred while executing this line:
/x1/jenkins/jenkins-slave/workspace/Lucene-Solr-Tests-trunk-Java8/solr/build.xml:233: The following error occurred while executing this line:
/x1/jenkins/jenkins-slave/workspace/Lucene-Solr-Tests-trunk-Java8/solr/common-build.xml:514: The following error occurred while executing this line:
/x1/jenkins/jenkins-slave/workspace/Lucene-Solr-Tests-trunk-Java8/lucene/common-build.xml:1431: The following error occurred while executing this line:
/x1/jenkins/jenkins-slave/workspace/Lucene-Solr-Tests-trunk-Java8/lucene/common-build.xml:986: There were test failures: 540 suites, 2131 tests, 2 failures, 44 ignored (32 assumptions)

Total time: 76 minutes 45 seconds
Build step 'Invoke Ant' marked build as failure
Archiving artifacts
Sending artifact delta relative to Lucene-Solr-Tests-trunk-Java8 #294
Archived 4 artifacts
Archive block size is 32768
Received 0 blocks and 290282698 bytes
Compression is 0.0%
Took 2 min 13 sec
Recording test results
Email was triggered for: Failure
Sending email for trigger: Failure



Mime
View raw message