lucene-dev mailing list archives

Site index · List index
Message view « Date » · « Thread »
Top « Date » · « Thread »
From Policeman Jenkins Server <jenk...@thetaphi.de>
Subject [JENKINS] Lucene-Solr-5.x-Windows (32bit/jdk1.7.0_80) - Build # 4966 - Still Failing!
Date Sun, 02 Aug 2015 05:53:02 GMT
Build: http://jenkins.thetaphi.de/job/Lucene-Solr-5.x-Windows/4966/
Java: 32bit/jdk1.7.0_80 -server -XX:+UseConcMarkSweepGC

4 tests failed.
FAILED:  junit.framework.TestSuite.org.apache.solr.cloud.SolrCloudExampleTest

Error Message:
ERROR: SolrIndexSearcher opens=22 closes=21

Stack Trace:
java.lang.AssertionError: ERROR: SolrIndexSearcher opens=22 closes=21
	at __randomizedtesting.SeedInfo.seed([B8E94E767B6F8132]:0)
	at org.junit.Assert.fail(Assert.java:93)
	at org.apache.solr.SolrTestCaseJ4.endTrackingSearchers(SolrTestCaseJ4.java:472)
	at org.apache.solr.SolrTestCaseJ4.afterClass(SolrTestCaseJ4.java:238)
	at sun.reflect.GeneratedMethodAccessor47.invoke(Unknown Source)
	at sun.reflect.DelegatingMethodAccessorImpl.invoke(DelegatingMethodAccessorImpl.java:43)
	at java.lang.reflect.Method.invoke(Method.java:606)
	at com.carrotsearch.randomizedtesting.RandomizedRunner.invoke(RandomizedRunner.java:1627)
	at com.carrotsearch.randomizedtesting.RandomizedRunner$5.evaluate(RandomizedRunner.java:799)
	at com.carrotsearch.randomizedtesting.rules.StatementAdapter.evaluate(StatementAdapter.java:36)
	at com.carrotsearch.randomizedtesting.rules.SystemPropertiesRestoreRule$1.evaluate(SystemPropertiesRestoreRule.java:57)
	at org.apache.lucene.util.AbstractBeforeAfterRule$1.evaluate(AbstractBeforeAfterRule.java:46)
	at com.carrotsearch.randomizedtesting.rules.StatementAdapter.evaluate(StatementAdapter.java:36)
	at org.apache.lucene.util.TestRuleStoreClassName$1.evaluate(TestRuleStoreClassName.java:42)
	at com.carrotsearch.randomizedtesting.rules.NoShadowingOrOverridesOnMethodsRule$1.evaluate(NoShadowingOrOverridesOnMethodsRule.java:39)
	at com.carrotsearch.randomizedtesting.rules.NoShadowingOrOverridesOnMethodsRule$1.evaluate(NoShadowingOrOverridesOnMethodsRule.java:39)
	at com.carrotsearch.randomizedtesting.rules.StatementAdapter.evaluate(StatementAdapter.java:36)
	at com.carrotsearch.randomizedtesting.rules.StatementAdapter.evaluate(StatementAdapter.java:36)
	at com.carrotsearch.randomizedtesting.rules.StatementAdapter.evaluate(StatementAdapter.java:36)
	at org.apache.lucene.util.TestRuleAssertionsRequired$1.evaluate(TestRuleAssertionsRequired.java:54)
	at org.apache.lucene.util.TestRuleMarkFailure$1.evaluate(TestRuleMarkFailure.java:48)
	at org.apache.lucene.util.TestRuleIgnoreAfterMaxFailures$1.evaluate(TestRuleIgnoreAfterMaxFailures.java:65)
	at org.apache.lucene.util.TestRuleIgnoreTestSuites$1.evaluate(TestRuleIgnoreTestSuites.java:55)
	at com.carrotsearch.randomizedtesting.rules.StatementAdapter.evaluate(StatementAdapter.java:36)
	at com.carrotsearch.randomizedtesting.ThreadLeakControl$StatementRunner.run(ThreadLeakControl.java:365)
	at java.lang.Thread.run(Thread.java:745)


FAILED:  junit.framework.TestSuite.org.apache.solr.cloud.SolrCloudExampleTest

Error Message:
Could not remove the following files (in the order of attempts):    C:\Users\JenkinsSlave\workspace\Lucene-Solr-5.x-Windows\solr\build\solr-core\test\J0\temp\solr.cloud.SolrCloudExampleTest_B8E94E767B6F8132-001\shard-3-001\cores\gettingstarted_shard2_replica1\data\tlog\tlog.0000000000000000001: java.nio.file.FileSystemException: C:\Users\JenkinsSlave\workspace\Lucene-Solr-5.x-Windows\solr\build\solr-core\test\J0\temp\solr.cloud.SolrCloudExampleTest_B8E94E767B6F8132-001\shard-3-001\cores\gettingstarted_shard2_replica1\data\tlog\tlog.0000000000000000001: The process cannot access the file because it is being used by another process.     C:\Users\JenkinsSlave\workspace\Lucene-Solr-5.x-Windows\solr\build\solr-core\test\J0\temp\solr.cloud.SolrCloudExampleTest_B8E94E767B6F8132-001\shard-3-001\cores\gettingstarted_shard2_replica1\data\tlog: java.nio.file.DirectoryNotEmptyException: C:\Users\JenkinsSlave\workspace\Lucene-Solr-5.x-Windows\solr\build\solr-core\test\J0\temp\solr.cloud.SolrCloudExampleTest_B8E94E767B6F8132-001\shard-3-001\cores\gettingstarted_shard2_replica1\data\tlog    C:\Users\JenkinsSlave\workspace\Lucene-Solr-5.x-Windows\solr\build\solr-core\test\J0\temp\solr.cloud.SolrCloudExampleTest_B8E94E767B6F8132-001\shard-3-001\cores\gettingstarted_shard2_replica1\data: java.nio.file.DirectoryNotEmptyException: C:\Users\JenkinsSlave\workspace\Lucene-Solr-5.x-Windows\solr\build\solr-core\test\J0\temp\solr.cloud.SolrCloudExampleTest_B8E94E767B6F8132-001\shard-3-001\cores\gettingstarted_shard2_replica1\data    C:\Users\JenkinsSlave\workspace\Lucene-Solr-5.x-Windows\solr\build\solr-core\test\J0\temp\solr.cloud.SolrCloudExampleTest_B8E94E767B6F8132-001\shard-3-001\cores\gettingstarted_shard2_replica1: java.nio.file.DirectoryNotEmptyException: C:\Users\JenkinsSlave\workspace\Lucene-Solr-5.x-Windows\solr\build\solr-core\test\J0\temp\solr.cloud.SolrCloudExampleTest_B8E94E767B6F8132-001\shard-3-001\cores\gettingstarted_shard2_replica1    C:\Users\JenkinsSlave\workspace\Lucene-Solr-5.x-Windows\solr\build\solr-core\test\J0\temp\solr.cloud.SolrCloudExampleTest_B8E94E767B6F8132-001\shard-3-001\cores: java.nio.file.DirectoryNotEmptyException: C:\Users\JenkinsSlave\workspace\Lucene-Solr-5.x-Windows\solr\build\solr-core\test\J0\temp\solr.cloud.SolrCloudExampleTest_B8E94E767B6F8132-001\shard-3-001\cores    C:\Users\JenkinsSlave\workspace\Lucene-Solr-5.x-Windows\solr\build\solr-core\test\J0\temp\solr.cloud.SolrCloudExampleTest_B8E94E767B6F8132-001\shard-3-001: java.nio.file.DirectoryNotEmptyException: C:\Users\JenkinsSlave\workspace\Lucene-Solr-5.x-Windows\solr\build\solr-core\test\J0\temp\solr.cloud.SolrCloudExampleTest_B8E94E767B6F8132-001\shard-3-001    C:\Users\JenkinsSlave\workspace\Lucene-Solr-5.x-Windows\solr\build\solr-core\test\J0\temp\solr.cloud.SolrCloudExampleTest_B8E94E767B6F8132-001: java.nio.file.DirectoryNotEmptyException: C:\Users\JenkinsSlave\workspace\Lucene-Solr-5.x-Windows\solr\build\solr-core\test\J0\temp\solr.cloud.SolrCloudExampleTest_B8E94E767B6F8132-001 

Stack Trace:
java.io.IOException: Could not remove the following files (in the order of attempts):
   C:\Users\JenkinsSlave\workspace\Lucene-Solr-5.x-Windows\solr\build\solr-core\test\J0\temp\solr.cloud.SolrCloudExampleTest_B8E94E767B6F8132-001\shard-3-001\cores\gettingstarted_shard2_replica1\data\tlog\tlog.0000000000000000001: java.nio.file.FileSystemException: C:\Users\JenkinsSlave\workspace\Lucene-Solr-5.x-Windows\solr\build\solr-core\test\J0\temp\solr.cloud.SolrCloudExampleTest_B8E94E767B6F8132-001\shard-3-001\cores\gettingstarted_shard2_replica1\data\tlog\tlog.0000000000000000001: The process cannot access the file because it is being used by another process.

   C:\Users\JenkinsSlave\workspace\Lucene-Solr-5.x-Windows\solr\build\solr-core\test\J0\temp\solr.cloud.SolrCloudExampleTest_B8E94E767B6F8132-001\shard-3-001\cores\gettingstarted_shard2_replica1\data\tlog: java.nio.file.DirectoryNotEmptyException: C:\Users\JenkinsSlave\workspace\Lucene-Solr-5.x-Windows\solr\build\solr-core\test\J0\temp\solr.cloud.SolrCloudExampleTest_B8E94E767B6F8132-001\shard-3-001\cores\gettingstarted_shard2_replica1\data\tlog
   C:\Users\JenkinsSlave\workspace\Lucene-Solr-5.x-Windows\solr\build\solr-core\test\J0\temp\solr.cloud.SolrCloudExampleTest_B8E94E767B6F8132-001\shard-3-001\cores\gettingstarted_shard2_replica1\data: java.nio.file.DirectoryNotEmptyException: C:\Users\JenkinsSlave\workspace\Lucene-Solr-5.x-Windows\solr\build\solr-core\test\J0\temp\solr.cloud.SolrCloudExampleTest_B8E94E767B6F8132-001\shard-3-001\cores\gettingstarted_shard2_replica1\data
   C:\Users\JenkinsSlave\workspace\Lucene-Solr-5.x-Windows\solr\build\solr-core\test\J0\temp\solr.cloud.SolrCloudExampleTest_B8E94E767B6F8132-001\shard-3-001\cores\gettingstarted_shard2_replica1: java.nio.file.DirectoryNotEmptyException: C:\Users\JenkinsSlave\workspace\Lucene-Solr-5.x-Windows\solr\build\solr-core\test\J0\temp\solr.cloud.SolrCloudExampleTest_B8E94E767B6F8132-001\shard-3-001\cores\gettingstarted_shard2_replica1
   C:\Users\JenkinsSlave\workspace\Lucene-Solr-5.x-Windows\solr\build\solr-core\test\J0\temp\solr.cloud.SolrCloudExampleTest_B8E94E767B6F8132-001\shard-3-001\cores: java.nio.file.DirectoryNotEmptyException: C:\Users\JenkinsSlave\workspace\Lucene-Solr-5.x-Windows\solr\build\solr-core\test\J0\temp\solr.cloud.SolrCloudExampleTest_B8E94E767B6F8132-001\shard-3-001\cores
   C:\Users\JenkinsSlave\workspace\Lucene-Solr-5.x-Windows\solr\build\solr-core\test\J0\temp\solr.cloud.SolrCloudExampleTest_B8E94E767B6F8132-001\shard-3-001: java.nio.file.DirectoryNotEmptyException: C:\Users\JenkinsSlave\workspace\Lucene-Solr-5.x-Windows\solr\build\solr-core\test\J0\temp\solr.cloud.SolrCloudExampleTest_B8E94E767B6F8132-001\shard-3-001
   C:\Users\JenkinsSlave\workspace\Lucene-Solr-5.x-Windows\solr\build\solr-core\test\J0\temp\solr.cloud.SolrCloudExampleTest_B8E94E767B6F8132-001: java.nio.file.DirectoryNotEmptyException: C:\Users\JenkinsSlave\workspace\Lucene-Solr-5.x-Windows\solr\build\solr-core\test\J0\temp\solr.cloud.SolrCloudExampleTest_B8E94E767B6F8132-001

	at org.apache.lucene.util.IOUtils.rm(IOUtils.java:295)
	at org.apache.lucene.util.TestRuleTemporaryFilesCleanup.afterAlways(TestRuleTemporaryFilesCleanup.java:215)
	at com.carrotsearch.randomizedtesting.rules.TestRuleAdapter$1.afterAlways(TestRuleAdapter.java:31)
	at com.carrotsearch.randomizedtesting.rules.StatementAdapter.evaluate(StatementAdapter.java:43)
	at com.carrotsearch.randomizedtesting.rules.StatementAdapter.evaluate(StatementAdapter.java:36)
	at org.apache.lucene.util.TestRuleAssertionsRequired$1.evaluate(TestRuleAssertionsRequired.java:54)
	at org.apache.lucene.util.TestRuleMarkFailure$1.evaluate(TestRuleMarkFailure.java:48)
	at org.apache.lucene.util.TestRuleIgnoreAfterMaxFailures$1.evaluate(TestRuleIgnoreAfterMaxFailures.java:65)
	at org.apache.lucene.util.TestRuleIgnoreTestSuites$1.evaluate(TestRuleIgnoreTestSuites.java:55)
	at com.carrotsearch.randomizedtesting.rules.StatementAdapter.evaluate(StatementAdapter.java:36)
	at com.carrotsearch.randomizedtesting.ThreadLeakControl$StatementRunner.run(ThreadLeakControl.java:365)
	at java.lang.Thread.run(Thread.java:745)


FAILED:  junit.framework.TestSuite.org.apache.solr.cloud.SolrCloudExampleTest

Error Message:
1 thread leaked from SUITE scope at org.apache.solr.cloud.SolrCloudExampleTest:     1) Thread[id=15138, name=searcherExecutor-6551-thread-1, state=WAITING, group=TGRP-SolrCloudExampleTest]         at sun.misc.Unsafe.park(Native Method)         at java.util.concurrent.locks.LockSupport.park(LockSupport.java:186)         at java.util.concurrent.locks.AbstractQueuedSynchronizer$ConditionObject.await(AbstractQueuedSynchronizer.java:2043)         at java.util.concurrent.LinkedBlockingQueue.take(LinkedBlockingQueue.java:442)         at java.util.concurrent.ThreadPoolExecutor.getTask(ThreadPoolExecutor.java:1068)         at java.util.concurrent.ThreadPoolExecutor.runWorker(ThreadPoolExecutor.java:1130)         at java.util.concurrent.ThreadPoolExecutor$Worker.run(ThreadPoolExecutor.java:615)         at java.lang.Thread.run(Thread.java:745)

Stack Trace:
com.carrotsearch.randomizedtesting.ThreadLeakError: 1 thread leaked from SUITE scope at org.apache.solr.cloud.SolrCloudExampleTest: 
   1) Thread[id=15138, name=searcherExecutor-6551-thread-1, state=WAITING, group=TGRP-SolrCloudExampleTest]
        at sun.misc.Unsafe.park(Native Method)
        at java.util.concurrent.locks.LockSupport.park(LockSupport.java:186)
        at java.util.concurrent.locks.AbstractQueuedSynchronizer$ConditionObject.await(AbstractQueuedSynchronizer.java:2043)
        at java.util.concurrent.LinkedBlockingQueue.take(LinkedBlockingQueue.java:442)
        at java.util.concurrent.ThreadPoolExecutor.getTask(ThreadPoolExecutor.java:1068)
        at java.util.concurrent.ThreadPoolExecutor.runWorker(ThreadPoolExecutor.java:1130)
        at java.util.concurrent.ThreadPoolExecutor$Worker.run(ThreadPoolExecutor.java:615)
        at java.lang.Thread.run(Thread.java:745)
	at __randomizedtesting.SeedInfo.seed([B8E94E767B6F8132]:0)


FAILED:  junit.framework.TestSuite.org.apache.solr.cloud.SolrCloudExampleTest

Error Message:
There are still zombie threads that couldn't be terminated:    1) Thread[id=15138, name=searcherExecutor-6551-thread-1, state=WAITING, group=TGRP-SolrCloudExampleTest]         at sun.misc.Unsafe.park(Native Method)         at java.util.concurrent.locks.LockSupport.park(LockSupport.java:186)         at java.util.concurrent.locks.AbstractQueuedSynchronizer$ConditionObject.await(AbstractQueuedSynchronizer.java:2043)         at java.util.concurrent.LinkedBlockingQueue.take(LinkedBlockingQueue.java:442)         at java.util.concurrent.ThreadPoolExecutor.getTask(ThreadPoolExecutor.java:1068)         at java.util.concurrent.ThreadPoolExecutor.runWorker(ThreadPoolExecutor.java:1130)         at java.util.concurrent.ThreadPoolExecutor$Worker.run(ThreadPoolExecutor.java:615)         at java.lang.Thread.run(Thread.java:745)

Stack Trace:
com.carrotsearch.randomizedtesting.ThreadLeakError: There are still zombie threads that couldn't be terminated:
   1) Thread[id=15138, name=searcherExecutor-6551-thread-1, state=WAITING, group=TGRP-SolrCloudExampleTest]
        at sun.misc.Unsafe.park(Native Method)
        at java.util.concurrent.locks.LockSupport.park(LockSupport.java:186)
        at java.util.concurrent.locks.AbstractQueuedSynchronizer$ConditionObject.await(AbstractQueuedSynchronizer.java:2043)
        at java.util.concurrent.LinkedBlockingQueue.take(LinkedBlockingQueue.java:442)
        at java.util.concurrent.ThreadPoolExecutor.getTask(ThreadPoolExecutor.java:1068)
        at java.util.concurrent.ThreadPoolExecutor.runWorker(ThreadPoolExecutor.java:1130)
        at java.util.concurrent.ThreadPoolExecutor$Worker.run(ThreadPoolExecutor.java:615)
        at java.lang.Thread.run(Thread.java:745)
	at __randomizedtesting.SeedInfo.seed([B8E94E767B6F8132]:0)




Build Log:
[...truncated 11208 lines...]
   [junit4] Suite: org.apache.solr.cloud.SolrCloudExampleTest
   [junit4]   2> Creating dataDir: C:\Users\JenkinsSlave\workspace\Lucene-Solr-5.x-Windows\solr\build\solr-core\test\J0\temp\solr.cloud.SolrCloudExampleTest_B8E94E767B6F8132-001\init-core-data-001
   [junit4]   2> 2677535 INFO  (SUITE-SolrCloudExampleTest-seed#[B8E94E767B6F8132]-worker) [    ] o.a.s.SolrTestCaseJ4 Randomized ssl (false) and clientAuth (true)
   [junit4]   2> 2677535 INFO  (SUITE-SolrCloudExampleTest-seed#[B8E94E767B6F8132]-worker) [    ] o.a.s.BaseDistributedSearchTestCase Setting hostContext system property: /aei/fr
   [junit4]   2> 2677541 INFO  (TEST-SolrCloudExampleTest.testLoadDocsIntoGettingStartedCollection-seed#[B8E94E767B6F8132]) [    ] o.a.s.c.ZkTestServer STARTING ZK TEST SERVER
   [junit4]   2> 2677541 INFO  (Thread-5597) [    ] o.a.s.c.ZkTestServer client port:0.0.0.0/0.0.0.0:0
   [junit4]   2> 2677541 INFO  (Thread-5597) [    ] o.a.s.c.ZkTestServer Starting server
   [junit4]   2> 2677651 INFO  (TEST-SolrCloudExampleTest.testLoadDocsIntoGettingStartedCollection-seed#[B8E94E767B6F8132]) [    ] o.a.s.c.ZkTestServer start zk server on port:59537
   [junit4]   2> 2677651 INFO  (TEST-SolrCloudExampleTest.testLoadDocsIntoGettingStartedCollection-seed#[B8E94E767B6F8132]) [    ] o.a.s.c.c.SolrZkClient Using default ZkCredentialsProvider
   [junit4]   2> 2677652 INFO  (TEST-SolrCloudExampleTest.testLoadDocsIntoGettingStartedCollection-seed#[B8E94E767B6F8132]) [    ] o.a.s.c.c.ConnectionManager Waiting for client to connect to ZooKeeper
   [junit4]   2> 2677656 INFO  (zkCallback-2284-thread-1) [    ] o.a.s.c.c.ConnectionManager Watcher org.apache.solr.common.cloud.ConnectionManager@1e04fcc name:ZooKeeperConnection Watcher:127.0.0.1:59537 got event WatchedEvent state:SyncConnected type:None path:null path:null type:None
   [junit4]   2> 2677657 INFO  (TEST-SolrCloudExampleTest.testLoadDocsIntoGettingStartedCollection-seed#[B8E94E767B6F8132]) [    ] o.a.s.c.c.ConnectionManager Client is connected to ZooKeeper
   [junit4]   2> 2677657 INFO  (TEST-SolrCloudExampleTest.testLoadDocsIntoGettingStartedCollection-seed#[B8E94E767B6F8132]) [    ] o.a.s.c.c.SolrZkClient Using default ZkACLProvider
   [junit4]   2> 2677657 INFO  (TEST-SolrCloudExampleTest.testLoadDocsIntoGettingStartedCollection-seed#[B8E94E767B6F8132]) [    ] o.a.s.c.c.SolrZkClient makePath: /solr
   [junit4]   2> 2677660 INFO  (TEST-SolrCloudExampleTest.testLoadDocsIntoGettingStartedCollection-seed#[B8E94E767B6F8132]) [    ] o.a.s.c.c.SolrZkClient Using default ZkCredentialsProvider
   [junit4]   2> 2677662 INFO  (TEST-SolrCloudExampleTest.testLoadDocsIntoGettingStartedCollection-seed#[B8E94E767B6F8132]) [    ] o.a.s.c.c.ConnectionManager Waiting for client to connect to ZooKeeper
   [junit4]   2> 2677663 INFO  (zkCallback-2285-thread-1) [    ] o.a.s.c.c.ConnectionManager Watcher org.apache.solr.common.cloud.ConnectionManager@7363d2 name:ZooKeeperConnection Watcher:127.0.0.1:59537/solr got event WatchedEvent state:SyncConnected type:None path:null path:null type:None
   [junit4]   2> 2677663 INFO  (TEST-SolrCloudExampleTest.testLoadDocsIntoGettingStartedCollection-seed#[B8E94E767B6F8132]) [    ] o.a.s.c.c.ConnectionManager Client is connected to ZooKeeper
   [junit4]   2> 2677664 INFO  (TEST-SolrCloudExampleTest.testLoadDocsIntoGettingStartedCollection-seed#[B8E94E767B6F8132]) [    ] o.a.s.c.c.SolrZkClient Using default ZkACLProvider
   [junit4]   2> 2677664 INFO  (TEST-SolrCloudExampleTest.testLoadDocsIntoGettingStartedCollection-seed#[B8E94E767B6F8132]) [    ] o.a.s.c.c.SolrZkClient makePath: /collections/collection1
   [junit4]   2> 2677667 INFO  (TEST-SolrCloudExampleTest.testLoadDocsIntoGettingStartedCollection-seed#[B8E94E767B6F8132]) [    ] o.a.s.c.c.SolrZkClient makePath: /collections/collection1/shards
   [junit4]   2> 2677670 INFO  (TEST-SolrCloudExampleTest.testLoadDocsIntoGettingStartedCollection-seed#[B8E94E767B6F8132]) [    ] o.a.s.c.c.SolrZkClient makePath: /collections/control_collection
   [junit4]   2> 2677672 INFO  (TEST-SolrCloudExampleTest.testLoadDocsIntoGettingStartedCollection-seed#[B8E94E767B6F8132]) [    ] o.a.s.c.c.SolrZkClient makePath: /collections/control_collection/shards
   [junit4]   2> 2677674 INFO  (TEST-SolrCloudExampleTest.testLoadDocsIntoGettingStartedCollection-seed#[B8E94E767B6F8132]) [    ] o.a.s.c.AbstractZkTestCase put C:\Users\JenkinsSlave\workspace\Lucene-Solr-5.x-Windows\solr\core\src\test-files\solr\collection1\conf\solrconfig-tlog.xml to /configs/conf1/solrconfig.xml
   [junit4]   2> 2677674 INFO  (TEST-SolrCloudExampleTest.testLoadDocsIntoGettingStartedCollection-seed#[B8E94E767B6F8132]) [    ] o.a.s.c.c.SolrZkClient makePath: /configs/conf1/solrconfig.xml
   [junit4]   2> 2677677 INFO  (TEST-SolrCloudExampleTest.testLoadDocsIntoGettingStartedCollection-seed#[B8E94E767B6F8132]) [    ] o.a.s.c.AbstractZkTestCase put C:\Users\JenkinsSlave\workspace\Lucene-Solr-5.x-Windows\solr\core\src\test-files\solr\collection1\conf\schema.xml to /configs/conf1/schema.xml
   [junit4]   2> 2677678 INFO  (TEST-SolrCloudExampleTest.testLoadDocsIntoGettingStartedCollection-seed#[B8E94E767B6F8132]) [    ] o.a.s.c.c.SolrZkClient makePath: /configs/conf1/schema.xml
   [junit4]   2> 2677681 INFO  (TEST-SolrCloudExampleTest.testLoadDocsIntoGettingStartedCollection-seed#[B8E94E767B6F8132]) [    ] o.a.s.c.AbstractZkTestCase put C:\Users\JenkinsSlave\workspace\Lucene-Solr-5.x-Windows\solr\core\src\test-files\solr\collection1\conf\solrconfig.snippet.randomindexconfig.xml to /configs/conf1/solrconfig.snippet.randomindexconfig.xml
   [junit4]   2> 2677682 INFO  (TEST-SolrCloudExampleTest.testLoadDocsIntoGettingStartedCollection-seed#[B8E94E767B6F8132]) [    ] o.a.s.c.c.SolrZkClient makePath: /configs/conf1/solrconfig.snippet.randomindexconfig.xml
   [junit4]   2> 2677686 INFO  (TEST-SolrCloudExampleTest.testLoadDocsIntoGettingStartedCollection-seed#[B8E94E767B6F8132]) [    ] o.a.s.c.AbstractZkTestCase put C:\Users\JenkinsSlave\workspace\Lucene-Solr-5.x-Windows\solr\core\src\test-files\solr\collection1\conf\stopwords.txt to /configs/conf1/stopwords.txt
   [junit4]   2> 2677687 INFO  (TEST-SolrCloudExampleTest.testLoadDocsIntoGettingStartedCollection-seed#[B8E94E767B6F8132]) [    ] o.a.s.c.c.SolrZkClient makePath: /configs/conf1/stopwords.txt
   [junit4]   2> 2677689 INFO  (TEST-SolrCloudExampleTest.testLoadDocsIntoGettingStartedCollection-seed#[B8E94E767B6F8132]) [    ] o.a.s.c.AbstractZkTestCase put C:\Users\JenkinsSlave\workspace\Lucene-Solr-5.x-Windows\solr\core\src\test-files\solr\collection1\conf\protwords.txt to /configs/conf1/protwords.txt
   [junit4]   2> 2677690 INFO  (TEST-SolrCloudExampleTest.testLoadDocsIntoGettingStartedCollection-seed#[B8E94E767B6F8132]) [    ] o.a.s.c.c.SolrZkClient makePath: /configs/conf1/protwords.txt
   [junit4]   2> 2677692 INFO  (TEST-SolrCloudExampleTest.testLoadDocsIntoGettingStartedCollection-seed#[B8E94E767B6F8132]) [    ] o.a.s.c.AbstractZkTestCase put C:\Users\JenkinsSlave\workspace\Lucene-Solr-5.x-Windows\solr\core\src\test-files\solr\collection1\conf\currency.xml to /configs/conf1/currency.xml
   [junit4]   2> 2677692 INFO  (TEST-SolrCloudExampleTest.testLoadDocsIntoGettingStartedCollection-seed#[B8E94E767B6F8132]) [    ] o.a.s.c.c.SolrZkClient makePath: /configs/conf1/currency.xml
   [junit4]   2> 2677695 INFO  (TEST-SolrCloudExampleTest.testLoadDocsIntoGettingStartedCollection-seed#[B8E94E767B6F8132]) [    ] o.a.s.c.AbstractZkTestCase put C:\Users\JenkinsSlave\workspace\Lucene-Solr-5.x-Windows\solr\core\src\test-files\solr\collection1\conf\enumsConfig.xml to /configs/conf1/enumsConfig.xml
   [junit4]   2> 2677695 INFO  (TEST-SolrCloudExampleTest.testLoadDocsIntoGettingStartedCollection-seed#[B8E94E767B6F8132]) [    ] o.a.s.c.c.SolrZkClient makePath: /configs/conf1/enumsConfig.xml
   [junit4]   2> 2677697 INFO  (TEST-SolrCloudExampleTest.testLoadDocsIntoGettingStartedCollection-seed#[B8E94E767B6F8132]) [    ] o.a.s.c.AbstractZkTestCase put C:\Users\JenkinsSlave\workspace\Lucene-Solr-5.x-Windows\solr\core\src\test-files\solr\collection1\conf\open-exchange-rates.json to /configs/conf1/open-exchange-rates.json
   [junit4]   2> 2677699 INFO  (TEST-SolrCloudExampleTest.testLoadDocsIntoGettingStartedCollection-seed#[B8E94E767B6F8132]) [    ] o.a.s.c.c.SolrZkClient makePath: /configs/conf1/open-exchange-rates.json
   [junit4]   2> 2677701 INFO  (TEST-SolrCloudExampleTest.testLoadDocsIntoGettingStartedCollection-seed#[B8E94E767B6F8132]) [    ] o.a.s.c.AbstractZkTestCase put C:\Users\JenkinsSlave\workspace\Lucene-Solr-5.x-Windows\solr\core\src\test-files\solr\collection1\conf\mapping-ISOLatin1Accent.txt to /configs/conf1/mapping-ISOLatin1Accent.txt
   [junit4]   2> 2677702 INFO  (TEST-SolrCloudExampleTest.testLoadDocsIntoGettingStartedCollection-seed#[B8E94E767B6F8132]) [    ] o.a.s.c.c.SolrZkClient makePath: /configs/conf1/mapping-ISOLatin1Accent.txt
   [junit4]   2> 2677705 INFO  (TEST-SolrCloudExampleTest.testLoadDocsIntoGettingStartedCollection-seed#[B8E94E767B6F8132]) [    ] o.a.s.c.AbstractZkTestCase put C:\Users\JenkinsSlave\workspace\Lucene-Solr-5.x-Windows\solr\core\src\test-files\solr\collection1\conf\old_synonyms.txt to /configs/conf1/old_synonyms.txt
   [junit4]   2> 2677705 INFO  (TEST-SolrCloudExampleTest.testLoadDocsIntoGettingStartedCollection-seed#[B8E94E767B6F8132]) [    ] o.a.s.c.c.SolrZkClient makePath: /configs/conf1/old_synonyms.txt
   [junit4]   2> 2677708 INFO  (TEST-SolrCloudExampleTest.testLoadDocsIntoGettingStartedCollection-seed#[B8E94E767B6F8132]) [    ] o.a.s.c.AbstractZkTestCase put C:\Users\JenkinsSlave\workspace\Lucene-Solr-5.x-Windows\solr\core\src\test-files\solr\collection1\conf\synonyms.txt to /configs/conf1/synonyms.txt
   [junit4]   2> 2677708 INFO  (TEST-SolrCloudExampleTest.testLoadDocsIntoGettingStartedCollection-seed#[B8E94E767B6F8132]) [    ] o.a.s.c.c.SolrZkClient makePath: /configs/conf1/synonyms.txt
   [junit4]   2> 2678095 INFO  (TEST-SolrCloudExampleTest.testLoadDocsIntoGettingStartedCollection-seed#[B8E94E767B6F8132]) [    ] o.a.s.SolrTestCaseJ4 Writing core.properties file to C:\Users\JenkinsSlave\workspace\Lucene-Solr-5.x-Windows\solr\build\solr-core\test\J0\temp\solr.cloud.SolrCloudExampleTest_B8E94E767B6F8132-001\control-001\cores\collection1
   [junit4]   2> 2678099 INFO  (TEST-SolrCloudExampleTest.testLoadDocsIntoGettingStartedCollection-seed#[B8E94E767B6F8132]) [    ] o.e.j.s.Server jetty-9.2.11.v20150529
   [junit4]   2> 2678101 INFO  (TEST-SolrCloudExampleTest.testLoadDocsIntoGettingStartedCollection-seed#[B8E94E767B6F8132]) [    ] o.e.j.s.h.ContextHandler Started o.e.j.s.ServletContextHandler@12379ff{/aei/fr,null,AVAILABLE}
   [junit4]   2> 2678102 INFO  (TEST-SolrCloudExampleTest.testLoadDocsIntoGettingStartedCollection-seed#[B8E94E767B6F8132]) [    ] o.e.j.s.ServerConnector Started ServerConnector@1e76c8{HTTP/1.1}{127.0.0.1:59544}
   [junit4]   2> 2678102 INFO  (TEST-SolrCloudExampleTest.testLoadDocsIntoGettingStartedCollection-seed#[B8E94E767B6F8132]) [    ] o.e.j.s.Server Started @2681441ms
   [junit4]   2> 2678102 INFO  (TEST-SolrCloudExampleTest.testLoadDocsIntoGettingStartedCollection-seed#[B8E94E767B6F8132]) [    ] o.a.s.c.s.e.JettySolrRunner Jetty properties: {coreRootDirectory=C:\Users\JenkinsSlave\workspace\Lucene-Solr-5.x-Windows\solr\build\solr-core\test\J0\..\..\..\..\..\..\..\..\..\Users\JenkinsSlave\workspace\Lucene-Solr-5.x-Windows\solr\build\solr-core\test\J0\temp\solr.cloud.SolrCloudExampleTest_B8E94E767B6F8132-001\control-001\cores, hostContext=/aei/fr, solr.data.dir=C:\Users\JenkinsSlave\workspace\Lucene-Solr-5.x-Windows\solr\build\solr-core\test\J0\temp\solr.cloud.SolrCloudExampleTest_B8E94E767B6F8132-001\tempDir-001/control/data, hostPort=59544}
   [junit4]   2> 2678104 INFO  (TEST-SolrCloudExampleTest.testLoadDocsIntoGettingStartedCollection-seed#[B8E94E767B6F8132]) [    ] o.a.s.s.SolrDispatchFilter SolrDispatchFilter.init(): sun.misc.Launcher$AppClassLoader@1ed7524
   [junit4]   2> 2678104 INFO  (TEST-SolrCloudExampleTest.testLoadDocsIntoGettingStartedCollection-seed#[B8E94E767B6F8132]) [    ] o.a.s.c.SolrResourceLoader new SolrResourceLoader for directory: 'C:\Users\JenkinsSlave\workspace\Lucene-Solr-5.x-Windows\solr\build\solr-core\test\J0\..\..\..\..\..\..\..\..\..\Users\JenkinsSlave\workspace\Lucene-Solr-5.x-Windows\solr\build\solr-core\test\J0\temp\solr.cloud.SolrCloudExampleTest_B8E94E767B6F8132-001\control-001\'
   [junit4]   2> 2678139 INFO  (TEST-SolrCloudExampleTest.testLoadDocsIntoGettingStartedCollection-seed#[B8E94E767B6F8132]) [    ] o.a.s.c.SolrXmlConfig Loading container configuration from C:\Users\JenkinsSlave\workspace\Lucene-Solr-5.x-Windows\solr\build\solr-core\test\J0\..\..\..\..\..\..\..\..\..\Users\JenkinsSlave\workspace\Lucene-Solr-5.x-Windows\solr\build\solr-core\test\J0\temp\solr.cloud.SolrCloudExampleTest_B8E94E767B6F8132-001\control-001\solr.xml
   [junit4]   2> 2678164 INFO  (TEST-SolrCloudExampleTest.testLoadDocsIntoGettingStartedCollection-seed#[B8E94E767B6F8132]) [    ] o.a.s.c.CoresLocator Config-defined core root directory: C:\Users\JenkinsSlave\workspace\Lucene-Solr-5.x-Windows\solr\build\solr-core\test\J0\..\..\..\..\..\..\..\..\..\Users\JenkinsSlave\workspace\Lucene-Solr-5.x-Windows\solr\build\solr-core\test\J0\temp\solr.cloud.SolrCloudExampleTest_B8E94E767B6F8132-001\control-001\cores
   [junit4]   2> 2678165 INFO  (TEST-SolrCloudExampleTest.testLoadDocsIntoGettingStartedCollection-seed#[B8E94E767B6F8132]) [    ] o.a.s.c.CoreContainer New CoreContainer 3075852
   [junit4]   2> 2678165 INFO  (TEST-SolrCloudExampleTest.testLoadDocsIntoGettingStartedCollection-seed#[B8E94E767B6F8132]) [    ] o.a.s.c.CoreContainer Loading cores into CoreContainer [instanceDir=C:\Users\JenkinsSlave\workspace\Lucene-Solr-5.x-Windows\solr\build\solr-core\test\J0\..\..\..\..\..\..\..\..\..\Users\JenkinsSlave\workspace\Lucene-Solr-5.x-Windows\solr\build\solr-core\test\J0\temp\solr.cloud.SolrCloudExampleTest_B8E94E767B6F8132-001\control-001\]
   [junit4]   2> 2678165 INFO  (TEST-SolrCloudExampleTest.testLoadDocsIntoGettingStartedCollection-seed#[B8E94E767B6F8132]) [    ] o.a.s.c.CoreContainer loading shared library: C:\Users\JenkinsSlave\workspace\Lucene-Solr-5.x-Windows\solr\build\solr-core\test\J0\..\..\..\..\..\..\..\..\..\Users\JenkinsSlave\workspace\Lucene-Solr-5.x-Windows\solr\build\solr-core\test\J0\temp\solr.cloud.SolrCloudExampleTest_B8E94E767B6F8132-001\control-001\lib
   [junit4]   2> 2678165 WARN  (TEST-SolrCloudExampleTest.testLoadDocsIntoGettingStartedCollection-seed#[B8E94E767B6F8132]) [    ] o.a.s.c.SolrResourceLoader Can't find (or read) directory to add to classloader: lib (resolved as: C:\Users\JenkinsSlave\workspace\Lucene-Solr-5.x-Windows\solr\build\solr-core\test\J0\..\..\..\..\..\..\..\..\..\Users\JenkinsSlave\workspace\Lucene-Solr-5.x-Windows\solr\build\solr-core\test\J0\temp\solr.cloud.SolrCloudExampleTest_B8E94E767B6F8132-001\control-001\lib).
   [junit4]   2> 2678174 INFO  (TEST-SolrCloudExampleTest.testLoadDocsIntoGettingStartedCollection-seed#[B8E94E767B6F8132]) [    ] o.a.s.h.c.HttpShardHandlerFactory created with socketTimeout : 90000,urlScheme : ,connTimeout : 15000,maxConnectionsPerHost : 20,maxConnections : 10000,corePoolSize : 0,maximumPoolSize : 2147483647,maxThreadIdleTime : 5,sizeOfQueue : -1,fairnessPolicy : false,useRetries : false,
   [junit4]   2> 2678177 INFO  (TEST-SolrCloudExampleTest.testLoadDocsIntoGettingStartedCollection-seed#[B8E94E767B6F8132]) [    ] o.a.s.u.UpdateShardHandler Creating UpdateShardHandler HTTP client with params: socketTimeout=340000&connTimeout=45000&retry=true
   [junit4]   2> 2678178 INFO  (TEST-SolrCloudExampleTest.testLoadDocsIntoGettingStartedCollection-seed#[B8E94E767B6F8132]) [    ] o.a.s.l.LogWatcher SLF4J impl is org.slf4j.impl.Log4jLoggerFactory
   [junit4]   2> 2678178 INFO  (TEST-SolrCloudExampleTest.testLoadDocsIntoGettingStartedCollection-seed#[B8E94E767B6F8132]) [    ] o.a.s.l.LogWatcher Registering Log Listener [Log4j (org.slf4j.impl.Log4jLoggerFactory)]
   [junit4]   2> 2678178 INFO  (TEST-SolrCloudExampleTest.testLoadDocsIntoGettingStartedCollection-seed#[B8E94E767B6F8132]) [    ] o.a.s.c.ZkContainer Zookeeper client=127.0.0.1:59537/solr
   [junit4]   2> 2678178 INFO  (TEST-SolrCloudExampleTest.testLoadDocsIntoGettingStartedCollection-seed#[B8E94E767B6F8132]) [    ] o.a.s.c.ZkController zkHost includes chroot
   [junit4]   2> 2678179 INFO  (TEST-SolrCloudExampleTest.testLoadDocsIntoGettingStartedCollection-seed#[B8E94E767B6F8132]) [    ] o.a.s.c.c.SolrZkClient Using default ZkCredentialsProvider
   [junit4]   2> 2678180 INFO  (TEST-SolrCloudExampleTest.testLoadDocsIntoGettingStartedCollection-seed#[B8E94E767B6F8132]) [    ] o.a.s.c.c.ConnectionManager Waiting for client to connect to ZooKeeper
   [junit4]   2> 2678181 INFO  (zkCallback-2287-thread-1) [    ] o.a.s.c.c.ConnectionManager Watcher org.apache.solr.common.cloud.ConnectionManager@9904b2 name:ZooKeeperConnection Watcher:127.0.0.1:59537 got event WatchedEvent state:SyncConnected type:None path:null path:null type:None
   [junit4]   2> 2678181 INFO  (TEST-SolrCloudExampleTest.testLoadDocsIntoGettingStartedCollection-seed#[B8E94E767B6F8132]) [    ] o.a.s.c.c.ConnectionManager Client is connected to ZooKeeper
   [junit4]   2> 2678182 INFO  (TEST-SolrCloudExampleTest.testLoadDocsIntoGettingStartedCollection-seed#[B8E94E767B6F8132]) [    ] o.a.s.c.c.SolrZkClient Using default ZkACLProvider
   [junit4]   2> 2678185 INFO  (TEST-SolrCloudExampleTest.testLoadDocsIntoGettingStartedCollection-seed#[B8E94E767B6F8132]) [n:127.0.0.1:59544_aei%2Ffr    ] o.a.s.c.c.ConnectionManager Waiting for client to connect to ZooKeeper
   [junit4]   2> 2678186 INFO  (zkCallback-2288-thread-1-processing-n:127.0.0.1:59544_aei%2Ffr) [n:127.0.0.1:59544_aei%2Ffr    ] o.a.s.c.c.ConnectionManager Watcher org.apache.solr.common.cloud.ConnectionManager@1a66817 name:ZooKeeperConnection Watcher:127.0.0.1:59537/solr got event WatchedEvent state:SyncConnected type:None path:null path:null type:None
   [junit4]   2> 2678186 INFO  (TEST-SolrCloudExampleTest.testLoadDocsIntoGettingStartedCollection-seed#[B8E94E767B6F8132]) [n:127.0.0.1:59544_aei%2Ffr    ] o.a.s.c.c.ConnectionManager Client is connected to ZooKeeper
   [junit4]   2> 2678188 INFO  (TEST-SolrCloudExampleTest.testLoadDocsIntoGettingStartedCollection-seed#[B8E94E767B6F8132]) [n:127.0.0.1:59544_aei%2Ffr    ] o.a.s.c.c.SolrZkClient makePath: /overseer/queue
   [junit4]   2> 2678191 INFO  (TEST-SolrCloudExampleTest.testLoadDocsIntoGettingStartedCollection-seed#[B8E94E767B6F8132]) [n:127.0.0.1:59544_aei%2Ffr    ] o.a.s.c.c.SolrZkClient makePath: /overseer/collection-queue-work
   [junit4]   2> 2678193 INFO  (TEST-SolrCloudExampleTest.testLoadDocsIntoGettingStartedCollection-seed#[B8E94E767B6F8132]) [n:127.0.0.1:59544_aei%2Ffr    ] o.a.s.c.c.SolrZkClient makePath: /overseer/collection-map-running
   [junit4]   2> 2678195 INFO  (TEST-SolrCloudExampleTest.testLoadDocsIntoGettingStartedCollection-seed#[B8E94E767B6F8132]) [n:127.0.0.1:59544_aei%2Ffr    ] o.a.s.c.c.SolrZkClient makePath: /overseer/collection-map-completed
   [junit4]   2> 2678198 INFO  (TEST-SolrCloudExampleTest.testLoadDocsIntoGettingStartedCollection-seed#[B8E94E767B6F8132]) [n:127.0.0.1:59544_aei%2Ffr    ] o.a.s.c.c.SolrZkClient makePath: /overseer/collection-map-failure
   [junit4]   2> 2678200 INFO  (TEST-SolrCloudExampleTest.testLoadDocsIntoGettingStartedCollection-seed#[B8E94E767B6F8132]) [n:127.0.0.1:59544_aei%2Ffr    ] o.a.s.c.c.SolrZkClient makePath: /live_nodes
   [junit4]   2> 2678202 INFO  (TEST-SolrCloudExampleTest.testLoadDocsIntoGettingStartedCollection-seed#[B8E94E767B6F8132]) [n:127.0.0.1:59544_aei%2Ffr    ] o.a.s.c.c.SolrZkClient makePath: /aliases.json
   [junit4]   2> 2678203 INFO  (TEST-SolrCloudExampleTest.testLoadDocsIntoGettingStartedCollection-seed#[B8E94E767B6F8132]) [n:127.0.0.1:59544_aei%2Ffr    ] o.a.s.c.c.SolrZkClient makePath: /clusterstate.json
   [junit4]   2> 2678205 INFO  (TEST-SolrCloudExampleTest.testLoadDocsIntoGettingStartedCollection-seed#[B8E94E767B6F8132]) [n:127.0.0.1:59544_aei%2Ffr    ] o.a.s.c.ZkController Register node as live in ZooKeeper:/live_nodes/127.0.0.1:59544_aei%2Ffr
   [junit4]   2> 2678206 INFO  (TEST-SolrCloudExampleTest.testLoadDocsIntoGettingStartedCollection-seed#[B8E94E767B6F8132]) [n:127.0.0.1:59544_aei%2Ffr    ] o.a.s.c.c.SolrZkClient makePath: /live_nodes/127.0.0.1:59544_aei%2Ffr
   [junit4]   2> 2678208 INFO  (TEST-SolrCloudExampleTest.testLoadDocsIntoGettingStartedCollection-seed#[B8E94E767B6F8132]) [n:127.0.0.1:59544_aei%2Ffr    ] o.a.s.c.c.SolrZkClient makePath: /overseer_elect
   [junit4]   2> 2678209 INFO  (TEST-SolrCloudExampleTest.testLoadDocsIntoGettingStartedCollection-seed#[B8E94E767B6F8132]) [n:127.0.0.1:59544_aei%2Ffr    ] o.a.s.c.c.SolrZkClient makePath: /overseer_elect/election
   [junit4]   2> 2678211 INFO  (TEST-SolrCloudExampleTest.testLoadDocsIntoGettingStartedCollection-seed#[B8E94E767B6F8132]) [n:127.0.0.1:59544_aei%2Ffr    ] o.a.s.c.Overseer Overseer (id=null) closing
   [junit4]   2> 2678212 INFO  (TEST-SolrCloudExampleTest.testLoadDocsIntoGettingStartedCollection-seed#[B8E94E767B6F8132]) [n:127.0.0.1:59544_aei%2Ffr    ] o.a.s.c.LeaderElector Joined leadership election with path: /overseer_elect/election/94273178829717507-127.0.0.1:59544_aei%2Ffr-n_0000000000
   [junit4]   2> 2678213 INFO  (TEST-SolrCloudExampleTest.testLoadDocsIntoGettingStartedCollection-seed#[B8E94E767B6F8132]) [n:127.0.0.1:59544_aei%2Ffr    ] o.a.s.c.OverseerElectionContext I am going to be the leader 127.0.0.1:59544_aei%2Ffr
   [junit4]   2> 2678213 INFO  (TEST-SolrCloudExampleTest.testLoadDocsIntoGettingStartedCollection-seed#[B8E94E767B6F8132]) [n:127.0.0.1:59544_aei%2Ffr    ] o.a.s.c.c.SolrZkClient makePath: /overseer_elect/leader
   [junit4]   2> 2678214 INFO  (TEST-SolrCloudExampleTest.testLoadDocsIntoGettingStartedCollection-seed#[B8E94E767B6F8132]) [n:127.0.0.1:59544_aei%2Ffr    ] o.a.s.c.Overseer Overseer (id=94273178829717507-127.0.0.1:59544_aei%2Ffr-n_0000000000) starting
   [junit4]   2> 2678216 INFO  (TEST-SolrCloudExampleTest.testLoadDocsIntoGettingStartedCollection-seed#[B8E94E767B6F8132]) [n:127.0.0.1:59544_aei%2Ffr    ] o.a.s.c.c.SolrZkClient makePath: /overseer/queue-work
   [junit4]   2> 2678224 INFO  (TEST-SolrCloudExampleTest.testLoadDocsIntoGettingStartedCollection-seed#[B8E94E767B6F8132]) [n:127.0.0.1:59544_aei%2Ffr    ] o.a.s.c.OverseerAutoReplicaFailoverThread Starting OverseerAutoReplicaFailoverThread autoReplicaFailoverWorkLoopDelay=10000 autoReplicaFailoverWaitAfterExpiration=30000 autoReplicaFailoverBadNodeExpiration=60000
   [junit4]   2> 2678227 INFO  (OverseerCollectionProcessor-94273178829717507-127.0.0.1:59544_aei%2Ffr-n_0000000000) [n:127.0.0.1:59544_aei%2Ffr    ] o.a.s.c.OverseerCollectionProcessor Process current queue of collection creations
   [junit4]   2> 2678227 INFO  (TEST-SolrCloudExampleTest.testLoadDocsIntoGettingStartedCollection-seed#[B8E94E767B6F8132]) [n:127.0.0.1:59544_aei%2Ffr    ] o.a.s.c.c.ZkStateReader Updating cluster state from ZooKeeper... 
   [junit4]   2> 2678228 INFO  (OverseerStateUpdate-94273178829717507-127.0.0.1:59544_aei%2Ffr-n_0000000000) [n:127.0.0.1:59544_aei%2Ffr    ] o.a.s.c.Overseer Starting to work on the main queue
   [junit4]   2> 2678236 INFO  (TEST-SolrCloudExampleTest.testLoadDocsIntoGettingStartedCollection-seed#[B8E94E767B6F8132]) [n:127.0.0.1:59544_aei%2Ffr    ] o.a.s.c.CoreContainer No authentication plugin used.
   [junit4]   2> 2678238 INFO  (TEST-SolrCloudExampleTest.testLoadDocsIntoGettingStartedCollection-seed#[B8E94E767B6F8132]) [n:127.0.0.1:59544_aei%2Ffr    ] o.a.s.c.CoreContainer Security conf doesn't exist. Skipping setup for authorization module.
   [junit4]   2> 2678240 INFO  (TEST-SolrCloudExampleTest.testLoadDocsIntoGettingStartedCollection-seed#[B8E94E767B6F8132]) [n:127.0.0.1:59544_aei%2Ffr    ] o.a.s.c.CoresLocator Looking for core definitions underneath C:\Users\JenkinsSlave\workspace\Lucene-Solr-5.x-Windows\solr\build\solr-core\test\J0\..\..\..\..\..\..\..\..\..\Users\JenkinsSlave\workspace\Lucene-Solr-5.x-Windows\solr\build\solr-core\test\J0\temp\solr.cloud.SolrCloudExampleTest_B8E94E767B6F8132-001\control-001\cores
   [junit4]   2> 2678243 INFO  (TEST-SolrCloudExampleTest.testLoadDocsIntoGettingStartedCollection-seed#[B8E94E767B6F8132]) [n:127.0.0.1:59544_aei%2Ffr    ] o.a.s.c.SolrCore Created CoreDescriptor: {configSetProperties=configsetprops.json, collection=control_collection, config=solrconfig.xml, name=collection1, instanceDir=C:\Users\JenkinsSlave\workspace\Lucene-Solr-5.x-Windows\solr\build\solr-core\test\J0\..\..\..\..\..\..\..\..\..\Users\JenkinsSlave\workspace\Lucene-Solr-5.x-Windows\solr\build\solr-core\test\J0\temp\solr.cloud.SolrCloudExampleTest_B8E94E767B6F8132-001\control-001\cores\collection1, coreNodeName=, absoluteInstDir=C:\Users\JenkinsSlave\workspace\Lucene-Solr-5.x-Windows\solr\build\solr-core\test\J0\..\..\..\..\..\..\..\..\..\Users\JenkinsSlave\workspace\Lucene-Solr-5.x-Windows\solr\build\solr-core\test\J0\temp\solr.cloud.SolrCloudExampleTest_B8E94E767B6F8132-001\control-001\cores\collection1\, shard=, loadOnStartup=true, transient=false, dataDir=data\, schema=schema.xml}
   [junit4]   2> 2678243 INFO  (TEST-SolrCloudExampleTest.testLoadDocsIntoGettingStartedCollection-seed#[B8E94E767B6F8132]) [n:127.0.0.1:59544_aei%2Ffr    ] o.a.s.c.CoresLocator Found core collection1 in C:\Users\JenkinsSlave\workspace\Lucene-Solr-5.x-Windows\solr\build\solr-core\test\J0\..\..\..\..\..\..\..\..\..\Users\JenkinsSlave\workspace\Lucene-Solr-5.x-Windows\solr\build\solr-core\test\J0\temp\solr.cloud.SolrCloudExampleTest_B8E94E767B6F8132-001\control-001\cores\collection1\
   [junit4]   2> 2678243 INFO  (TEST-SolrCloudExampleTest.testLoadDocsIntoGettingStartedCollection-seed#[B8E94E767B6F8132]) [n:127.0.0.1:59544_aei%2Ffr    ] o.a.s.c.CoresLocator Found 1 core definitions
   [junit4]   2> 2678245 INFO  (coreLoadExecutor-6464-thread-1-processing-n:127.0.0.1:59544_aei%2Ffr) [n:127.0.0.1:59544_aei%2Ffr c:control_collection   x:collection1] o.a.s.c.ZkController publishing state=down
   [junit4]   2> 2678245 INFO  (coreLoadExecutor-6464-thread-1-processing-n:127.0.0.1:59544_aei%2Ffr) [n:127.0.0.1:59544_aei%2Ffr c:control_collection   x:collection1] o.a.s.c.ZkController numShards not found on descriptor - reading it from system property
   [junit4]   2> 2678245 INFO  (TEST-SolrCloudExampleTest.testLoadDocsIntoGettingStartedCollection-seed#[B8E94E767B6F8132]) [n:127.0.0.1:59544_aei%2Ffr    ] o.a.s.s.SolrDispatchFilter user.dir=C:\Users\JenkinsSlave\workspace\Lucene-Solr-5.x-Windows\solr\build\solr-core\test\J0
   [junit4]   2> 2678245 INFO  (TEST-SolrCloudExampleTest.testLoadDocsIntoGettingStartedCollection-seed#[B8E94E767B6F8132]) [n:127.0.0.1:59544_aei%2Ffr    ] o.a.s.s.SolrDispatchFilter SolrDispatchFilter.init() done
   [junit4]   2> 2678246 INFO  (coreLoadExecutor-6464-thread-1-processing-n:127.0.0.1:59544_aei%2Ffr) [n:127.0.0.1:59544_aei%2Ffr c:control_collection   x:collection1] o.a.s.c.ZkController look for our core node name
   [junit4]   2> 2678246 INFO  (zkCallback-2288-thread-1-processing-n:127.0.0.1:59544_aei%2Ffr) [n:127.0.0.1:59544_aei%2Ffr    ] o.a.s.c.DistributedQueue NodeChildrenChanged fired on path /overseer/queue state SyncConnected
   [junit4]   2> 2678247 INFO  (OverseerStateUpdate-94273178829717507-127.0.0.1:59544_aei%2Ffr-n_0000000000) [n:127.0.0.1:59544_aei%2Ffr    ] o.a.s.c.Overseer processMessage: queueSize: 1, message = {
   [junit4]   2>   "numShards":"1",
   [junit4]   2>   "state":"down",
   [junit4]   2>   "shard":null,
   [junit4]   2>   "node_name":"127.0.0.1:59544_aei%2Ffr",
   [junit4]   2>   "operation":"state",
   [junit4]   2>   "core":"collection1",
   [junit4]   2>   "roles":null,
   [junit4]   2>   "collection":"control_collection",
   [junit4]   2>   "base_url":"http://127.0.0.1:59544/aei/fr"} current state version: 0
   [junit4]   2> 2678249 INFO  (OverseerStateUpdate-94273178829717507-127.0.0.1:59544_aei%2Ffr-n_0000000000) [n:127.0.0.1:59544_aei%2Ffr    ] o.a.s.c.o.ReplicaMutator Update state numShards=1 message={
   [junit4]   2>   "numShards":"1",
   [junit4]   2>   "state":"down",
   [junit4]   2>   "shard":null,
   [junit4]   2>   "node_name":"127.0.0.1:59544_aei%2Ffr",
   [junit4]   2>   "operation":"state",
   [junit4]   2>   "core":"collection1",
   [junit4]   2>   "roles":null,
   [junit4]   2>   "collection":"control_collection",
   [junit4]   2>   "base_url":"http://127.0.0.1:59544/aei/fr"}
   [junit4]   2> 2678249 INFO  (OverseerStateUpdate-94273178829717507-127.0.0.1:59544_aei%2Ffr-n_0000000000) [n:127.0.0.1:59544_aei%2Ffr    ] o.a.s.c.o.ClusterStateMutator building a new cName: control_collection
   [junit4]   2> 2678249 INFO  (OverseerStateUpdate-94273178829717507-127.0.0.1:59544_aei%2Ffr-n_0000000000) [n:127.0.0.1:59544_aei%2Ffr    ] o.a.s.c.o.ReplicaMutator Assigning new node to shard shard=shard1
   [junit4]   2> 2678250 INFO  (zkCallback-2288-thread-1-processing-n:127.0.0.1:59544_aei%2Ffr) [n:127.0.0.1:59544_aei%2Ffr    ] o.a.s.c.c.ZkStateReader A cluster state change: WatchedEvent state:SyncConnected type:NodeDataChanged path:/clusterstate.json, has occurred - updating... (live nodes size: 1)
   [junit4]   2> 2678278 INFO  (zkCallback-2288-thread-1-processing-n:127.0.0.1:59544_aei%2Ffr) [n:127.0.0.1:59544_aei%2Ffr    ] o.a.s.c.c.ZkStateReader Updated cluster state version to 1
   [junit4]   2> 2679346 INFO  (coreLoadExecutor-6464-thread-1-processing-n:127.0.0.1:59544_aei%2Ffr) [n:127.0.0.1:59544_aei%2Ffr c:control_collection   x:collection1] o.a.s.c.ZkController waiting to find shard id in clusterstate for collection1
   [junit4]   2> 2679346 INFO  (coreLoadExecutor-6464-thread-1-processing-n:127.0.0.1:59544_aei%2Ffr) [n:127.0.0.1:59544_aei%2Ffr c:control_collection   x:collection1] o.a.s.c.ZkController Check for collection zkNode:control_collection
   [junit4]   2> 2679346 INFO  (coreLoadExecutor-6464-thread-1-processing-n:127.0.0.1:59544_aei%2Ffr) [n:127.0.0.1:59544_aei%2Ffr c:control_collection   x:collection1] o.a.s.c.ZkController Collection zkNode exists
   [junit4]   2> 2679347 INFO  (coreLoadExecutor-6464-thread-1-processing-n:127.0.0.1:59544_aei%2Ffr) [n:127.0.0.1:59544_aei%2Ffr c:control_collection   x:collection1] o.a.s.c.c.ZkStateReader Load collection config from:/collections/control_collection
   [junit4]   2> 2679349 INFO  (coreLoadExecutor-6464-thread-1-processing-n:127.0.0.1:59544_aei%2Ffr) [n:127.0.0.1:59544_aei%2Ffr c:control_collection   x:collection1] o.a.s.c.c.ZkStateReader path=/collections/control_collection configName=conf1 specified config exists in ZooKeeper
   [junit4]   2> 2679349 INFO  (coreLoadExecutor-6464-thread-1-processing-n:127.0.0.1:59544_aei%2Ffr) [n:127.0.0.1:59544_aei%2Ffr c:control_collection   x:collection1] o.a.s.c.SolrResourceLoader new SolrResourceLoader for directory: 'C:\Users\JenkinsSlave\workspace\Lucene-Solr-5.x-Windows\solr\build\solr-core\test\J0\..\..\..\..\..\..\..\..\..\Users\JenkinsSlave\workspace\Lucene-Solr-5.x-Windows\solr\build\solr-core\test\J0\temp\solr.cloud.SolrCloudExampleTest_B8E94E767B6F8132-001\control-001\cores\collection1\'
   [junit4]   2> 2679374 INFO  (coreLoadExecutor-6464-thread-1-processing-n:127.0.0.1:59544_aei%2Ffr) [n:127.0.0.1:59544_aei%2Ffr c:control_collection   x:collection1] o.a.s.c.Config loaded config solrconfig.xml with version 0 
   [junit4]   2> 2679385 INFO  (coreLoadExecutor-6464-thread-1-processing-n:127.0.0.1:59544_aei%2Ffr) [n:127.0.0.1:59544_aei%2Ffr c:control_collection   x:collection1] o.a.s.c.SolrConfig current version of requestparams : -1
   [junit4]   2> 2679401 INFO  (coreLoadExecutor-6464-thread-1-processing-n:127.0.0.1:59544_aei%2Ffr) [n:127.0.0.1:59544_aei%2Ffr c:control_collection   x:collection1] o.a.s.c.SolrConfig Using Lucene MatchVersion: 5.3.0
   [junit4]   2> 2679475 INFO  (coreLoadExecutor-6464-thread-1-processing-n:127.0.0.1:59544_aei%2Ffr) [n:127.0.0.1:59544_aei%2Ffr c:control_collection   x:collection1] o.a.s.c.Config Loaded SolrConfig: solrconfig.xml
   [junit4]   2> 2679476 INFO  (coreLoadExecutor-6464-thread-1-processing-n:127.0.0.1:59544_aei%2Ffr) [n:127.0.0.1:59544_aei%2Ffr c:control_collection   x:collection1] o.a.s.s.IndexSchema Reading Solr Schema from /configs/conf1/schema.xml
   [junit4]   2> 2679485 INFO  (coreLoadExecutor-6464-thread-1-processing-n:127.0.0.1:59544_aei%2Ffr) [n:127.0.0.1:59544_aei%2Ffr c:control_collection   x:collection1] o.a.s.s.IndexSchema [collection1] Schema name=test
   [junit4]   2> 2679821 INFO  (coreLoadExecutor-6464-thread-1-processing-n:127.0.0.1:59544_aei%2Ffr) [n:127.0.0.1:59544_aei%2Ffr c:control_collection   x:collection1] o.a.s.s.OpenExchangeRatesOrgProvider Initialized with rates=open-exchange-rates.json, refreshInterval=1440.
   [junit4]   2> 2679831 INFO  (coreLoadExecutor-6464-thread-1-processing-n:127.0.0.1:59544_aei%2Ffr) [n:127.0.0.1:59544_aei%2Ffr c:control_collection   x:collection1] o.a.s.s.IndexSchema default search field in schema is text
   [junit4]   2> 2679832 INFO  (coreLoadExecutor-6464-thread-1-processing-n:127.0.0.1:59544_aei%2Ffr) [n:127.0.0.1:59544_aei%2Ffr c:control_collection   x:collection1] o.a.s.s.IndexSchema unique key field: id
   [junit4]   2> 2679846 INFO  (coreLoadExecutor-6464-thread-1-processing-n:127.0.0.1:59544_aei%2Ffr) [n:127.0.0.1:59544_aei%2Ffr c:control_collection   x:collection1] o.a.s.s.FileExchangeRateProvider Reloading exchange rates from file currency.xml
   [junit4]   2> 2679850 INFO  (coreLoadExecutor-6464-thread-1-processing-n:127.0.0.1:59544_aei%2Ffr) [n:127.0.0.1:59544_aei%2Ffr c:control_collection   x:collection1] o.a.s.s.FileExchangeRateProvider Reloading exchange rates from file currency.xml
   [junit4]   2> 2679856 INFO  (coreLoadExecutor-6464-thread-1-processing-n:127.0.0.1:59544_aei%2Ffr) [n:127.0.0.1:59544_aei%2Ffr c:control_collection   x:collection1] o.a.s.s.OpenExchangeRatesOrgProvider Reloading exchange rates from open-exchange-rates.json
   [junit4]   2> 2679857 WARN  (coreLoadExecutor-6464-thread-1-processing-n:127.0.0.1:59544_aei%2Ffr) [n:127.0.0.1:59544_aei%2Ffr c:control_collection   x:collection1] o.a.s.s.OpenExchangeRatesOrgProvider Unknown key IMPORTANT NOTE
   [junit4]   2> 2679857 WARN  (coreLoadExecutor-6464-thread-1-processing-n:127.0.0.1:59544_aei%2Ffr) [n:127.0.0.1:59544_aei%2Ffr c:control_collection   x:collection1] o.a.s.s.OpenExchangeRatesOrgProvider Expected key, got STRING
   [junit4]   2> 2679857 INFO  (coreLoadExecutor-6464-thread-1-processing-n:127.0.0.1:59544_aei%2Ffr) [n:127.0.0.1:59544_aei%2Ffr c:control_collection   x:collection1] o.a.s.s.OpenExchangeRatesOrgProvider Reloading exchange rates from open-exchange-rates.json
   [junit4]   2> 2679858 WARN  (coreLoadExecutor-6464-thread-1-processing-n:127.0.0.1:59544_aei%2Ffr) [n:127.0.0.1:59544_aei%2Ffr c:control_collection   x:collection1] o.a.s.s.OpenExchangeRatesOrgProvider Unknown key IMPORTANT NOTE
   [junit4]   2> 2679858 WARN  (coreLoadExecutor-6464-thread-1-processing-n:127.0.0.1:59544_aei%2Ffr) [n:127.0.0.1:59544_aei%2Ffr c:control_collection   x:collection1] o.a.s.s.OpenExchangeRatesOrgProvider Expected key, got STRING
   [junit4]   2> 2679862 INFO  (coreLoadExecutor-6464-thread-1-processing-n:127.0.0.1:59544_aei%2Ffr) [n:127.0.0.1:59544_aei%2Ffr c:control_collection   x:collection1] o.a.s.c.ConfigSetProperties Did not find ConfigSet properties, assuming default properties: Can't find resource 'configsetprops.json' in classpath or '/configs/conf1', cwd=C:\Users\JenkinsSlave\workspace\Lucene-Solr-5.x-Windows\solr\build\solr-core\test\J0
   [junit4]   2> 2679862 INFO  (coreLoadExecutor-6464-thread-1-processing-n:127.0.0.1:59544_aei%2Ffr) [n:127.0.0.1:59544_aei%2Ffr c:control_collection   x:collection1] o.a.s.c.CoreContainer Creating SolrCore 'collection1' using configuration from collection control_collection
   [junit4]   2> 2679862 INFO  (coreLoadExecutor-6464-thread-1-processing-n:127.0.0.1:59544_aei%2Ffr) [n:127.0.0.1:59544_aei%2Ffr c:control_collection s:shard1 r:core_node1 x:collection1] o.a.s.c.SolrCore org.apache.solr.core.MockDirectoryFactory
   [junit4]   2> 2679862 INFO  (coreLoadExecutor-6464-thread-1-processing-n:127.0.0.1:59544_aei%2Ffr) [n:127.0.0.1:59544_aei%2Ffr c:control_collection s:shard1 r:core_node1 x:collection1] o.a.s.c.SolrCore [[collection1] ] Opening new SolrCore at [C:\Users\JenkinsSlave\workspace\Lucene-Solr-5.x-Windows\solr\build\solr-core\test\J0\..\..\..\..\..\..\..\..\..\Users\JenkinsSlave\workspace\Lucene-Solr-5.x-Windows\solr\build\solr-core\test\J0\temp\solr.cloud.SolrCloudExampleTest_B8E94E767B6F8132-001\control-001\cores\collection1\], dataDir=[null]
   [junit4]   2> 2679862 INFO  (coreLoadExecutor-6464-thread-1-processing-n:127.0.0.1:59544_aei%2Ffr) [n:127.0.0.1:59544_aei%2Ffr c:control_collection s:shard1 r:core_node1 x:collection1] o.a.s.c.JmxMonitoredMap JMX monitoring is enabled. Adding Solr mbeans to JMX Server: com.sun.jmx.mbeanserver.JmxMBeanServer@131f965
   [junit4]   2> 2679863 INFO  (coreLoadExecutor-6464-thread-1-processing-n:127.0.0.1:59544_aei%2Ffr) [n:127.0.0.1:59544_aei%2Ffr c:control_collection s:shard1 r:core_node1 x:collection1] o.a.s.c.CachingDirectoryFactory return new directory for C:\Users\JenkinsSlave\workspace\Lucene-Solr-5.x-Windows\solr\build\solr-core\test\J0\..\..\..\..\..\..\..\..\..\Users\JenkinsSlave\workspace\Lucene-Solr-5.x-Windows\solr\build\solr-core\test\J0\temp\solr.cloud.SolrCloudExampleTest_B8E94E767B6F8132-001\control-001\cores\collection1\data\
   [junit4]   2> 2679863 INFO  (coreLoadExecutor-6464-thread-1-processing-n:127.0.0.1:59544_aei%2Ffr) [n:127.0.0.1:59544_aei%2Ffr c:control_collection s:shard1 r:core_node1 x:collection1] o.a.s.c.SolrCore New index directory detected: old=null new=C:\Users\JenkinsSlave\workspace\Lucene-Solr-5.x-Windows\solr\build\solr-core\test\J0\..\..\..\..\..\..\..\..\..\Users\JenkinsSlave\workspace\Lucene-Solr-5.x-Windows\solr\build\solr-core\test\J0\temp\solr.cloud.SolrCloudExampleTest_B8E94E767B6F8132-001\control-001\cores\collection1\data\index/
   [junit4]   2> 2679863 WARN  (coreLoadExecutor-6464-thread-1-processing-n:127.0.0.1:59544_aei%2Ffr) [n:127.0.0.1:59544_aei%2Ffr c:control_collection s:shard1 r:core_node1 x:collection1] o.a.s.c.SolrCore [collection1] Solr index directory 'C:\Users\JenkinsSlave\workspace\Lucene-Solr-5.x-Windows\solr\build\solr-core\test\J0\..\..\..\..\..\..\..\..\..\Users\JenkinsSlave\workspace\Lucene-Solr-5.x-Windows\solr\build\solr-core\test\J0\temp\solr.cloud.SolrCloudExampleTest_B8E94E767B6F8132-001\control-001\cores\collection1\data\index' doesn't exist. Creating new index...
   [junit4]   2> 2679864 INFO  (coreLoadExecutor-6464-thread-1-processing-n:127.0.0.1:59544_aei%2Ffr) [n:127.0.0.1:59544_aei%2Ffr c:control_collection s:shard1 r:core_node1 x:collection1] o.a.s.c.CachingDirectoryFactory return new directory for C:\Users\JenkinsSlave\workspace\Lucene-Solr-5.x-Windows\solr\build\solr-core\test\J0\..\..\..\..\..\..\..\..\..\Users\JenkinsSlave\workspace\Lucene-Solr-5.x-Windows\solr\build\solr-core\test\J0\temp\solr.cloud.SolrCloudExampleTest_B8E94E767B6F8132-001\control-001\cores\collection1\data\index
   [junit4]   2> 2679864 INFO  (coreLoadExecutor-6464-thread-1-processing-n:127.0.0.1:59544_aei%2Ffr) [n:127.0.0.1:59544_aei%2Ffr c:control_collection s:shard1 r:core_node1 x:collection1] o.a.s.u.RandomMergePolicy RandomMergePolicy wrapping class org.apache.lucene.index.LogDocMergePolicy: [LogDocMergePolicy: minMergeSize=1000, mergeFactor=49, maxMergeSize=9223372036854775807, maxMergeSizeForForcedMerge=9223372036854775807, calibrateSizeByDeletes=false, maxMergeDocs=2147483647, maxCFSSegmentSizeMB=8.796093022207999E12, noCFSRatio=0.0]
   [junit4]   2> 2679865 INFO  (coreLoadExecutor-6464-thread-1-processing-n:127.0.0.1:59544_aei%2Ffr) [n:127.0.0.1:59544_aei%2Ffr c:control_collection s:shard1 r:core_node1 x:collection1] o.a.s.c.SolrCore SolrDeletionPolicy.onCommit: commits: num=1
   [junit4]   2> 	commit{dir=MockDirectoryWrapper(RAMDirectory@1969790 lockFactory=org.apache.lucene.store.SingleInstanceLockFactory@1b876ee),segFN=segments_1,generation=1}
   [junit4]   2> 2679865 INFO  (coreLoadExecutor-6464-thread-1-processing-n:127.0.0.1:59544_aei%2Ffr) [n:127.0.0.1:59544_aei%2Ffr c:control_collection s:shard1 r:core_node1 x:collection1] o.a.s.c.SolrCore newest commit generation = 1
   [junit4]   2> 2679866 INFO  (OldIndexDirectoryCleanupThreadForCore-collection1) [n:127.0.0.1:59544_aei%2Ffr c:control_collection s:shard1 r:core_node1 x:collection1] o.a.s.c.SolrCore Looking for old index directories to cleanup for core collection1 in C:\Users\JenkinsSlave\workspace\Lucene-Solr-5.x-Windows\solr\build\solr-core\test\J0\..\..\..\..\..\..\..\..\..\Users\JenkinsSlave\workspace\Lucene-Solr-5.x-Windows\solr\build\solr-core\test\J0\temp\solr.cloud.SolrCloudExampleTest_B8E94E767B6F8132-001\control-001\cores\collection1\data\
   [junit4]   2> 2679866 WARN  (OldIndexDirectoryCleanupThreadForCore-collection1) [n:127.0.0.1:59544_aei%2Ffr c:control_collection s:shard1 r:core_node1 x:collection1] o.a.s.c.DirectoryFactory C:\Users\JenkinsSlave\workspace\Lucene-Solr-5.x-Windows\solr\build\solr-core\test\J0\..\..\..\..\..\..\..\..\..\Users\JenkinsSlave\workspace\Lucene-Solr-5.x-Windows\solr\build\solr-core\test\J0\temp\solr.cloud.SolrCloudExampleTest_B8E94E767B6F8132-001\control-001\cores\collection1\data\ does not point to a valid data directory; skipping clean-up of old index directories.
   [junit4]   2> 2679873 INFO  (coreLoadExecutor-6464-thread-1-processing-n:127.0.0.1:59544_aei%2Ffr) [n:127.0.0.1:59544_aei%2Ffr c:control_collection s:shard1 r:core_node1 x:collection1] o.a.s.u.p.UpdateRequestProcessorChain creating updateRequestProcessorChain "nodistrib"
   [junit4]   2> 2679874 INFO  (coreLoadExecutor-6464-thread-1-processing-n:127.0.0.1:59544_aei%2Ffr) [n:127.0.0.1:59544_aei%2Ffr c:control_collection s:shard1 r:core_node1 x:collection1] o.a.s.u.p.UpdateRequestProcessorChain creating updateRequestProcessorChain "dedupe"
   [junit4]   2> 2679874 INFO  (coreLoadExecutor-6464-thread-1-processing-n:127.0.0.1:59544_aei%2Ffr) [n:127.0.0.1:59544_aei%2Ffr c:control_collection s:shard1 r:core_node1 x:collection1] o.a.s.u.p.UpdateRequestProcessorChain inserting DistributedUpdateProcessorFactory into updateRequestProcessorChain "dedupe"
   [junit4]   2> 2679874 INFO  (coreLoadExecutor-6464-thread-1-processing-n:127.0.0.1:59544_aei%2Ffr) [n:127.0.0.1:59544_aei%2Ffr c:control_collection s:shard1 r:core_node1 x:collection1] o.a.s.u.p.UpdateRequestProcessorChain creating updateRequestProcessorChain "stored_sig"
   [junit4]   2> 2679874 INFO  (coreLoadExecutor-6464-thread-1-processing-n:127.0.0.1:59544_aei%2Ffr) [n:127.0.0.1:59544_aei%2Ffr c:control_collection s:shard1 r:core_node1 x:collection1] o.a.s.u.p.UpdateRequestProcessorChain inserting DistributedUpdateProcessorFactory into updateRequestProcessorChain "stored_sig"
   [junit4]   2> 2679875 INFO  (coreLoadExecutor-6464-thread-1-processing-n:127.0.0.1:59544_aei%2Ffr) [n:127.0.0.1:59544_aei%2Ffr c:control_collection s:shard1 r:core_node1 x:collection1] o.a.s.u.p.UpdateRequestProcessorChain creating updateRequestProcessorChain "distrib-dup-test-chain-explicit"
   [junit4]   2> 2679875 INFO  (coreLoadExecutor-6464-thread-1-processing-n:127.0.0.1:59544_aei%2Ffr) [n:127.0.0.1:59544_aei%2Ffr c:control_collection s:shard1 r:core_node1 x:collection1] o.a.s.u.p.UpdateRequestProcessorChain creating updateRequestProcessorChain "distrib-dup-test-chain-implicit"
   [junit4]   2> 2679875 INFO  (coreLoadExecutor-6464-thread-1-processing-n:127.0.0.1:59544_aei%2Ffr) [n:127.0.0.1:59544_aei%2Ffr c:control_collection s:shard1 r:core_node1 x:collection1] o.a.s.u.p.UpdateRequestProcessorChain inserting DistributedUpdateProcessorFactory into updateRequestProcessorChain "distrib-dup-test-chain-implicit"
   [junit4]   2> 2679875 INFO  (coreLoadExecutor-6464-thread-1-processing-n:127.0.0.1:59544_aei%2Ffr) [n:127.0.0.1:59544_aei%2Ffr c:control_collection s:shard1 r:core_node1 x:collection1] o.a.s.c.SolrCore no updateRequestProcessorChain defined as default, creating implicit default
   [junit4]   2> 2679882 INFO  (coreLoadExecutor-6464-thread-1-processing-n:127.0.0.1:59544_aei%2Ffr) [n:127.0.0.1:59544_aei%2Ffr c:control_collection s:shard1 r:core_node1 x:collection1] o.a.s.h.l.XMLLoader xsltCacheLifetimeSeconds=60
   [junit4]   2> 2679885 INFO  (coreLoadExecutor-6464-thread-1-processing-n:127.0.0.1:59544_aei%2Ffr) [n:127.0.0.1:59544_aei%2Ffr c:control_collection s:shard1 r:core_node1 x:collection1] o.a.s.h.l.XMLLoader xsltCacheLifetimeSeconds=60
   [junit4]   2> 2679886 INFO  (coreLoadExecutor-6464-thread-1-processing-n:127.0.0.1:59544_aei%2Ffr) [n:127.0.0.1:59544_aei%2Ffr c:control_collection s:shard1 r:core_node1 x:collection1] o.a.s.h.l.XMLLoader xsltCacheLifetimeSeconds=60
   [junit4]   2> 2679888 INFO  (coreLoadExecutor-6464-thread-1-processing-n:127.0.0.1:59544_aei%2Ffr) [n:127.0.0.1:59544_aei%2Ffr c:control_collection s:shard1 r:core_node1 x:collection1] o.a.s.h.l.XMLLoader xsltCacheLifetimeSeconds=60
   [junit4]   2> 2679892 INFO  (coreLoadExecutor-6464-thread-1-processing-n:127.0.0.1:59544_aei%2Ffr) [n:127.0.0.1:59544_aei%2Ffr c:control_collection s:shard1 r:core_node1 x:collection1] o.a.s.c.RequestHandlers Registered paths: /admin/properties,/config,/admin/system,/update/json/docs,/admin/ping,/replication,/admin/mbeans,/update/csv,/update/json,/admin/file,/get,/schema,/admin/plugins,/update,/admin/segments,/admin/logging,/admin/luke,/admin/threads,standard
   [junit4]   2> 2679895 INFO  (coreLoadExecutor-6464-thread-1-processing-n:127.0.0.1:59544_aei%2Ffr) [n:127.0.0.1:59544_aei%2Ffr c:control_collection s:shard1 r:core_node1 x:collection1] o.a.s.c.SolrCore Using default statsCache cache: org.apache.solr.search.stats.LocalStatsCache
   [junit4]   2> 2679896 INFO  (coreLoadExecutor-6464-thread-1-processing-n:127.0.0.1:59544_aei%2Ffr) [n:127.0.0.1:59544_aei%2Ffr c:control_collection s:shard1 r:core_node1 x:collection1] o.a.s.u.UpdateHandler Using UpdateLog implementation: org.apache.solr.update.UpdateLog
   [junit4]   2> 2679896 INFO  (coreLoadExecutor-6464-thread-1-processing-n:127.0.0.1:59544_aei%2Ffr) [n:127.0.0.1:59544_aei%2Ffr c:control_collection s:shard1 r:core_node1 x:collection1] o.a.s.u.UpdateLog Initializing UpdateLog: dataDir= defaultSyncLevel=FLUSH numRecordsToKeep=100 maxNumLogsToKeep=10 numVersionBuckets=65536
   [junit4]   2> 2679899 INFO  (coreLoadExecutor-6464-thread-1-processing-n:127.0.0.1:59544_aei%2Ffr) [n:127.0.0.1:59544_aei%2Ffr c:control_collection s:shard1 r:core_node1 x:collection1] o.a.s.c.SolrCore Hard AutoCommit: disabled
   [junit4]   2> 2679899 INFO  (coreLoadExecutor-6464-thread-1-processing-n:127.0.0.1:59544_aei%2Ffr) [n:127.0.0.1:59544_aei%2Ffr c:control_collection s:shard1 r:core_node1 x:collection1] o.a.s.c.SolrCore Soft AutoCommit: disabled
   [junit4]   2> 2679899 INFO  (coreLoadExecutor-6464-thread-1-processing-n:127.0.0.1:59544_aei%2Ffr) [n:127.0.0.1:59544_aei%2Ffr c:control_collection s:shard1 r:core_node1 x:collection1] o.a.s.u.RandomMergePolicy RandomMergePolicy wrapping class org.apache.lucene.index.TieredMergePolicy: [TieredMergePolicy: maxMergeAtOnce=17, maxMergeAtOnceExplicit=29, maxMergedSegmentMB=1.1162109375, floorSegmentMB=1.2451171875, forceMergeDeletesPctAllowed=24.2662249859614, segmentsPerTier=28.0, maxCFSSegmentSizeMB=8.796093022207999E12, noCFSRatio=0.6554713003181349
   [junit4]   2> 2679899 INFO  (coreLoadExecutor-6464-thread-1-processing-n:127.0.0.1:59544_aei%2Ffr) [n:127.0.0.1:59544_aei%2Ffr c:control_collection s:shard1 r:core_node1 x:collection1] o.a.s.c.SolrCore SolrDeletionPolicy.onInit: commits: num=1
   [junit4]   2> 	commit{dir=MockDirectoryWrapper(RAMDirectory@1969790 lockFactory=org.apache.lucene.store.SingleInstanceLockFactory@1b876ee),segFN=segments_1,generation=1}
   [junit4]   2> 2679900 INFO  (coreLoadExecutor-6464-thread-1-processing-n:127.0.0.1:59544_aei%2Ffr) [n:127.0.0.1:59544_aei%2Ffr c:control_collection s:shard1 r:core_node1 x:collection1] o.a.s.c.SolrCore newest commit generation = 1
   [junit4]   2> 2679900 INFO  (coreLoadExecutor-6464-thread-1-processing-n:127.0.0.1:59544_aei%2Ffr) [n:127.0.0.1:59544_aei%2Ffr c:control_collection s:shard1 r:core_node1 x:collection1] o.a.s.s.SolrIndexSearcher Opening Searcher@163b796[collection1] main
   [junit4]   2> 2679900 INFO  (coreLoadExecutor-6464-thread-1-processing-n:127.0.0.1:59544_aei%2Ffr) [n:127.0.0.1:59544_aei%2Ffr c:control_collection s:shard1 r:core_node1 x:collection1] o.a.s.c.c.ZkStateReader Load collection config from:/collections/control_collection
   [junit4]   2> 2679901 INFO  (coreLoadExecutor-6464-thread-1-processing-n:127.0.0.1:59544_aei%2Ffr) [n:127.0.0.1:59544_aei%2Ffr c:control_collection s:shard1 r:core_node1 x:collection1] o.a.s.c.c.ZkStateReader path=/collections/control_collection configName=conf1 specified config exists in ZooKeeper
   [junit4]   2> 2679901 INFO  (coreLoadExecutor-6464-thread-1-processing-n:127.0.0.1:59544_aei%2Ffr) [n:127.0.0.1:59544_aei%2Ffr c:control_collection s:shard1 r:core_node1 x:collection1] o.a.s.r.ManagedResourceStorage Setting up ZooKeeper-based storage for the RestManager with znodeBase: /configs/conf1
   [junit4]   2> 2679903 INFO  (coreLoadExecutor-6464-thread-1-processing-n:127.0.0.1:59544_aei%2Ffr) [n:127.0.0.1:59544_aei%2Ffr c:control_collection s:shard1 r:core_node1 x:collection1] o.a.s.r.ManagedResourceStorage Configured ZooKeeperStorageIO with znodeBase: /configs/conf1
   [junit4]   2> 2679903 INFO  (coreLoadExecutor-6464-thread-1-processing-n:127.0.0.1:59544_aei%2Ffr) [n:127.0.0.1:59544_aei%2Ffr c:control_collection s:shard1 r:core_node1 x:collection1] o.a.s.r.RestManager Initializing RestManager with initArgs: {}
   [junit4]   2> 2679903 INFO  (coreLoadExecutor-6464-thread-1-processing-n:127.0.0.1:59544_aei%2Ffr) [n:127.0.0.1:59544_aei%2Ffr c:control_collection s:shard1 r:core_node1 x:collection1] o.a.s.r.ManagedResourceStorage Reading _rest_managed.json using ZooKeeperStorageIO:path=/configs/conf1
   [junit4]   2> 2679903 INFO  (coreLoadExecutor-6464-thread-1-processing-n:127.0.0.1:59544_aei%2Ffr) [n:127.0.0.1:59544_aei%2Ffr c:control_collection s:shard1 r:core_node1 x:collection1] o.a.s.r.ManagedResourceStorage No data found for znode /configs/conf1/_rest_managed.json
   [junit4]   2> 2679903 INFO  (coreLoadExecutor-6464-thread-1-processing-n:127.0.0.1:59544_aei%2Ffr) [n:127.0.0.1:59544_aei%2Ffr c:control_collection s:shard1 r:core_node1 x:collection1] o.a.s.r.ManagedResourceStorage Loaded null at path _rest_managed.json using ZooKeeperStorageIO:path=/configs/conf1
   [junit4]   2> 2679904 INFO  (coreLoadExecutor-6464-thread-1-processing-n:127.0.0.1:59544_aei%2Ffr) [n:127.0.0.1:59544_aei%2Ffr c:control_collection s:shard1 r:core_node1 x:collection1] o.a.s.r.RestManager Initializing 0 registered ManagedResources
   [junit4]   2> 2679904 INFO  (coreLoadExecutor-6464-thread-1-processing-n:127.0.0.1:59544_aei%2Ffr) [n:127.0.0.1:59544_aei%2Ffr c:control_collection s:shard1 r:core_node1 x:collection1] o.a.s.h.ReplicationHandler Commits will be reserved for  10000
   [junit4]   2> 2679904 INFO  (searcherExecutor-6465-thread-1-processing-n:127.0.0.1:59544_aei%2Ffr s:shard1 x:collection1 r:core_node1 c:control_collection) [n:127.0.0.1:59544_aei%2Ffr c:control_collection s:shard1 r:core_node1 x:collection1] o.a.s.c.SolrCore [collection1] Registered new searcher Searcher@163b796[collection1] main{ExitableDirectoryReader(UninvertingDirectoryReader())}
   [junit4]   2> 2679904 INFO  (coreLoadExecutor-6464-thread-1-processing-n:127.0.0.1:59544_aei%2Ffr) [n:127.0.0.1:59544_aei%2Ffr c:control_collection s:shard1 r:core_node1 x:collection1] o.a.s.u.UpdateLog Looking up max value of version field to seed version buckets
   [junit4]   2> 2679904 INFO  (coreLoadExecutor-6464-thread-1-processing-n:127.0.0.1:59544_aei%2Ffr) [n:127.0.0.1:59544_aei%2Ffr c:control_collection s:shard1 r:core_node1 x:collection1] o.a.s.u.VersionInfo Refreshing highest value of _version_ for 65536 version buckets from index
   [junit4]   2> 2679905 INFO  (coreLoadExecutor-6464-thread-1-processing-n:127.0.0.1:59544_aei%2Ffr) [n:127.0.0.1:59544_aei%2Ffr c:control_collection s:shard1 r:core_node1 x:collection1] o.a.s.u.VersionInfo No terms found for _version_, cannot seed version bucket highest value from index
   [junit4]   2> 2679905 INFO  (coreLoadExecutor-6464-thread-1-processing-n:127.0.0.1:59544_aei%2Ffr) [n:127.0.0.1:59544_aei%2Ffr c:control_collection s:shard1 r:core_node1 x:collection1] o.a.s.u.UpdateLog Could not find max version in index or recent updates, using new clock 1508370863750119424
   [junit4]   2> 2679907 INFO  (coreLoadExecutor-6464-thread-1-processing-n:127.0.0.1:59544_aei%2Ffr) [n:127.0.0.1:59544_aei%2Ffr c:control_collection s:shard1 r:core_node1 x:collection1] o.a.s.u.UpdateLog Took 3 ms to seed version buckets with highest version 1508370863750119424
   [junit4]   2> 2679907 INFO  (coreLoadExecutor-6464-thread-1-processing-n:127.0.0.1:59544_aei%2Ffr) [n:127.0.0.1:59544_aei%2Ffr c:control_collection s:shard1 r:core_node1 x:collection1] o.a.s.c.ZkController watch zkdir /configs/conf1
   [junit4]   2> 2679908 INFO  (coreLoadExecutor-6464-thread-1-processing-n:127.0.0.1:59544_aei%2Ffr) [n:127.0.0.1:59544_aei%2Ffr c:control_collection s:shard1 r:core_node1 x:collection1] o.a.s.c.CoreContainer registering core: collection1
   [junit4]   2> 2679908 INFO  (coreZkRegister-6458-thread-1-processing-n:127.0.0.1:59544_aei%2Ffr s:shard1 x:collection1 r:core_node1 c:control_collection) [n:127.0.0.1:59544_aei%2Ffr c:control_collection s:shard1 r:core_node1 x:collection1] o.a.s.c.ZkController Register replica - core:collection1 address:http://127.0.0.1:59544/aei/fr collection:control_collection shard:shard1
   [junit4]   2> 2679909 INFO  (coreZkRegister-6458-thread-1-processing-n:127.0.0.1:59544_aei%2Ffr s:shard1 x:collection1 r:core_node1 c:control_collection) [n:127.0.0.1:59544_aei%2Ffr c:control_collection s:shard1 r:core_node1 x:collection1] o.a.s.c.c.SolrZkClient makePath: /collections/control_collection/leader_elect/shard1/election
   [junit4]   2> 2679911 INFO  (coreZkRegister-6458-thread-1-processing-n:127.0.0.1:59544_aei%2Ffr s:shard1 x:collection1 r:core_node1 c:control_collection) [n:127.0.0.1:59544_aei%2Ffr c:control_collection s:shard1 r:core_node1 x:collection1] o.a.s.c.LeaderElector Joined leadership election with path: /collections/control_collection/leader_elect/shard1/election/94273178829717507-core_node1-n_0000000000
   [junit4]   2> 2679916 INFO  (coreZkRegister-6458-thread-1-processing-n:127.0.0.1:59544_aei%2Ffr s:shard1 x:collection1 r:core_node1 c:control_collection) [n:127.0.0.1:59544_aei%2Ffr c:control_collection s:shard1 r:core_node1 x:collection1] o.a.s.c.ShardLeaderElectionContext Running the leader process for shard shard1
   [junit4]   2> 2679917 INFO  (zkCallback-2288-thread-1-processing-n:127.0.0.1:59544_aei%2Ffr) [n:127.0.0.1:59544_aei%2Ffr    ] o.a.s.c.DistributedQueue NodeChildrenChanged fired on path /overseer/queue state SyncConnected
   [junit4]   2> 2679918 INFO  (coreZkRegister-6458-thread-1-processing-n:127.0.0.1:59544_aei%2Ffr s:shard1 x:collection1 r:core_node1 c:control_collection) [n:127.0.0.1:59544_aei%2Ffr c:control_collection s:shard1 r:core_node1 x:collection1] o.a.s.c.ShardLeaderElectionContext Enough replicas found to continue.
   [junit4]   2> 2679918 INFO  (coreZkRegister-6458-thread-1-processing-n:127.0.0.1:59544_aei%2Ffr s:shard1 x:collection1 r:core_node1 c:control_collection) [n:127.0.0.1:59544_aei%2Ffr c:control_collection s:shard1 r:core_node1 x:collection1] o.a.s.c.ShardLeaderElectionContext I may be the new leader - try and sync
   [junit4]   2> 2679918 INFO  (coreZkRegister-6458-thread-1-processing-n:127.0.0.1:59544_aei%2Ffr s:shard1 x:collection1 r:core_node1 c:control_collection) [n:127.0.0.1:59544_aei%2Ffr c:control_collection s:shard1 r:core_node1 x:collection1] o.a.s.c.SyncStrategy Sync replicas to http://127.0.0.1:59544/aei/fr/collection1/
   [junit4]   2> 2679918 INFO  (coreZkRegister-6458-thread-1-processing-n:127.0.0.1:59544_aei%2Ffr s:shard1 x:collection1 r:core_node1 c:control_collection) [n:127.0.0.1:59544_aei%2Ffr c:control_collection s:shard1 r:core_node1 x:collection1] o.a.s.c.SyncStrategy Sync Success - now sync replicas to me
   [junit4]   2> 2679918 INFO  (coreZkRegister-6458-thread-1-processing-n:127.0.0.1:59544_aei%2Ffr s:shard1 x:collection1 r:core_node1 c:control_collection) [n:127.0.0.1:59544_aei%2Ffr c:control_collection s:shard1 r:core_node1 x:collection1] o.a.s.c.SyncStrategy http://127.0.0.1:59544/aei/fr/collection1/ has no replicas
   [junit4]   2> 2679918 INFO  (coreZkRegister-6458-thread-1-processing-n:127.0.0.1:59544_aei%2Ffr s:shard1 x:collection1 r:core_node1 c:control_collection) [n:127.0.0.1:59544_aei%2Ffr c:control_collection s:shard1 r:core_node1 x:collection1] o.a.s.c.ShardLeaderElectionContext I am the new leader: http://127.0.0.1:59544/aei/fr/collection1/ shard1
   [junit4]   2> 2679919 INFO  (coreZkRegister-6458-thread-1-processing-n:127.0.0.1:59544_aei%2Ffr s:shard1 x:collection1 r:core_node1 c:control_collection) [n:127.0.0.1:59544_aei%2Ffr c:control_collection s:shard1 r:core_node1 x:collection1] o.a.s.c.c.SolrZkClient makePath: /collections/control_collection/leaders/shard1
   [junit4]   2> 2679919 INFO  (OverseerStateUpdate-94273178829717507-127.0.0.1:59544_aei%2Ffr-n_0000000000) [n:127.0.0.1:59544_aei%2Ffr    ] o.a.s.c.Overseer processMessage: queueSize: 1, message = {
   [junit4]   2>   "operation":"leader",
   [junit4]   2>   "shard":"shard1",
   [junit4]   2>   "collection":"control_collection"} current state version: 1
   [junit4]   2> 2679921 INFO  (zkCallback-2288-thread-1-processing-n:127.0.0.1:59544_aei%2Ffr) [n:127.0.0.1:59544_aei%2Ffr    ] o.a.s.c.c.ZkStateReader A cluster state change: WatchedEvent state:SyncConnected type:NodeDataChanged path:/clusterstate.json, has occurred - updating... (live nodes size: 1)
   [junit4]   2> 2679922 INFO  (zkCallback-2288-thread-1-processing-n:127.0.0.1:59544_aei%2Ffr) [n:127.0.0.1:59544_aei%2Ffr    ] o.a.s.c.c.ZkStateReader Updated cluster state version to 2
   [junit4]   2> 2679924 INFO  (OverseerStateUpdate-94273178829717507-127.0.0.1:59544_aei%2Ffr-n_0000000000) [n:127.0.0.1:59544_aei%2Ffr    ] o.a.s.c.Overseer processMessage: queueSize: 1, message = {
   [junit4]   2>   "operation":"leader",
   [junit4]   2>   "shard":"shard1",
   [junit4]   2>   "collection":"control_collection",
   [junit4]   2>   "base_url":"http://127.0.0.1:59544/aei/fr",
   [junit4]   2>   "core":"collection1",
   [junit4]   2>   "state":"active"} current state version: 2
   [junit4]   2> 2679926 INFO  (zkCallback-2288-thread-1-processing-n:127.0.0.1:59544_aei%2Ffr) [n:127.0.0.1:59544_aei%2Ffr    ] o.a.s.c.DistributedQueue NodeChildrenChanged fired on path /overseer/queue state SyncConnected
   [junit4]   2> 2679928 INFO  (zkCallback-2288-thread-1-processing-n:127.0.0.1:59544_aei%2Ffr) [n:127.0.0.1:59544_aei%2Ffr    ] o.a.s.c.c.ZkStateReader A cluster state change: WatchedEvent state:SyncConnected type:NodeDataChanged path:/clusterstate.json, has occurred - updating... (live nodes size: 1)
   [junit4]   2> 2679930 INFO  (zkCallback-2288-thread-1-processing-n:127.0.0.1:59544_aei%2Ffr) [n:127.0.0.1:59544_aei%2Ffr    ] o.a.s.c.c.ZkStateReader Updated cluster state version to 3
   [junit4]   2> 2679980 INFO  (coreZkRegister-6458-thread-1-processing-n:127.0.0.1:59544_aei%2Ffr s:shard1 x:collection1 r:core_node1 c:control_collection) [n:127.0.0.1:59544_aei%2Ffr c:control_collection s:shard1 r:core_node1 x:collection1] o.a.s.c.ZkController We are http://127.0.0.1:59544/aei/fr/collection1/ and leader is http://127.0.0.1:59544/aei/fr/collection1/
   [junit4]   2> 2679980 INFO  (coreZkRegister-6458-thread-1-processing-n:127.0.0.1:59544_aei%2Ffr s:shard1 x:collection1 r:core_node1 c:control_collection) [n:127.0.0.1:59544_aei%2Ffr c:control_collection s:shard1 r:core_node1 x:collection1] o.a.s.c.ZkController No LogReplay needed for core=collection1 baseURL=http://127.0.0.1:59544/aei/fr
   [junit4]   2> 2679980 INFO  (coreZkRegister-6458-thread-1-processing-n:127.0.0.1:59544_aei%2Ffr s:shard1 x:collection1 r:core_node1 c:control_collection) [n:127.0.0.1:59544_aei%2Ffr c:control_collection s:shard1 r:core_node1 x:collection1] o.a.s.c.ZkController I am the leader, no recovery necessary
   [junit4]   2> 2679980 INFO  (coreZkRegister-6458-thread-1-processing-n:127.0.0.1:59544_aei%2Ffr s:shard1 x:collection1 r:core_node1 c:control_collection) [n:127.0.0.1:59544_aei%2Ffr c:control_collection s:shard1 r:core_node1 x:collection1] o.a.s.c.ZkController publishing state=active
   [junit4]   2> 2679980 INFO  (coreZkRegister-6458-thread-1-processing-n:127.0.0.1:59544_aei%2Ffr s:shard1 x:collection1 r:core_node1 c:control_collection) [n:127.0.0.1:59544_aei%2Ffr c:control_collection s:shard1 r:core_node1 x:collection1] o.a.s.c.ZkController numShards not found on descriptor - reading it from system property
   [junit4]   2> 2679982 INFO  (zkCallback-2288-thread-1-processing-n:127.0.0.1:59544_aei%2Ffr) [n:127.0.0.1:59544_aei%2Ffr    ] o.a.s.c.DistributedQueue NodeChildrenChanged fired on path /overseer/queue state SyncConnected
   [junit4]   2> 2679983 INFO  (OverseerStateUpdate-94273178829717507-127.0.0.1:59544_aei%2Ffr-n_0000000000) [n:127.0.0.1:59544_aei%2Ffr    ] o.a.s.c.Overseer processMessage: queueSize: 1, message = {
   [junit4]   2>   "numShards":"1",
   [junit4]   2>   "state":"active",
   [junit4]   2>   "shard":"shard1",
   [junit4]   2>   "node_name":"127.0.0.1:59544_aei%2Ffr",
   [junit4]   2>   "operation":"state",
   [junit4]   2>   "core":"collection1",
   [junit4]   2>   "roles":null,
   [junit4]   2>   "core_node_name":"core_node1",
   [junit4]   2>   "collection":"control_collection",
   [junit4]   2>   "base_url":"http://127.0.0.1:59544/aei/fr"} current state version: 3
   [junit4]   2> 2679983 INFO  (OverseerStateUpdate-94273178829717507-127.0.0.1:59544_aei%2Ffr-n_0000000000) [n:127.0.0.1:59544_aei%2Ffr    ] o.a.s.c.o.ReplicaMutator Update state numShards=1 message={
   [junit4]   2>   "numShards":"1",
   [junit4]   2>   "state":"active",
   [junit4]   2>   "shard":"shard1",
   [junit4]   2>   "node_name":"127.0.0.1:59544_aei%2Ffr",
   [junit4]   2>   "operation":"state",
   [junit4]   2>   "core":"collection1",
   [junit4]   2>   "roles":null,
   [junit4]   2>   "core_node_name":"core_node1",
   [junit4]   2>   "collection":"control_collection",
   [junit4]   2>   "base_url":"http://127.0.0.1:59544/aei/fr"}
   [junit4]   2> 2680098 INFO  (zkCallback-2288-thread-1-processing-n:127.0.0.1:59544_aei%2Ffr) [n:127.0.0.1:59544_aei%2Ffr    ] o.a.s.c.c.ZkStateReader A cluster state change: WatchedEvent state:SyncConnected type:NodeDataChanged path:/clusterstate.json, has occurred - updating... (live nodes size: 1)
   [junit4]   2> 2680100 INFO  (zkCallback-2288-thread-1-processing-n:127.0.0.1:59544_aei%2Ffr) [n:127.0.0.1:59544_aei%2Ffr    ] o.a.s.c.c.ZkStateReader Updated cluster state version to 4
   [junit4]   2> 2680447 INFO  (TEST-SolrCloudExampleTest.testLoadDocsIntoGettingStartedCollection-seed#[B8E94E767B6F8132]) [    ] o.a.s.c.c.SolrZkClient Using default ZkCredentialsProvider
   [junit4]   2> 2680450 INFO  (TEST-SolrCloudExampleTest.testLoadDocsIntoGettingStartedCollection-seed#[B8E94E767B6F8132]) [    ] o.a.s.c.c.ConnectionManager Waiting for client to connect to ZooKeeper
   [junit4]   2> 2680452 INFO  (zkCallback-2290-thread-1) [    ] o.a.s.c.c.ConnectionManager Watcher org.apache.solr.common.cloud.ConnectionManager@234cd8 name:ZooKeeperConnection Watcher:127.0.0.1:59537/solr got event WatchedEvent state:SyncConnected type:None path:null path:null type:None
   [junit4]   2> 2680452 INFO  (TEST-SolrCloudExampleTest.testLoadDocsIntoGettingStartedCollection-seed#[B8E94E767B6F8132]) [    ] o.a.s.c.c.ConnectionManager Client is connected to ZooKeeper
   [junit4]   2> 2680452 INFO  (TEST-SolrCloudExampleTest.testLoadDocsIntoGettingStartedCollection-seed#[B8E94E767B6F8132]) [    ] o.a.s.c.c.SolrZkClient Using default ZkACLProvider
   [junit4]   2> 2680453 INFO  (TEST-SolrCloudExampleTest.testLoadDocsIntoGettingStartedCollection-seed#[B8E94E767B6F8132]) [    ] o.a.s.c.c.ZkStateReader Updating cluster state from ZooKeeper... 
   [junit4]   2> 2680455 INFO  (TEST-SolrCloudExampleTest.testLoadDocsIntoGettingStartedCollection-seed#[B8E94E767B6F8132]) [    ] o.a.s.c.ChaosMonkey monkey: init - expire sessions:false cause connection loss:false
   [junit4]   2> 2680455 INFO  (TEST-SolrCloudExampleTest.testLoadDocsIntoGettingStartedCollection-seed#[B8E94E767B6F8132]) [    ] o.a.s.c.AbstractFullDistribZkTestBase Creating collection1 with stateFormat=2
   [junit4]   2> 2680455 INFO  (TEST-SolrCloudExampleTest.testLoadDocsIntoGettingStartedCollection-seed#[B8E94E767B6F8132]) [    ] o.a.s.c.c.SolrZkClient Using default ZkCredentialsProvider
   [junit4]   2> 2680456 INFO  (TEST-SolrCloudExampleTest.testLoadDocsIntoGettingStartedCollection-seed#[B8E94E767B6F8132]) [    ] o.a.s.c.c.ConnectionManager Waiting for client to connect to ZooKeeper
   [junit4]   2> 2680458 INFO  (zkCallback-2291-thread-1) [    ] o.a.s.c.c.ConnectionManager Watcher org.apache.solr.common.cloud.ConnectionManager@ba2ff5 name:ZooKeeperConnection Watcher:127.0.0.1:59537/solr got event WatchedEvent state:SyncConnected type:None path:null path:null type:None
   [junit4]   2> 2680458 INFO  (TEST-SolrCloudExampleTest.testLoadDocsIntoGettingStartedCollection-seed#[B8E94E767B6F8132]) [    ] o.a.s.c.c.ConnectionManager Client is connected to ZooKeeper
   [junit4]   2> 2680459 INFO  (TEST-SolrCloudExampleTest.testLoadDocsIntoGettingStartedCollection-seed#[B8E94E767B6F8132]) [    ] o.a.s.c.c.SolrZkClient Using default ZkACLProvider
   [junit4]   2> 2680460 INFO  (zkCallback-2288-thread-1-processing-n:127.0.0.1:59544_aei%2Ffr) [n:127.0.0.1:59544_aei%2Ffr    ] o.a.s.c.DistributedQueue NodeChildrenChanged fired on path /overseer/queue state SyncConnected
   [junit4]   2> 2680461 WARN  (NIOServerCxn.Factory:0.0.0.0/0.0.0.0:0) [    ] o.a.z.s.NIOServerCnxn caught end of stream exception
   [junit4]   2> EndOfStreamException: Unable to read additional data from client sessionid 0x14eecf4e7fe0005, likely client has closed socket
   [junit4]   2> 	at org.apache.zookeeper.server.NIOServerCnxn.doIO(NIOServerCnxn.java:228)
   [junit4]   2> 	at org.apache.zookeeper.server.NIOServerCnxnFactory.run(NIOServerCnxnFactory.java:208)
   [junit4]   2> 	at java.lang.Thread.run(Thread.java:745)
   [junit4]   2> 2680462 INFO  (OverseerStateUpdate-94273178829717507-127.0.0.1:59544_aei%2Ffr-n_0000000000) [n:127.0.0.1:59544_aei%2Ffr    ] o.a.s.c.Overseer processMessage: queueSize: 1, message = {
   [junit4]   2>   "operation":"create",
   [junit4]   2>   "name":"collection1",
   [junit4]   2>   "numShards":"2",
   [junit4]   2>   "stateFormat":"2"} current state version: 4
   [junit4]   2> 2680464 INFO  (OverseerStateUpdate-94273178829717507-127.0.0.1:59544_aei%2Ffr-n_0000000000) [n:127.0.0.1:59544_aei%2Ffr    ] o.a.s.c.o.ClusterStateMutator building a new cName: collection1
   [junit4]   2> 2680576 INFO  (OverseerStateUpdate-94273178829717507-127.0.0.1:59544_aei%2Ffr-n_0000000000) [n:127.0.0.1:59544_aei%2Ffr    ] o.a.s.c.o.ZkStateWriter going to create_collection /collections/collection1/state.json
   [junit4]   2> 2680577 INFO  (zkCallback-2288-thread-1-processing-n:127.0.0.1:59544_aei%2Ffr) [n:127.0.0.1:59544_aei%2Ffr    ] o.a.s.c.c.ZkStateReader A cluster state change: WatchedEvent state:SyncConnected type:NodeDataChanged path:/clusterstate.json, has occurred - updating... (live nodes size: 1)
   [junit4]   2> 2680577 INFO  (zkCallback-2290-thread-1) [    ] o.a.s.c.c.ZkStateReader A cluster state change: WatchedEvent state:SyncConnected type:NodeDataChanged path:/clusterstate.json, has occurred - updating... (live nodes size: 1)
   [junit4]   2> 2680582 INFO  (zkCallback-2290-thread-1) [    ] o.a.s.c.c.ZkStateReader Updated cluster state version to 5
   [junit4]   2> 2680583 INFO  (zkCallback-2288-thread-1-processing-n:127.0.0.1:59544_aei%2Ffr) [n:127.0.0.1:59544_aei%2Ffr    ] o.a.s.c.c.ZkStateReader Updated cluster state version to 5
   [junit4]   2> 2680932 INFO  (TEST-SolrCloudExampleTest.testLoadDocsIntoGettingStartedCollection-seed#[B8E94E767B6F8132]) [    ] o.a.s.SolrTestCaseJ4 Writing core.properties file to C:\Users\JenkinsSlave\workspace\Lucene-Solr-5.x-Windows\solr\build\solr-core\test\J0\temp\solr.cloud.SolrCloudExampleTest_B8E94E767B6F8132-001\shard-1-001\cores\collection1
   [junit4]   2> 2680934 INFO  (TEST-SolrCloudExampleTest.testLoadDocsIntoGettingStartedCollection-seed#[B8E94E767B6F8132]) [    ] o.a.s.c.AbstractFullDistribZkTestBase create jetty 1 in directory C:\Users\JenkinsSlave\workspace\Lucene-Solr-5.x-Windows\solr\build\solr-core\test\J0\temp\solr.cloud.SolrCloudExampleTest_B8E94E767B6F8132-001\shard-1-001
   [junit4]   2> 2680934 INFO  (TEST-SolrCloudExampleTest.testLoadDocsIntoGettingStartedCollection-seed#[B8E94E767B6F8132]) [    ] o.e.j.s.Server jetty-9.2.11.v20150529
   [junit4]   2> 2680937 INFO  (TEST-SolrCloudExampleTest.testLoadDocsIntoGettingStartedCollection-seed#[B8E94E767B6F8132]) [    ] o.e.j.s.h.ContextHandler Started o.e.j.s.ServletContextHandler@f46c7{/aei/fr,null,AVAILABLE}
   [junit4]   2> 2680938 INFO  (TEST-SolrCloudExampleTest.testLoadDocsIntoGettingStartedCollection-seed#[B8E94E767B6F8132]) [    ] o.e.j.s.ServerConnector Started ServerConnector@efc135{HTTP/1.1}{127.0.0.1:59559}
   [junit4]   2> 2680938 INFO  (TEST-SolrCloudExampleTest.testLoadDocsIntoGettingStartedCollection-seed#[B8E94E767B6F8132]) [    ] o.e.j.s.Server Started @2684277ms
   [junit4]   2> 2680938 INFO  (TEST-SolrCloudExampleTest.testLoadDocsIntoGettingStartedCollection-seed#[B8E94E767B6F8132]) [    ] o.a.s.c.s.e.JettySolrRunner Jetty properties: {solrconfig=solrconfig.xml, coreRootDirectory=C:\Users\JenkinsSlave\workspace\Lucene-Solr-5.x-Windows\solr\build\solr-core\test\J0\temp\solr.cloud.SolrCloudExampleTest_B8E94E767B6F8132-001\shard-1-001\cores, hostContext=/aei/fr, solr.data.dir=C:\Users\JenkinsSlave\workspace\Lucene-Solr-5.x-Windows\solr\build\solr-core\test\J0\temp\solr.cloud.SolrCloudExampleTest_B8E94E767B6F8132-001\tempDir-001/jetty1, hostPort=59559}
   [junit4]   2> 2680939 INFO  (TEST-SolrCloudExampleTest.testLoadDocsIntoGettingStartedCollection-seed#[B8E94E767B6F8132]) [    ] o.a.s.s.SolrDispatchFilter SolrDispatchFilter.init(): sun.misc.Launcher$AppClassLoader@1ed7524
   [junit4]   2> 2680939 INFO  (TEST-SolrCloudExampleTest.testLoadDocsIntoGettingStartedCollection-seed#[B8E94E767B6F8132]) [    ] o.a.s.c.SolrResourceLoader new SolrResourceLoader for directory: 'C:\Users\JenkinsSlave\workspace\Lucene-Solr-5.x-Windows\solr\build\solr-core\test\J0\temp\solr.cloud.SolrCloudExampleTest_B8E94E767B6F8132-001\shard-1-001\'
   [junit4]   2> 2680973 INFO  (TEST-SolrCloudExampleTest.testLoadDocsIntoGettingStartedCollection-seed#[B8E94E767B6F8132]) [    ] o.a.s.c.SolrXmlConfig Loading container configuration from C:\Users\JenkinsSlave\workspace\Lucene-Solr-5.x-Windows\solr\build\solr-core\test\J0\temp\solr.cloud.SolrCloudExampleTest_B8E94E767B6F8132-001\shard-1-001\solr.xml
   [junit4]   2> 2681031 INFO  (TEST-SolrCloudExampleTest.testLoadDocsIntoGettingStartedCollection-seed#[B8E94E767B6F8132]) [    ] o.a.s.c.CoresLocator Config-defined core root directory: C:\Users\JenkinsSlave\workspace\Lucene-Solr-5.x-Windows\solr\build\solr-core\test\J0\temp\solr.cloud.SolrCloudExampleTest_B8E94E767B6F8132-001\shard-1-001\cores
   [junit4]   2> 2681031 INFO  (TEST-SolrCloudExampleTest.testLoadDocsIntoGettingStartedCollection-seed#[B8E94E767B6F8132]) [    ] o.a.s.c.CoreContainer New CoreContainer 7966775
   [junit4]   2> 2681031 INFO  (TEST-SolrCloudExampleTest.testLoadDocsIntoGettingStartedCollection-seed#[B8E94E767B6F8132]) [    ] o.a.s.c.CoreContainer Loading cores into CoreContainer [instanceDir=C:\Users\JenkinsSlave\workspace\Lucene-Solr-5.x-Windows\solr\build\solr-core\test\J0\temp\solr.cloud.SolrCloudExampleTest_B8E94E767B6F8132-001\shard-1-001\]
   [junit4]   2> 2681031 INFO  (TEST-SolrCloudExampleTest.testLoadDocsIntoGettingStartedCollection-seed#[B8E94E767B6F8132]) [    ] o.a.s.c.CoreContainer loading shared library: C:\Users\JenkinsSlave\workspace\Lucene-Solr-5.x-Windows\solr\build\solr-core\test\J0\temp\solr.cloud.SolrCloudExampleTest_B8E94E767B6F8132-001\shard-1-001\lib
   [junit4]   2> 2681031 WARN  (TEST-SolrCloudExampleTest.testLoadDocsIntoGettingStartedCollection-seed#[B8E94E767B6F8132]) [    ] o.a.s.c.SolrResourceLoader Can't find (or read) directory to add to classloader: lib (resolved as: C:\Users\JenkinsSlave\workspace\Lucene-Solr-5.x-Windows\solr\build\solr-core\test\J0\temp\solr.cloud.SolrCloudExampleTest_B8E94E767B6F8132-001\shard-1-001\lib).
   [junit4]   2> 2681040 INFO  (TEST-SolrCloudExampleTest.testLoadDocsIntoGettingStartedCollection-seed#[B8E94E767B6F8132]) [    ] o.a.s.h.c.HttpShardHandlerFactory created with socketTimeout : 90000,urlScheme : ,connTimeout : 15000,maxConnectionsPerHost : 20,maxConnections : 10000,corePoolSize : 0,maximumPoolSize : 2147483647,maxThreadIdleTime : 5,sizeOfQueue : -1,fairnessPolicy : false,useRetries : false,
   [junit4]   2> 2681044 INFO  (TEST-SolrCloudExampleTest.testLoadDocsIntoGettingStartedCollection-seed#[B8E94E767B6F8132]) [    ] o.a.s.u.UpdateShardHandler Creating UpdateShardHandler HTTP client with params: socketTimeout=340000&connTimeout=45000&retry=true
   [junit4]   2> 2681045 INFO  (TEST-SolrCloudExampleTest.testLoadDocsIntoGettingStartedCollection-seed#[B8E94E767B6F8132]) [    ] o.a.s.l.LogWatcher SLF4J impl is org.slf4j.impl.Log4jLoggerFactory
   [junit4]   2> 2681045 INFO  (TEST-SolrCloudExampleTest.testLoadDocsIntoGettingStartedCollection-seed#[B8E94E767B6F8132]) [    ] o.a.s.l.LogWatcher Registering Log Listener [Log4j (org.slf4j.impl.Log4jLoggerFactory)]
   [junit4]   2> 2681045 INFO  (TEST-SolrCloudExampleTest.testLoadDocsIntoGettingStartedCollection-seed#[B8E94E767B6F8132]) [    ] o.a.s.c.ZkContainer Zookeeper client=127.0.0.1:59537/solr
   [junit4]   2> 2681045 INFO  (TEST-SolrCloudExampleTest.testLoadDocsIntoGettingStartedCollection-seed#[B8E94E767B6F8132]) [    ] o.a.s.c.ZkController zkHost includes chroot
   [junit4]   2> 2681045 INFO  (TEST-SolrCloudExampleTest.testLoadDocsIntoGettingStartedCollection-seed#[B8E94E767B6F8132]) [    ] o.a.s.c.c.SolrZkClient Using default ZkCredentialsProvider
   [junit4]   2> 2681046 INFO  (TEST-SolrCloudExampleTest.testLoadDocsIntoGettingStartedCollection-seed#[B8E94E767B6F8132]) [    ] o.a.s.c.c.ConnectionManager Waiting for client to connect to ZooKeeper
   [junit4]   2> 2681048 INFO  (zkCallback-2293-thread-1) [    ] o.a.s.c.c.ConnectionManager Watcher org.apache.solr.common.cloud.ConnectionManager@fae4a9 name:ZooKeeperConnection Watcher:127.0.0.1:59537 got event WatchedEvent state:SyncConnected type:None path:null path:null type:None
   [junit4]   2> 2681048 INFO  (TEST-SolrCloudExampleTest.testLoadDocsIntoGettingStartedCollection-seed#[B8E94E767B6F8132]) [    ] o.a.s.c.c.ConnectionManager Client is connected to ZooKeeper
   [junit4]   2> 2681049 INFO  (TEST-SolrCloudExampleTest.testLoadDocsIntoGettingStartedCollection-seed#[B8E94E767B6F8132]) [    ] o.a.s.c.c.SolrZkClient Using default ZkACLProvider
   [junit4]   2> 2681051 INFO  (TEST-SolrCloudExampleTest.testLoadDocsIntoGettingStartedCollection-seed#[B8E94E767B6F8132]) [n:127.0.0.1:59559_aei%2Ffr    ] o.a.s.c.c.ConnectionManager Waiting for client to connect to ZooKeeper
   [junit4]   2> 2681053 INFO  (zkCallback-2294-thread-1-processing-n:127.0.0.1:59559_aei%2Ffr) [n:127.0.0.1:59559_aei%2Ffr    ] o.a.s.c.c.ConnectionManager Watcher org.apache.solr.comm

[...truncated too long message...]

dResource, TestRandomMergePolicy, LeaderInitiatedRecoveryOnCommitTest, DistributedFacetPivotLargeTest, TestInitQParser, BigEndianAscendingWordDeserializerTest, TestManagedSchemaDynamicFieldResource, TestEmbeddedSolrServerConstructors, XmlUpdateRequestHandlerTest, TestCoreContainer, PeerSyncTest, TestLFUCache, TestXIncludeConfig, RequestHandlersTest, TestLazyCores, SortByFunctionTest, UnloadDistributedZkTest, SolrCoreTest, SyncSliceTest, TestSchemaResource, HdfsBasicDistributedZkTest, TestSurroundQueryParser, ShardRoutingCustomTest, AutoCommitTest, TermVectorComponentDistributedTest, TestRealTimeGet, TestJoin, TestStressVersions, TestRangeQuery, SpellCheckComponentTest, BadIndexSchemaTest, DirectUpdateHandlerTest, TestIndexSearcher, ShowFileRequestHandlerTest, SolrIndexSplitterTest, SimplePostToolTest, SignatureUpdateProcessorFactoryTest, SpellCheckCollatorTest, CoreAdminHandlerTest, TestStressLucene, TestTrie, SpatialFilterTest, TestCSVLoader, TestUpdate, DefaultValueUpdateProcessorTest, TestSolrDeletionPolicy1, XsltUpdateRequestHandlerTest, CacheHeaderTest, DisMaxRequestHandlerTest, TestQueryUtils, DirectSolrSpellCheckerTest, TermsComponentTest, TermVectorComponentTest, TestArbitraryIndexDir, IndexSchemaRuntimeFieldTest, RegexBoostProcessorTest, IndexSchemaTest, JSONWriterTest, QueryParsingTest, UniqFieldsUpdateProcessorFactoryTest, TestComponentsName, HighlighterConfigTest, TestQuerySenderListener, BadComponentTest, TestDocSet, NumericFieldsTest, TestFuzzyAnalyzedSuggestions, TestPostingsSolrHighlighter, TestCodecSupport, TestDFRSimilarityFactory, TestFastWriter, TimeZoneUtilsTest, URLClassifyProcessorTest, PreAnalyzedFieldTest, TestSuggestSpellingConverter, DOMUtilTest, RAMDirectoryFactoryTest, ClusterStateTest, TestSolrJ, TestLRUCache, SliceStateTest, UUIDFieldTest, FileUtilsTest, CircularListTest, DistributedMLTComponentTest, DistributedIntervalFacetingTest, SolrTestCaseJ4Test, TestTolerantSearch, TestJettySolrRunner, AssignTest, AsyncMigrateRouteKeyTest, CollectionReloadTest, ConcurrentDeleteAndCreateCollectionTest, DeleteInactiveReplicaTest, DistributedQueueTest, MultiThreadedOCPTest, RecoveryAfterSoftCommitTest, RemoteQueryErrorTest, SSLMigrationTest, SaslZkACLProviderTest, SharedFSAutoReplicaFailoverTest, SharedFSAutoReplicaFailoverUtilsTest, SimpleCollectionCreateDeleteTest, SolrCloudExampleTest]
   [junit4]   2> NOTE: reproduce with: ant test  -Dtestcase=SolrCloudExampleTest -Dtests.seed=B8E94E767B6F8132 -Dtests.slow=true -Dtests.locale=is_IS -Dtests.timezone=Antarctica/Palmer -Dtests.asserts=true -Dtests.file.encoding=US-ASCII
   [junit4] ERROR   0.00s J0 | SolrCloudExampleTest (suite) <<<
   [junit4]    > Throwable #1: java.lang.AssertionError: ERROR: SolrIndexSearcher opens=22 closes=21
   [junit4]    > 	at __randomizedtesting.SeedInfo.seed([B8E94E767B6F8132]:0)
   [junit4]    > 	at org.apache.solr.SolrTestCaseJ4.endTrackingSearchers(SolrTestCaseJ4.java:472)
   [junit4]    > 	at org.apache.solr.SolrTestCaseJ4.afterClass(SolrTestCaseJ4.java:238)
   [junit4]    > 	at java.lang.Thread.run(Thread.java:745)Throwable #2: java.io.IOException: Could not remove the following files (in the order of attempts):
   [junit4]    >    C:\Users\JenkinsSlave\workspace\Lucene-Solr-5.x-Windows\solr\build\solr-core\test\J0\temp\solr.cloud.SolrCloudExampleTest_B8E94E767B6F8132-001\shard-3-001\cores\gettingstarted_shard2_replica1\data\tlog\tlog.0000000000000000001: java.nio.file.FileSystemException: C:\Users\JenkinsSlave\workspace\Lucene-Solr-5.x-Windows\solr\build\solr-core\test\J0\temp\solr.cloud.SolrCloudExampleTest_B8E94E767B6F8132-001\shard-3-001\cores\gettingstarted_shard2_replica1\data\tlog\tlog.0000000000000000001: The process cannot access the file because it is being used by another process.
   [junit4]    >    C:\Users\JenkinsSlave\workspace\Lucene-Solr-5.x-Windows\solr\build\solr-core\test\J0\temp\solr.cloud.SolrCloudExampleTest_B8E94E767B6F8132-001\shard-3-001\cores\gettingstarted_shard2_replica1\data\tlog: java.nio.file.DirectoryNotEmptyException: C:\Users\JenkinsSlave\workspace\Lucene-Solr-5.x-Windows\solr\build\solr-core\test\J0\temp\solr.cloud.SolrCloudExampleTest_B8E94E767B6F8132-001\shard-3-001\cores\gettingstarted_shard2_replica1\data\tlog
   [junit4]    >    C:\Users\JenkinsSlave\workspace\Lucene-Solr-5.x-Windows\solr\build\solr-core\test\J0\temp\solr.cloud.SolrCloudExampleTest_B8E94E767B6F8132-001\shard-3-001\cores\gettingstarted_shard2_replica1\data: java.nio.file.DirectoryNotEmptyException: C:\Users\JenkinsSlave\workspace\Lucene-Solr-5.x-Windows\solr\build\solr-core\test\J0\temp\solr.cloud.SolrCloudExampleTest_B8E94E767B6F8132-001\shard-3-001\cores\gettingstarted_shard2_replica1\data
   [junit4]    >    C:\Users\JenkinsSlave\workspace\Lucene-Solr-5.x-Windows\solr\build\solr-core\test\J0\temp\solr.cloud.SolrCloudExampleTest_B8E94E767B6F8132-001\shard-3-001\cores\gettingstarted_shard2_replica1: java.nio.file.DirectoryNotEmptyException: C:\Users\JenkinsSlave\workspace\Lucene-Solr-5.x-Windows\solr\build\solr-core\test\J0\temp\solr.cloud.SolrCloudExampleTest_B8E94E767B6F8132-001\shard-3-001\cores\gettingstarted_shard2_replica1
   [junit4]    >    C:\Users\JenkinsSlave\workspace\Lucene-Solr-5.x-Windows\solr\build\solr-core\test\J0\temp\solr.cloud.SolrCloudExampleTest_B8E94E767B6F8132-001\shard-3-001\cores: java.nio.file.DirectoryNotEmptyException: C:\Users\JenkinsSlave\workspace\Lucene-Solr-5.x-Windows\solr\build\solr-core\test\J0\temp\solr.cloud.SolrCloudExampleTest_B8E94E767B6F8132-001\shard-3-001\cores
   [junit4]    >    C:\Users\JenkinsSlave\workspace\Lucene-Solr-5.x-Windows\solr\build\solr-core\test\J0\temp\solr.cloud.SolrCloudExampleTest_B8E94E767B6F8132-001\shard-3-001: java.nio.file.DirectoryNotEmptyException: C:\Users\JenkinsSlave\workspace\Lucene-Solr-5.x-Windows\solr\build\solr-core\test\J0\temp\solr.cloud.SolrCloudExampleTest_B8E94E767B6F8132-001\shard-3-001
   [junit4]    >    C:\Users\JenkinsSlave\workspace\Lucene-Solr-5.x-Windows\solr\build\solr-core\test\J0\temp\solr.cloud.SolrCloudExampleTest_B8E94E767B6F8132-001: java.nio.file.DirectoryNotEmptyException: C:\Users\JenkinsSlave\workspace\Lucene-Solr-5.x-Windows\solr\build\solr-core\test\J0\temp\solr.cloud.SolrCloudExampleTest_B8E94E767B6F8132-001
   [junit4]    > 	at org.apache.lucene.util.IOUtils.rm(IOUtils.java:295)
   [junit4]    > 	at java.lang.Thread.run(Thread.java:745)Throwable #3: com.carrotsearch.randomizedtesting.ThreadLeakError: 1 thread leaked from SUITE scope at org.apache.solr.cloud.SolrCloudExampleTest: 
   [junit4]    >    1) Thread[id=15138, name=searcherExecutor-6551-thread-1, state=WAITING, group=TGRP-SolrCloudExampleTest]
   [junit4]    >         at sun.misc.Unsafe.park(Native Method)
   [junit4]    >         at java.util.concurrent.locks.LockSupport.park(LockSupport.java:186)
   [junit4]    >         at java.util.concurrent.locks.AbstractQueuedSynchronizer$ConditionObject.await(AbstractQueuedSynchronizer.java:2043)
   [junit4]    >         at java.util.concurrent.LinkedBlockingQueue.take(LinkedBlockingQueue.java:442)
   [junit4]    >         at java.util.concurrent.ThreadPoolExecutor.getTask(ThreadPoolExecutor.java:1068)
   [junit4]    >         at java.util.concurrent.ThreadPoolExecutor.runWorker(ThreadPoolExecutor.java:1130)
   [junit4]    >         at java.util.concurrent.ThreadPoolExecutor$Worker.run(ThreadPoolExecutor.java:615)
   [junit4]    >         at java.lang.Thread.run(Thread.java:745)
   [junit4]    > 	at __randomizedtesting.SeedInfo.seed([B8E94E767B6F8132]:0)Throwable #4: com.carrotsearch.randomizedtesting.ThreadLeakError: There are still zombie threads that couldn't be terminated:
   [junit4]    >    1) Thread[id=15138, name=searcherExecutor-6551-thread-1, state=WAITING, group=TGRP-SolrCloudExampleTest]
   [junit4]    >         at sun.misc.Unsafe.park(Native Method)
   [junit4]    >         at java.util.concurrent.locks.LockSupport.park(LockSupport.java:186)
   [junit4]    >         at java.util.concurrent.locks.AbstractQueuedSynchronizer$ConditionObject.await(AbstractQueuedSynchronizer.java:2043)
   [junit4]    >         at java.util.concurrent.LinkedBlockingQueue.take(LinkedBlockingQueue.java:442)
   [junit4]    >         at java.util.concurrent.ThreadPoolExecutor.getTask(ThreadPoolExecutor.java:1068)
   [junit4]    >         at java.util.concurrent.ThreadPoolExecutor.runWorker(ThreadPoolExecutor.java:1130)
   [junit4]    >         at java.util.concurrent.ThreadPoolExecutor$Worker.run(ThreadPoolExecutor.java:615)
   [junit4]    >         at java.lang.Thread.run(Thread.java:745)
   [junit4]    > 	at __randomizedtesting.SeedInfo.seed([B8E94E767B6F8132]:0)
   [junit4] Completed [426/522] on J0 in 196.76s, 1 test, 1 failure, 3 errors <<< FAILURES!

[...truncated 300 lines...]
BUILD FAILED
C:\Users\JenkinsSlave\workspace\Lucene-Solr-5.x-Windows\build.xml:726: The following error occurred while executing this line:
C:\Users\JenkinsSlave\workspace\Lucene-Solr-5.x-Windows\build.xml:670: The following error occurred while executing this line:
C:\Users\JenkinsSlave\workspace\Lucene-Solr-5.x-Windows\build.xml:59: The following error occurred while executing this line:
C:\Users\JenkinsSlave\workspace\Lucene-Solr-5.x-Windows\solr\build.xml:230: The following error occurred while executing this line:
C:\Users\JenkinsSlave\workspace\Lucene-Solr-5.x-Windows\solr\common-build.xml:524: The following error occurred while executing this line:
C:\Users\JenkinsSlave\workspace\Lucene-Solr-5.x-Windows\lucene\common-build.xml:1449: The following error occurred while executing this line:
C:\Users\JenkinsSlave\workspace\Lucene-Solr-5.x-Windows\lucene\common-build.xml:1003: There were test failures: 522 suites, 2078 tests, 4 suite-level errors, 349 ignored (39 assumptions)

Total time: 68 minutes 46 seconds
Build step 'Invoke Ant' marked build as failure
Archiving artifacts
Recording test results
Email was triggered for: Failure - Any
Sending email for trigger: Failure - Any



Mime
View raw message