lucene-dev mailing list archives

Site index · List index
Message view « Date » · « Thread »
Top « Date » · « Thread »
From Policeman Jenkins Server <jenk...@thetaphi.de>
Subject [JENKINS] Lucene-Solr-trunk-Linux (64bit/jdk1.8.0_51) - Build # 13710 - Failure!
Date Mon, 03 Aug 2015 04:36:21 GMT
Build: http://jenkins.thetaphi.de/job/Lucene-Solr-trunk-Linux/13710/
Java: 64bit/jdk1.8.0_51 -XX:-UseCompressedOops -XX:+UseSerialGC

2 tests failed.
FAILED:  org.apache.solr.cloud.CdcrReplicationHandlerTest.doTest

Error Message:
There are still nodes recoverying - waited for 330 seconds

Stack Trace:
java.lang.AssertionError: There are still nodes recoverying - waited for 330 seconds
	at __randomizedtesting.SeedInfo.seed([C75661F707DC4B01:6012D9536A6758B8]:0)
	at org.junit.Assert.fail(Assert.java:93)
	at org.apache.solr.cloud.AbstractDistribZkTestBase.waitForRecoveriesToFinish(AbstractDistribZkTestBase.java:172)
	at org.apache.solr.cloud.AbstractDistribZkTestBase.waitForRecoveriesToFinish(AbstractDistribZkTestBase.java:133)
	at org.apache.solr.cloud.AbstractDistribZkTestBase.waitForRecoveriesToFinish(AbstractDistribZkTestBase.java:128)
	at org.apache.solr.cloud.BaseCdcrDistributedZkTest.waitForRecoveriesToFinish(BaseCdcrDistributedZkTest.java:465)
	at org.apache.solr.cloud.BaseCdcrDistributedZkTest.clearSourceCollection(BaseCdcrDistributedZkTest.java:319)
	at org.apache.solr.cloud.CdcrReplicationHandlerTest.doTestPartialReplication(CdcrReplicationHandlerTest.java:86)
	at org.apache.solr.cloud.CdcrReplicationHandlerTest.doTest(CdcrReplicationHandlerTest.java:51)
	at sun.reflect.NativeMethodAccessorImpl.invoke0(Native Method)
	at sun.reflect.NativeMethodAccessorImpl.invoke(NativeMethodAccessorImpl.java:62)
	at sun.reflect.DelegatingMethodAccessorImpl.invoke(DelegatingMethodAccessorImpl.java:43)
	at java.lang.reflect.Method.invoke(Method.java:497)
	at com.carrotsearch.randomizedtesting.RandomizedRunner.invoke(RandomizedRunner.java:1627)
	at com.carrotsearch.randomizedtesting.RandomizedRunner$6.evaluate(RandomizedRunner.java:836)
	at com.carrotsearch.randomizedtesting.RandomizedRunner$7.evaluate(RandomizedRunner.java:872)
	at com.carrotsearch.randomizedtesting.RandomizedRunner$8.evaluate(RandomizedRunner.java:886)
	at org.apache.solr.BaseDistributedSearchTestCase$ShardsRepeatRule$ShardsFixedStatement.callStatement(BaseDistributedSearchTestCase.java:966)
	at org.apache.solr.BaseDistributedSearchTestCase$ShardsRepeatRule$ShardsStatement.evaluate(BaseDistributedSearchTestCase.java:941)
	at com.carrotsearch.randomizedtesting.rules.SystemPropertiesRestoreRule$1.evaluate(SystemPropertiesRestoreRule.java:57)
	at org.apache.lucene.util.TestRuleSetupTeardownChained$1.evaluate(TestRuleSetupTeardownChained.java:50)
	at org.apache.lucene.util.AbstractBeforeAfterRule$1.evaluate(AbstractBeforeAfterRule.java:46)
	at org.apache.lucene.util.TestRuleThreadAndTestName$1.evaluate(TestRuleThreadAndTestName.java:49)
	at org.apache.lucene.util.TestRuleIgnoreAfterMaxFailures$1.evaluate(TestRuleIgnoreAfterMaxFailures.java:65)
	at org.apache.lucene.util.TestRuleMarkFailure$1.evaluate(TestRuleMarkFailure.java:48)
	at com.carrotsearch.randomizedtesting.rules.StatementAdapter.evaluate(StatementAdapter.java:36)
	at com.carrotsearch.randomizedtesting.ThreadLeakControl$StatementRunner.run(ThreadLeakControl.java:365)
	at com.carrotsearch.randomizedtesting.ThreadLeakControl.forkTimeoutingTask(ThreadLeakControl.java:798)
	at com.carrotsearch.randomizedtesting.ThreadLeakControl$3.evaluate(ThreadLeakControl.java:458)
	at com.carrotsearch.randomizedtesting.RandomizedRunner.runSingleTest(RandomizedRunner.java:845)
	at com.carrotsearch.randomizedtesting.RandomizedRunner$3.evaluate(RandomizedRunner.java:747)
	at com.carrotsearch.randomizedtesting.RandomizedRunner$4.evaluate(RandomizedRunner.java:781)
	at com.carrotsearch.randomizedtesting.RandomizedRunner$5.evaluate(RandomizedRunner.java:792)
	at com.carrotsearch.randomizedtesting.rules.StatementAdapter.evaluate(StatementAdapter.java:36)
	at com.carrotsearch.randomizedtesting.rules.SystemPropertiesRestoreRule$1.evaluate(SystemPropertiesRestoreRule.java:57)
	at org.apache.lucene.util.AbstractBeforeAfterRule$1.evaluate(AbstractBeforeAfterRule.java:46)
	at com.carrotsearch.randomizedtesting.rules.StatementAdapter.evaluate(StatementAdapter.java:36)
	at org.apache.lucene.util.TestRuleStoreClassName$1.evaluate(TestRuleStoreClassName.java:42)
	at com.carrotsearch.randomizedtesting.rules.NoShadowingOrOverridesOnMethodsRule$1.evaluate(NoShadowingOrOverridesOnMethodsRule.java:39)
	at com.carrotsearch.randomizedtesting.rules.NoShadowingOrOverridesOnMethodsRule$1.evaluate(NoShadowingOrOverridesOnMethodsRule.java:39)
	at com.carrotsearch.randomizedtesting.rules.StatementAdapter.evaluate(StatementAdapter.java:36)
	at com.carrotsearch.randomizedtesting.rules.StatementAdapter.evaluate(StatementAdapter.java:36)
	at com.carrotsearch.randomizedtesting.rules.StatementAdapter.evaluate(StatementAdapter.java:36)
	at org.apache.lucene.util.TestRuleAssertionsRequired$1.evaluate(TestRuleAssertionsRequired.java:54)
	at org.apache.lucene.util.TestRuleMarkFailure$1.evaluate(TestRuleMarkFailure.java:48)
	at org.apache.lucene.util.TestRuleIgnoreAfterMaxFailures$1.evaluate(TestRuleIgnoreAfterMaxFailures.java:65)
	at org.apache.lucene.util.TestRuleIgnoreTestSuites$1.evaluate(TestRuleIgnoreTestSuites.java:55)
	at com.carrotsearch.randomizedtesting.rules.StatementAdapter.evaluate(StatementAdapter.java:36)
	at com.carrotsearch.randomizedtesting.ThreadLeakControl$StatementRunner.run(ThreadLeakControl.java:365)
	at java.lang.Thread.run(Thread.java:745)


FAILED:  org.apache.solr.cloud.ChaosMonkeySafeLeaderTest.test

Error Message:
expected:<0> but was:<2>

Stack Trace:
java.lang.AssertionError: expected:<0> but was:<2>
	at __randomizedtesting.SeedInfo.seed([C75661F707DC4B01:4F025E2DA92026F9]:0)
	at org.junit.Assert.fail(Assert.java:93)
	at org.junit.Assert.failNotEquals(Assert.java:647)
	at org.junit.Assert.assertEquals(Assert.java:128)
	at org.junit.Assert.assertEquals(Assert.java:472)
	at org.junit.Assert.assertEquals(Assert.java:456)
	at org.apache.solr.cloud.ChaosMonkeySafeLeaderTest.test(ChaosMonkeySafeLeaderTest.java:156)
	at sun.reflect.NativeMethodAccessorImpl.invoke0(Native Method)
	at sun.reflect.NativeMethodAccessorImpl.invoke(NativeMethodAccessorImpl.java:62)
	at sun.reflect.DelegatingMethodAccessorImpl.invoke(DelegatingMethodAccessorImpl.java:43)
	at java.lang.reflect.Method.invoke(Method.java:497)
	at com.carrotsearch.randomizedtesting.RandomizedRunner.invoke(RandomizedRunner.java:1627)
	at com.carrotsearch.randomizedtesting.RandomizedRunner$6.evaluate(RandomizedRunner.java:836)
	at com.carrotsearch.randomizedtesting.RandomizedRunner$7.evaluate(RandomizedRunner.java:872)
	at com.carrotsearch.randomizedtesting.RandomizedRunner$8.evaluate(RandomizedRunner.java:886)
	at org.apache.solr.BaseDistributedSearchTestCase$ShardsRepeatRule$ShardsFixedStatement.callStatement(BaseDistributedSearchTestCase.java:966)
	at org.apache.solr.BaseDistributedSearchTestCase$ShardsRepeatRule$ShardsStatement.evaluate(BaseDistributedSearchTestCase.java:941)
	at com.carrotsearch.randomizedtesting.rules.SystemPropertiesRestoreRule$1.evaluate(SystemPropertiesRestoreRule.java:57)
	at org.apache.lucene.util.TestRuleSetupTeardownChained$1.evaluate(TestRuleSetupTeardownChained.java:50)
	at org.apache.lucene.util.AbstractBeforeAfterRule$1.evaluate(AbstractBeforeAfterRule.java:46)
	at org.apache.lucene.util.TestRuleThreadAndTestName$1.evaluate(TestRuleThreadAndTestName.java:49)
	at org.apache.lucene.util.TestRuleIgnoreAfterMaxFailures$1.evaluate(TestRuleIgnoreAfterMaxFailures.java:65)
	at org.apache.lucene.util.TestRuleMarkFailure$1.evaluate(TestRuleMarkFailure.java:48)
	at com.carrotsearch.randomizedtesting.rules.StatementAdapter.evaluate(StatementAdapter.java:36)
	at com.carrotsearch.randomizedtesting.ThreadLeakControl$StatementRunner.run(ThreadLeakControl.java:365)
	at com.carrotsearch.randomizedtesting.ThreadLeakControl.forkTimeoutingTask(ThreadLeakControl.java:798)
	at com.carrotsearch.randomizedtesting.ThreadLeakControl$3.evaluate(ThreadLeakControl.java:458)
	at com.carrotsearch.randomizedtesting.RandomizedRunner.runSingleTest(RandomizedRunner.java:845)
	at com.carrotsearch.randomizedtesting.RandomizedRunner$3.evaluate(RandomizedRunner.java:747)
	at com.carrotsearch.randomizedtesting.RandomizedRunner$4.evaluate(RandomizedRunner.java:781)
	at com.carrotsearch.randomizedtesting.RandomizedRunner$5.evaluate(RandomizedRunner.java:792)
	at com.carrotsearch.randomizedtesting.rules.StatementAdapter.evaluate(StatementAdapter.java:36)
	at com.carrotsearch.randomizedtesting.rules.SystemPropertiesRestoreRule$1.evaluate(SystemPropertiesRestoreRule.java:57)
	at org.apache.lucene.util.AbstractBeforeAfterRule$1.evaluate(AbstractBeforeAfterRule.java:46)
	at com.carrotsearch.randomizedtesting.rules.StatementAdapter.evaluate(StatementAdapter.java:36)
	at org.apache.lucene.util.TestRuleStoreClassName$1.evaluate(TestRuleStoreClassName.java:42)
	at com.carrotsearch.randomizedtesting.rules.NoShadowingOrOverridesOnMethodsRule$1.evaluate(NoShadowingOrOverridesOnMethodsRule.java:39)
	at com.carrotsearch.randomizedtesting.rules.NoShadowingOrOverridesOnMethodsRule$1.evaluate(NoShadowingOrOverridesOnMethodsRule.java:39)
	at com.carrotsearch.randomizedtesting.rules.StatementAdapter.evaluate(StatementAdapter.java:36)
	at com.carrotsearch.randomizedtesting.rules.StatementAdapter.evaluate(StatementAdapter.java:36)
	at com.carrotsearch.randomizedtesting.rules.StatementAdapter.evaluate(StatementAdapter.java:36)
	at org.apache.lucene.util.TestRuleAssertionsRequired$1.evaluate(TestRuleAssertionsRequired.java:54)
	at org.apache.lucene.util.TestRuleMarkFailure$1.evaluate(TestRuleMarkFailure.java:48)
	at org.apache.lucene.util.TestRuleIgnoreAfterMaxFailures$1.evaluate(TestRuleIgnoreAfterMaxFailures.java:65)
	at org.apache.lucene.util.TestRuleIgnoreTestSuites$1.evaluate(TestRuleIgnoreTestSuites.java:55)
	at com.carrotsearch.randomizedtesting.rules.StatementAdapter.evaluate(StatementAdapter.java:36)
	at com.carrotsearch.randomizedtesting.ThreadLeakControl$StatementRunner.run(ThreadLeakControl.java:365)
	at java.lang.Thread.run(Thread.java:745)




Build Log:
[...truncated 9851 lines...]
   [junit4] Suite: org.apache.solr.cloud.ChaosMonkeySafeLeaderTest
   [junit4]   2> Creating dataDir: /home/jenkins/workspace/Lucene-Solr-trunk-Linux/solr/build/solr-core/test/J1/temp/solr.cloud.ChaosMonkeySafeLeaderTest_C75661F707DC4B01-001/init-core-data-001
   [junit4]   2> 163463 INFO  (SUITE-ChaosMonkeySafeLeaderTest-seed#[C75661F707DC4B01]-worker) [    ] o.a.s.SolrTestCaseJ4 Randomized ssl (false) and clientAuth (false)
   [junit4]   2> 163463 INFO  (SUITE-ChaosMonkeySafeLeaderTest-seed#[C75661F707DC4B01]-worker) [    ] o.a.s.BaseDistributedSearchTestCase Setting hostContext system property: /
   [junit4]   2> 163466 INFO  (TEST-ChaosMonkeySafeLeaderTest.test-seed#[C75661F707DC4B01]) [    ] o.a.s.c.ZkTestServer STARTING ZK TEST SERVER
   [junit4]   2> 163466 INFO  (Thread-331) [    ] o.a.s.c.ZkTestServer client port:0.0.0.0/0.0.0.0:0
   [junit4]   2> 163466 INFO  (Thread-331) [    ] o.a.s.c.ZkTestServer Starting server
   [junit4]   2> 163566 INFO  (TEST-ChaosMonkeySafeLeaderTest.test-seed#[C75661F707DC4B01]) [    ] o.a.s.c.ZkTestServer start zk server on port:38531
   [junit4]   2> 163566 INFO  (TEST-ChaosMonkeySafeLeaderTest.test-seed#[C75661F707DC4B01]) [    ] o.a.s.c.c.SolrZkClient Using default ZkCredentialsProvider
   [junit4]   2> 163567 INFO  (TEST-ChaosMonkeySafeLeaderTest.test-seed#[C75661F707DC4B01]) [    ] o.a.s.c.c.ConnectionManager Waiting for client to connect to ZooKeeper
   [junit4]   2> 163568 INFO  (zkCallback-110-thread-1) [    ] o.a.s.c.c.ConnectionManager Watcher org.apache.solr.common.cloud.ConnectionManager@2bc31e42 name:ZooKeeperConnection Watcher:127.0.0.1:38531 got event WatchedEvent state:SyncConnected type:None path:null path:null type:None
   [junit4]   2> 163569 INFO  (TEST-ChaosMonkeySafeLeaderTest.test-seed#[C75661F707DC4B01]) [    ] o.a.s.c.c.ConnectionManager Client is connected to ZooKeeper
   [junit4]   2> 163569 INFO  (TEST-ChaosMonkeySafeLeaderTest.test-seed#[C75661F707DC4B01]) [    ] o.a.s.c.c.SolrZkClient Using default ZkACLProvider
   [junit4]   2> 163569 INFO  (TEST-ChaosMonkeySafeLeaderTest.test-seed#[C75661F707DC4B01]) [    ] o.a.s.c.c.SolrZkClient makePath: /solr
   [junit4]   2> 163570 INFO  (TEST-ChaosMonkeySafeLeaderTest.test-seed#[C75661F707DC4B01]) [    ] o.a.s.c.c.SolrZkClient Using default ZkCredentialsProvider
   [junit4]   2> 163571 INFO  (TEST-ChaosMonkeySafeLeaderTest.test-seed#[C75661F707DC4B01]) [    ] o.a.s.c.c.ConnectionManager Waiting for client to connect to ZooKeeper
   [junit4]   2> 163572 INFO  (zkCallback-111-thread-1) [    ] o.a.s.c.c.ConnectionManager Watcher org.apache.solr.common.cloud.ConnectionManager@64ac3cb6 name:ZooKeeperConnection Watcher:127.0.0.1:38531/solr got event WatchedEvent state:SyncConnected type:None path:null path:null type:None
   [junit4]   2> 163572 INFO  (TEST-ChaosMonkeySafeLeaderTest.test-seed#[C75661F707DC4B01]) [    ] o.a.s.c.c.ConnectionManager Client is connected to ZooKeeper
   [junit4]   2> 163572 INFO  (TEST-ChaosMonkeySafeLeaderTest.test-seed#[C75661F707DC4B01]) [    ] o.a.s.c.c.SolrZkClient Using default ZkACLProvider
   [junit4]   2> 163572 INFO  (TEST-ChaosMonkeySafeLeaderTest.test-seed#[C75661F707DC4B01]) [    ] o.a.s.c.c.SolrZkClient makePath: /collections/collection1
   [junit4]   2> 163573 INFO  (TEST-ChaosMonkeySafeLeaderTest.test-seed#[C75661F707DC4B01]) [    ] o.a.s.c.c.SolrZkClient makePath: /collections/collection1/shards
   [junit4]   2> 163573 INFO  (TEST-ChaosMonkeySafeLeaderTest.test-seed#[C75661F707DC4B01]) [    ] o.a.s.c.c.SolrZkClient makePath: /collections/control_collection
   [junit4]   2> 163574 INFO  (TEST-ChaosMonkeySafeLeaderTest.test-seed#[C75661F707DC4B01]) [    ] o.a.s.c.c.SolrZkClient makePath: /collections/control_collection/shards
   [junit4]   2> 163574 INFO  (TEST-ChaosMonkeySafeLeaderTest.test-seed#[C75661F707DC4B01]) [    ] o.a.s.c.AbstractZkTestCase put /home/jenkins/workspace/Lucene-Solr-trunk-Linux/solr/core/src/test-files/solr/collection1/conf/solrconfig-tlog.xml to /configs/conf1/solrconfig.xml
   [junit4]   2> 163575 INFO  (TEST-ChaosMonkeySafeLeaderTest.test-seed#[C75661F707DC4B01]) [    ] o.a.s.c.c.SolrZkClient makePath: /configs/conf1/solrconfig.xml
   [junit4]   2> 163575 INFO  (TEST-ChaosMonkeySafeLeaderTest.test-seed#[C75661F707DC4B01]) [    ] o.a.s.c.AbstractZkTestCase put /home/jenkins/workspace/Lucene-Solr-trunk-Linux/solr/core/src/test-files/solr/collection1/conf/schema15.xml to /configs/conf1/schema.xml
   [junit4]   2> 163576 INFO  (TEST-ChaosMonkeySafeLeaderTest.test-seed#[C75661F707DC4B01]) [    ] o.a.s.c.c.SolrZkClient makePath: /configs/conf1/schema.xml
   [junit4]   2> 163576 INFO  (TEST-ChaosMonkeySafeLeaderTest.test-seed#[C75661F707DC4B01]) [    ] o.a.s.c.AbstractZkTestCase put /home/jenkins/workspace/Lucene-Solr-trunk-Linux/solr/core/src/test-files/solr/collection1/conf/solrconfig.snippet.randomindexconfig.xml to /configs/conf1/solrconfig.snippet.randomindexconfig.xml
   [junit4]   2> 163576 INFO  (TEST-ChaosMonkeySafeLeaderTest.test-seed#[C75661F707DC4B01]) [    ] o.a.s.c.c.SolrZkClient makePath: /configs/conf1/solrconfig.snippet.randomindexconfig.xml
   [junit4]   2> 163577 INFO  (TEST-ChaosMonkeySafeLeaderTest.test-seed#[C75661F707DC4B01]) [    ] o.a.s.c.AbstractZkTestCase put /home/jenkins/workspace/Lucene-Solr-trunk-Linux/solr/core/src/test-files/solr/collection1/conf/stopwords.txt to /configs/conf1/stopwords.txt
   [junit4]   2> 163577 INFO  (TEST-ChaosMonkeySafeLeaderTest.test-seed#[C75661F707DC4B01]) [    ] o.a.s.c.c.SolrZkClient makePath: /configs/conf1/stopwords.txt
   [junit4]   2> 163578 INFO  (TEST-ChaosMonkeySafeLeaderTest.test-seed#[C75661F707DC4B01]) [    ] o.a.s.c.AbstractZkTestCase put /home/jenkins/workspace/Lucene-Solr-trunk-Linux/solr/core/src/test-files/solr/collection1/conf/protwords.txt to /configs/conf1/protwords.txt
   [junit4]   2> 163578 INFO  (TEST-ChaosMonkeySafeLeaderTest.test-seed#[C75661F707DC4B01]) [    ] o.a.s.c.c.SolrZkClient makePath: /configs/conf1/protwords.txt
   [junit4]   2> 163578 INFO  (TEST-ChaosMonkeySafeLeaderTest.test-seed#[C75661F707DC4B01]) [    ] o.a.s.c.AbstractZkTestCase put /home/jenkins/workspace/Lucene-Solr-trunk-Linux/solr/core/src/test-files/solr/collection1/conf/currency.xml to /configs/conf1/currency.xml
   [junit4]   2> 163579 INFO  (TEST-ChaosMonkeySafeLeaderTest.test-seed#[C75661F707DC4B01]) [    ] o.a.s.c.c.SolrZkClient makePath: /configs/conf1/currency.xml
   [junit4]   2> 163579 INFO  (TEST-ChaosMonkeySafeLeaderTest.test-seed#[C75661F707DC4B01]) [    ] o.a.s.c.AbstractZkTestCase put /home/jenkins/workspace/Lucene-Solr-trunk-Linux/solr/core/src/test-files/solr/collection1/conf/enumsConfig.xml to /configs/conf1/enumsConfig.xml
   [junit4]   2> 163579 INFO  (TEST-ChaosMonkeySafeLeaderTest.test-seed#[C75661F707DC4B01]) [    ] o.a.s.c.c.SolrZkClient makePath: /configs/conf1/enumsConfig.xml
   [junit4]   2> 163580 INFO  (TEST-ChaosMonkeySafeLeaderTest.test-seed#[C75661F707DC4B01]) [    ] o.a.s.c.AbstractZkTestCase put /home/jenkins/workspace/Lucene-Solr-trunk-Linux/solr/core/src/test-files/solr/collection1/conf/open-exchange-rates.json to /configs/conf1/open-exchange-rates.json
   [junit4]   2> 163580 INFO  (TEST-ChaosMonkeySafeLeaderTest.test-seed#[C75661F707DC4B01]) [    ] o.a.s.c.c.SolrZkClient makePath: /configs/conf1/open-exchange-rates.json
   [junit4]   2> 163581 INFO  (TEST-ChaosMonkeySafeLeaderTest.test-seed#[C75661F707DC4B01]) [    ] o.a.s.c.AbstractZkTestCase put /home/jenkins/workspace/Lucene-Solr-trunk-Linux/solr/core/src/test-files/solr/collection1/conf/mapping-ISOLatin1Accent.txt to /configs/conf1/mapping-ISOLatin1Accent.txt
   [junit4]   2> 163581 INFO  (TEST-ChaosMonkeySafeLeaderTest.test-seed#[C75661F707DC4B01]) [    ] o.a.s.c.c.SolrZkClient makePath: /configs/conf1/mapping-ISOLatin1Accent.txt
   [junit4]   2> 163581 INFO  (TEST-ChaosMonkeySafeLeaderTest.test-seed#[C75661F707DC4B01]) [    ] o.a.s.c.AbstractZkTestCase put /home/jenkins/workspace/Lucene-Solr-trunk-Linux/solr/core/src/test-files/solr/collection1/conf/old_synonyms.txt to /configs/conf1/old_synonyms.txt
   [junit4]   2> 163581 INFO  (TEST-ChaosMonkeySafeLeaderTest.test-seed#[C75661F707DC4B01]) [    ] o.a.s.c.c.SolrZkClient makePath: /configs/conf1/old_synonyms.txt
   [junit4]   2> 163582 INFO  (TEST-ChaosMonkeySafeLeaderTest.test-seed#[C75661F707DC4B01]) [    ] o.a.s.c.AbstractZkTestCase put /home/jenkins/workspace/Lucene-Solr-trunk-Linux/solr/core/src/test-files/solr/collection1/conf/synonyms.txt to /configs/conf1/synonyms.txt
   [junit4]   2> 163582 INFO  (TEST-ChaosMonkeySafeLeaderTest.test-seed#[C75661F707DC4B01]) [    ] o.a.s.c.c.SolrZkClient makePath: /configs/conf1/synonyms.txt
   [junit4]   2> 163646 INFO  (TEST-ChaosMonkeySafeLeaderTest.test-seed#[C75661F707DC4B01]) [    ] o.a.s.SolrTestCaseJ4 Writing core.properties file to /home/jenkins/workspace/Lucene-Solr-trunk-Linux/solr/build/solr-core/test/J1/temp/solr.cloud.ChaosMonkeySafeLeaderTest_C75661F707DC4B01-001/control-001/cores/collection1
   [junit4]   2> 163647 INFO  (TEST-ChaosMonkeySafeLeaderTest.test-seed#[C75661F707DC4B01]) [    ] o.e.j.s.Server jetty-9.2.11.v20150529
   [junit4]   2> 163648 INFO  (TEST-ChaosMonkeySafeLeaderTest.test-seed#[C75661F707DC4B01]) [    ] o.e.j.s.h.ContextHandler Started o.e.j.s.ServletContextHandler@5e29fef7{/,null,AVAILABLE}
   [junit4]   2> 163650 INFO  (TEST-ChaosMonkeySafeLeaderTest.test-seed#[C75661F707DC4B01]) [    ] o.e.j.s.ServerConnector Started ServerConnector@56384d56{HTTP/1.1}{127.0.0.1:38178}
   [junit4]   2> 163650 INFO  (TEST-ChaosMonkeySafeLeaderTest.test-seed#[C75661F707DC4B01]) [    ] o.e.j.s.Server Started @165504ms
   [junit4]   2> 163650 INFO  (TEST-ChaosMonkeySafeLeaderTest.test-seed#[C75661F707DC4B01]) [    ] o.a.s.c.s.e.JettySolrRunner Jetty properties: {solr.data.dir=/home/jenkins/workspace/Lucene-Solr-trunk-Linux/solr/build/solr-core/test/J1/temp/solr.cloud.ChaosMonkeySafeLeaderTest_C75661F707DC4B01-001/tempDir-001/control/data, hostContext=/, hostPort=38178, coreRootDirectory=/home/jenkins/workspace/Lucene-Solr-trunk-Linux/solr/build/solr-core/test/J1/../../../../../../../../../home/jenkins/workspace/Lucene-Solr-trunk-Linux/solr/build/solr-core/test/J1/temp/solr.cloud.ChaosMonkeySafeLeaderTest_C75661F707DC4B01-001/control-001/cores}
   [junit4]   2> 163650 INFO  (TEST-ChaosMonkeySafeLeaderTest.test-seed#[C75661F707DC4B01]) [    ] o.a.s.s.SolrDispatchFilter SolrDispatchFilter.init(): sun.misc.Launcher$AppClassLoader@4e0e2f2a
   [junit4]   2> 163650 INFO  (TEST-ChaosMonkeySafeLeaderTest.test-seed#[C75661F707DC4B01]) [    ] o.a.s.c.SolrResourceLoader new SolrResourceLoader for directory: '/home/jenkins/workspace/Lucene-Solr-trunk-Linux/solr/build/solr-core/test/J1/../../../../../../../../../home/jenkins/workspace/Lucene-Solr-trunk-Linux/solr/build/solr-core/test/J1/temp/solr.cloud.ChaosMonkeySafeLeaderTest_C75661F707DC4B01-001/control-001/'
   [junit4]   2> 163658 INFO  (TEST-ChaosMonkeySafeLeaderTest.test-seed#[C75661F707DC4B01]) [    ] o.a.s.c.c.SolrZkClient Using default ZkCredentialsProvider
   [junit4]   2> 163658 INFO  (TEST-ChaosMonkeySafeLeaderTest.test-seed#[C75661F707DC4B01]) [    ] o.a.s.c.c.ConnectionManager Waiting for client to connect to ZooKeeper
   [junit4]   2> 163659 INFO  (zkCallback-112-thread-1) [    ] o.a.s.c.c.ConnectionManager Watcher org.apache.solr.common.cloud.ConnectionManager@6a72d103 name:ZooKeeperConnection Watcher:127.0.0.1:38531/solr got event WatchedEvent state:SyncConnected type:None path:null path:null type:None
   [junit4]   2> 163659 INFO  (TEST-ChaosMonkeySafeLeaderTest.test-seed#[C75661F707DC4B01]) [    ] o.a.s.c.c.ConnectionManager Client is connected to ZooKeeper
   [junit4]   2> 163660 INFO  (TEST-ChaosMonkeySafeLeaderTest.test-seed#[C75661F707DC4B01]) [    ] o.a.s.c.c.SolrZkClient Using default ZkACLProvider
   [junit4]   2> 163661 INFO  (TEST-ChaosMonkeySafeLeaderTest.test-seed#[C75661F707DC4B01]) [    ] o.a.s.s.SolrDispatchFilter Loading solr.xml from SolrHome (not found in ZooKeeper)
   [junit4]   2> 163661 INFO  (TEST-ChaosMonkeySafeLeaderTest.test-seed#[C75661F707DC4B01]) [    ] o.a.s.c.SolrXmlConfig Loading container configuration from /home/jenkins/workspace/Lucene-Solr-trunk-Linux/solr/build/solr-core/test/J1/../../../../../../../../../home/jenkins/workspace/Lucene-Solr-trunk-Linux/solr/build/solr-core/test/J1/temp/solr.cloud.ChaosMonkeySafeLeaderTest_C75661F707DC4B01-001/control-001/solr.xml
   [junit4]   2> 163666 INFO  (TEST-ChaosMonkeySafeLeaderTest.test-seed#[C75661F707DC4B01]) [    ] o.a.s.c.CoresLocator Config-defined core root directory: /home/jenkins/workspace/Lucene-Solr-trunk-Linux/solr/build/solr-core/test/J1/../../../../../../../../../home/jenkins/workspace/Lucene-Solr-trunk-Linux/solr/build/solr-core/test/J1/temp/solr.cloud.ChaosMonkeySafeLeaderTest_C75661F707DC4B01-001/control-001/cores
   [junit4]   2> 163666 INFO  (TEST-ChaosMonkeySafeLeaderTest.test-seed#[C75661F707DC4B01]) [    ] o.a.s.c.CoreContainer New CoreContainer 126052554
   [junit4]   2> 163666 INFO  (TEST-ChaosMonkeySafeLeaderTest.test-seed#[C75661F707DC4B01]) [    ] o.a.s.c.CoreContainer Loading cores into CoreContainer [instanceDir=/home/jenkins/workspace/Lucene-Solr-trunk-Linux/solr/build/solr-core/test/J1/../../../../../../../../../home/jenkins/workspace/Lucene-Solr-trunk-Linux/solr/build/solr-core/test/J1/temp/solr.cloud.ChaosMonkeySafeLeaderTest_C75661F707DC4B01-001/control-001/]
   [junit4]   2> 163666 INFO  (TEST-ChaosMonkeySafeLeaderTest.test-seed#[C75661F707DC4B01]) [    ] o.a.s.c.CoreContainer loading shared library: /home/jenkins/workspace/Lucene-Solr-trunk-Linux/solr/build/solr-core/test/J1/../../../../../../../../../home/jenkins/workspace/Lucene-Solr-trunk-Linux/solr/build/solr-core/test/J1/temp/solr.cloud.ChaosMonkeySafeLeaderTest_C75661F707DC4B01-001/control-001/lib
   [junit4]   2> 163667 WARN  (TEST-ChaosMonkeySafeLeaderTest.test-seed#[C75661F707DC4B01]) [    ] o.a.s.c.SolrResourceLoader Can't find (or read) directory to add to classloader: lib (resolved as: /home/jenkins/workspace/Lucene-Solr-trunk-Linux/solr/build/solr-core/test/J1/../../../../../../../../../home/jenkins/workspace/Lucene-Solr-trunk-Linux/solr/build/solr-core/test/J1/temp/solr.cloud.ChaosMonkeySafeLeaderTest_C75661F707DC4B01-001/control-001/lib).
   [junit4]   2> 163671 INFO  (TEST-ChaosMonkeySafeLeaderTest.test-seed#[C75661F707DC4B01]) [    ] o.a.s.h.c.HttpShardHandlerFactory created with socketTimeout : 90000,urlScheme : ,connTimeout : 15000,maxConnectionsPerHost : 20,maxConnections : 10000,corePoolSize : 0,maximumPoolSize : 2147483647,maxThreadIdleTime : 5,sizeOfQueue : -1,fairnessPolicy : false,useRetries : false,
   [junit4]   2> 163672 INFO  (TEST-ChaosMonkeySafeLeaderTest.test-seed#[C75661F707DC4B01]) [    ] o.a.s.u.UpdateShardHandler Creating UpdateShardHandler HTTP client with params: socketTimeout=340000&connTimeout=45000&retry=true
   [junit4]   2> 163672 INFO  (TEST-ChaosMonkeySafeLeaderTest.test-seed#[C75661F707DC4B01]) [    ] o.a.s.l.LogWatcher SLF4J impl is org.slf4j.impl.Log4jLoggerFactory
   [junit4]   2> 163672 INFO  (TEST-ChaosMonkeySafeLeaderTest.test-seed#[C75661F707DC4B01]) [    ] o.a.s.l.LogWatcher Registering Log Listener [Log4j (org.slf4j.impl.Log4jLoggerFactory)]
   [junit4]   2> 163672 INFO  (TEST-ChaosMonkeySafeLeaderTest.test-seed#[C75661F707DC4B01]) [    ] o.a.s.c.ZkContainer Zookeeper client=127.0.0.1:38531/solr
   [junit4]   2> 163673 INFO  (TEST-ChaosMonkeySafeLeaderTest.test-seed#[C75661F707DC4B01]) [    ] o.a.s.c.ZkController zkHost includes chroot
   [junit4]   2> 163673 INFO  (TEST-ChaosMonkeySafeLeaderTest.test-seed#[C75661F707DC4B01]) [    ] o.a.s.c.c.SolrZkClient Using default ZkCredentialsProvider
   [junit4]   2> 163673 INFO  (TEST-ChaosMonkeySafeLeaderTest.test-seed#[C75661F707DC4B01]) [    ] o.a.s.c.c.ConnectionManager Waiting for client to connect to ZooKeeper
   [junit4]   2> 163674 INFO  (zkCallback-114-thread-1) [    ] o.a.s.c.c.ConnectionManager Watcher org.apache.solr.common.cloud.ConnectionManager@1036742c name:ZooKeeperConnection Watcher:127.0.0.1:38531 got event WatchedEvent state:SyncConnected type:None path:null path:null type:None
   [junit4]   2> 163674 INFO  (TEST-ChaosMonkeySafeLeaderTest.test-seed#[C75661F707DC4B01]) [    ] o.a.s.c.c.ConnectionManager Client is connected to ZooKeeper
   [junit4]   2> 163675 INFO  (TEST-ChaosMonkeySafeLeaderTest.test-seed#[C75661F707DC4B01]) [    ] o.a.s.c.c.SolrZkClient Using default ZkACLProvider
   [junit4]   2> 163676 INFO  (TEST-ChaosMonkeySafeLeaderTest.test-seed#[C75661F707DC4B01]) [n:127.0.0.1:38178_    ] o.a.s.c.c.ConnectionManager Waiting for client to connect to ZooKeeper
   [junit4]   2> 163677 INFO  (zkCallback-115-thread-1-processing-n:127.0.0.1:38178_) [n:127.0.0.1:38178_    ] o.a.s.c.c.ConnectionManager Watcher org.apache.solr.common.cloud.ConnectionManager@65cc5d96 name:ZooKeeperConnection Watcher:127.0.0.1:38531/solr got event WatchedEvent state:SyncConnected type:None path:null path:null type:None
   [junit4]   2> 163677 INFO  (TEST-ChaosMonkeySafeLeaderTest.test-seed#[C75661F707DC4B01]) [n:127.0.0.1:38178_    ] o.a.s.c.c.ConnectionManager Client is connected to ZooKeeper
   [junit4]   2> 163678 INFO  (TEST-ChaosMonkeySafeLeaderTest.test-seed#[C75661F707DC4B01]) [n:127.0.0.1:38178_    ] o.a.s.c.c.SolrZkClient makePath: /overseer/queue
   [junit4]   2> 163679 INFO  (TEST-ChaosMonkeySafeLeaderTest.test-seed#[C75661F707DC4B01]) [n:127.0.0.1:38178_    ] o.a.s.c.c.SolrZkClient makePath: /overseer/collection-queue-work
   [junit4]   2> 163679 INFO  (TEST-ChaosMonkeySafeLeaderTest.test-seed#[C75661F707DC4B01]) [n:127.0.0.1:38178_    ] o.a.s.c.c.SolrZkClient makePath: /overseer/collection-map-running
   [junit4]   2> 163680 INFO  (TEST-ChaosMonkeySafeLeaderTest.test-seed#[C75661F707DC4B01]) [n:127.0.0.1:38178_    ] o.a.s.c.c.SolrZkClient makePath: /overseer/collection-map-completed
   [junit4]   2> 163681 INFO  (TEST-ChaosMonkeySafeLeaderTest.test-seed#[C75661F707DC4B01]) [n:127.0.0.1:38178_    ] o.a.s.c.c.SolrZkClient makePath: /overseer/collection-map-failure
   [junit4]   2> 163681 INFO  (TEST-ChaosMonkeySafeLeaderTest.test-seed#[C75661F707DC4B01]) [n:127.0.0.1:38178_    ] o.a.s.c.c.SolrZkClient makePath: /live_nodes
   [junit4]   2> 163682 INFO  (TEST-ChaosMonkeySafeLeaderTest.test-seed#[C75661F707DC4B01]) [n:127.0.0.1:38178_    ] o.a.s.c.c.SolrZkClient makePath: /aliases.json
   [junit4]   2> 163682 INFO  (TEST-ChaosMonkeySafeLeaderTest.test-seed#[C75661F707DC4B01]) [n:127.0.0.1:38178_    ] o.a.s.c.c.SolrZkClient makePath: /clusterstate.json
   [junit4]   2> 163683 INFO  (TEST-ChaosMonkeySafeLeaderTest.test-seed#[C75661F707DC4B01]) [n:127.0.0.1:38178_    ] o.a.s.c.ZkController Register node as live in ZooKeeper:/live_nodes/127.0.0.1:38178_
   [junit4]   2> 163683 INFO  (TEST-ChaosMonkeySafeLeaderTest.test-seed#[C75661F707DC4B01]) [n:127.0.0.1:38178_    ] o.a.s.c.c.SolrZkClient makePath: /live_nodes/127.0.0.1:38178_
   [junit4]   2> 163684 INFO  (TEST-ChaosMonkeySafeLeaderTest.test-seed#[C75661F707DC4B01]) [n:127.0.0.1:38178_    ] o.a.s.c.c.SolrZkClient makePath: /overseer_elect
   [junit4]   2> 163684 INFO  (TEST-ChaosMonkeySafeLeaderTest.test-seed#[C75661F707DC4B01]) [n:127.0.0.1:38178_    ] o.a.s.c.c.SolrZkClient makePath: /overseer_elect/election
   [junit4]   2> 163685 INFO  (TEST-ChaosMonkeySafeLeaderTest.test-seed#[C75661F707DC4B01]) [n:127.0.0.1:38178_    ] o.a.s.c.Overseer Overseer (id=null) closing
   [junit4]   2> 163685 INFO  (TEST-ChaosMonkeySafeLeaderTest.test-seed#[C75661F707DC4B01]) [n:127.0.0.1:38178_    ] o.a.s.c.LeaderElector Joined leadership election with path: /overseer_elect/election/94278443533008900-127.0.0.1:38178_-n_0000000000
   [junit4]   2> 163685 INFO  (TEST-ChaosMonkeySafeLeaderTest.test-seed#[C75661F707DC4B01]) [n:127.0.0.1:38178_    ] o.a.s.c.OverseerElectionContext I am going to be the leader 127.0.0.1:38178_
   [junit4]   2> 163685 INFO  (TEST-ChaosMonkeySafeLeaderTest.test-seed#[C75661F707DC4B01]) [n:127.0.0.1:38178_    ] o.a.s.c.c.SolrZkClient makePath: /overseer_elect/leader
   [junit4]   2> 163686 INFO  (TEST-ChaosMonkeySafeLeaderTest.test-seed#[C75661F707DC4B01]) [n:127.0.0.1:38178_    ] o.a.s.c.Overseer Overseer (id=94278443533008900-127.0.0.1:38178_-n_0000000000) starting
   [junit4]   2> 163686 INFO  (TEST-ChaosMonkeySafeLeaderTest.test-seed#[C75661F707DC4B01]) [n:127.0.0.1:38178_    ] o.a.s.c.c.SolrZkClient makePath: /overseer/queue-work
   [junit4]   2> 163689 INFO  (TEST-ChaosMonkeySafeLeaderTest.test-seed#[C75661F707DC4B01]) [n:127.0.0.1:38178_    ] o.a.s.c.OverseerAutoReplicaFailoverThread Starting OverseerAutoReplicaFailoverThread autoReplicaFailoverWorkLoopDelay=10000 autoReplicaFailoverWaitAfterExpiration=30000 autoReplicaFailoverBadNodeExpiration=60000
   [junit4]   2> 163689 INFO  (TEST-ChaosMonkeySafeLeaderTest.test-seed#[C75661F707DC4B01]) [n:127.0.0.1:38178_    ] o.a.s.c.c.ZkStateReader Updating cluster state from ZooKeeper... 
   [junit4]   2> 163689 INFO  (OverseerCollectionProcessor-94278443533008900-127.0.0.1:38178_-n_0000000000) [n:127.0.0.1:38178_    ] o.a.s.c.OverseerCollectionProcessor Process current queue of collection creations
   [junit4]   2> 163689 INFO  (OverseerStateUpdate-94278443533008900-127.0.0.1:38178_-n_0000000000) [n:127.0.0.1:38178_    ] o.a.s.c.Overseer Starting to work on the main queue
   [junit4]   2> 163691 INFO  (TEST-ChaosMonkeySafeLeaderTest.test-seed#[C75661F707DC4B01]) [n:127.0.0.1:38178_    ] o.a.s.c.CoreContainer No authentication plugin used.
   [junit4]   2> 163691 INFO  (TEST-ChaosMonkeySafeLeaderTest.test-seed#[C75661F707DC4B01]) [n:127.0.0.1:38178_    ] o.a.s.c.CoreContainer Security conf doesn't exist. Skipping setup for authorization module.
   [junit4]   2> 163692 INFO  (TEST-ChaosMonkeySafeLeaderTest.test-seed#[C75661F707DC4B01]) [n:127.0.0.1:38178_    ] o.a.s.c.CoresLocator Looking for core definitions underneath /home/jenkins/workspace/Lucene-Solr-trunk-Linux/solr/build/solr-core/test/J1/../../../../../../../../../home/jenkins/workspace/Lucene-Solr-trunk-Linux/solr/build/solr-core/test/J1/temp/solr.cloud.ChaosMonkeySafeLeaderTest_C75661F707DC4B01-001/control-001/cores
   [junit4]   2> 163692 INFO  (TEST-ChaosMonkeySafeLeaderTest.test-seed#[C75661F707DC4B01]) [n:127.0.0.1:38178_    ] o.a.s.c.SolrCore Created CoreDescriptor: {name=collection1, config=solrconfig.xml, transient=false, schema=schema.xml, loadOnStartup=true, configSetProperties=configsetprops.json, instanceDir=/home/jenkins/workspace/Lucene-Solr-trunk-Linux/solr/build/solr-core/test/J1/../../../../../../../../../home/jenkins/workspace/Lucene-Solr-trunk-Linux/solr/build/solr-core/test/J1/temp/solr.cloud.ChaosMonkeySafeLeaderTest_C75661F707DC4B01-001/control-001/cores/collection1, collection=control_collection, absoluteInstDir=/home/jenkins/workspace/Lucene-Solr-trunk-Linux/solr/build/solr-core/test/J1/../../../../../../../../../home/jenkins/workspace/Lucene-Solr-trunk-Linux/solr/build/solr-core/test/J1/temp/solr.cloud.ChaosMonkeySafeLeaderTest_C75661F707DC4B01-001/control-001/cores/collection1/, coreNodeName=, dataDir=data/, shard=}
   [junit4]   2> 163692 INFO  (TEST-ChaosMonkeySafeLeaderTest.test-seed#[C75661F707DC4B01]) [n:127.0.0.1:38178_    ] o.a.s.c.CoresLocator Found core collection1 in /home/jenkins/workspace/Lucene-Solr-trunk-Linux/solr/build/solr-core/test/J1/../../../../../../../../../home/jenkins/workspace/Lucene-Solr-trunk-Linux/solr/build/solr-core/test/J1/temp/solr.cloud.ChaosMonkeySafeLeaderTest_C75661F707DC4B01-001/control-001/cores/collection1/
   [junit4]   2> 163693 INFO  (TEST-ChaosMonkeySafeLeaderTest.test-seed#[C75661F707DC4B01]) [n:127.0.0.1:38178_    ] o.a.s.c.CoresLocator Found 1 core definitions
   [junit4]   2> 163693 INFO  (coreLoadExecutor-586-thread-1-processing-n:127.0.0.1:38178_) [n:127.0.0.1:38178_ c:control_collection   x:collection1] o.a.s.c.ZkController publishing state=down
   [junit4]   2> 163693 INFO  (TEST-ChaosMonkeySafeLeaderTest.test-seed#[C75661F707DC4B01]) [n:127.0.0.1:38178_    ] o.a.s.s.SolrDispatchFilter user.dir=/home/jenkins/workspace/Lucene-Solr-trunk-Linux/solr/build/solr-core/test/J1
   [junit4]   2> 163693 INFO  (coreLoadExecutor-586-thread-1-processing-n:127.0.0.1:38178_) [n:127.0.0.1:38178_ c:control_collection   x:collection1] o.a.s.c.ZkController numShards not found on descriptor - reading it from system property
   [junit4]   2> 163693 INFO  (TEST-ChaosMonkeySafeLeaderTest.test-seed#[C75661F707DC4B01]) [n:127.0.0.1:38178_    ] o.a.s.s.SolrDispatchFilter SolrDispatchFilter.init() done
   [junit4]   2> 163693 INFO  (coreLoadExecutor-586-thread-1-processing-n:127.0.0.1:38178_) [n:127.0.0.1:38178_ c:control_collection   x:collection1] o.a.s.c.ZkController look for our core node name
   [junit4]   2> 163693 INFO  (zkCallback-115-thread-1-processing-n:127.0.0.1:38178_) [n:127.0.0.1:38178_    ] o.a.s.c.DistributedQueue NodeChildrenChanged fired on path /overseer/queue state SyncConnected
   [junit4]   2> 163694 INFO  (OverseerStateUpdate-94278443533008900-127.0.0.1:38178_-n_0000000000) [n:127.0.0.1:38178_    ] o.a.s.c.Overseer processMessage: queueSize: 1, message = {
   [junit4]   2>   "core":"collection1",
   [junit4]   2>   "roles":null,
   [junit4]   2>   "base_url":"http://127.0.0.1:38178",
   [junit4]   2>   "node_name":"127.0.0.1:38178_",
   [junit4]   2>   "numShards":"1",
   [junit4]   2>   "state":"down",
   [junit4]   2>   "shard":null,
   [junit4]   2>   "collection":"control_collection",
   [junit4]   2>   "operation":"state"} current state version: 0
   [junit4]   2> 163695 INFO  (OverseerStateUpdate-94278443533008900-127.0.0.1:38178_-n_0000000000) [n:127.0.0.1:38178_    ] o.a.s.c.o.ReplicaMutator Update state numShards=1 message={
   [junit4]   2>   "core":"collection1",
   [junit4]   2>   "roles":null,
   [junit4]   2>   "base_url":"http://127.0.0.1:38178",
   [junit4]   2>   "node_name":"127.0.0.1:38178_",
   [junit4]   2>   "numShards":"1",
   [junit4]   2>   "state":"down",
   [junit4]   2>   "shard":null,
   [junit4]   2>   "collection":"control_collection",
   [junit4]   2>   "operation":"state"}
   [junit4]   2> 163695 INFO  (OverseerStateUpdate-94278443533008900-127.0.0.1:38178_-n_0000000000) [n:127.0.0.1:38178_    ] o.a.s.c.o.ClusterStateMutator building a new cName: control_collection
   [junit4]   2> 163695 INFO  (OverseerStateUpdate-94278443533008900-127.0.0.1:38178_-n_0000000000) [n:127.0.0.1:38178_    ] o.a.s.c.o.ReplicaMutator Assigning new node to shard shard=shard1
   [junit4]   2> 163695 INFO  (zkCallback-115-thread-1-processing-n:127.0.0.1:38178_) [n:127.0.0.1:38178_    ] o.a.s.c.c.ZkStateReader A cluster state change: WatchedEvent state:SyncConnected type:NodeDataChanged path:/clusterstate.json, has occurred - updating... (live nodes size: 1)
   [junit4]   2> 163696 INFO  (zkCallback-115-thread-1-processing-n:127.0.0.1:38178_) [n:127.0.0.1:38178_    ] o.a.s.c.c.ZkStateReader Updated cluster state version to 1
   [junit4]   2> 164694 INFO  (coreLoadExecutor-586-thread-1-processing-n:127.0.0.1:38178_) [n:127.0.0.1:38178_ c:control_collection   x:collection1] o.a.s.c.ZkController waiting to find shard id in clusterstate for collection1
   [junit4]   2> 164694 INFO  (coreLoadExecutor-586-thread-1-processing-n:127.0.0.1:38178_) [n:127.0.0.1:38178_ c:control_collection   x:collection1] o.a.s.c.ZkController Check for collection zkNode:control_collection
   [junit4]   2> 164694 INFO  (coreLoadExecutor-586-thread-1-processing-n:127.0.0.1:38178_) [n:127.0.0.1:38178_ c:control_collection   x:collection1] o.a.s.c.ZkController Collection zkNode exists
   [junit4]   2> 164694 INFO  (coreLoadExecutor-586-thread-1-processing-n:127.0.0.1:38178_) [n:127.0.0.1:38178_ c:control_collection   x:collection1] o.a.s.c.c.ZkStateReader Load collection config from:/collections/control_collection
   [junit4]   2> 164695 INFO  (coreLoadExecutor-586-thread-1-processing-n:127.0.0.1:38178_) [n:127.0.0.1:38178_ c:control_collection   x:collection1] o.a.s.c.c.ZkStateReader path=/collections/control_collection configName=conf1 specified config exists in ZooKeeper
   [junit4]   2> 164695 INFO  (coreLoadExecutor-586-thread-1-processing-n:127.0.0.1:38178_) [n:127.0.0.1:38178_ c:control_collection   x:collection1] o.a.s.c.SolrResourceLoader new SolrResourceLoader for directory: '/home/jenkins/workspace/Lucene-Solr-trunk-Linux/solr/build/solr-core/test/J1/../../../../../../../../../home/jenkins/workspace/Lucene-Solr-trunk-Linux/solr/build/solr-core/test/J1/temp/solr.cloud.ChaosMonkeySafeLeaderTest_C75661F707DC4B01-001/control-001/cores/collection1/'
   [junit4]   2> 164701 INFO  (coreLoadExecutor-586-thread-1-processing-n:127.0.0.1:38178_) [n:127.0.0.1:38178_ c:control_collection   x:collection1] o.a.s.c.Config loaded config solrconfig.xml with version 0 
   [junit4]   2> 164705 INFO  (coreLoadExecutor-586-thread-1-processing-n:127.0.0.1:38178_) [n:127.0.0.1:38178_ c:control_collection   x:collection1] o.a.s.c.SolrConfig current version of requestparams : -1
   [junit4]   2> 164708 INFO  (coreLoadExecutor-586-thread-1-processing-n:127.0.0.1:38178_) [n:127.0.0.1:38178_ c:control_collection   x:collection1] o.a.s.c.SolrConfig Using Lucene MatchVersion: 6.0.0
   [junit4]   2> 164714 INFO  (coreLoadExecutor-586-thread-1-processing-n:127.0.0.1:38178_) [n:127.0.0.1:38178_ c:control_collection   x:collection1] o.a.s.c.Config Loaded SolrConfig: solrconfig.xml
   [junit4]   2> 164715 INFO  (coreLoadExecutor-586-thread-1-processing-n:127.0.0.1:38178_) [n:127.0.0.1:38178_ c:control_collection   x:collection1] o.a.s.s.IndexSchema Reading Solr Schema from /configs/conf1/schema.xml
   [junit4]   2> 164717 INFO  (coreLoadExecutor-586-thread-1-processing-n:127.0.0.1:38178_) [n:127.0.0.1:38178_ c:control_collection   x:collection1] o.a.s.s.IndexSchema [collection1] Schema name=test
   [junit4]   2> 164775 INFO  (coreLoadExecutor-586-thread-1-processing-n:127.0.0.1:38178_) [n:127.0.0.1:38178_ c:control_collection   x:collection1] o.a.s.s.IndexSchema default search field in schema is text
   [junit4]   2> 164775 INFO  (coreLoadExecutor-586-thread-1-processing-n:127.0.0.1:38178_) [n:127.0.0.1:38178_ c:control_collection   x:collection1] o.a.s.s.IndexSchema unique key field: id
   [junit4]   2> 164776 INFO  (coreLoadExecutor-586-thread-1-processing-n:127.0.0.1:38178_) [n:127.0.0.1:38178_ c:control_collection   x:collection1] o.a.s.s.FileExchangeRateProvider Reloading exchange rates from file currency.xml
   [junit4]   2> 164777 INFO  (coreLoadExecutor-586-thread-1-processing-n:127.0.0.1:38178_) [n:127.0.0.1:38178_ c:control_collection   x:collection1] o.a.s.s.FileExchangeRateProvider Reloading exchange rates from file currency.xml
   [junit4]   2> 164785 INFO  (coreLoadExecutor-586-thread-1-processing-n:127.0.0.1:38178_) [n:127.0.0.1:38178_ c:control_collection   x:collection1] o.a.s.c.ConfigSetProperties Did not find ConfigSet properties, assuming default properties: Can't find resource 'configsetprops.json' in classpath or '/configs/conf1', cwd=/home/jenkins/workspace/Lucene-Solr-trunk-Linux/solr/build/solr-core/test/J1
   [junit4]   2> 164785 INFO  (coreLoadExecutor-586-thread-1-processing-n:127.0.0.1:38178_) [n:127.0.0.1:38178_ c:control_collection   x:collection1] o.a.s.c.CoreContainer Creating SolrCore 'collection1' using configuration from collection control_collection
   [junit4]   2> 164785 INFO  (coreLoadExecutor-586-thread-1-processing-n:127.0.0.1:38178_) [n:127.0.0.1:38178_ c:control_collection s:shard1 r:core_node1 x:collection1] o.a.s.c.SolrCore solr.StandardDirectoryFactory
   [junit4]   2> 164790 INFO  (coreLoadExecutor-586-thread-1-processing-n:127.0.0.1:38178_) [n:127.0.0.1:38178_ c:control_collection s:shard1 r:core_node1 x:collection1] o.a.s.c.SolrCore [[collection1] ] Opening new SolrCore at [/home/jenkins/workspace/Lucene-Solr-trunk-Linux/solr/build/solr-core/test/J1/../../../../../../../../../home/jenkins/workspace/Lucene-Solr-trunk-Linux/solr/build/solr-core/test/J1/temp/solr.cloud.ChaosMonkeySafeLeaderTest_C75661F707DC4B01-001/control-001/cores/collection1/], dataDir=[null]
   [junit4]   2> 164790 INFO  (coreLoadExecutor-586-thread-1-processing-n:127.0.0.1:38178_) [n:127.0.0.1:38178_ c:control_collection s:shard1 r:core_node1 x:collection1] o.a.s.c.JmxMonitoredMap JMX monitoring is enabled. Adding Solr mbeans to JMX Server: com.sun.jmx.mbeanserver.JmxMBeanServer@4c762c9c
   [junit4]   2> 164790 INFO  (coreLoadExecutor-586-thread-1-processing-n:127.0.0.1:38178_) [n:127.0.0.1:38178_ c:control_collection s:shard1 r:core_node1 x:collection1] o.a.s.c.CachingDirectoryFactory return new directory for /home/jenkins/workspace/Lucene-Solr-trunk-Linux/solr/build/solr-core/test/J1/temp/solr.cloud.ChaosMonkeySafeLeaderTest_C75661F707DC4B01-001/control-001/cores/collection1/data
   [junit4]   2> 164790 INFO  (coreLoadExecutor-586-thread-1-processing-n:127.0.0.1:38178_) [n:127.0.0.1:38178_ c:control_collection s:shard1 r:core_node1 x:collection1] o.a.s.c.SolrCore New index directory detected: old=null new=/home/jenkins/workspace/Lucene-Solr-trunk-Linux/solr/build/solr-core/test/J1/temp/solr.cloud.ChaosMonkeySafeLeaderTest_C75661F707DC4B01-001/control-001/cores/collection1/data/index/
   [junit4]   2> 164791 WARN  (coreLoadExecutor-586-thread-1-processing-n:127.0.0.1:38178_) [n:127.0.0.1:38178_ c:control_collection s:shard1 r:core_node1 x:collection1] o.a.s.c.SolrCore [collection1] Solr index directory '/home/jenkins/workspace/Lucene-Solr-trunk-Linux/solr/build/solr-core/test/J1/temp/solr.cloud.ChaosMonkeySafeLeaderTest_C75661F707DC4B01-001/control-001/cores/collection1/data/index' doesn't exist. Creating new index...
   [junit4]   2> 164791 INFO  (coreLoadExecutor-586-thread-1-processing-n:127.0.0.1:38178_) [n:127.0.0.1:38178_ c:control_collection s:shard1 r:core_node1 x:collection1] o.a.s.c.CachingDirectoryFactory return new directory for /home/jenkins/workspace/Lucene-Solr-trunk-Linux/solr/build/solr-core/test/J1/temp/solr.cloud.ChaosMonkeySafeLeaderTest_C75661F707DC4B01-001/control-001/cores/collection1/data/index
   [junit4]   2> 164791 INFO  (coreLoadExecutor-586-thread-1-processing-n:127.0.0.1:38178_) [n:127.0.0.1:38178_ c:control_collection s:shard1 r:core_node1 x:collection1] o.a.s.u.RandomMergePolicy RandomMergePolicy wrapping class org.apache.lucene.index.LogByteSizeMergePolicy: [LogByteSizeMergePolicy: minMergeSize=1677721, mergeFactor=17, maxMergeSize=2147483648, maxMergeSizeForForcedMerge=9223372036854775807, calibrateSizeByDeletes=false, maxMergeDocs=2147483647, maxCFSSegmentSizeMB=8.796093022207999E12, noCFSRatio=0.6457977404164854]
   [junit4]   2> 164824 INFO  (coreLoadExecutor-586-thread-1-processing-n:127.0.0.1:38178_) [n:127.0.0.1:38178_ c:control_collection s:shard1 r:core_node1 x:collection1] o.a.s.c.SolrCore SolrDeletionPolicy.onCommit: commits: num=1
   [junit4]   2> 	commit{dir=/home/jenkins/workspace/Lucene-Solr-trunk-Linux/solr/build/solr-core/test/J1/temp/solr.cloud.ChaosMonkeySafeLeaderTest_C75661F707DC4B01-001/control-001/cores/collection1/data/index,segFN=segments_1,generation=1}
   [junit4]   2> 164824 INFO  (coreLoadExecutor-586-thread-1-processing-n:127.0.0.1:38178_) [n:127.0.0.1:38178_ c:control_collection s:shard1 r:core_node1 x:collection1] o.a.s.c.SolrCore newest commit generation = 1
   [junit4]   2> 164825 INFO  (OldIndexDirectoryCleanupThreadForCore-collection1) [n:127.0.0.1:38178_ c:control_collection s:shard1 r:core_node1 x:collection1] o.a.s.c.SolrCore Looking for old index directories to cleanup for core collection1 in /home/jenkins/workspace/Lucene-Solr-trunk-Linux/solr/build/solr-core/test/J1/temp/solr.cloud.ChaosMonkeySafeLeaderTest_C75661F707DC4B01-001/control-001/cores/collection1/data/
   [junit4]   2> 164827 INFO  (coreLoadExecutor-586-thread-1-processing-n:127.0.0.1:38178_) [n:127.0.0.1:38178_ c:control_collection s:shard1 r:core_node1 x:collection1] o.a.s.u.p.UpdateRequestProcessorChain creating updateRequestProcessorChain "nodistrib"
   [junit4]   2> 164828 INFO  (coreLoadExecutor-586-thread-1-processing-n:127.0.0.1:38178_) [n:127.0.0.1:38178_ c:control_collection s:shard1 r:core_node1 x:collection1] o.a.s.u.p.UpdateRequestProcessorChain creating updateRequestProcessorChain "dedupe"
   [junit4]   2> 164828 INFO  (coreLoadExecutor-586-thread-1-processing-n:127.0.0.1:38178_) [n:127.0.0.1:38178_ c:control_collection s:shard1 r:core_node1 x:collection1] o.a.s.u.p.UpdateRequestProcessorChain inserting DistributedUpdateProcessorFactory into updateRequestProcessorChain "dedupe"
   [junit4]   2> 164828 INFO  (coreLoadExecutor-586-thread-1-processing-n:127.0.0.1:38178_) [n:127.0.0.1:38178_ c:control_collection s:shard1 r:core_node1 x:collection1] o.a.s.u.p.UpdateRequestProcessorChain creating updateRequestProcessorChain "stored_sig"
   [junit4]   2> 164828 INFO  (coreLoadExecutor-586-thread-1-processing-n:127.0.0.1:38178_) [n:127.0.0.1:38178_ c:control_collection s:shard1 r:core_node1 x:collection1] o.a.s.u.p.UpdateRequestProcessorChain inserting DistributedUpdateProcessorFactory into updateRequestProcessorChain "stored_sig"
   [junit4]   2> 164828 INFO  (coreLoadExecutor-586-thread-1-processing-n:127.0.0.1:38178_) [n:127.0.0.1:38178_ c:control_collection s:shard1 r:core_node1 x:collection1] o.a.s.u.p.UpdateRequestProcessorChain creating updateRequestProcessorChain "distrib-dup-test-chain-explicit"
   [junit4]   2> 164828 INFO  (coreLoadExecutor-586-thread-1-processing-n:127.0.0.1:38178_) [n:127.0.0.1:38178_ c:control_collection s:shard1 r:core_node1 x:collection1] o.a.s.u.p.UpdateRequestProcessorChain creating updateRequestProcessorChain "distrib-dup-test-chain-implicit"
   [junit4]   2> 164829 INFO  (coreLoadExecutor-586-thread-1-processing-n:127.0.0.1:38178_) [n:127.0.0.1:38178_ c:control_collection s:shard1 r:core_node1 x:collection1] o.a.s.u.p.UpdateRequestProcessorChain inserting DistributedUpdateProcessorFactory into updateRequestProcessorChain "distrib-dup-test-chain-implicit"
   [junit4]   2> 164829 INFO  (coreLoadExecutor-586-thread-1-processing-n:127.0.0.1:38178_) [n:127.0.0.1:38178_ c:control_collection s:shard1 r:core_node1 x:collection1] o.a.s.c.SolrCore no updateRequestProcessorChain defined as default, creating implicit default
   [junit4]   2> 164831 INFO  (coreLoadExecutor-586-thread-1-processing-n:127.0.0.1:38178_) [n:127.0.0.1:38178_ c:control_collection s:shard1 r:core_node1 x:collection1] o.a.s.h.l.XMLLoader xsltCacheLifetimeSeconds=60
   [junit4]   2> 164832 INFO  (coreLoadExecutor-586-thread-1-processing-n:127.0.0.1:38178_) [n:127.0.0.1:38178_ c:control_collection s:shard1 r:core_node1 x:collection1] o.a.s.h.l.XMLLoader xsltCacheLifetimeSeconds=60
   [junit4]   2> 164833 INFO  (coreLoadExecutor-586-thread-1-processing-n:127.0.0.1:38178_) [n:127.0.0.1:38178_ c:control_collection s:shard1 r:core_node1 x:collection1] o.a.s.h.l.XMLLoader xsltCacheLifetimeSeconds=60
   [junit4]   2> 164834 INFO  (coreLoadExecutor-586-thread-1-processing-n:127.0.0.1:38178_) [n:127.0.0.1:38178_ c:control_collection s:shard1 r:core_node1 x:collection1] o.a.s.h.l.XMLLoader xsltCacheLifetimeSeconds=60
   [junit4]   2> 164836 INFO  (coreLoadExecutor-586-thread-1-processing-n:127.0.0.1:38178_) [n:127.0.0.1:38178_ c:control_collection s:shard1 r:core_node1 x:collection1] o.a.s.c.RequestHandlers Registered paths: /admin/mbeans,standard,/update/csv,/update/json/docs,/admin/luke,/admin/segments,/get,/admin/system,/replication,/admin/properties,/config,/schema,/admin/plugins,/admin/logging,/update/json,/admin/threads,/admin/ping,/update,/admin/file
   [junit4]   2> 164837 INFO  (coreLoadExecutor-586-thread-1-processing-n:127.0.0.1:38178_) [n:127.0.0.1:38178_ c:control_collection s:shard1 r:core_node1 x:collection1] o.a.s.c.SolrCore Using default statsCache cache: org.apache.solr.search.stats.LocalStatsCache
   [junit4]   2> 164837 INFO  (coreLoadExecutor-586-thread-1-processing-n:127.0.0.1:38178_) [n:127.0.0.1:38178_ c:control_collection s:shard1 r:core_node1 x:collection1] o.a.s.u.UpdateHandler Using UpdateLog implementation: org.apache.solr.update.UpdateLog
   [junit4]   2> 164837 INFO  (coreLoadExecutor-586-thread-1-processing-n:127.0.0.1:38178_) [n:127.0.0.1:38178_ c:control_collection s:shard1 r:core_node1 x:collection1] o.a.s.u.UpdateLog Initializing UpdateLog: dataDir= defaultSyncLevel=FLUSH numRecordsToKeep=100 maxNumLogsToKeep=10 numVersionBuckets=65536
   [junit4]   2> 164838 INFO  (coreLoadExecutor-586-thread-1-processing-n:127.0.0.1:38178_) [n:127.0.0.1:38178_ c:control_collection s:shard1 r:core_node1 x:collection1] o.a.s.c.SolrCore Hard AutoCommit: disabled
   [junit4]   2> 164838 INFO  (coreLoadExecutor-586-thread-1-processing-n:127.0.0.1:38178_) [n:127.0.0.1:38178_ c:control_collection s:shard1 r:core_node1 x:collection1] o.a.s.c.SolrCore Soft AutoCommit: disabled
   [junit4]   2> 164839 INFO  (coreLoadExecutor-586-thread-1-processing-n:127.0.0.1:38178_) [n:127.0.0.1:38178_ c:control_collection s:shard1 r:core_node1 x:collection1] o.a.s.u.RandomMergePolicy RandomMergePolicy wrapping class org.apache.lucene.index.TieredMergePolicy: [TieredMergePolicy: maxMergeAtOnce=24, maxMergeAtOnceExplicit=38, maxMergedSegmentMB=42.5498046875, floorSegmentMB=0.6357421875, forceMergeDeletesPctAllowed=11.237559175238804, segmentsPerTier=34.0, maxCFSSegmentSizeMB=8.796093022207999E12, noCFSRatio=1.0
   [junit4]   2> 164839 INFO  (coreLoadExecutor-586-thread-1-processing-n:127.0.0.1:38178_) [n:127.0.0.1:38178_ c:control_collection s:shard1 r:core_node1 x:collection1] o.a.s.c.SolrCore SolrDeletionPolicy.onInit: commits: num=1
   [junit4]   2> 	commit{dir=/home/jenkins/workspace/Lucene-Solr-trunk-Linux/solr/build/solr-core/test/J1/temp/solr.cloud.ChaosMonkeySafeLeaderTest_C75661F707DC4B01-001/control-001/cores/collection1/data/index,segFN=segments_1,generation=1}
   [junit4]   2> 164839 INFO  (coreLoadExecutor-586-thread-1-processing-n:127.0.0.1:38178_) [n:127.0.0.1:38178_ c:control_collection s:shard1 r:core_node1 x:collection1] o.a.s.c.SolrCore newest commit generation = 1
   [junit4]   2> 164840 INFO  (coreLoadExecutor-586-thread-1-processing-n:127.0.0.1:38178_) [n:127.0.0.1:38178_ c:control_collection s:shard1 r:core_node1 x:collection1] o.a.s.s.SolrIndexSearcher Opening Searcher@35296723[collection1] main
   [junit4]   2> 164840 INFO  (coreLoadExecutor-586-thread-1-processing-n:127.0.0.1:38178_) [n:127.0.0.1:38178_ c:control_collection s:shard1 r:core_node1 x:collection1] o.a.s.c.c.ZkStateReader Load collection config from:/collections/control_collection
   [junit4]   2> 164840 INFO  (coreLoadExecutor-586-thread-1-processing-n:127.0.0.1:38178_) [n:127.0.0.1:38178_ c:control_collection s:shard1 r:core_node1 x:collection1] o.a.s.c.c.ZkStateReader path=/collections/control_collection configName=conf1 specified config exists in ZooKeeper
   [junit4]   2> 164841 INFO  (coreLoadExecutor-586-thread-1-processing-n:127.0.0.1:38178_) [n:127.0.0.1:38178_ c:control_collection s:shard1 r:core_node1 x:collection1] o.a.s.r.ManagedResourceStorage Setting up ZooKeeper-based storage for the RestManager with znodeBase: /configs/conf1
   [junit4]   2> 164854 INFO  (coreLoadExecutor-586-thread-1-processing-n:127.0.0.1:38178_) [n:127.0.0.1:38178_ c:control_collection s:shard1 r:core_node1 x:collection1] o.a.s.r.ManagedResourceStorage Configured ZooKeeperStorageIO with znodeBase: /configs/conf1
   [junit4]   2> 164854 INFO  (coreLoadExecutor-586-thread-1-processing-n:127.0.0.1:38178_) [n:127.0.0.1:38178_ c:control_collection s:shard1 r:core_node1 x:collection1] o.a.s.r.RestManager Initializing RestManager with initArgs: {}
   [junit4]   2> 164854 INFO  (coreLoadExecutor-586-thread-1-processing-n:127.0.0.1:38178_) [n:127.0.0.1:38178_ c:control_collection s:shard1 r:core_node1 x:collection1] o.a.s.r.ManagedResourceStorage Reading _rest_managed.json using ZooKeeperStorageIO:path=/configs/conf1
   [junit4]   2> 164854 INFO  (coreLoadExecutor-586-thread-1-processing-n:127.0.0.1:38178_) [n:127.0.0.1:38178_ c:control_collection s:shard1 r:core_node1 x:collection1] o.a.s.r.ManagedResourceStorage No data found for znode /configs/conf1/_rest_managed.json
   [junit4]   2> 164855 INFO  (coreLoadExecutor-586-thread-1-processing-n:127.0.0.1:38178_) [n:127.0.0.1:38178_ c:control_collection s:shard1 r:core_node1 x:collection1] o.a.s.r.ManagedResourceStorage Loaded null at path _rest_managed.json using ZooKeeperStorageIO:path=/configs/conf1
   [junit4]   2> 164855 INFO  (coreLoadExecutor-586-thread-1-processing-n:127.0.0.1:38178_) [n:127.0.0.1:38178_ c:control_collection s:shard1 r:core_node1 x:collection1] o.a.s.r.RestManager Initializing 0 registered ManagedResources
   [junit4]   2> 164855 INFO  (coreLoadExecutor-586-thread-1-processing-n:127.0.0.1:38178_) [n:127.0.0.1:38178_ c:control_collection s:shard1 r:core_node1 x:collection1] o.a.s.h.ReplicationHandler Commits will be reserved for  10000
   [junit4]   2> 164856 INFO  (searcherExecutor-587-thread-1-processing-n:127.0.0.1:38178_ x:collection1 s:shard1 c:control_collection r:core_node1) [n:127.0.0.1:38178_ c:control_collection s:shard1 r:core_node1 x:collection1] o.a.s.c.SolrCore [collection1] Registered new searcher Searcher@35296723[collection1] main{ExitableDirectoryReader(UninvertingDirectoryReader())}
   [junit4]   2> 164856 INFO  (coreLoadExecutor-586-thread-1-processing-n:127.0.0.1:38178_) [n:127.0.0.1:38178_ c:control_collection s:shard1 r:core_node1 x:collection1] o.a.s.u.UpdateLog Looking up max value of version field to seed version buckets
   [junit4]   2> 164856 INFO  (coreLoadExecutor-586-thread-1-processing-n:127.0.0.1:38178_) [n:127.0.0.1:38178_ c:control_collection s:shard1 r:core_node1 x:collection1] o.a.s.u.VersionInfo Refreshing highest value of _version_ for 65536 version buckets from index
   [junit4]   2> 164856 INFO  (coreLoadExecutor-586-thread-1-processing-n:127.0.0.1:38178_) [n:127.0.0.1:38178_ c:control_collection s:shard1 r:core_node1 x:collection1] o.a.s.u.VersionInfo No terms found for _version_, cannot seed version bucket highest value from index
   [junit4]   2> 164856 INFO  (coreLoadExecutor-586-thread-1-processing-n:127.0.0.1:38178_) [n:127.0.0.1:38178_ c:control_collection s:shard1 r:core_node1 x:collection1] o.a.s.u.UpdateLog Could not find max version in index or recent updates, using new clock 1508455097984614400
   [junit4]   2> 164858 INFO  (coreLoadExecutor-586-thread-1-processing-n:127.0.0.1:38178_) [n:127.0.0.1:38178_ c:control_collection s:shard1 r:core_node1 x:collection1] o.a.s.u.UpdateLog Took 2 ms to seed version buckets with highest version 1508455097984614400
   [junit4]   2> 164858 INFO  (coreLoadExecutor-586-thread-1-processing-n:127.0.0.1:38178_) [n:127.0.0.1:38178_ c:control_collection s:shard1 r:core_node1 x:collection1] o.a.s.c.ZkController watch zkdir /configs/conf1
   [junit4]   2> 164858 INFO  (coreLoadExecutor-586-thread-1-processing-n:127.0.0.1:38178_) [n:127.0.0.1:38178_ c:control_collection s:shard1 r:core_node1 x:collection1] o.a.s.c.CoreContainer registering core: collection1
   [junit4]   2> 164859 INFO  (coreZkRegister-580-thread-1-processing-n:127.0.0.1:38178_ x:collection1 s:shard1 c:control_collection r:core_node1) [n:127.0.0.1:38178_ c:control_collection s:shard1 r:core_node1 x:collection1] o.a.s.c.ZkController Register replica - core:collection1 address:http://127.0.0.1:38178 collection:control_collection shard:shard1
   [junit4]   2> 164859 INFO  (coreZkRegister-580-thread-1-processing-n:127.0.0.1:38178_ x:collection1 s:shard1 c:control_collection r:core_node1) [n:127.0.0.1:38178_ c:control_collection s:shard1 r:core_node1 x:collection1] o.a.s.c.c.SolrZkClient makePath: /collections/control_collection/leader_elect/shard1/election
   [junit4]   2> 164860 INFO  (coreZkRegister-580-thread-1-processing-n:127.0.0.1:38178_ x:collection1 s:shard1 c:control_collection r:core_node1) [n:127.0.0.1:38178_ c:control_collection s:shard1 r:core_node1 x:collection1] o.a.s.c.LeaderElector Joined leadership election with path: /collections/control_collection/leader_elect/shard1/election/94278443533008900-core_node1-n_0000000000
   [junit4]   2> 164861 INFO  (coreZkRegister-580-thread-1-processing-n:127.0.0.1:38178_ x:collection1 s:shard1 c:control_collection r:core_node1) [n:127.0.0.1:38178_ c:control_collection s:shard1 r:core_node1 x:collection1] o.a.s.c.ShardLeaderElectionContext Running the leader process for shard shard1
   [junit4]   2> 164861 INFO  (zkCallback-115-thread-1-processing-n:127.0.0.1:38178_) [n:127.0.0.1:38178_    ] o.a.s.c.DistributedQueue NodeChildrenChanged fired on path /overseer/queue state SyncConnected
   [junit4]   2> 164861 INFO  (coreZkRegister-580-thread-1-processing-n:127.0.0.1:38178_ x:collection1 s:shard1 c:control_collection r:core_node1) [n:127.0.0.1:38178_ c:control_collection s:shard1 r:core_node1 x:collection1] o.a.s.c.ShardLeaderElectionContext Enough replicas found to continue.
   [junit4]   2> 164861 INFO  (coreZkRegister-580-thread-1-processing-n:127.0.0.1:38178_ x:collection1 s:shard1 c:control_collection r:core_node1) [n:127.0.0.1:38178_ c:control_collection s:shard1 r:core_node1 x:collection1] o.a.s.c.ShardLeaderElectionContext I may be the new leader - try and sync
   [junit4]   2> 164862 INFO  (coreZkRegister-580-thread-1-processing-n:127.0.0.1:38178_ x:collection1 s:shard1 c:control_collection r:core_node1) [n:127.0.0.1:38178_ c:control_collection s:shard1 r:core_node1 x:collection1] o.a.s.c.SyncStrategy Sync replicas to http://127.0.0.1:38178/collection1/
   [junit4]   2> 164862 INFO  (coreZkRegister-580-thread-1-processing-n:127.0.0.1:38178_ x:collection1 s:shard1 c:control_collection r:core_node1) [n:127.0.0.1:38178_ c:control_collection s:shard1 r:core_node1 x:collection1] o.a.s.c.SyncStrategy Sync Success - now sync replicas to me
   [junit4]   2> 164862 INFO  (OverseerStateUpdate-94278443533008900-127.0.0.1:38178_-n_0000000000) [n:127.0.0.1:38178_    ] o.a.s.c.Overseer processMessage: queueSize: 1, message = {
   [junit4]   2>   "operation":"leader",
   [junit4]   2>   "shard":"shard1",
   [junit4]   2>   "collection":"control_collection"} current state version: 1
   [junit4]   2> 164862 INFO  (coreZkRegister-580-thread-1-processing-n:127.0.0.1:38178_ x:collection1 s:shard1 c:control_collection r:core_node1) [n:127.0.0.1:38178_ c:control_collection s:shard1 r:core_node1 x:collection1] o.a.s.c.SyncStrategy http://127.0.0.1:38178/collection1/ has no replicas
   [junit4]   2> 164862 INFO  (coreZkRegister-580-thread-1-processing-n:127.0.0.1:38178_ x:collection1 s:shard1 c:control_collection r:core_node1) [n:127.0.0.1:38178_ c:control_collection s:shard1 r:core_node1 x:collection1] o.a.s.c.ShardLeaderElectionContext I am the new leader: http://127.0.0.1:38178/collection1/ shard1
   [junit4]   2> 164862 INFO  (coreZkRegister-580-thread-1-processing-n:127.0.0.1:38178_ x:collection1 s:shard1 c:control_collection r:core_node1) [n:127.0.0.1:38178_ c:control_collection s:shard1 r:core_node1 x:collection1] o.a.s.c.c.SolrZkClient makePath: /collections/control_collection/leaders/shard1
   [junit4]   2> 164863 INFO  (zkCallback-115-thread-1-processing-n:127.0.0.1:38178_) [n:127.0.0.1:38178_    ] o.a.s.c.DistributedQueue NodeChildrenChanged fired on path /overseer/queue state SyncConnected
   [junit4]   2> 164864 INFO  (OverseerStateUpdate-94278443533008900-127.0.0.1:38178_-n_0000000000) [n:127.0.0.1:38178_    ] o.a.s.c.Overseer processMessage: queueSize: 1, message = {
   [junit4]   2>   "operation":"leader",
   [junit4]   2>   "shard":"shard1",
   [junit4]   2>   "collection":"control_collection",
   [junit4]   2>   "base_url":"http://127.0.0.1:38178",
   [junit4]   2>   "core":"collection1",
   [junit4]   2>   "state":"active"} current state version: 1
   [junit4]   2> 164965 INFO  (zkCallback-115-thread-1-processing-n:127.0.0.1:38178_) [n:127.0.0.1:38178_    ] o.a.s.c.c.ZkStateReader A cluster state change: WatchedEvent state:SyncConnected type:NodeDataChanged path:/clusterstate.json, has occurred - updating... (live nodes size: 1)
   [junit4]   2> 164966 INFO  (zkCallback-115-thread-1-processing-n:127.0.0.1:38178_) [n:127.0.0.1:38178_    ] o.a.s.c.c.ZkStateReader Updated cluster state version to 2
   [junit4]   2> 165014 INFO  (coreZkRegister-580-thread-1-processing-n:127.0.0.1:38178_ x:collection1 s:shard1 c:control_collection r:core_node1) [n:127.0.0.1:38178_ c:control_collection s:shard1 r:core_node1 x:collection1] o.a.s.c.ZkController We are http://127.0.0.1:38178/collection1/ and leader is http://127.0.0.1:38178/collection1/
   [junit4]   2> 165014 INFO  (coreZkRegister-580-thread-1-processing-n:127.0.0.1:38178_ x:collection1 s:shard1 c:control_collection r:core_node1) [n:127.0.0.1:38178_ c:control_collection s:shard1 r:core_node1 x:collection1] o.a.s.c.ZkController No LogReplay needed for core=collection1 baseURL=http://127.0.0.1:38178
   [junit4]   2> 165014 INFO  (coreZkRegister-580-thread-1-processing-n:127.0.0.1:38178_ x:collection1 s:shard1 c:control_collection r:core_node1) [n:127.0.0.1:38178_ c:control_collection s:shard1 r:core_node1 x:collection1] o.a.s.c.ZkController I am the leader, no recovery necessary
   [junit4]   2> 165014 INFO  (coreZkRegister-580-thread-1-processing-n:127.0.0.1:38178_ x:collection1 s:shard1 c:control_collection r:core_node1) [n:127.0.0.1:38178_ c:control_collection s:shard1 r:core_node1 x:collection1] o.a.s.c.ZkController publishing state=active
   [junit4]   2> 165015 INFO  (coreZkRegister-580-thread-1-processing-n:127.0.0.1:38178_ x:collection1 s:shard1 c:control_collection r:core_node1) [n:127.0.0.1:38178_ c:control_collection s:shard1 r:core_node1 x:collection1] o.a.s.c.ZkController numShards not found on descriptor - reading it from system property
   [junit4]   2> 165015 INFO  (zkCallback-115-thread-1-processing-n:127.0.0.1:38178_) [n:127.0.0.1:38178_    ] o.a.s.c.DistributedQueue NodeChildrenChanged fired on path /overseer/queue state SyncConnected
   [junit4]   2> 165016 INFO  (OverseerStateUpdate-94278443533008900-127.0.0.1:38178_-n_0000000000) [n:127.0.0.1:38178_    ] o.a.s.c.Overseer processMessage: queueSize: 1, message = {
   [junit4]   2>   "core":"collection1",
   [junit4]   2>   "core_node_name":"core_node1",
   [junit4]   2>   "roles":null,
   [junit4]   2>   "base_url":"http://127.0.0.1:38178",
   [junit4]   2>   "node_name":"127.0.0.1:38178_",
   [junit4]   2>   "numShards":"1",
   [junit4]   2>   "state":"active",
   [junit4]   2>   "shard":"shard1",
   [junit4]   2>   "collection":"control_collection",
   [junit4]   2>   "operation":"state"} current state version: 2
   [junit4]   2> 165016 INFO  (OverseerStateUpdate-94278443533008900-127.0.0.1:38178_-n_0000000000) [n:127.0.0.1:38178_    ] o.a.s.c.o.ReplicaMutator Update state numShards=1 message={
   [junit4]   2>   "core":"collection1",
   [junit4]   2>   "core_node_name":"core_node1",
   [junit4]   2>   "roles":null,
   [junit4]   2>   "base_url":"http://127.0.0.1:38178",
   [junit4]   2>   "node_name":"127.0.0.1:38178_",
   [junit4]   2>   "numShards":"1",
   [junit4]   2>   "state":"active",
   [junit4]   2>   "shard":"shard1",
   [junit4]   2>   "collection":"control_collection",
   [junit4]   2>   "operation":"state"}
   [junit4]   2> 165118 INFO  (zkCallback-115-thread-1-processing-n:127.0.0.1:38178_) [n:127.0.0.1:38178_    ] o.a.s.c.c.ZkStateReader A cluster state change: WatchedEvent state:SyncConnected type:NodeDataChanged path:/clusterstate.json, has occurred - updating... (live nodes size: 1)
   [junit4]   2> 165119 INFO  (zkCallback-115-thread-1-processing-n:127.0.0.1:38178_) [n:127.0.0.1:38178_    ] o.a.s.c.c.ZkStateReader Updated cluster state version to 3
   [junit4]   2> 165194 INFO  (TEST-ChaosMonkeySafeLeaderTest.test-seed#[C75661F707DC4B01]) [    ] o.a.s.c.c.SolrZkClient Using default ZkCredentialsProvider
   [junit4]   2> 165195 INFO  (TEST-ChaosMonkeySafeLeaderTest.test-seed#[C75661F707DC4B01]) [    ] o.a.s.c.c.ConnectionManager Waiting for client to connect to ZooKeeper
   [junit4]   2> 165196 INFO  (zkCallback-117-thread-1) [    ] o.a.s.c.c.ConnectionManager Watcher org.apache.solr.common.cloud.ConnectionManager@5f00d94f name:ZooKeeperConnection Watcher:127.0.0.1:38531/solr got event WatchedEvent state:SyncConnected type:None path:null path:null type:None
   [junit4]   2> 165196 INFO  (TEST-ChaosMonkeySafeLeaderTest.test-seed#[C75661F707DC4B01]) [    ] o.a.s.c.c.ConnectionManager Client is connected to ZooKeeper
   [junit4]   2> 165196 INFO  (TEST-ChaosMonkeySafeLeaderTest.test-seed#[C75661F707DC4B01]) [    ] o.a.s.c.c.SolrZkClient Using default ZkACLProvider
   [junit4]   2> 165196 INFO  (TEST-ChaosMonkeySafeLeaderTest.test-seed#[C75661F707DC4B01]) [    ] o.a.s.c.c.ZkStateReader Updating cluster state from ZooKeeper... 
   [junit4]   2> 165198 INFO  (TEST-ChaosMonkeySafeLeaderTest.test-seed#[C75661F707DC4B01]) [    ] o.a.s.c.ChaosMonkey monkey: init - expire sessions:false cause connection loss:false
   [junit4]   2> 165245 INFO  (TEST-ChaosMonkeySafeLeaderTest.test-seed#[C75661F707DC4B01]) [    ] o.a.s.SolrTestCaseJ4 Writing core.properties file to /home/jenkins/workspace/Lucene-Solr-trunk-Linux/solr/build/solr-core/test/J1/temp/solr.cloud.ChaosMonkeySafeLeaderTest_C75661F707DC4B01-001/shard-1-001/cores/collection1
   [junit4]   2> 165245 INFO  (TEST-ChaosMonkeySafeLeaderTest.test-seed#[C75661F707DC4B01]) [    ] o.a.s.c.AbstractFullDistribZkTestBase create jetty 1 in directory /home/jenkins/workspace/Lucene-Solr-trunk-Linux/solr/build/solr-core/test/J1/temp/solr.cloud.ChaosMonkeySafeLeaderTest_C75661F707DC4B01-001/shard-1-001
   [junit4]   2> 165246 INFO  (TEST-ChaosMonkeySafeLeaderTest.test-seed#[C75661F707DC4B01]) [    ] o.e.j.s.Server jetty-9.2.11.v20150529
   [junit4]   2> 165247 INFO  (TEST-ChaosMonkeySafeLeaderTest.test-seed#[C75661F707DC4B01]) [    ] o.e.j.s.h.ContextHandler Started o.e.j.s.ServletContextHandler@5c8e94ab{/,null,AVAILABLE}
   [junit4]   2> 165247 INFO  (TEST-ChaosMonkeySafeLeaderTest.test-seed#[C75661F707DC4B01]) [    ] o.e.j.s.ServerConnector Started ServerConnector@546268c6{HTTP/1.1}{127.0.0.1:42109}
   [junit4]   2> 165248 INFO  (TEST-ChaosMonkeySafeLeaderTest.test-seed#[C75661F707DC4B01]) [    ] o.e.j.s.Server Started @167103ms
   [junit4]   2> 165248 INFO  (TEST-ChaosMonkeySafeLeaderTest.test-seed#[C75661F707DC4B01]) [    ] o.a.s.c.s.e.JettySolrRunner Jetty properties: {solr.data.dir=/home/jenkins/workspace/Lucene-Solr-trunk-Linux/solr/build/solr-core/test/J1/temp/solr.cloud.ChaosMonkeySafeLeaderTest_C75661F707DC4B01-001/tempDir-001/jetty1, solrconfig=solrconfig.xml, hostContext=/, hostPort=42109, coreRootDirectory=/home/jenkins/workspace/Lucene-Solr-trunk-Linux/solr/build/solr-core/test/J1/temp/solr.cloud.ChaosMonkeySafeLeaderTest_C75661F707DC4B01-001/shard-1-001/cores}
   [junit4]   2> 165249 INFO  (TEST-ChaosMonkeySafeLeaderTest.test-seed#[C75661F707DC4B01]) [    ] o.a.s.s.SolrDispatchFilter SolrDispatchFilter.init(): sun.misc.Launcher$AppClassLoader@4e0e2f2a
   [junit4]   2> 165249 INFO  (TEST-ChaosMonkeySafeLeaderTest.test-seed#[C75661F707DC4B01]) [    ] o.a.s.c.SolrResourceLoader new SolrResourceLoader for directory: '/home/jenkins/workspace/Lucene-Solr-trunk-Linux/solr/build/solr-core/test/J1/temp/solr.cloud.ChaosMonkeySafeLeaderTest_C75661F707DC4B01-001/shard-1-001/'
   [junit4]   2> 165257 INFO  (TEST-ChaosMonkeySafeLeaderTest.test-seed#[C75661F707DC4B01]) [    ] o.a.s.c.c.SolrZkClient Using default ZkCredentialsProvider
   [junit4]   2> 165258 INFO  (TEST-ChaosMonkeySafeLeaderTest.test-seed#[C75661F707DC4B01]) [    ] o.a.s.c.c.ConnectionManager Waiting for client to connect to ZooKeeper
   [junit4]   2> 165259 INFO  (zkCallback-118-thread-1) [    ] o.a.s.c.c.ConnectionManager Watcher org.apache.solr.common.cloud.ConnectionManager@61c2faaf name:ZooKeeperConnection Watcher:127.0.0.1:38531/solr got event WatchedEvent state:SyncConnected type:None path:null path:null type:None
   [junit4]   2> 165260 INFO  (TEST-ChaosMonkeySafeLeaderTest.test-seed#[C75661F707DC4B01]) [    ] o.a.s.c.c.ConnectionManager Client is connected to ZooKeeper
   [junit4]   2> 165260 INFO  (TEST-ChaosMonkeySafeLeaderTest.test-seed#[C75661F707DC4B01]) [    ] o.a.s.c.c.SolrZkClient Using default ZkACLProvider
   [junit4]   2> 165261 INFO  (TEST-ChaosMonkeySafeLeaderTest.test-seed#[C75661F707DC4B01]) [    ] o.a.s.s.SolrDispatchFilter Loading solr.xml from SolrHome (not found in ZooKeeper)
   [junit4]   2> 165261 INFO  (TEST-ChaosMonkeySafeLeaderTest.test-seed#[C75661F707DC4B01]) [    ] o.a.s.c.SolrXmlConfig Loading container configuration from /home/jenkins/workspace/Lucene-Solr-trunk-Linux/solr/build/solr-core/test/J1/temp/solr.cloud.ChaosMonkeySafeLeaderTest_C75661F707DC4B01-001/shard-1-001/solr.xml
   [junit4]   2> 165265 INFO  (TEST-ChaosMonkeySafeLeaderTest.test-seed#[C75661F707DC4B01]) [    ] o.a.s.c.CoresLocator Config-defined core root directory: /home/jenkins/workspace/Lucene-Solr-trunk-Linux/solr/build/solr-core/test/J1/temp/solr.cloud.ChaosMonkeySafeLeaderTest_C75661F707DC4B01-001/shard-1-001/cores
   [junit4]   2> 165265 INFO  (TEST-ChaosMonkeySafeLeaderTest.test-seed#[C75661F707DC4B01]) [    ] o.a.s.c.CoreContainer New CoreContainer 1846357529
   [junit4]   2> 165265 INFO  (TEST-ChaosMonkeySafeLeaderTest.test-seed#[C75661F707DC4B01]) [    ] o.a.s.c.CoreContainer Loading cores into CoreContainer [instanceDir=/home/jenkins/workspace/Lucene-Solr-trunk-Linux/solr/build/solr-core/test/J1/temp/solr.cloud.ChaosMonkeySafeLeaderTest_C75661F707DC4B01-001/shard-1-001/]
   [junit4]   2> 165265 INFO  (TEST-ChaosMonkeySafeLeaderTest.test-seed#[C75661F707DC4B01]) [    ] o.a.s.c.CoreContainer loading shared library: /home/jenkins/workspace/Lucene-Solr-trunk-Linux/solr/build/solr-core/test/J1/temp/solr.cloud.ChaosMonkeySafeLeaderTest_C75661F707DC4B01-001/shard-1-001/lib
   [junit4]   2> 165265 WARN  (TEST-ChaosMonkeySafeLeaderTest.test-seed#[C75661F707DC4B01]) [    ] o.a.s.c.SolrResourceLoader Can't find (or read) directory to add to classloader: lib (resolved as: /home/jenkins/workspace/Lucene-Solr-trunk-Linux/solr/build/solr-core/test/J1/temp/solr.cloud.ChaosMonkeySafeLeaderTest_C75661F707DC4B01-001/shard-1-001/lib).
   [junit4]   2> 165269 INFO  (TEST-ChaosMonkeySafeLeaderTest.test-seed#[C75661F707DC4B01]) [    ] o.a.s.h.c.HttpShardHandlerFactory created with socketTimeout : 90000,urlScheme : ,connTimeout : 15000,maxConnectionsPerHost : 20,maxConnections : 10000,corePoolSize : 0,maximumPoolSize : 2147483647,maxThreadIdleTime : 5,sizeOfQueue : -1,fairnessPolicy : false,useRetries : false,
   [junit4]   2> 165270 INFO  (TEST-ChaosMonkeySafeLeaderTest.test-seed#[C75661F707DC4B01]) [    ] o.a.s.u.UpdateShardHandler Creating UpdateShardHandler HTTP client with params: socketTimeout=340000&connTimeout=45000&retry=true
   [junit4]   2> 165270 INFO  (TEST-ChaosMonkeySafeLeaderTest.test-seed#[C75661F707DC4B01]) [    ] o.a.s.l.LogWatcher SLF4J impl is org.slf4j.impl.Log4jLoggerFactory
   [junit4]   2> 165270 INFO  (TEST-ChaosMonkeySafeLeaderTest.test-seed#[C75661F707DC4B01]) [    ] o.a.s.l.LogWatcher Registering Log Listener [Log4j (org.slf4j.impl.Log4jLoggerFactory)]
   [junit4]   2> 165270 INFO  (TEST-ChaosMonkeySafeLeaderTest.test-seed#[C75661F707DC4B01]) [    ] o.a.s.c.ZkContainer Zookeeper client=127.0.0.1:38531/solr
   [junit4]   2> 165270 INFO  (TEST-ChaosMonkeySafeLeaderTest.test-seed#[C75661F707DC4B01]) [    ] o.a.s.c.ZkController zkHost includes chroot
   [junit4]   2> 165271 INFO  (TEST-ChaosMonkeySafeLeaderTest.test-seed#[C75661F707DC4B01]) [    ] o.a.s.c.c.SolrZkClient Using default ZkCredentialsProvider
   [junit4]   2> 165271 INFO  (TEST-ChaosMonkeySafeLeaderTest.test-seed#[C75661F707DC4B01]) [    ] o.a.s.c.c.ConnectionManager Waiting for client to connect to ZooKeeper
   [junit4]   2> 165272 INFO  (zkCallback-120-thread-1) [    ] o.a.s.c.c.ConnectionManager Watcher org.apache.solr.common.cloud.ConnectionManager@3c55d58d name:ZooKeeperConnection Watcher:127.0.0.1:38531 got event WatchedEvent state:SyncConnected type:None path:null path:null type:None
   [junit4]   2> 165272 INFO  (TEST-ChaosMonkeySafeLeaderTest.test-seed#[C75661F707DC4B01]) [    ] o.a.s.c.c.ConnectionManager Client is connected to ZooKeeper
   [junit4]   2> 165272 INFO  (TEST-ChaosMonkeySafeLeaderTest.test-seed#[C75661F707DC4B01]) [    ] o.a.s.c.c.SolrZkClient Using default ZkACLProvider
   [junit4]   2> 165273 INFO  (TEST-ChaosMonkeySafeLeaderTest.test-seed#[C75661F707DC4B01]) [n:127.0.0.1:42109_    ] o.a.s.c.c.ConnectionManager Waiting for client to connect to ZooKeeper
   [junit4]   2> 165275 INFO  (zkCallback-121-thread-1-processing-n:127.0.0.1:42109_) [n:127.0.0.1:42109_    ] o.a.s.c.c.ConnectionManager Watcher org.apache.solr.common.cloud.ConnectionManager@2dcbfa14 name:ZooKeeperConnection Watcher:127.0.0.1:38531/solr got event WatchedEvent state:SyncConnected type:None path:null path:null type:None
   [junit4]   2> 165275 INFO  (TEST-ChaosMonkeySafeLeaderTest.test-seed#[C75661F707DC4B01]) [n:127.0.0.1:42109_    ] o.a.s.c.c.ConnectionManager Client is connected to ZooKeeper
   [junit4]   2> 165276 INFO  (TEST-ChaosMonkeySafeLeaderTest.test-seed#[C75661F707DC4B01]) [n:127.0.0.1:42109_    ] o.a.s.c.c.ZkStateReader Updating cluster state from ZooKeeper... 
   [junit4]   2> 166278 INFO  (TEST-ChaosMonkeySafeLeaderTest.test-seed#[C75661F707DC4B01]) [n:127.0.0.1:42109_    ] o.a.s.c.ZkController Register node as live in ZooKeeper:/live_nodes/127.0.0.1:42109_
   [junit4]   2> 166279 INFO  (TEST-ChaosMonkeySafeLeaderTest.test-seed#[C75661F707DC4B01]) [n:127.0.0.1:42109_    ] o.a.s.c.c.SolrZkClient makePath: /live_nodes/127.0.0.1:42109_
   [junit4]   2> 166280 INFO  (TEST-ChaosMonkeySafeLeaderTest.test-seed#[C75661F707DC4B01]) [n:127.0.0.1:42109_    ] o.a.s.c.Overseer Overseer (id=null) closing
   [junit4]   2> 166280 INFO  (TEST-ChaosMonkeySafeLeaderTest.test-seed#[C75661F707DC4B01]) [n:127.0.0.1:42109_    ] o.a.s.c.LeaderElector Joined leadership election with path: /overseer_elect/election/94278443533008904-127.0.0.1:42109_-n_0000000001
   [junit4]   2> 166281 INFO  (TEST-ChaosMonkeySafeLeaderTest.test-seed#[C75661F707DC4B01]) [n:127.0.0.1:42109_    ] o.a.s.c.LeaderElector Watching path /overseer_elect/election/94278443533008900-127.0.0.1:38178_-n_0000000000 to know if I could be the leader
   [junit4]   2> 166281 INFO  (TEST-ChaosMonkeySafeLeaderTest.test-seed#[C75661F707DC4B01]) [n:127.0.0.1:42109_    ] o.a.s.c.CoreContainer No authentication plugin used.
   [junit4]   2> 166281 INFO  (TEST-ChaosMonkeySafeLeaderTest.test-seed#[C75661F707DC4B01]) [n:127.0.0.1:42109_    ] o.a.s.c.CoreContainer Security conf doesn't exist. Skipping setup for authorization module.
   [junit4]   2> 166281 INFO  (TEST-ChaosMonkeySafeLeaderTest.test-seed#[C75661F707DC4B01]) [n:127.0.0.1:42109_    ] o.a.s.c.CoresLocator Looking for core definitions underneath /home/jenkins/workspace/Lucene-Solr-trunk-Linux/solr/build/solr-core/test/J1/temp/solr.cloud.ChaosMonkeySafeLeaderTest_C75661F707DC4B01-001/shard-1-001/cores
   [junit4]   2> 166282 INFO  (TEST-ChaosMonkeySafeLeaderTest.test-seed#[C75661F707DC4B01]) [n:127.0.0.1:42109_    ] o.a.s.c.SolrCore Created CoreDescriptor: {name=collection1, config=solrconfig.xml, transient=false, schema=schema.xml, loadOnStartup=true, configSetProperties=configsetprops.json, instanceDir=/home/jenkins/workspace/Lucene-Solr-trunk-Linux/solr/build/solr-core/test/J1/temp/solr.cloud.ChaosMonkeySafeLeaderTest_C75661F707DC4B01-001/shard-1-001/cores/collection1, collection=collection1, absoluteInstDir=/home/jenkins/workspace/Lucene-Solr-trunk-Linux/solr/build/solr-core/test/J1/temp/solr.cloud.ChaosMonkeySafeLeaderTest_C75661F707DC4B01-001/shard-1-001/cores/collection1/, coreNodeName=, dataDir=data/, shard=}
   [junit4]   2> 166282 INFO  (TEST-ChaosMonkeySafeLeaderTest.test-seed#[C75661F707DC4B01]) [n:127.0.0.1:42109_    ] o.a.s.c.CoresLocator Found core collection1 in /home/jenkins/workspace/Lucene-Solr-trunk-Linux/solr/build/solr-core/test/J1/temp/solr.cloud.ChaosMonkeySafeLeaderTest_C75661F707DC4B01-001/shard-1-001/cores/collection1/
   [junit4]   2> 166282 INFO  (TEST-ChaosMonkeySafeLeaderTest.test-seed#[C75661F707DC4B01]) [n:127.0.0.1:42109_    ] o.a.s.c.CoresLocator Found 1 core definitions
   [junit4]   2> 166283 INFO  (coreLoadExecutor-597-thread-1-processing-n:127.0.0.1:42109_) [n:127.0.0.1:42109_ c:collection1   x:collection1] o.a.s.c.ZkController publishing state=down
   [junit4]   2> 166283 INFO  (TEST-ChaosMonkeySafeLeaderTest.test-seed#[C75661F707DC4B01]) [n:127.0.0.1:42109_    ] o.a.s.s.SolrDispatchFilter user.dir=/home/jenkins/workspace/Lucene-Solr-trunk-Linux/solr/build/solr-core/test/J1
   [junit4]   2> 166283 INFO  (TEST-ChaosMonkeySafeLeaderTest.test-seed#[C75661F707DC4B01]) [n:127.0.0.1:42109_    ] o.a.s.s.SolrDispatchFilter SolrDispatchFilter.init() done
   [junit4]   2> 166283 INFO  (coreLoadExecutor-597-thread-1-processing-n:127.0.0.1:42109_) [n:127.0.0.1:42109_ c:collection1   x:collection1] o.a.s.c.ZkController numShards not found on descriptor - reading it from system property
   [junit4]   2> 166283 INFO  (coreLoadExecutor-597-thread-1-processing-n:127.0.0.1:42109_) [n:127.0.0.1:42109_ c:collection1   x:collection1] o.a.s.c.ZkController look for our core node name
   [junit4]   2> 166283 INFO  (zkCallback-115-thread-1-processing-n:127.0.0.1:38178_) [n:127.0.0.1:38178_    ] o.a.s.c.DistributedQueue NodeChildrenChanged fired on path /overseer/queue state SyncConnected
   [junit4]   2> 166284 INFO  (OverseerStateUpdate-94278443533008900-127.0.0.1:38178_-n_0000000000) [n:127.0.0.1:38178_    ] o.a.s.c.Overseer processMessage: queueSize: 1, message = {
   [junit4]   2>   "core":"collection1",
   [junit4]   2>   "roles":null,
   [junit4]   2>   "base_url":"http://127.0.0.1:42109",
   [junit4]   2>   "node_name":"127.0.0.1:42109_",
   [junit4]   2>   "numShards":"3",
   [junit4]   2>   "state":"down",
   [junit4]   2>   "shard":null,
   [junit4]   2>   "collection":"collection1",
   [junit4]   2>   "operation":"state"} current state version: 3
   [junit4]   2> 166284 INFO  (OverseerStateUpdate-94278443533008900-127.0.0.1:38178_-n_0000000000) [n:127.0.0.1:38178_    ] o.a.s.c.o.ReplicaMutator Update state numShards=3 message={
   [junit4]   2>   "core":"collection1",
   [junit4]   2>   "roles":null,
   [junit4]   2>   "base_url":"http://127.0.0.1:42109",
   [junit4]   2>   "node_name":"127.0.0.1:42109_",
   [junit4]   2>   "numShards":"3",
   [junit4]   2>   "state":"down",
   [junit4]   2>   "shard":null,
   [junit4]   2>   "collection":"collection1",
   [junit4]   2>   "operation":"state"}
   [junit4]   2> 166284 INFO  (OverseerStateUpdate-94278443533008900-127.0.0.1:38178_-n_0000000000) [n:127.0.0.1:38178_    ] o.a.s.c.o.ClusterStateMutator building a new cName: collection1
   [junit4]   2> 166284 INFO  (OverseerStateUpdate-94278443533008900-127.0.0.1:38178_-n_0000000000) [n:127.0.0.1:38178_    ] o.a.s.c.o.ReplicaMutator Assigning new node to shard shard=shard2
   [junit4]   2> 166385 INFO  (zkCallback-117-thread-1) [    ] o.a.s.c.c.ZkStateReader A cluster state change: WatchedEvent state:SyncConnected type:NodeDataChanged path:/clusterstate.json, has occurred - updating... (live nodes size: 2)
   [junit4]   2> 166385 INFO  (zkCallback-121-thread-1-processing-n:127.0.0.1:42109_) [n:127.0.0.1:42109_    ] o.a.s.c.c.ZkStateReader A cluster state change: WatchedEvent state:SyncConnected type:NodeDataChanged path:/clusterstate.json, has occurred - updating... (live nodes size: 2)
   [junit4]   2> 166385 INFO  (zkCallback-115-thread-1-processing-n:127.0.0.1:38178_) [n:127.0.0.1:38178_    ] o.a.s.c.c.ZkStateReader A cluster state change: WatchedEvent state:SyncConnected type:NodeDataChanged path:/clusterstate.json, has occurred - updating... (live nodes size: 2)
   [junit4]   2> 166386 INFO  (zkCallback-117-thread-1) [    ] o.a.s.c.c.ZkStateReader Updated cluster state version to 4
   [junit4]   2> 166386 INFO  (zkCallback-121-thread-1-processing-n:127.0.0.1:42109_) [n:127.0.0.1:42109_    ] o.a.s.c.c.ZkStateReader Updated cluster state version to 4
   [junit4]   2> 166387 INFO  (zkCallback-115-thread-1-processing-n:127.0.0.1:38178_) [n:127.0.0.1:38178_    ] o.a.s.c.c.ZkStateReader Updated cluster state version to 4
   [junit4]   2> 167283 INFO  (coreLoadExecutor-597-thread-1-processing-n:127.0.0.1:42109_) [n:127.0.0.1:42109_ c:collection1   x:collection1] o.a.s.c.ZkController waiting to find shard id in clusterstate for collection1
   [junit4]   2> 167284 INFO  (coreLoadExecutor-597-thread-1-processing-n:127.0.0.1:42109_) [n:127.0.0.1:42109_ c:collection1   x:collection1] o.a.s.c.ZkController Check for collection zkNode:collection1
   [junit4]   2> 167284 INFO  (coreLoadExecutor-597-thread-1-processing-n:127.0.0.1:42109_) [n:127.0.0.1:42109_ c:collection1   x:collection1] o.a.s.c.ZkController Collection zkNode exists
   [junit4]   2> 167284 INFO  (coreLoadExecutor-597-thread-1-processing-n:127.0.0.1:42109_) [n:127.0.0.1:42109_ c:collection1   x:collection1] o.a.s.c.c.ZkStateReader Load collection config from:/collections/collection1
   [junit4]   2> 167284 INFO  (coreLoadExecutor-597-thread-1-processing-n:127.0.0.1:42109_) [n:127.0.0.1:42109_ c:collection1   x:collection1] o.a.s.c.c.ZkStateReader path=/collections/collection1 configName=conf1 specified config exists in ZooKeeper
   [junit4]   2> 167284 INFO  (coreLoadExecutor-597-thread-1-processing-n:127.0.0.1:42109_) [n:127.0.0.1:42109_ c:collection1   x:collection1] o.a.s.c.SolrResourceLoader new SolrResourceLoader for directory: '/home/jenkins/workspace/Lucene-Solr-trunk-Linux/solr/build/solr-core/test/J1/temp/solr.cloud.ChaosMonkeySafeLeaderTest_C75661F707DC4B01-001/shard-1-001/cores/collection1/'
   [junit4]   2> 167290 INFO  (coreLoadExecutor-597-thread-1-processing-n:127.0.0.1:42109_) [n:127.0.0.1:42109_ c:collection1   x:collection1] o.a.s.c.Config loaded config solrconfig.xml with version 0 
   [junit4]   2> 167293 INFO  (coreLoadExecutor-597-thread-1-processing-n:127.0.0.1:42109_) [n:127.0.0.1:42109_ c:collection1   x:collection1] o.a.s.c.SolrConfig current version of requestparams : -1
   [junit4]   2> 167296 INFO  (coreLoadExecutor-597-thread-1-processing-n:127.0.0.1:42109_) [n:127.0.0.1:42109_ c:collection1   x:collection1] o.a.s.c.SolrConfig Using Lucene MatchVersion: 6.0.0
   [junit4]   2> 167301 INFO  (coreLoadExecutor-597-thread-1-processing-n:127.0.0.1:42109_) [n:127.0.0.1:42109_ c:collection1   x:collection1] o.a.s.c.Config Loaded SolrConfig: solrconfig.xml
   [junit4]   2> 167302 INFO  (coreLoadExecutor-597-thread-1-processing-n:127.0.0.1:42109_) [n:127.0.0.1:42109_ c:collection1   x:collection1] o.a.s.s.IndexSchema Reading Solr Schema from /configs/conf1/schema.xml
   [junit4]   2> 167305 INFO  (coreLoadExecutor-597-thread-1-processing-n:127.0.0.1:42109_) [n:127.0.0.1:42109_ c:collection1   x:collection1] o.a.s.s.IndexSchema [collection1] Schema name=test
   [junit4]   2> 167364 INFO  (coreLoadExecutor-597-thread-1-processing-n:127.0.0.1:42109_) [n:127.0.0.1:42109_ c:collection1   x:collection1] o.a.s.s.IndexSchema default search field in schema is text
   [junit4]   2> 167365 INFO  (coreLoadExecutor-597-thread-1-processing-n:127.0.0.1:42109_) [n:127.0.0.1:42109_ c:collection1   x:collection1] o.a.s.s.IndexSchema unique key field: id
   [junit4]   2> 167365 INFO  (coreLoadExecutor-597-thread-1-processing-n:127.0.0.1:42109_) [n:127.0.0.1:42109_ c:collection1   x:collection1] o.a.s.s.FileExchangeRateProvider Reloading exchange rates from file currency.xml
   [junit4]   2> 167367 INFO  (coreLoadExecutor-597-thread-1-processing-n:127.0.0.1:42109_) [n:127.0.0.1:42109_ c:collection1   x:collection1] o.a.s.s.FileExchangeRateProvider Reloading exchange rates from file currency.xml
   [junit4]   2> 167377 INFO  (coreLoadExecutor-597-thread-1-processing-n:127.0.0.1:42109_) [n:127.0.0.1:42109_ c:collection1   x:collection1] o.a.s.c.ConfigSetProperties Did not find ConfigSet properties, assuming default properties: Can't find resource 'configsetprops.json' in classpath or '/configs/conf1', cwd=/home/jenkins/workspace/Lucene-Solr-trunk-Linux/solr/build/solr-core/test/J1
   [junit4]   2> 167378 INFO  (coreLoadExecutor-597-thread-1-processing-n:127.0.0.1:42109_) [n:127.0.0.1:42109_ c:collection1   x:collection1] o.a.s.c.CoreContainer Creating SolrCore 'collection1' using configuration from collection collection1
   [junit4]   2> 167378 INFO  (coreLoadExecutor-597-thread-1-processing-n:127.0.0.1:42109_) [n:127.0.0.1:42109_ c:collection1 s:shard2 r:core_node1 x:collection1] o.a.s.c.SolrCore solr.StandardDirectoryFactory
   [junit4]   2> 167378 INFO  (coreLoadExecutor-597-thread-1-processing-n:127.0.0.1:42109_) [n:127.0.0.1:42109_ c:collection1 s:shard2 r:core_node1 x:collection1] o.a.s.c.SolrCore [[collection1] ] Opening new SolrCore at [/home/jenkins/workspace/Lucene-Solr-trunk-Linux/solr/build/solr-core/test/J1/temp/solr.cloud.ChaosMonkeySafeLeaderTest_C75661F707DC4B01-001/shard-1-001/cores/collection1/], dataDir=[null]
   [junit4]   2> 167378 INFO  (coreLoadExecutor-597-thread-1-processing-n:127.0.0.1:42109_) [n:127.0.0.1:42109_ c:collection1 s:shard2 r:core_node1 x:collection1] o.a.s.c.JmxMonitoredMap JMX monitoring is enabled. Adding Solr mbeans to JMX Server: com.sun.jmx.mbeanserver.JmxMBeanServer@4c762c9c
   [junit4]   2> 167379 INFO  (coreLoadExecutor-597-thread-1-processing-n:127.0.0.1:42109_) [n:127.0.0.1:42109_ c:collection1 s:shard2 r:core_node1 x:collection1] o.a.s.c.CachingDirectoryFactory return new directory for /home/jenkins/workspace/Lucene-Solr-trunk-Linux/solr/build/solr-core/test/J1/temp/solr.cloud.ChaosMonkeySafeLeaderTest_C75661F707DC4B01-001/shard-1-001/cores/collection1/data
   [junit4]   2> 167379 INFO  (coreLoadExecutor-597-thread-1-processing-n:127.0.0.1:42109_) [n:127.0.0.1:42109_ c:collection1 s:shard2 r:core_node1 x:collection1] o.a.s.c.SolrCore New index directory detected: old=null new=/home/jenkins/workspace/Lucene-Solr-trunk-Linux/solr/build/solr-core/test/J1/temp/solr.cloud.ChaosMonkeySafeLeaderTest_C75661F707DC4B01-001/shard-1-001/cores/collection1/data/index/
   [junit4]   2> 167379 WARN  (coreLoadExecutor-597-thread-1-processing-n:127.0.0.1:42109_) [n:127.0.0.1:42109_ c:collection1 s:shard2 r:core_node1 x:collection1] o.a.s.c.SolrCore [collection1] Solr index directory '/home/jenkins/workspace/Lucene-Solr-trunk-Linux/solr/build/solr-core/test/J1/temp/solr.cloud.ChaosMonkeySafeLeaderTest_C75661F707DC4B01-001/shard-1-001/cores/collection1/data/index' doesn't exist. Creating new index...
   [junit4]   2> 167380 INFO  (coreLoadExecutor-597-thread-1-processing-n:127.0.0.1:42109_) [n:127.0.0.1:42109_ c:collection1 s:shard2 r:core_node1 x:collection1] o.a.s.c.CachingDirectoryFactory return new directory for /home/jenkins/workspace/Lucene-Solr-trunk-Linux/solr/build/solr-core/test/J1/temp/solr.cloud.ChaosMonkeySafeLeaderTest_C75661F707DC4B01-001/shard-1-001/cores/collection1/data/index
   [junit4]   2> 167380 INFO  (coreLoadExecutor-597-thread-1-processing-n:127.0.0.1:42109_) [n:127.0.0.1:42109_ c:collection1 s:shard2 r:core_node1 x:collection1] o.a.s.u.RandomMergePolicy RandomMergePolicy wrapping class org.apache.lucene.index.LogByteSizeMergePolicy: [LogByteSizeMergePolicy: minMergeSize=1677721, mergeFactor=17, maxMergeSize=2147483648, maxMergeSizeForForcedMerge=9223372036854775807, calibrateSizeByDeletes=false, maxMergeDocs=2147483647, maxCFSSegmentSizeMB=8.796093022207999E12, noCFSRatio=0.6457977404164854]
   [junit4]   2> 167408 INFO  (coreLoadExecutor-597-thread-1-processing-n:127.0.0.1:42109_) [n:127.0.0.1:42109_ c:collection1 s:shard2 r:core_node1 x:collection1] o.a.s.c.SolrCore SolrDeletionPolicy.onCommit: commits: num=1
   [junit4]   2> 	commit{dir=/home/jenkins/workspace/Lucene-Solr-trunk-Linux/solr/build/solr-core/test/J1/temp/solr.cloud.ChaosMonkeySafeLeaderTest_C75661F707DC4B01-001/shard-1-001/cores/collection1/data/index,segFN=segments_1,generation=1}
   [junit4]   2> 167408 INFO  (coreLoadExecutor-597-thread-1-processing-n:127.0.0.1:42109_) [n:127.0.0.1:42109_ c:collection1 s:shard2 r:core_node1 x:collection1] o.a.s.c.Solr

[...truncated too long message...]

 (OverseerStateUpdate-94278485161082912-127.0.0.1:58110_-n_0000000002) [n:127.0.0.1:58110_    ] o.a.s.c.Overseer Overseer Loop exiting : 127.0.0.1:58110_
   [junit4]   2> 1194376 ERROR (TEST-CdcrReplicationHandlerTest.doTest-seed#[C75661F707DC4B01]-EventThread) [n:127.0.0.1:58110_    ] o.a.z.ClientCnxn Error while calling watcher 
   [junit4]   2> java.util.concurrent.RejectedExecutionException: Task org.apache.solr.common.util.ExecutorUtil$MDCAwareThreadPoolExecutor$1@5343fea2 rejected from org.apache.solr.common.util.ExecutorUtil$MDCAwareThreadPoolExecutor@2f88294e[Shutting down, pool size = 1, active threads = 1, queued tasks = 0, completed tasks = 31]
   [junit4]   2> 	at java.util.concurrent.ThreadPoolExecutor$AbortPolicy.rejectedExecution(ThreadPoolExecutor.java:2047)
   [junit4]   2> 	at java.util.concurrent.ThreadPoolExecutor.reject(ThreadPoolExecutor.java:823)
   [junit4]   2> 	at java.util.concurrent.ThreadPoolExecutor.execute(ThreadPoolExecutor.java:1369)
   [junit4]   2> 	at org.apache.solr.common.util.ExecutorUtil$MDCAwareThreadPoolExecutor.execute(ExecutorUtil.java:193)
   [junit4]   2> 	at java.util.concurrent.AbstractExecutorService.submit(AbstractExecutorService.java:112)
   [junit4]   2> 	at org.apache.solr.common.cloud.SolrZkClient$3.process(SolrZkClient.java:266)
   [junit4]   2> 	at org.apache.zookeeper.ClientCnxn$EventThread.processEvent(ClientCnxn.java:522)
   [junit4]   2> 	at org.apache.zookeeper.ClientCnxn$EventThread.run(ClientCnxn.java:498)
   [junit4]   2> 1195875 WARN  (zkCallback-675-thread-6-processing-n:127.0.0.1:58110_) [n:127.0.0.1:58110_    ] o.a.s.c.c.ZkStateReader ZooKeeper watch triggered, but Solr cannot talk to ZK
   [junit4]   2> 1195876 INFO  (TEST-CdcrReplicationHandlerTest.doTest-seed#[C75661F707DC4B01]) [    ] o.e.j.s.ServerConnector Stopped ServerConnector@54672d86{SSL-http/1.1}{127.0.0.1:58110}
   [junit4]   2> 1195877 INFO  (TEST-CdcrReplicationHandlerTest.doTest-seed#[C75661F707DC4B01]) [    ] o.e.j.s.h.ContextHandler Stopped o.e.j.s.ServletContextHandler@6acc539a{/,null,UNAVAILABLE}
   [junit4]   2> 1195877 INFO  (TEST-CdcrReplicationHandlerTest.doTest-seed#[C75661F707DC4B01]) [n:127.0.0.1:58110_ c:source_collection s:shard1 r:core_node2 x:source_collection_shard1_replica2] o.a.s.SolrTestCaseJ4 ###Ending doTest
   [junit4]   2> 1195878 INFO  (TEST-CdcrReplicationHandlerTest.doTest-seed#[C75661F707DC4B01]) [n:127.0.0.1:58110_ c:source_collection s:shard1 r:core_node2 x:source_collection_shard1_replica2] o.a.s.c.ZkTestServer connecting to 127.0.0.1:35147 35147
   [junit4]   2> 1195907 INFO  (Thread-1923) [    ] o.a.s.c.ZkTestServer connecting to 127.0.0.1:35147 35147
   [junit4]   2> 1195907 WARN  (Thread-1923) [    ] o.a.s.c.ZkTestServer Watch limit violations: 
   [junit4]   2> Maximum concurrent create/delete watches above limit:
   [junit4]   2> 
   [junit4]   2> 	29	/solr/aliases.json
   [junit4]   2> 	29	/solr/clusterstate.json
   [junit4]   2> 	8	/solr/configs/conf1
   [junit4]   2> 	6	/solr/collections/source_collection/state.json
   [junit4]   2> 	5	/solr/collections/source_collection/leaders/shard1
   [junit4]   2> 	2	/solr/collections/tmp_collection/leaders/shard1
   [junit4]   2> 
   [junit4]   2> Maximum concurrent data watches above limit:
   [junit4]   2> 
   [junit4]   2> 	7	/solr/collections/source_collection/cdcr/state/buffer
   [junit4]   2> 	7	/solr/collections/source_collection/cdcr/state/process
   [junit4]   2> 	3	/solr/collections/source_collection/leader_elect/shard1/election/94278485161082885-core_node1-n_0000000000
   [junit4]   2> 	2	/solr/collections/tmp_collection/cdcr/state/buffer
   [junit4]   2> 	2	/solr/overseer_elect/election/94278485161082885-127.0.0.1:42799_-n_0000000000
   [junit4]   2> 	2	/solr/collections/tmp_collection/cdcr/state/process
   [junit4]   2> 
   [junit4]   2> Maximum concurrent children watches above limit:
   [junit4]   2> 
   [junit4]   2> 	28	/solr/live_nodes
   [junit4]   2> 	2	/solr/overseer/queue
   [junit4]   2> 	2	/solr/overseer/collection-queue-work
   [junit4]   2> 
   [junit4]   2> NOTE: reproduce with: ant test  -Dtestcase=CdcrReplicationHandlerTest -Dtests.method=doTest -Dtests.seed=C75661F707DC4B01 -Dtests.multiplier=3 -Dtests.slow=true -Dtests.locale=ga -Dtests.timezone=Pacific/Pitcairn -Dtests.asserts=true -Dtests.file.encoding=UTF-8
   [junit4] FAILURE  397s J1 | CdcrReplicationHandlerTest.doTest <<<
   [junit4]    > Throwable #1: java.lang.AssertionError: There are still nodes recoverying - waited for 330 seconds
   [junit4]    > 	at __randomizedtesting.SeedInfo.seed([C75661F707DC4B01:6012D9536A6758B8]:0)
   [junit4]    > 	at org.apache.solr.cloud.AbstractDistribZkTestBase.waitForRecoveriesToFinish(AbstractDistribZkTestBase.java:172)
   [junit4]    > 	at org.apache.solr.cloud.AbstractDistribZkTestBase.waitForRecoveriesToFinish(AbstractDistribZkTestBase.java:133)
   [junit4]    > 	at org.apache.solr.cloud.AbstractDistribZkTestBase.waitForRecoveriesToFinish(AbstractDistribZkTestBase.java:128)
   [junit4]    > 	at org.apache.solr.cloud.BaseCdcrDistributedZkTest.waitForRecoveriesToFinish(BaseCdcrDistributedZkTest.java:465)
   [junit4]    > 	at org.apache.solr.cloud.BaseCdcrDistributedZkTest.clearSourceCollection(BaseCdcrDistributedZkTest.java:319)
   [junit4]    > 	at org.apache.solr.cloud.CdcrReplicationHandlerTest.doTestPartialReplication(CdcrReplicationHandlerTest.java:86)
   [junit4]    > 	at org.apache.solr.cloud.CdcrReplicationHandlerTest.doTest(CdcrReplicationHandlerTest.java:51)
   [junit4]    > 	at org.apache.solr.BaseDistributedSearchTestCase$ShardsRepeatRule$ShardsFixedStatement.callStatement(BaseDistributedSearchTestCase.java:966)
   [junit4]    > 	at org.apache.solr.BaseDistributedSearchTestCase$ShardsRepeatRule$ShardsStatement.evaluate(BaseDistributedSearchTestCase.java:941)
   [junit4]    > 	at java.lang.Thread.run(Thread.java:745)
   [junit4]   2> 1195913 INFO  (SUITE-CdcrReplicationHandlerTest-seed#[C75661F707DC4B01]-worker) [n:127.0.0.1:58110_ c:source_collection s:shard1 r:core_node2 x:source_collection_shard1_replica2] o.a.s.SolrTestCaseJ4 ###deleteCore
   [junit4]   2> NOTE: leaving temporary files on disk at: /home/jenkins/workspace/Lucene-Solr-trunk-Linux/solr/build/solr-core/test/J1/temp/solr.cloud.CdcrReplicationHandlerTest_C75661F707DC4B01-001
   [junit4]   2> Aug 03, 2015 4:25:15 AM com.carrotsearch.randomizedtesting.ThreadLeakControl checkThreadLeaks
   [junit4]   2> WARNING: Will linger awaiting termination of 1 leaked thread(s).
   [junit4]   2> NOTE: test params are: codec=Asserting(Lucene53): {_version_=PostingsFormat(name=Memory doPackFST= true), id=Lucene50(blocksize=128)}, docValues:{}, sim=DefaultSimilarity, locale=ga, timezone=Pacific/Pitcairn
   [junit4]   2> NOTE: Linux 3.16.0-44-generic amd64/Oracle Corporation 1.8.0_51 (64-bit)/cpus=12,threads=1,free=110895824,total=518979584
   [junit4]   2> NOTE: All tests run in this JVM: [TestClusterStateMutator, LeaderFailoverAfterPartitionTest, SegmentsInfoRequestHandlerTest, DistribDocExpirationUpdateProcessorTest, TestHighlightDedupGrouping, FieldAnalysisRequestHandlerTest, SaslZkACLProviderTest, TestManagedSchema, CopyFieldTest, LukeRequestHandlerTest, ZkStateWriterTest, TestSolrCoreProperties, TestFuzzyAnalyzedSuggestions, TestLMDirichletSimilarityFactory, BadComponentTest, TestLMJelinekMercerSimilarityFactory, TestManagedResource, BasicFunctionalityTest, ChaosMonkeySafeLeaderTest, TestConfigReload, TestLRUCache, StatelessScriptUpdateProcessorFactoryTest, SpellPossibilityIteratorTest, TestSchemaSimilarityResource, TestComponentsName, ResponseHeaderTest, TestSimpleQParserPlugin, OutOfBoxZkACLAndCredentialsProvidersTest, AnalyticsMergeStrategyTest, BlockDirectoryTest, SimpleCollectionCreateDeleteTest, EchoParamsTest, EnumFieldTest, RecoveryAfterSoftCommitTest, TestJsonRequest, TestShardHandlerFactory, TestFieldSortValues, TestHighFrequencyDictionaryFactory, CollectionsAPIDistributedZkTest, DistanceUnitsTest, TestReplicationHandlerBackup, TestElisionMultitermQuery, TestFastLRUCache, TestRequestStatusCollectionAPI, RequiredFieldsTest, HdfsThreadLeakTest, TestScoreJoinQPScore, TestInitQParser, TestCloudInspectUtil, AnalysisAfterCoreReloadTest, OverseerRolesTest, TestCoreContainer, AlternateDirectoryTest, DocValuesMultiTest, CoreAdminHandlerTest, TestSolrConfigHandlerConcurrent, JSONWriterTest, ShardSplitTest, DocumentBuilderTest, OverseerStatusTest, SpatialFilterTest, TestShortCircuitedRequests, RemoteQueryErrorTest, TestSolrDeletionPolicy2, DisMaxRequestHandlerTest, TestSearchPerf, TestAnalyzedSuggestions, TestAtomicUpdateErrorCases, TestStressUserVersions, CacheHeaderTest, SolrPluginUtilsTest, PreAnalyzedFieldTest, BitVectorTest, SharedFSAutoReplicaFailoverUtilsTest, CdcrReplicationHandlerTest]
   [junit4] Completed [388/529] on J1 in 398.03s, 1 test, 1 failure <<< FAILURES!

[...truncated 462 lines...]
BUILD FAILED
/home/jenkins/workspace/Lucene-Solr-trunk-Linux/build.xml:716: The following error occurred while executing this line:
/home/jenkins/workspace/Lucene-Solr-trunk-Linux/build.xml:660: The following error occurred while executing this line:
/home/jenkins/workspace/Lucene-Solr-trunk-Linux/build.xml:59: The following error occurred while executing this line:
/home/jenkins/workspace/Lucene-Solr-trunk-Linux/solr/build.xml:230: The following error occurred while executing this line:
/home/jenkins/workspace/Lucene-Solr-trunk-Linux/solr/common-build.xml:514: The following error occurred while executing this line:
/home/jenkins/workspace/Lucene-Solr-trunk-Linux/lucene/common-build.xml:1429: The following error occurred while executing this line:
/home/jenkins/workspace/Lucene-Solr-trunk-Linux/lucene/common-build.xml:984: There were test failures: 529 suites, 2093 tests, 2 failures, 65 ignored (30 assumptions)

Total time: 47 minutes 14 seconds
Build step 'Invoke Ant' marked build as failure
Archiving artifacts
Recording test results
Email was triggered for: Failure - Any
Sending email for trigger: Failure - Any



Mime
View raw message