lucene-dev mailing list archives

Site index · List index
Message view « Date » · « Thread »
Top « Date » · « Thread »
From Policeman Jenkins Server <jenk...@thetaphi.de>
Subject [JENKINS-EA] Lucene-Solr-trunk-Linux (64bit/jdk1.8.0_60-ea-b24) - Build # 13754 - Failure!
Date Thu, 06 Aug 2015 16:31:21 GMT
Build: http://jenkins.thetaphi.de/job/Lucene-Solr-trunk-Linux/13754/
Java: 64bit/jdk1.8.0_60-ea-b24 -XX:-UseCompressedOops -XX:+UseSerialGC

1 tests failed.
FAILED:  org.apache.solr.cloud.HttpPartitionTest.test

Error Message:
Didn't see all replicas for shard shard1 in c8n_1x2 come up within 30000 ms! ClusterState: {   "collection1":{     "replicationFactor":"1",     "shards":{       "shard1":{         "range":"80000000-ffffffff",         "state":"active",         "replicas":{"core_node2":{             "core":"collection1",             "base_url":"http://127.0.0.1:53917/x_hpw/zd",             "node_name":"127.0.0.1:53917_x_hpw%2Fzd",             "state":"active",             "leader":"true"}}},       "shard2":{         "range":"0-7fffffff",         "state":"active",         "replicas":{           "core_node1":{             "core":"collection1",             "base_url":"http://127.0.0.1:34093/x_hpw/zd",             "node_name":"127.0.0.1:34093_x_hpw%2Fzd",             "state":"active",             "leader":"true"},           "core_node3":{             "core":"collection1",             "base_url":"http://127.0.0.1:59645/x_hpw/zd",             "node_name":"127.0.0.1:59645_x_hpw%2Fzd",             "state":"active"}}}},     "router":{"name":"compositeId"},     "maxShardsPerNode":"1",     "autoAddReplicas":"false",     "autoCreated":"true"},   "control_collection":{     "replicationFactor":"1",     "shards":{"shard1":{         "range":"80000000-7fffffff",         "state":"active",         "replicas":{"core_node1":{             "core":"collection1",             "base_url":"http://127.0.0.1:54227/x_hpw/zd",             "node_name":"127.0.0.1:54227_x_hpw%2Fzd",             "state":"active",             "leader":"true"}}}},     "router":{"name":"compositeId"},     "maxShardsPerNode":"1",     "autoAddReplicas":"false",     "autoCreated":"true"},   "c8n_1x2":{     "replicationFactor":"2",     "shards":{"shard1":{         "range":"80000000-7fffffff",         "state":"active",         "replicas":{           "core_node1":{             "core":"c8n_1x2_shard1_replica2",             "base_url":"http://127.0.0.1:59645/x_hpw/zd",             "node_name":"127.0.0.1:59645_x_hpw%2Fzd",             "state":"active",             "leader":"true"},           "core_node2":{             "core":"c8n_1x2_shard1_replica1",             "base_url":"http://127.0.0.1:34093/x_hpw/zd",             "node_name":"127.0.0.1:34093_x_hpw%2Fzd",             "state":"recovering"}}}},     "router":{"name":"compositeId"},     "maxShardsPerNode":"1",     "autoAddReplicas":"false"}}

Stack Trace:
java.lang.AssertionError: Didn't see all replicas for shard shard1 in c8n_1x2 come up within 30000 ms! ClusterState: {
  "collection1":{
    "replicationFactor":"1",
    "shards":{
      "shard1":{
        "range":"80000000-ffffffff",
        "state":"active",
        "replicas":{"core_node2":{
            "core":"collection1",
            "base_url":"http://127.0.0.1:53917/x_hpw/zd",
            "node_name":"127.0.0.1:53917_x_hpw%2Fzd",
            "state":"active",
            "leader":"true"}}},
      "shard2":{
        "range":"0-7fffffff",
        "state":"active",
        "replicas":{
          "core_node1":{
            "core":"collection1",
            "base_url":"http://127.0.0.1:34093/x_hpw/zd",
            "node_name":"127.0.0.1:34093_x_hpw%2Fzd",
            "state":"active",
            "leader":"true"},
          "core_node3":{
            "core":"collection1",
            "base_url":"http://127.0.0.1:59645/x_hpw/zd",
            "node_name":"127.0.0.1:59645_x_hpw%2Fzd",
            "state":"active"}}}},
    "router":{"name":"compositeId"},
    "maxShardsPerNode":"1",
    "autoAddReplicas":"false",
    "autoCreated":"true"},
  "control_collection":{
    "replicationFactor":"1",
    "shards":{"shard1":{
        "range":"80000000-7fffffff",
        "state":"active",
        "replicas":{"core_node1":{
            "core":"collection1",
            "base_url":"http://127.0.0.1:54227/x_hpw/zd",
            "node_name":"127.0.0.1:54227_x_hpw%2Fzd",
            "state":"active",
            "leader":"true"}}}},
    "router":{"name":"compositeId"},
    "maxShardsPerNode":"1",
    "autoAddReplicas":"false",
    "autoCreated":"true"},
  "c8n_1x2":{
    "replicationFactor":"2",
    "shards":{"shard1":{
        "range":"80000000-7fffffff",
        "state":"active",
        "replicas":{
          "core_node1":{
            "core":"c8n_1x2_shard1_replica2",
            "base_url":"http://127.0.0.1:59645/x_hpw/zd",
            "node_name":"127.0.0.1:59645_x_hpw%2Fzd",
            "state":"active",
            "leader":"true"},
          "core_node2":{
            "core":"c8n_1x2_shard1_replica1",
            "base_url":"http://127.0.0.1:34093/x_hpw/zd",
            "node_name":"127.0.0.1:34093_x_hpw%2Fzd",
            "state":"recovering"}}}},
    "router":{"name":"compositeId"},
    "maxShardsPerNode":"1",
    "autoAddReplicas":"false"}}
	at __randomizedtesting.SeedInfo.seed([3BD52B5944D56E06:B3811483EA2903FE]:0)
	at org.junit.Assert.fail(Assert.java:93)
	at org.apache.solr.cloud.AbstractFullDistribZkTestBase.ensureAllReplicasAreActive(AbstractFullDistribZkTestBase.java:1842)
	at org.apache.solr.cloud.HttpPartitionTest.testRf2(HttpPartitionTest.java:248)
	at org.apache.solr.cloud.HttpPartitionTest.test(HttpPartitionTest.java:102)
	at sun.reflect.NativeMethodAccessorImpl.invoke0(Native Method)
	at sun.reflect.NativeMethodAccessorImpl.invoke(NativeMethodAccessorImpl.java:62)
	at sun.reflect.DelegatingMethodAccessorImpl.invoke(DelegatingMethodAccessorImpl.java:43)
	at java.lang.reflect.Method.invoke(Method.java:497)
	at com.carrotsearch.randomizedtesting.RandomizedRunner.invoke(RandomizedRunner.java:1627)
	at com.carrotsearch.randomizedtesting.RandomizedRunner$6.evaluate(RandomizedRunner.java:836)
	at com.carrotsearch.randomizedtesting.RandomizedRunner$7.evaluate(RandomizedRunner.java:872)
	at com.carrotsearch.randomizedtesting.RandomizedRunner$8.evaluate(RandomizedRunner.java:886)
	at org.apache.solr.BaseDistributedSearchTestCase$ShardsRepeatRule$ShardsFixedStatement.callStatement(BaseDistributedSearchTestCase.java:963)
	at org.apache.solr.BaseDistributedSearchTestCase$ShardsRepeatRule$ShardsStatement.evaluate(BaseDistributedSearchTestCase.java:938)
	at com.carrotsearch.randomizedtesting.rules.SystemPropertiesRestoreRule$1.evaluate(SystemPropertiesRestoreRule.java:57)
	at org.apache.lucene.util.TestRuleSetupTeardownChained$1.evaluate(TestRuleSetupTeardownChained.java:50)
	at org.apache.lucene.util.AbstractBeforeAfterRule$1.evaluate(AbstractBeforeAfterRule.java:46)
	at org.apache.lucene.util.TestRuleThreadAndTestName$1.evaluate(TestRuleThreadAndTestName.java:49)
	at org.apache.lucene.util.TestRuleIgnoreAfterMaxFailures$1.evaluate(TestRuleIgnoreAfterMaxFailures.java:65)
	at org.apache.lucene.util.TestRuleMarkFailure$1.evaluate(TestRuleMarkFailure.java:48)
	at com.carrotsearch.randomizedtesting.rules.StatementAdapter.evaluate(StatementAdapter.java:36)
	at com.carrotsearch.randomizedtesting.ThreadLeakControl$StatementRunner.run(ThreadLeakControl.java:365)
	at com.carrotsearch.randomizedtesting.ThreadLeakControl.forkTimeoutingTask(ThreadLeakControl.java:798)
	at com.carrotsearch.randomizedtesting.ThreadLeakControl$3.evaluate(ThreadLeakControl.java:458)
	at com.carrotsearch.randomizedtesting.RandomizedRunner.runSingleTest(RandomizedRunner.java:845)
	at com.carrotsearch.randomizedtesting.RandomizedRunner$3.evaluate(RandomizedRunner.java:747)
	at com.carrotsearch.randomizedtesting.RandomizedRunner$4.evaluate(RandomizedRunner.java:781)
	at com.carrotsearch.randomizedtesting.RandomizedRunner$5.evaluate(RandomizedRunner.java:792)
	at com.carrotsearch.randomizedtesting.rules.StatementAdapter.evaluate(StatementAdapter.java:36)
	at com.carrotsearch.randomizedtesting.rules.SystemPropertiesRestoreRule$1.evaluate(SystemPropertiesRestoreRule.java:57)
	at org.apache.lucene.util.AbstractBeforeAfterRule$1.evaluate(AbstractBeforeAfterRule.java:46)
	at com.carrotsearch.randomizedtesting.rules.StatementAdapter.evaluate(StatementAdapter.java:36)
	at org.apache.lucene.util.TestRuleStoreClassName$1.evaluate(TestRuleStoreClassName.java:42)
	at com.carrotsearch.randomizedtesting.rules.NoShadowingOrOverridesOnMethodsRule$1.evaluate(NoShadowingOrOverridesOnMethodsRule.java:39)
	at com.carrotsearch.randomizedtesting.rules.NoShadowingOrOverridesOnMethodsRule$1.evaluate(NoShadowingOrOverridesOnMethodsRule.java:39)
	at com.carrotsearch.randomizedtesting.rules.StatementAdapter.evaluate(StatementAdapter.java:36)
	at com.carrotsearch.randomizedtesting.rules.StatementAdapter.evaluate(StatementAdapter.java:36)
	at com.carrotsearch.randomizedtesting.rules.StatementAdapter.evaluate(StatementAdapter.java:36)
	at org.apache.lucene.util.TestRuleAssertionsRequired$1.evaluate(TestRuleAssertionsRequired.java:54)
	at org.apache.lucene.util.TestRuleMarkFailure$1.evaluate(TestRuleMarkFailure.java:48)
	at org.apache.lucene.util.TestRuleIgnoreAfterMaxFailures$1.evaluate(TestRuleIgnoreAfterMaxFailures.java:65)
	at org.apache.lucene.util.TestRuleIgnoreTestSuites$1.evaluate(TestRuleIgnoreTestSuites.java:55)
	at com.carrotsearch.randomizedtesting.rules.StatementAdapter.evaluate(StatementAdapter.java:36)
	at com.carrotsearch.randomizedtesting.ThreadLeakControl$StatementRunner.run(ThreadLeakControl.java:365)
	at java.lang.Thread.run(Thread.java:745)




Build Log:
[...truncated 10947 lines...]
   [junit4] Suite: org.apache.solr.cloud.HttpPartitionTest
   [junit4]   2> Creating dataDir: /home/jenkins/workspace/Lucene-Solr-trunk-Linux/solr/build/solr-core/test/J2/temp/solr.cloud.HttpPartitionTest_3BD52B5944D56E06-001/init-core-data-001
   [junit4]   2> 1221441 INFO  (SUITE-HttpPartitionTest-seed#[3BD52B5944D56E06]-worker) [    ] o.a.s.BaseDistributedSearchTestCase Setting hostContext system property: /x_hpw/zd
   [junit4]   2> 1221442 INFO  (TEST-HttpPartitionTest.test-seed#[3BD52B5944D56E06]) [    ] o.a.s.c.ZkTestServer STARTING ZK TEST SERVER
   [junit4]   2> 1221443 INFO  (Thread-3251) [    ] o.a.s.c.ZkTestServer client port:0.0.0.0/0.0.0.0:0
   [junit4]   2> 1221443 INFO  (Thread-3251) [    ] o.a.s.c.ZkTestServer Starting server
   [junit4]   2> 1221543 INFO  (TEST-HttpPartitionTest.test-seed#[3BD52B5944D56E06]) [    ] o.a.s.c.ZkTestServer start zk server on port:49737
   [junit4]   2> 1221543 INFO  (TEST-HttpPartitionTest.test-seed#[3BD52B5944D56E06]) [    ] o.a.s.c.c.SolrZkClient Using default ZkCredentialsProvider
   [junit4]   2> 1221543 INFO  (TEST-HttpPartitionTest.test-seed#[3BD52B5944D56E06]) [    ] o.a.s.c.c.ConnectionManager Waiting for client to connect to ZooKeeper
   [junit4]   2> 1221545 INFO  (zkCallback-1151-thread-1) [    ] o.a.s.c.c.ConnectionManager Watcher org.apache.solr.common.cloud.ConnectionManager@3305f703 name:ZooKeeperConnection Watcher:127.0.0.1:49737 got event WatchedEvent state:SyncConnected type:None path:null path:null type:None
   [junit4]   2> 1221545 INFO  (TEST-HttpPartitionTest.test-seed#[3BD52B5944D56E06]) [    ] o.a.s.c.c.ConnectionManager Client is connected to ZooKeeper
   [junit4]   2> 1221545 INFO  (TEST-HttpPartitionTest.test-seed#[3BD52B5944D56E06]) [    ] o.a.s.c.c.SolrZkClient Using default ZkACLProvider
   [junit4]   2> 1221545 INFO  (TEST-HttpPartitionTest.test-seed#[3BD52B5944D56E06]) [    ] o.a.s.c.c.SolrZkClient makePath: /solr
   [junit4]   2> 1221546 INFO  (TEST-HttpPartitionTest.test-seed#[3BD52B5944D56E06]) [    ] o.a.s.c.c.SolrZkClient Using default ZkCredentialsProvider
   [junit4]   2> 1221546 INFO  (TEST-HttpPartitionTest.test-seed#[3BD52B5944D56E06]) [    ] o.a.s.c.c.ConnectionManager Waiting for client to connect to ZooKeeper
   [junit4]   2> 1221547 INFO  (zkCallback-1152-thread-1) [    ] o.a.s.c.c.ConnectionManager Watcher org.apache.solr.common.cloud.ConnectionManager@4691d378 name:ZooKeeperConnection Watcher:127.0.0.1:49737/solr got event WatchedEvent state:SyncConnected type:None path:null path:null type:None
   [junit4]   2> 1221547 INFO  (TEST-HttpPartitionTest.test-seed#[3BD52B5944D56E06]) [    ] o.a.s.c.c.ConnectionManager Client is connected to ZooKeeper
   [junit4]   2> 1221547 INFO  (TEST-HttpPartitionTest.test-seed#[3BD52B5944D56E06]) [    ] o.a.s.c.c.SolrZkClient Using default ZkACLProvider
   [junit4]   2> 1221547 INFO  (TEST-HttpPartitionTest.test-seed#[3BD52B5944D56E06]) [    ] o.a.s.c.c.SolrZkClient makePath: /collections/collection1
   [junit4]   2> 1221548 INFO  (TEST-HttpPartitionTest.test-seed#[3BD52B5944D56E06]) [    ] o.a.s.c.c.SolrZkClient makePath: /collections/collection1/shards
   [junit4]   2> 1221548 INFO  (TEST-HttpPartitionTest.test-seed#[3BD52B5944D56E06]) [    ] o.a.s.c.c.SolrZkClient makePath: /collections/control_collection
   [junit4]   2> 1221549 INFO  (TEST-HttpPartitionTest.test-seed#[3BD52B5944D56E06]) [    ] o.a.s.c.c.SolrZkClient makePath: /collections/control_collection/shards
   [junit4]   2> 1221549 INFO  (TEST-HttpPartitionTest.test-seed#[3BD52B5944D56E06]) [    ] o.a.s.c.AbstractZkTestCase put /home/jenkins/workspace/Lucene-Solr-trunk-Linux/solr/core/src/test-files/solr/collection1/conf/solrconfig-tlog.xml to /configs/conf1/solrconfig.xml
   [junit4]   2> 1221549 INFO  (TEST-HttpPartitionTest.test-seed#[3BD52B5944D56E06]) [    ] o.a.s.c.c.SolrZkClient makePath: /configs/conf1/solrconfig.xml
   [junit4]   2> 1221550 INFO  (TEST-HttpPartitionTest.test-seed#[3BD52B5944D56E06]) [    ] o.a.s.c.AbstractZkTestCase put /home/jenkins/workspace/Lucene-Solr-trunk-Linux/solr/core/src/test-files/solr/collection1/conf/schema.xml to /configs/conf1/schema.xml
   [junit4]   2> 1221550 INFO  (TEST-HttpPartitionTest.test-seed#[3BD52B5944D56E06]) [    ] o.a.s.c.c.SolrZkClient makePath: /configs/conf1/schema.xml
   [junit4]   2> 1221551 INFO  (TEST-HttpPartitionTest.test-seed#[3BD52B5944D56E06]) [    ] o.a.s.c.AbstractZkTestCase put /home/jenkins/workspace/Lucene-Solr-trunk-Linux/solr/core/src/test-files/solr/collection1/conf/solrconfig.snippet.randomindexconfig.xml to /configs/conf1/solrconfig.snippet.randomindexconfig.xml
   [junit4]   2> 1221551 INFO  (TEST-HttpPartitionTest.test-seed#[3BD52B5944D56E06]) [    ] o.a.s.c.c.SolrZkClient makePath: /configs/conf1/solrconfig.snippet.randomindexconfig.xml
   [junit4]   2> 1221552 INFO  (TEST-HttpPartitionTest.test-seed#[3BD52B5944D56E06]) [    ] o.a.s.c.AbstractZkTestCase put /home/jenkins/workspace/Lucene-Solr-trunk-Linux/solr/core/src/test-files/solr/collection1/conf/stopwords.txt to /configs/conf1/stopwords.txt
   [junit4]   2> 1221552 INFO  (TEST-HttpPartitionTest.test-seed#[3BD52B5944D56E06]) [    ] o.a.s.c.c.SolrZkClient makePath: /configs/conf1/stopwords.txt
   [junit4]   2> 1221552 INFO  (TEST-HttpPartitionTest.test-seed#[3BD52B5944D56E06]) [    ] o.a.s.c.AbstractZkTestCase put /home/jenkins/workspace/Lucene-Solr-trunk-Linux/solr/core/src/test-files/solr/collection1/conf/protwords.txt to /configs/conf1/protwords.txt
   [junit4]   2> 1221552 INFO  (TEST-HttpPartitionTest.test-seed#[3BD52B5944D56E06]) [    ] o.a.s.c.c.SolrZkClient makePath: /configs/conf1/protwords.txt
   [junit4]   2> 1221553 INFO  (TEST-HttpPartitionTest.test-seed#[3BD52B5944D56E06]) [    ] o.a.s.c.AbstractZkTestCase put /home/jenkins/workspace/Lucene-Solr-trunk-Linux/solr/core/src/test-files/solr/collection1/conf/currency.xml to /configs/conf1/currency.xml
   [junit4]   2> 1221553 INFO  (TEST-HttpPartitionTest.test-seed#[3BD52B5944D56E06]) [    ] o.a.s.c.c.SolrZkClient makePath: /configs/conf1/currency.xml
   [junit4]   2> 1221554 INFO  (TEST-HttpPartitionTest.test-seed#[3BD52B5944D56E06]) [    ] o.a.s.c.AbstractZkTestCase put /home/jenkins/workspace/Lucene-Solr-trunk-Linux/solr/core/src/test-files/solr/collection1/conf/enumsConfig.xml to /configs/conf1/enumsConfig.xml
   [junit4]   2> 1221554 INFO  (TEST-HttpPartitionTest.test-seed#[3BD52B5944D56E06]) [    ] o.a.s.c.c.SolrZkClient makePath: /configs/conf1/enumsConfig.xml
   [junit4]   2> 1221554 INFO  (TEST-HttpPartitionTest.test-seed#[3BD52B5944D56E06]) [    ] o.a.s.c.AbstractZkTestCase put /home/jenkins/workspace/Lucene-Solr-trunk-Linux/solr/core/src/test-files/solr/collection1/conf/open-exchange-rates.json to /configs/conf1/open-exchange-rates.json
   [junit4]   2> 1221555 INFO  (TEST-HttpPartitionTest.test-seed#[3BD52B5944D56E06]) [    ] o.a.s.c.c.SolrZkClient makePath: /configs/conf1/open-exchange-rates.json
   [junit4]   2> 1221555 INFO  (TEST-HttpPartitionTest.test-seed#[3BD52B5944D56E06]) [    ] o.a.s.c.AbstractZkTestCase put /home/jenkins/workspace/Lucene-Solr-trunk-Linux/solr/core/src/test-files/solr/collection1/conf/mapping-ISOLatin1Accent.txt to /configs/conf1/mapping-ISOLatin1Accent.txt
   [junit4]   2> 1221555 INFO  (TEST-HttpPartitionTest.test-seed#[3BD52B5944D56E06]) [    ] o.a.s.c.c.SolrZkClient makePath: /configs/conf1/mapping-ISOLatin1Accent.txt
   [junit4]   2> 1221556 INFO  (TEST-HttpPartitionTest.test-seed#[3BD52B5944D56E06]) [    ] o.a.s.c.AbstractZkTestCase put /home/jenkins/workspace/Lucene-Solr-trunk-Linux/solr/core/src/test-files/solr/collection1/conf/old_synonyms.txt to /configs/conf1/old_synonyms.txt
   [junit4]   2> 1221556 INFO  (TEST-HttpPartitionTest.test-seed#[3BD52B5944D56E06]) [    ] o.a.s.c.c.SolrZkClient makePath: /configs/conf1/old_synonyms.txt
   [junit4]   2> 1221557 INFO  (TEST-HttpPartitionTest.test-seed#[3BD52B5944D56E06]) [    ] o.a.s.c.AbstractZkTestCase put /home/jenkins/workspace/Lucene-Solr-trunk-Linux/solr/core/src/test-files/solr/collection1/conf/synonyms.txt to /configs/conf1/synonyms.txt
   [junit4]   2> 1221557 INFO  (TEST-HttpPartitionTest.test-seed#[3BD52B5944D56E06]) [    ] o.a.s.c.c.SolrZkClient makePath: /configs/conf1/synonyms.txt
   [junit4]   2> 1221633 INFO  (TEST-HttpPartitionTest.test-seed#[3BD52B5944D56E06]) [    ] o.a.s.SolrTestCaseJ4 Writing core.properties file to /home/jenkins/workspace/Lucene-Solr-trunk-Linux/solr/build/solr-core/test/J2/temp/solr.cloud.HttpPartitionTest_3BD52B5944D56E06-001/control-001/cores/collection1
   [junit4]   2> 1221636 INFO  (TEST-HttpPartitionTest.test-seed#[3BD52B5944D56E06]) [    ] o.e.j.s.Server jetty-9.2.11.v20150529
   [junit4]   2> 1221637 INFO  (TEST-HttpPartitionTest.test-seed#[3BD52B5944D56E06]) [    ] o.e.j.s.h.ContextHandler Started o.e.j.s.ServletContextHandler@741d7c96{/x_hpw/zd,null,AVAILABLE}
   [junit4]   2> 1221638 INFO  (TEST-HttpPartitionTest.test-seed#[3BD52B5944D56E06]) [    ] o.e.j.s.ServerConnector Started ServerConnector@a32bde6{HTTP/1.1}{127.0.0.1:46879}
   [junit4]   2> 1221638 INFO  (TEST-HttpPartitionTest.test-seed#[3BD52B5944D56E06]) [    ] o.e.j.s.Server Started @1223236ms
   [junit4]   2> 1221638 INFO  (TEST-HttpPartitionTest.test-seed#[3BD52B5944D56E06]) [    ] o.a.s.c.s.e.JettySolrRunner Jetty properties: {solr.data.dir=/home/jenkins/workspace/Lucene-Solr-trunk-Linux/solr/build/solr-core/test/J2/temp/solr.cloud.HttpPartitionTest_3BD52B5944D56E06-001/tempDir-001/control/data, hostContext=/x_hpw/zd, hostPort=54227, coreRootDirectory=/home/jenkins/workspace/Lucene-Solr-trunk-Linux/solr/build/solr-core/test/J2/temp/solr.cloud.HttpPartitionTest_3BD52B5944D56E06-001/control-001/cores}
   [junit4]   2> 1221638 INFO  (TEST-HttpPartitionTest.test-seed#[3BD52B5944D56E06]) [    ] o.a.s.s.SolrDispatchFilter SolrDispatchFilter.init(): sun.misc.Launcher$AppClassLoader@4e0e2f2a
   [junit4]   2> 1221639 INFO  (TEST-HttpPartitionTest.test-seed#[3BD52B5944D56E06]) [    ] o.a.s.c.SolrResourceLoader new SolrResourceLoader for directory: '/home/jenkins/workspace/Lucene-Solr-trunk-Linux/solr/build/solr-core/test/J2/temp/solr.cloud.HttpPartitionTest_3BD52B5944D56E06-001/control-001/'
   [junit4]   2> 1221650 INFO  (TEST-HttpPartitionTest.test-seed#[3BD52B5944D56E06]) [    ] o.a.s.c.c.SolrZkClient Using default ZkCredentialsProvider
   [junit4]   2> 1221650 INFO  (TEST-HttpPartitionTest.test-seed#[3BD52B5944D56E06]) [    ] o.a.s.c.c.ConnectionManager Waiting for client to connect to ZooKeeper
   [junit4]   2> 1221651 INFO  (zkCallback-1153-thread-1) [    ] o.a.s.c.c.ConnectionManager Watcher org.apache.solr.common.cloud.ConnectionManager@238ed106 name:ZooKeeperConnection Watcher:127.0.0.1:49737/solr got event WatchedEvent state:SyncConnected type:None path:null path:null type:None
   [junit4]   2> 1221651 INFO  (TEST-HttpPartitionTest.test-seed#[3BD52B5944D56E06]) [    ] o.a.s.c.c.ConnectionManager Client is connected to ZooKeeper
   [junit4]   2> 1221651 INFO  (TEST-HttpPartitionTest.test-seed#[3BD52B5944D56E06]) [    ] o.a.s.c.c.SolrZkClient Using default ZkACLProvider
   [junit4]   2> 1221652 INFO  (TEST-HttpPartitionTest.test-seed#[3BD52B5944D56E06]) [    ] o.a.s.s.SolrDispatchFilter Loading solr.xml from SolrHome (not found in ZooKeeper)
   [junit4]   2> 1221652 INFO  (TEST-HttpPartitionTest.test-seed#[3BD52B5944D56E06]) [    ] o.a.s.c.SolrXmlConfig Loading container configuration from /home/jenkins/workspace/Lucene-Solr-trunk-Linux/solr/build/solr-core/test/J2/temp/solr.cloud.HttpPartitionTest_3BD52B5944D56E06-001/control-001/solr.xml
   [junit4]   2> 1221655 INFO  (TEST-HttpPartitionTest.test-seed#[3BD52B5944D56E06]) [    ] o.a.s.c.CoresLocator Config-defined core root directory: /home/jenkins/workspace/Lucene-Solr-trunk-Linux/solr/build/solr-core/test/J2/temp/solr.cloud.HttpPartitionTest_3BD52B5944D56E06-001/control-001/cores
   [junit4]   2> 1221656 INFO  (TEST-HttpPartitionTest.test-seed#[3BD52B5944D56E06]) [    ] o.a.s.c.CoreContainer New CoreContainer 839238905
   [junit4]   2> 1221656 INFO  (TEST-HttpPartitionTest.test-seed#[3BD52B5944D56E06]) [    ] o.a.s.c.CoreContainer Loading cores into CoreContainer [instanceDir=/home/jenkins/workspace/Lucene-Solr-trunk-Linux/solr/build/solr-core/test/J2/temp/solr.cloud.HttpPartitionTest_3BD52B5944D56E06-001/control-001/]
   [junit4]   2> 1221656 INFO  (TEST-HttpPartitionTest.test-seed#[3BD52B5944D56E06]) [    ] o.a.s.c.CoreContainer loading shared library: /home/jenkins/workspace/Lucene-Solr-trunk-Linux/solr/build/solr-core/test/J2/temp/solr.cloud.HttpPartitionTest_3BD52B5944D56E06-001/control-001/lib
   [junit4]   2> 1221656 WARN  (TEST-HttpPartitionTest.test-seed#[3BD52B5944D56E06]) [    ] o.a.s.c.SolrResourceLoader Can't find (or read) directory to add to classloader: lib (resolved as: /home/jenkins/workspace/Lucene-Solr-trunk-Linux/solr/build/solr-core/test/J2/temp/solr.cloud.HttpPartitionTest_3BD52B5944D56E06-001/control-001/lib).
   [junit4]   2> 1221660 INFO  (TEST-HttpPartitionTest.test-seed#[3BD52B5944D56E06]) [    ] o.a.s.h.c.HttpShardHandlerFactory created with socketTimeout : 90000,urlScheme : ,connTimeout : 15000,maxConnectionsPerHost : 20,maxConnections : 10000,corePoolSize : 0,maximumPoolSize : 2147483647,maxThreadIdleTime : 5,sizeOfQueue : -1,fairnessPolicy : false,useRetries : false,
   [junit4]   2> 1221661 INFO  (TEST-HttpPartitionTest.test-seed#[3BD52B5944D56E06]) [    ] o.a.s.u.UpdateShardHandler Creating UpdateShardHandler HTTP client with params: socketTimeout=340000&connTimeout=45000&retry=true
   [junit4]   2> 1221661 INFO  (TEST-HttpPartitionTest.test-seed#[3BD52B5944D56E06]) [    ] o.a.s.l.LogWatcher SLF4J impl is org.slf4j.impl.Log4jLoggerFactory
   [junit4]   2> 1221661 INFO  (TEST-HttpPartitionTest.test-seed#[3BD52B5944D56E06]) [    ] o.a.s.l.LogWatcher Registering Log Listener [Log4j (org.slf4j.impl.Log4jLoggerFactory)]
   [junit4]   2> 1221661 INFO  (TEST-HttpPartitionTest.test-seed#[3BD52B5944D56E06]) [    ] o.a.s.c.ZkContainer Zookeeper client=127.0.0.1:49737/solr
   [junit4]   2> 1221662 INFO  (TEST-HttpPartitionTest.test-seed#[3BD52B5944D56E06]) [    ] o.a.s.c.ZkController zkHost includes chroot
   [junit4]   2> 1221662 INFO  (TEST-HttpPartitionTest.test-seed#[3BD52B5944D56E06]) [    ] o.a.s.c.c.SolrZkClient Using default ZkCredentialsProvider
   [junit4]   2> 1221662 INFO  (TEST-HttpPartitionTest.test-seed#[3BD52B5944D56E06]) [    ] o.a.s.c.c.ConnectionManager Waiting for client to connect to ZooKeeper
   [junit4]   2> 1221663 INFO  (zkCallback-1155-thread-1) [    ] o.a.s.c.c.ConnectionManager Watcher org.apache.solr.common.cloud.ConnectionManager@4603a6c9 name:ZooKeeperConnection Watcher:127.0.0.1:49737 got event WatchedEvent state:SyncConnected type:None path:null path:null type:None
   [junit4]   2> 1221663 INFO  (TEST-HttpPartitionTest.test-seed#[3BD52B5944D56E06]) [    ] o.a.s.c.c.ConnectionManager Client is connected to ZooKeeper
   [junit4]   2> 1221663 INFO  (TEST-HttpPartitionTest.test-seed#[3BD52B5944D56E06]) [    ] o.a.s.c.c.SolrZkClient Using default ZkACLProvider
   [junit4]   2> 1221664 INFO  (TEST-HttpPartitionTest.test-seed#[3BD52B5944D56E06]) [n:127.0.0.1:54227_x_hpw%2Fzd    ] o.a.s.c.c.ConnectionManager Waiting for client to connect to ZooKeeper
   [junit4]   2> 1221664 INFO  (zkCallback-1156-thread-1-processing-n:127.0.0.1:54227_x_hpw%2Fzd) [n:127.0.0.1:54227_x_hpw%2Fzd    ] o.a.s.c.c.ConnectionManager Watcher org.apache.solr.common.cloud.ConnectionManager@37c1aab9 name:ZooKeeperConnection Watcher:127.0.0.1:49737/solr got event WatchedEvent state:SyncConnected type:None path:null path:null type:None
   [junit4]   2> 1221664 INFO  (TEST-HttpPartitionTest.test-seed#[3BD52B5944D56E06]) [n:127.0.0.1:54227_x_hpw%2Fzd    ] o.a.s.c.c.ConnectionManager Client is connected to ZooKeeper
   [junit4]   2> 1221665 INFO  (TEST-HttpPartitionTest.test-seed#[3BD52B5944D56E06]) [n:127.0.0.1:54227_x_hpw%2Fzd    ] o.a.s.c.c.SolrZkClient makePath: /overseer/queue
   [junit4]   2> 1221666 INFO  (TEST-HttpPartitionTest.test-seed#[3BD52B5944D56E06]) [n:127.0.0.1:54227_x_hpw%2Fzd    ] o.a.s.c.c.SolrZkClient makePath: /overseer/collection-queue-work
   [junit4]   2> 1221666 INFO  (TEST-HttpPartitionTest.test-seed#[3BD52B5944D56E06]) [n:127.0.0.1:54227_x_hpw%2Fzd    ] o.a.s.c.c.SolrZkClient makePath: /overseer/collection-map-running
   [junit4]   2> 1221667 INFO  (TEST-HttpPartitionTest.test-seed#[3BD52B5944D56E06]) [n:127.0.0.1:54227_x_hpw%2Fzd    ] o.a.s.c.c.SolrZkClient makePath: /overseer/collection-map-completed
   [junit4]   2> 1221668 INFO  (TEST-HttpPartitionTest.test-seed#[3BD52B5944D56E06]) [n:127.0.0.1:54227_x_hpw%2Fzd    ] o.a.s.c.c.SolrZkClient makePath: /overseer/collection-map-failure
   [junit4]   2> 1221669 INFO  (TEST-HttpPartitionTest.test-seed#[3BD52B5944D56E06]) [n:127.0.0.1:54227_x_hpw%2Fzd    ] o.a.s.c.c.SolrZkClient makePath: /live_nodes
   [junit4]   2> 1221669 INFO  (TEST-HttpPartitionTest.test-seed#[3BD52B5944D56E06]) [n:127.0.0.1:54227_x_hpw%2Fzd    ] o.a.s.c.c.SolrZkClient makePath: /aliases.json
   [junit4]   2> 1221670 INFO  (TEST-HttpPartitionTest.test-seed#[3BD52B5944D56E06]) [n:127.0.0.1:54227_x_hpw%2Fzd    ] o.a.s.c.c.SolrZkClient makePath: /clusterstate.json
   [junit4]   2> 1221670 INFO  (TEST-HttpPartitionTest.test-seed#[3BD52B5944D56E06]) [n:127.0.0.1:54227_x_hpw%2Fzd    ] o.a.s.c.ZkController Register node as live in ZooKeeper:/live_nodes/127.0.0.1:54227_x_hpw%2Fzd
   [junit4]   2> 1221671 INFO  (TEST-HttpPartitionTest.test-seed#[3BD52B5944D56E06]) [n:127.0.0.1:54227_x_hpw%2Fzd    ] o.a.s.c.c.SolrZkClient makePath: /live_nodes/127.0.0.1:54227_x_hpw%2Fzd
   [junit4]   2> 1221672 INFO  (TEST-HttpPartitionTest.test-seed#[3BD52B5944D56E06]) [n:127.0.0.1:54227_x_hpw%2Fzd    ] o.a.s.c.c.SolrZkClient makePath: /overseer_elect
   [junit4]   2> 1221672 INFO  (TEST-HttpPartitionTest.test-seed#[3BD52B5944D56E06]) [n:127.0.0.1:54227_x_hpw%2Fzd    ] o.a.s.c.c.SolrZkClient makePath: /overseer_elect/election
   [junit4]   2> 1221673 INFO  (TEST-HttpPartitionTest.test-seed#[3BD52B5944D56E06]) [n:127.0.0.1:54227_x_hpw%2Fzd    ] o.a.s.c.Overseer Overseer (id=null) closing
   [junit4]   2> 1221673 INFO  (TEST-HttpPartitionTest.test-seed#[3BD52B5944D56E06]) [n:127.0.0.1:54227_x_hpw%2Fzd    ] o.a.s.c.LeaderElector Joined leadership election with path: /overseer_elect/election/94298322582568964-127.0.0.1:54227_x_hpw%2Fzd-n_0000000000
   [junit4]   2> 1221676 INFO  (TEST-HttpPartitionTest.test-seed#[3BD52B5944D56E06]) [n:127.0.0.1:54227_x_hpw%2Fzd    ] o.a.s.c.OverseerElectionContext I am going to be the leader 127.0.0.1:54227_x_hpw%2Fzd
   [junit4]   2> 1221676 INFO  (TEST-HttpPartitionTest.test-seed#[3BD52B5944D56E06]) [n:127.0.0.1:54227_x_hpw%2Fzd    ] o.a.s.c.c.SolrZkClient makePath: /overseer_elect/leader
   [junit4]   2> 1221676 INFO  (TEST-HttpPartitionTest.test-seed#[3BD52B5944D56E06]) [n:127.0.0.1:54227_x_hpw%2Fzd    ] o.a.s.c.Overseer Overseer (id=94298322582568964-127.0.0.1:54227_x_hpw%2Fzd-n_0000000000) starting
   [junit4]   2> 1221677 INFO  (TEST-HttpPartitionTest.test-seed#[3BD52B5944D56E06]) [n:127.0.0.1:54227_x_hpw%2Fzd    ] o.a.s.c.c.SolrZkClient makePath: /overseer/queue-work
   [junit4]   2> 1221679 INFO  (TEST-HttpPartitionTest.test-seed#[3BD52B5944D56E06]) [n:127.0.0.1:54227_x_hpw%2Fzd    ] o.a.s.c.OverseerAutoReplicaFailoverThread Starting OverseerAutoReplicaFailoverThread autoReplicaFailoverWorkLoopDelay=10000 autoReplicaFailoverWaitAfterExpiration=30000 autoReplicaFailoverBadNodeExpiration=60000
   [junit4]   2> 1221679 INFO  (TEST-HttpPartitionTest.test-seed#[3BD52B5944D56E06]) [n:127.0.0.1:54227_x_hpw%2Fzd    ] o.a.s.c.c.ZkStateReader Updating cluster state from ZooKeeper... 
   [junit4]   2> 1221679 INFO  (OverseerCollectionProcessor-94298322582568964-127.0.0.1:54227_x_hpw%2Fzd-n_0000000000) [n:127.0.0.1:54227_x_hpw%2Fzd    ] o.a.s.c.OverseerProcessor Process current queue of overseer operations
   [junit4]   2> 1221679 INFO  (OverseerStateUpdate-94298322582568964-127.0.0.1:54227_x_hpw%2Fzd-n_0000000000) [n:127.0.0.1:54227_x_hpw%2Fzd    ] o.a.s.c.Overseer Starting to work on the main queue
   [junit4]   2> 1221690 INFO  (TEST-HttpPartitionTest.test-seed#[3BD52B5944D56E06]) [n:127.0.0.1:54227_x_hpw%2Fzd    ] o.a.s.c.CoreContainer No authentication plugin used.
   [junit4]   2> 1221690 INFO  (TEST-HttpPartitionTest.test-seed#[3BD52B5944D56E06]) [n:127.0.0.1:54227_x_hpw%2Fzd    ] o.a.s.c.CoreContainer Security conf doesn't exist. Skipping setup for authorization module.
   [junit4]   2> 1221690 INFO  (TEST-HttpPartitionTest.test-seed#[3BD52B5944D56E06]) [n:127.0.0.1:54227_x_hpw%2Fzd    ] o.a.s.c.CoresLocator Looking for core definitions underneath /home/jenkins/workspace/Lucene-Solr-trunk-Linux/solr/build/solr-core/test/J2/temp/solr.cloud.HttpPartitionTest_3BD52B5944D56E06-001/control-001/cores
   [junit4]   2> 1221691 INFO  (TEST-HttpPartitionTest.test-seed#[3BD52B5944D56E06]) [n:127.0.0.1:54227_x_hpw%2Fzd    ] o.a.s.c.SolrCore Created CoreDescriptor: {name=collection1, config=solrconfig.xml, transient=false, schema=schema.xml, loadOnStartup=true, configSetProperties=configsetprops.json, instanceDir=/home/jenkins/workspace/Lucene-Solr-trunk-Linux/solr/build/solr-core/test/J2/temp/solr.cloud.HttpPartitionTest_3BD52B5944D56E06-001/control-001/cores/collection1, collection=control_collection, absoluteInstDir=/home/jenkins/workspace/Lucene-Solr-trunk-Linux/solr/build/solr-core/test/J2/temp/solr.cloud.HttpPartitionTest_3BD52B5944D56E06-001/control-001/cores/collection1/, coreNodeName=, dataDir=data/, shard=}
   [junit4]   2> 1221691 INFO  (TEST-HttpPartitionTest.test-seed#[3BD52B5944D56E06]) [n:127.0.0.1:54227_x_hpw%2Fzd    ] o.a.s.c.CoresLocator Found core collection1 in /home/jenkins/workspace/Lucene-Solr-trunk-Linux/solr/build/solr-core/test/J2/temp/solr.cloud.HttpPartitionTest_3BD52B5944D56E06-001/control-001/cores/collection1/
   [junit4]   2> 1221691 INFO  (TEST-HttpPartitionTest.test-seed#[3BD52B5944D56E06]) [n:127.0.0.1:54227_x_hpw%2Fzd    ] o.a.s.c.CoresLocator Found 1 core definitions
   [junit4]   2> 1221691 INFO  (coreLoadExecutor-4251-thread-1-processing-n:127.0.0.1:54227_x_hpw%2Fzd) [n:127.0.0.1:54227_x_hpw%2Fzd c:control_collection   x:collection1] o.a.s.c.ZkController publishing state=down
   [junit4]   2> 1221692 INFO  (TEST-HttpPartitionTest.test-seed#[3BD52B5944D56E06]) [n:127.0.0.1:54227_x_hpw%2Fzd    ] o.a.s.s.SolrDispatchFilter user.dir=/home/jenkins/workspace/Lucene-Solr-trunk-Linux/solr/build/solr-core/test/J2
   [junit4]   2> 1221692 INFO  (TEST-HttpPartitionTest.test-seed#[3BD52B5944D56E06]) [n:127.0.0.1:54227_x_hpw%2Fzd    ] o.a.s.s.SolrDispatchFilter SolrDispatchFilter.init() done
   [junit4]   2> 1221692 INFO  (coreLoadExecutor-4251-thread-1-processing-n:127.0.0.1:54227_x_hpw%2Fzd) [n:127.0.0.1:54227_x_hpw%2Fzd c:control_collection   x:collection1] o.a.s.c.ZkController numShards not found on descriptor - reading it from system property
   [junit4]   2> 1221692 INFO  (coreLoadExecutor-4251-thread-1-processing-n:127.0.0.1:54227_x_hpw%2Fzd) [n:127.0.0.1:54227_x_hpw%2Fzd c:control_collection   x:collection1] o.a.s.c.ZkController look for our core node name
   [junit4]   2> 1221692 INFO  (zkCallback-1156-thread-1-processing-n:127.0.0.1:54227_x_hpw%2Fzd) [n:127.0.0.1:54227_x_hpw%2Fzd    ] o.a.s.c.DistributedQueue NodeChildrenChanged fired on path /overseer/queue state SyncConnected
   [junit4]   2> 1221692 INFO  (OverseerStateUpdate-94298322582568964-127.0.0.1:54227_x_hpw%2Fzd-n_0000000000) [n:127.0.0.1:54227_x_hpw%2Fzd    ] o.a.s.c.Overseer processMessage: queueSize: 1, message = {
   [junit4]   2>   "core":"collection1",
   [junit4]   2>   "roles":null,
   [junit4]   2>   "base_url":"http://127.0.0.1:54227/x_hpw/zd",
   [junit4]   2>   "node_name":"127.0.0.1:54227_x_hpw%2Fzd",
   [junit4]   2>   "numShards":"1",
   [junit4]   2>   "state":"down",
   [junit4]   2>   "shard":null,
   [junit4]   2>   "collection":"control_collection",
   [junit4]   2>   "operation":"state"} current state version: 0
   [junit4]   2> 1221693 INFO  (OverseerStateUpdate-94298322582568964-127.0.0.1:54227_x_hpw%2Fzd-n_0000000000) [n:127.0.0.1:54227_x_hpw%2Fzd    ] o.a.s.c.o.ReplicaMutator Update state numShards=1 message={
   [junit4]   2>   "core":"collection1",
   [junit4]   2>   "roles":null,
   [junit4]   2>   "base_url":"http://127.0.0.1:54227/x_hpw/zd",
   [junit4]   2>   "node_name":"127.0.0.1:54227_x_hpw%2Fzd",
   [junit4]   2>   "numShards":"1",
   [junit4]   2>   "state":"down",
   [junit4]   2>   "shard":null,
   [junit4]   2>   "collection":"control_collection",
   [junit4]   2>   "operation":"state"}
   [junit4]   2> 1221693 INFO  (OverseerStateUpdate-94298322582568964-127.0.0.1:54227_x_hpw%2Fzd-n_0000000000) [n:127.0.0.1:54227_x_hpw%2Fzd    ] o.a.s.c.o.ClusterStateMutator building a new cName: control_collection
   [junit4]   2> 1221693 INFO  (OverseerStateUpdate-94298322582568964-127.0.0.1:54227_x_hpw%2Fzd-n_0000000000) [n:127.0.0.1:54227_x_hpw%2Fzd    ] o.a.s.c.o.ReplicaMutator Assigning new node to shard shard=shard1
   [junit4]   2> 1221693 INFO  (zkCallback-1156-thread-1-processing-n:127.0.0.1:54227_x_hpw%2Fzd) [n:127.0.0.1:54227_x_hpw%2Fzd    ] o.a.s.c.c.ZkStateReader A cluster state change: WatchedEvent state:SyncConnected type:NodeDataChanged path:/clusterstate.json, has occurred - updating... (live nodes size: 1)
   [junit4]   2> 1221694 INFO  (zkCallback-1156-thread-1-processing-n:127.0.0.1:54227_x_hpw%2Fzd) [n:127.0.0.1:54227_x_hpw%2Fzd    ] o.a.s.c.c.ZkStateReader Updated cluster state version to 1
   [junit4]   2> 1222692 INFO  (coreLoadExecutor-4251-thread-1-processing-n:127.0.0.1:54227_x_hpw%2Fzd) [n:127.0.0.1:54227_x_hpw%2Fzd c:control_collection   x:collection1] o.a.s.c.ZkController waiting to find shard id in clusterstate for collection1
   [junit4]   2> 1222692 INFO  (coreLoadExecutor-4251-thread-1-processing-n:127.0.0.1:54227_x_hpw%2Fzd) [n:127.0.0.1:54227_x_hpw%2Fzd c:control_collection   x:collection1] o.a.s.c.ZkController Check for collection zkNode:control_collection
   [junit4]   2> 1222693 INFO  (coreLoadExecutor-4251-thread-1-processing-n:127.0.0.1:54227_x_hpw%2Fzd) [n:127.0.0.1:54227_x_hpw%2Fzd c:control_collection   x:collection1] o.a.s.c.ZkController Collection zkNode exists
   [junit4]   2> 1222693 INFO  (coreLoadExecutor-4251-thread-1-processing-n:127.0.0.1:54227_x_hpw%2Fzd) [n:127.0.0.1:54227_x_hpw%2Fzd c:control_collection   x:collection1] o.a.s.c.c.ZkStateReader Load collection config from:/collections/control_collection
   [junit4]   2> 1222693 INFO  (coreLoadExecutor-4251-thread-1-processing-n:127.0.0.1:54227_x_hpw%2Fzd) [n:127.0.0.1:54227_x_hpw%2Fzd c:control_collection   x:collection1] o.a.s.c.c.ZkStateReader path=/collections/control_collection configName=conf1 specified config exists in ZooKeeper
   [junit4]   2> 1222693 INFO  (coreLoadExecutor-4251-thread-1-processing-n:127.0.0.1:54227_x_hpw%2Fzd) [n:127.0.0.1:54227_x_hpw%2Fzd c:control_collection   x:collection1] o.a.s.c.SolrResourceLoader new SolrResourceLoader for directory: '/home/jenkins/workspace/Lucene-Solr-trunk-Linux/solr/build/solr-core/test/J2/temp/solr.cloud.HttpPartitionTest_3BD52B5944D56E06-001/control-001/cores/collection1/'
   [junit4]   2> 1222699 INFO  (coreLoadExecutor-4251-thread-1-processing-n:127.0.0.1:54227_x_hpw%2Fzd) [n:127.0.0.1:54227_x_hpw%2Fzd c:control_collection   x:collection1] o.a.s.c.Config loaded config solrconfig.xml with version 0 
   [junit4]   2> 1222702 INFO  (coreLoadExecutor-4251-thread-1-processing-n:127.0.0.1:54227_x_hpw%2Fzd) [n:127.0.0.1:54227_x_hpw%2Fzd c:control_collection   x:collection1] o.a.s.c.SolrConfig current version of requestparams : -1
   [junit4]   2> 1222705 INFO  (coreLoadExecutor-4251-thread-1-processing-n:127.0.0.1:54227_x_hpw%2Fzd) [n:127.0.0.1:54227_x_hpw%2Fzd c:control_collection   x:collection1] o.a.s.c.SolrConfig Using Lucene MatchVersion: 6.0.0
   [junit4]   2> 1222711 INFO  (coreLoadExecutor-4251-thread-1-processing-n:127.0.0.1:54227_x_hpw%2Fzd) [n:127.0.0.1:54227_x_hpw%2Fzd c:control_collection   x:collection1] o.a.s.c.Config Loaded SolrConfig: solrconfig.xml
   [junit4]   2> 1222712 INFO  (coreLoadExecutor-4251-thread-1-processing-n:127.0.0.1:54227_x_hpw%2Fzd) [n:127.0.0.1:54227_x_hpw%2Fzd c:control_collection   x:collection1] o.a.s.s.IndexSchema Reading Solr Schema from /configs/conf1/schema.xml
   [junit4]   2> 1222714 INFO  (coreLoadExecutor-4251-thread-1-processing-n:127.0.0.1:54227_x_hpw%2Fzd) [n:127.0.0.1:54227_x_hpw%2Fzd c:control_collection   x:collection1] o.a.s.s.IndexSchema [collection1] Schema name=test
   [junit4]   2> 1222799 INFO  (coreLoadExecutor-4251-thread-1-processing-n:127.0.0.1:54227_x_hpw%2Fzd) [n:127.0.0.1:54227_x_hpw%2Fzd c:control_collection   x:collection1] o.a.s.s.OpenExchangeRatesOrgProvider Initialized with rates=open-exchange-rates.json, refreshInterval=1440.
   [junit4]   2> 1222803 INFO  (coreLoadExecutor-4251-thread-1-processing-n:127.0.0.1:54227_x_hpw%2Fzd) [n:127.0.0.1:54227_x_hpw%2Fzd c:control_collection   x:collection1] o.a.s.s.IndexSchema default search field in schema is text
   [junit4]   2> 1222804 INFO  (coreLoadExecutor-4251-thread-1-processing-n:127.0.0.1:54227_x_hpw%2Fzd) [n:127.0.0.1:54227_x_hpw%2Fzd c:control_collection   x:collection1] o.a.s.s.IndexSchema unique key field: id
   [junit4]   2> 1222807 INFO  (coreLoadExecutor-4251-thread-1-processing-n:127.0.0.1:54227_x_hpw%2Fzd) [n:127.0.0.1:54227_x_hpw%2Fzd c:control_collection   x:collection1] o.a.s.s.FileExchangeRateProvider Reloading exchange rates from file currency.xml
   [junit4]   2> 1222808 INFO  (coreLoadExecutor-4251-thread-1-processing-n:127.0.0.1:54227_x_hpw%2Fzd) [n:127.0.0.1:54227_x_hpw%2Fzd c:control_collection   x:collection1] o.a.s.s.FileExchangeRateProvider Reloading exchange rates from file currency.xml
   [junit4]   2> 1222809 INFO  (coreLoadExecutor-4251-thread-1-processing-n:127.0.0.1:54227_x_hpw%2Fzd) [n:127.0.0.1:54227_x_hpw%2Fzd c:control_collection   x:collection1] o.a.s.s.OpenExchangeRatesOrgProvider Reloading exchange rates from open-exchange-rates.json
   [junit4]   2> 1222809 WARN  (coreLoadExecutor-4251-thread-1-processing-n:127.0.0.1:54227_x_hpw%2Fzd) [n:127.0.0.1:54227_x_hpw%2Fzd c:control_collection   x:collection1] o.a.s.s.OpenExchangeRatesOrgProvider Unknown key IMPORTANT NOTE
   [junit4]   2> 1222809 WARN  (coreLoadExecutor-4251-thread-1-processing-n:127.0.0.1:54227_x_hpw%2Fzd) [n:127.0.0.1:54227_x_hpw%2Fzd c:control_collection   x:collection1] o.a.s.s.OpenExchangeRatesOrgProvider Expected key, got STRING
   [junit4]   2> 1222809 INFO  (coreLoadExecutor-4251-thread-1-processing-n:127.0.0.1:54227_x_hpw%2Fzd) [n:127.0.0.1:54227_x_hpw%2Fzd c:control_collection   x:collection1] o.a.s.s.OpenExchangeRatesOrgProvider Reloading exchange rates from open-exchange-rates.json
   [junit4]   2> 1222809 WARN  (coreLoadExecutor-4251-thread-1-processing-n:127.0.0.1:54227_x_hpw%2Fzd) [n:127.0.0.1:54227_x_hpw%2Fzd c:control_collection   x:collection1] o.a.s.s.OpenExchangeRatesOrgProvider Unknown key IMPORTANT NOTE
   [junit4]   2> 1222809 WARN  (coreLoadExecutor-4251-thread-1-processing-n:127.0.0.1:54227_x_hpw%2Fzd) [n:127.0.0.1:54227_x_hpw%2Fzd c:control_collection   x:collection1] o.a.s.s.OpenExchangeRatesOrgProvider Expected key, got STRING
   [junit4]   2> 1222810 INFO  (coreLoadExecutor-4251-thread-1-processing-n:127.0.0.1:54227_x_hpw%2Fzd) [n:127.0.0.1:54227_x_hpw%2Fzd c:control_collection   x:collection1] o.a.s.c.ConfigSetProperties Did not find ConfigSet properties, assuming default properties: Can't find resource 'configsetprops.json' in classpath or '/configs/conf1', cwd=/home/jenkins/workspace/Lucene-Solr-trunk-Linux/solr/build/solr-core/test/J2
   [junit4]   2> 1222810 INFO  (coreLoadExecutor-4251-thread-1-processing-n:127.0.0.1:54227_x_hpw%2Fzd) [n:127.0.0.1:54227_x_hpw%2Fzd c:control_collection   x:collection1] o.a.s.c.CoreContainer Creating SolrCore 'collection1' using configuration from collection control_collection
   [junit4]   2> 1222810 INFO  (coreLoadExecutor-4251-thread-1-processing-n:127.0.0.1:54227_x_hpw%2Fzd) [n:127.0.0.1:54227_x_hpw%2Fzd c:control_collection s:shard1 r:core_node1 x:collection1] o.a.s.c.SolrCore org.apache.solr.core.MockDirectoryFactory
   [junit4]   2> 1222810 INFO  (coreLoadExecutor-4251-thread-1-processing-n:127.0.0.1:54227_x_hpw%2Fzd) [n:127.0.0.1:54227_x_hpw%2Fzd c:control_collection s:shard1 r:core_node1 x:collection1] o.a.s.c.SolrCore [[collection1] ] Opening new SolrCore at [/home/jenkins/workspace/Lucene-Solr-trunk-Linux/solr/build/solr-core/test/J2/temp/solr.cloud.HttpPartitionTest_3BD52B5944D56E06-001/control-001/cores/collection1/], dataDir=[null]
   [junit4]   2> 1222810 INFO  (coreLoadExecutor-4251-thread-1-processing-n:127.0.0.1:54227_x_hpw%2Fzd) [n:127.0.0.1:54227_x_hpw%2Fzd c:control_collection s:shard1 r:core_node1 x:collection1] o.a.s.c.JmxMonitoredMap JMX monitoring is enabled. Adding Solr mbeans to JMX Server: com.sun.jmx.mbeanserver.JmxMBeanServer@58720fca
   [junit4]   2> 1222811 INFO  (coreLoadExecutor-4251-thread-1-processing-n:127.0.0.1:54227_x_hpw%2Fzd) [n:127.0.0.1:54227_x_hpw%2Fzd c:control_collection s:shard1 r:core_node1 x:collection1] o.a.s.c.CachingDirectoryFactory return new directory for /home/jenkins/workspace/Lucene-Solr-trunk-Linux/solr/build/solr-core/test/J2/temp/solr.cloud.HttpPartitionTest_3BD52B5944D56E06-001/control-001/cores/collection1/data
   [junit4]   2> 1222811 INFO  (coreLoadExecutor-4251-thread-1-processing-n:127.0.0.1:54227_x_hpw%2Fzd) [n:127.0.0.1:54227_x_hpw%2Fzd c:control_collection s:shard1 r:core_node1 x:collection1] o.a.s.c.SolrCore New index directory detected: old=null new=/home/jenkins/workspace/Lucene-Solr-trunk-Linux/solr/build/solr-core/test/J2/temp/solr.cloud.HttpPartitionTest_3BD52B5944D56E06-001/control-001/cores/collection1/data/index/
   [junit4]   2> 1222811 WARN  (coreLoadExecutor-4251-thread-1-processing-n:127.0.0.1:54227_x_hpw%2Fzd) [n:127.0.0.1:54227_x_hpw%2Fzd c:control_collection s:shard1 r:core_node1 x:collection1] o.a.s.c.SolrCore [collection1] Solr index directory '/home/jenkins/workspace/Lucene-Solr-trunk-Linux/solr/build/solr-core/test/J2/temp/solr.cloud.HttpPartitionTest_3BD52B5944D56E06-001/control-001/cores/collection1/data/index' doesn't exist. Creating new index...
   [junit4]   2> 1222811 INFO  (coreLoadExecutor-4251-thread-1-processing-n:127.0.0.1:54227_x_hpw%2Fzd) [n:127.0.0.1:54227_x_hpw%2Fzd c:control_collection s:shard1 r:core_node1 x:collection1] o.a.s.c.CachingDirectoryFactory return new directory for /home/jenkins/workspace/Lucene-Solr-trunk-Linux/solr/build/solr-core/test/J2/temp/solr.cloud.HttpPartitionTest_3BD52B5944D56E06-001/control-001/cores/collection1/data/index
   [junit4]   2> 1222812 INFO  (coreLoadExecutor-4251-thread-1-processing-n:127.0.0.1:54227_x_hpw%2Fzd) [n:127.0.0.1:54227_x_hpw%2Fzd c:control_collection s:shard1 r:core_node1 x:collection1] o.a.s.u.RandomMergePolicy RandomMergePolicy wrapping class org.apache.lucene.index.AlcoholicMergePolicy: [AlcoholicMergePolicy: minMergeSize=0, mergeFactor=10, maxMergeSize=915558636, maxMergeSizeForForcedMerge=9223372036854775807, calibrateSizeByDeletes=true, maxMergeDocs=2147483647, maxCFSSegmentSizeMB=8.796093022207999E12, noCFSRatio=0.1]
   [junit4]   2> 1222812 INFO  (coreLoadExecutor-4251-thread-1-processing-n:127.0.0.1:54227_x_hpw%2Fzd) [n:127.0.0.1:54227_x_hpw%2Fzd c:control_collection s:shard1 r:core_node1 x:collection1] o.a.s.c.SolrCore SolrDeletionPolicy.onCommit: commits: num=1
   [junit4]   2> 	commit{dir=MockDirectoryWrapper(RAMDirectory@2b09626a lockFactory=org.apache.lucene.store.SingleInstanceLockFactory@452dc130),segFN=segments_1,generation=1}
   [junit4]   2> 1222812 INFO  (coreLoadExecutor-4251-thread-1-processing-n:127.0.0.1:54227_x_hpw%2Fzd) [n:127.0.0.1:54227_x_hpw%2Fzd c:control_collection s:shard1 r:core_node1 x:collection1] o.a.s.c.SolrCore newest commit generation = 1
   [junit4]   2> 1222812 INFO  (OldIndexDirectoryCleanupThreadForCore-collection1) [n:127.0.0.1:54227_x_hpw%2Fzd c:control_collection s:shard1 r:core_node1 x:collection1] o.a.s.c.SolrCore Looking for old index directories to cleanup for core collection1 in /home/jenkins/workspace/Lucene-Solr-trunk-Linux/solr/build/solr-core/test/J2/temp/solr.cloud.HttpPartitionTest_3BD52B5944D56E06-001/control-001/cores/collection1/data/
   [junit4]   2> 1222812 WARN  (OldIndexDirectoryCleanupThreadForCore-collection1) [n:127.0.0.1:54227_x_hpw%2Fzd c:control_collection s:shard1 r:core_node1 x:collection1] o.a.s.c.DirectoryFactory /home/jenkins/workspace/Lucene-Solr-trunk-Linux/solr/build/solr-core/test/J2/temp/solr.cloud.HttpPartitionTest_3BD52B5944D56E06-001/control-001/cores/collection1/data/ does not point to a valid data directory; skipping clean-up of old index directories.
   [junit4]   2> 1222813 INFO  (coreLoadExecutor-4251-thread-1-processing-n:127.0.0.1:54227_x_hpw%2Fzd) [n:127.0.0.1:54227_x_hpw%2Fzd c:control_collection s:shard1 r:core_node1 x:collection1] o.a.s.u.p.UpdateRequestProcessorChain creating updateRequestProcessorChain "nodistrib"
   [junit4]   2> 1222814 INFO  (coreLoadExecutor-4251-thread-1-processing-n:127.0.0.1:54227_x_hpw%2Fzd) [n:127.0.0.1:54227_x_hpw%2Fzd c:control_collection s:shard1 r:core_node1 x:collection1] o.a.s.u.p.UpdateRequestProcessorChain creating updateRequestProcessorChain "dedupe"
   [junit4]   2> 1222814 INFO  (coreLoadExecutor-4251-thread-1-processing-n:127.0.0.1:54227_x_hpw%2Fzd) [n:127.0.0.1:54227_x_hpw%2Fzd c:control_collection s:shard1 r:core_node1 x:collection1] o.a.s.u.p.UpdateRequestProcessorChain inserting DistributedUpdateProcessorFactory into updateRequestProcessorChain "dedupe"
   [junit4]   2> 1222814 INFO  (coreLoadExecutor-4251-thread-1-processing-n:127.0.0.1:54227_x_hpw%2Fzd) [n:127.0.0.1:54227_x_hpw%2Fzd c:control_collection s:shard1 r:core_node1 x:collection1] o.a.s.u.p.UpdateRequestProcessorChain creating updateRequestProcessorChain "stored_sig"
   [junit4]   2> 1222814 INFO  (coreLoadExecutor-4251-thread-1-processing-n:127.0.0.1:54227_x_hpw%2Fzd) [n:127.0.0.1:54227_x_hpw%2Fzd c:control_collection s:shard1 r:core_node1 x:collection1] o.a.s.u.p.UpdateRequestProcessorChain inserting DistributedUpdateProcessorFactory into updateRequestProcessorChain "stored_sig"
   [junit4]   2> 1222814 INFO  (coreLoadExecutor-4251-thread-1-processing-n:127.0.0.1:54227_x_hpw%2Fzd) [n:127.0.0.1:54227_x_hpw%2Fzd c:control_collection s:shard1 r:core_node1 x:collection1] o.a.s.u.p.UpdateRequestProcessorChain creating updateRequestProcessorChain "distrib-dup-test-chain-explicit"
   [junit4]   2> 1222814 INFO  (coreLoadExecutor-4251-thread-1-processing-n:127.0.0.1:54227_x_hpw%2Fzd) [n:127.0.0.1:54227_x_hpw%2Fzd c:control_collection s:shard1 r:core_node1 x:collection1] o.a.s.u.p.UpdateRequestProcessorChain creating updateRequestProcessorChain "distrib-dup-test-chain-implicit"
   [junit4]   2> 1222814 INFO  (coreLoadExecutor-4251-thread-1-processing-n:127.0.0.1:54227_x_hpw%2Fzd) [n:127.0.0.1:54227_x_hpw%2Fzd c:control_collection s:shard1 r:core_node1 x:collection1] o.a.s.u.p.UpdateRequestProcessorChain inserting DistributedUpdateProcessorFactory into updateRequestProcessorChain "distrib-dup-test-chain-implicit"
   [junit4]   2> 1222814 INFO  (coreLoadExecutor-4251-thread-1-processing-n:127.0.0.1:54227_x_hpw%2Fzd) [n:127.0.0.1:54227_x_hpw%2Fzd c:control_collection s:shard1 r:core_node1 x:collection1] o.a.s.c.SolrCore no updateRequestProcessorChain defined as default, creating implicit default
   [junit4]   2> 1222815 INFO  (coreLoadExecutor-4251-thread-1-processing-n:127.0.0.1:54227_x_hpw%2Fzd) [n:127.0.0.1:54227_x_hpw%2Fzd c:control_collection s:shard1 r:core_node1 x:collection1] o.a.s.h.l.XMLLoader xsltCacheLifetimeSeconds=60
   [junit4]   2> 1222816 INFO  (coreLoadExecutor-4251-thread-1-processing-n:127.0.0.1:54227_x_hpw%2Fzd) [n:127.0.0.1:54227_x_hpw%2Fzd c:control_collection s:shard1 r:core_node1 x:collection1] o.a.s.h.l.XMLLoader xsltCacheLifetimeSeconds=60
   [junit4]   2> 1222816 INFO  (coreLoadExecutor-4251-thread-1-processing-n:127.0.0.1:54227_x_hpw%2Fzd) [n:127.0.0.1:54227_x_hpw%2Fzd c:control_collection s:shard1 r:core_node1 x:collection1] o.a.s.h.l.XMLLoader xsltCacheLifetimeSeconds=60
   [junit4]   2> 1222817 INFO  (coreLoadExecutor-4251-thread-1-processing-n:127.0.0.1:54227_x_hpw%2Fzd) [n:127.0.0.1:54227_x_hpw%2Fzd c:control_collection s:shard1 r:core_node1 x:collection1] o.a.s.h.l.XMLLoader xsltCacheLifetimeSeconds=60
   [junit4]   2> 1222818 INFO  (coreLoadExecutor-4251-thread-1-processing-n:127.0.0.1:54227_x_hpw%2Fzd) [n:127.0.0.1:54227_x_hpw%2Fzd c:control_collection s:shard1 r:core_node1 x:collection1] o.a.s.c.RequestHandlers Registered paths: /admin/mbeans,standard,/update/csv,/update/json/docs,/admin/luke,/admin/segments,/get,/admin/system,/replication,/admin/properties,/config,/schema,/admin/plugins,/admin/logging,/update/json,/admin/threads,/admin/ping,/update,/admin/file
   [junit4]   2> 1222818 INFO  (coreLoadExecutor-4251-thread-1-processing-n:127.0.0.1:54227_x_hpw%2Fzd) [n:127.0.0.1:54227_x_hpw%2Fzd c:control_collection s:shard1 r:core_node1 x:collection1] o.a.s.c.SolrCore Using default statsCache cache: org.apache.solr.search.stats.LocalStatsCache
   [junit4]   2> 1222818 INFO  (coreLoadExecutor-4251-thread-1-processing-n:127.0.0.1:54227_x_hpw%2Fzd) [n:127.0.0.1:54227_x_hpw%2Fzd c:control_collection s:shard1 r:core_node1 x:collection1] o.a.s.u.UpdateHandler Using UpdateLog implementation: org.apache.solr.update.UpdateLog
   [junit4]   2> 1222819 INFO  (coreLoadExecutor-4251-thread-1-processing-n:127.0.0.1:54227_x_hpw%2Fzd) [n:127.0.0.1:54227_x_hpw%2Fzd c:control_collection s:shard1 r:core_node1 x:collection1] o.a.s.u.UpdateLog Initializing UpdateLog: dataDir= defaultSyncLevel=FLUSH numRecordsToKeep=100 maxNumLogsToKeep=10 numVersionBuckets=65536
   [junit4]   2> 1222819 INFO  (coreLoadExecutor-4251-thread-1-processing-n:127.0.0.1:54227_x_hpw%2Fzd) [n:127.0.0.1:54227_x_hpw%2Fzd c:control_collection s:shard1 r:core_node1 x:collection1] o.a.s.c.SolrCore Hard AutoCommit: disabled
   [junit4]   2> 1222819 INFO  (coreLoadExecutor-4251-thread-1-processing-n:127.0.0.1:54227_x_hpw%2Fzd) [n:127.0.0.1:54227_x_hpw%2Fzd c:control_collection s:shard1 r:core_node1 x:collection1] o.a.s.c.SolrCore Soft AutoCommit: disabled
   [junit4]   2> 1222820 INFO  (coreLoadExecutor-4251-thread-1-processing-n:127.0.0.1:54227_x_hpw%2Fzd) [n:127.0.0.1:54227_x_hpw%2Fzd c:control_collection s:shard1 r:core_node1 x:collection1] o.a.s.u.RandomMergePolicy RandomMergePolicy wrapping class org.apache.lucene.index.TieredMergePolicy: [TieredMergePolicy: maxMergeAtOnce=29, maxMergeAtOnceExplicit=25, maxMergedSegmentMB=30.7353515625, floorSegmentMB=1.6484375, forceMergeDeletesPctAllowed=6.870940251642215, segmentsPerTier=23.0, maxCFSSegmentSizeMB=8.796093022207999E12, noCFSRatio=1.0
   [junit4]   2> 1222820 INFO  (coreLoadExecutor-4251-thread-1-processing-n:127.0.0.1:54227_x_hpw%2Fzd) [n:127.0.0.1:54227_x_hpw%2Fzd c:control_collection s:shard1 r:core_node1 x:collection1] o.a.s.c.SolrCore SolrDeletionPolicy.onInit: commits: num=1
   [junit4]   2> 	commit{dir=MockDirectoryWrapper(RAMDirectory@2b09626a lockFactory=org.apache.lucene.store.SingleInstanceLockFactory@452dc130),segFN=segments_1,generation=1}
   [junit4]   2> 1222820 INFO  (coreLoadExecutor-4251-thread-1-processing-n:127.0.0.1:54227_x_hpw%2Fzd) [n:127.0.0.1:54227_x_hpw%2Fzd c:control_collection s:shard1 r:core_node1 x:collection1] o.a.s.c.SolrCore newest commit generation = 1
   [junit4]   2> 1222820 INFO  (coreLoadExecutor-4251-thread-1-processing-n:127.0.0.1:54227_x_hpw%2Fzd) [n:127.0.0.1:54227_x_hpw%2Fzd c:control_collection s:shard1 r:core_node1 x:collection1] o.a.s.s.SolrIndexSearcher Opening Searcher@61749e33[collection1] main
   [junit4]   2> 1222820 INFO  (coreLoadExecutor-4251-thread-1-processing-n:127.0.0.1:54227_x_hpw%2Fzd) [n:127.0.0.1:54227_x_hpw%2Fzd c:control_collection s:shard1 r:core_node1 x:collection1] o.a.s.c.c.ZkStateReader Load collection config from:/collections/control_collection
   [junit4]   2> 1222821 INFO  (coreLoadExecutor-4251-thread-1-processing-n:127.0.0.1:54227_x_hpw%2Fzd) [n:127.0.0.1:54227_x_hpw%2Fzd c:control_collection s:shard1 r:core_node1 x:collection1] o.a.s.c.c.ZkStateReader path=/collections/control_collection configName=conf1 specified config exists in ZooKeeper
   [junit4]   2> 1222821 INFO  (coreLoadExecutor-4251-thread-1-processing-n:127.0.0.1:54227_x_hpw%2Fzd) [n:127.0.0.1:54227_x_hpw%2Fzd c:control_collection s:shard1 r:core_node1 x:collection1] o.a.s.r.ManagedResourceStorage Setting up ZooKeeper-based storage for the RestManager with znodeBase: /configs/conf1
   [junit4]   2> 1222821 INFO  (coreLoadExecutor-4251-thread-1-processing-n:127.0.0.1:54227_x_hpw%2Fzd) [n:127.0.0.1:54227_x_hpw%2Fzd c:control_collection s:shard1 r:core_node1 x:collection1] o.a.s.r.ManagedResourceStorage Configured ZooKeeperStorageIO with znodeBase: /configs/conf1
   [junit4]   2> 1222821 INFO  (coreLoadExecutor-4251-thread-1-processing-n:127.0.0.1:54227_x_hpw%2Fzd) [n:127.0.0.1:54227_x_hpw%2Fzd c:control_collection s:shard1 r:core_node1 x:collection1] o.a.s.r.RestManager Initializing RestManager with initArgs: {}
   [junit4]   2> 1222821 INFO  (coreLoadExecutor-4251-thread-1-processing-n:127.0.0.1:54227_x_hpw%2Fzd) [n:127.0.0.1:54227_x_hpw%2Fzd c:control_collection s:shard1 r:core_node1 x:collection1] o.a.s.r.ManagedResourceStorage Reading _rest_managed.json using ZooKeeperStorageIO:path=/configs/conf1
   [junit4]   2> 1222821 INFO  (coreLoadExecutor-4251-thread-1-processing-n:127.0.0.1:54227_x_hpw%2Fzd) [n:127.0.0.1:54227_x_hpw%2Fzd c:control_collection s:shard1 r:core_node1 x:collection1] o.a.s.r.ManagedResourceStorage No data found for znode /configs/conf1/_rest_managed.json
   [junit4]   2> 1222821 INFO  (coreLoadExecutor-4251-thread-1-processing-n:127.0.0.1:54227_x_hpw%2Fzd) [n:127.0.0.1:54227_x_hpw%2Fzd c:control_collection s:shard1 r:core_node1 x:collection1] o.a.s.r.ManagedResourceStorage Loaded null at path _rest_managed.json using ZooKeeperStorageIO:path=/configs/conf1
   [junit4]   2> 1222821 INFO  (coreLoadExecutor-4251-thread-1-processing-n:127.0.0.1:54227_x_hpw%2Fzd) [n:127.0.0.1:54227_x_hpw%2Fzd c:control_collection s:shard1 r:core_node1 x:collection1] o.a.s.r.RestManager Initializing 0 registered ManagedResources
   [junit4]   2> 1222822 INFO  (coreLoadExecutor-4251-thread-1-processing-n:127.0.0.1:54227_x_hpw%2Fzd) [n:127.0.0.1:54227_x_hpw%2Fzd c:control_collection s:shard1 r:core_node1 x:collection1] o.a.s.h.ReplicationHandler Commits will be reserved for  10000
   [junit4]   2> 1222822 INFO  (searcherExecutor-4252-thread-1-processing-n:127.0.0.1:54227_x_hpw%2Fzd x:collection1 s:shard1 c:control_collection r:core_node1) [n:127.0.0.1:54227_x_hpw%2Fzd c:control_collection s:shard1 r:core_node1 x:collection1] o.a.s.c.SolrCore [collection1] Registered new searcher Searcher@61749e33[collection1] main{ExitableDirectoryReader(UninvertingDirectoryReader())}
   [junit4]   2> 1222822 INFO  (coreLoadExecutor-4251-thread-1-processing-n:127.0.0.1:54227_x_hpw%2Fzd) [n:127.0.0.1:54227_x_hpw%2Fzd c:control_collection s:shard1 r:core_node1 x:collection1] o.a.s.u.UpdateLog Looking up max value of version field to seed version buckets
   [junit4]   2> 1222822 INFO  (coreLoadExecutor-4251-thread-1-processing-n:127.0.0.1:54227_x_hpw%2Fzd) [n:127.0.0.1:54227_x_hpw%2Fzd c:control_collection s:shard1 r:core_node1 x:collection1] o.a.s.u.VersionInfo Refreshing highest value of _version_ for 65536 version buckets from index
   [junit4]   2> 1222822 INFO  (coreLoadExecutor-4251-thread-1-processing-n:127.0.0.1:54227_x_hpw%2Fzd) [n:127.0.0.1:54227_x_hpw%2Fzd c:control_collection s:shard1 r:core_node1 x:collection1] o.a.s.u.VersionInfo No terms found for _version_, cannot seed version bucket highest value from index
   [junit4]   2> 1222822 INFO  (coreLoadExecutor-4251-thread-1-processing-n:127.0.0.1:54227_x_hpw%2Fzd) [n:127.0.0.1:54227_x_hpw%2Fzd c:control_collection s:shard1 r:core_node1 x:collection1] o.a.s.u.UpdateLog Could not find max version in index or recent updates, using new clock 1508773162766041088
   [junit4]   2> 1222824 INFO  (coreLoadExecutor-4251-thread-1-processing-n:127.0.0.1:54227_x_hpw%2Fzd) [n:127.0.0.1:54227_x_hpw%2Fzd c:control_collection s:shard1 r:core_node1 x:collection1] o.a.s.u.UpdateLog Took 2 ms to seed version buckets with highest version 1508773162766041088
   [junit4]   2> 1222824 INFO  (coreLoadExecutor-4251-thread-1-processing-n:127.0.0.1:54227_x_hpw%2Fzd) [n:127.0.0.1:54227_x_hpw%2Fzd c:control_collection s:shard1 r:core_node1 x:collection1] o.a.s.c.ZkController watch zkdir /configs/conf1
   [junit4]   2> 1222824 INFO  (coreLoadExecutor-4251-thread-1-processing-n:127.0.0.1:54227_x_hpw%2Fzd) [n:127.0.0.1:54227_x_hpw%2Fzd c:control_collection s:shard1 r:core_node1 x:collection1] o.a.s.c.CoreContainer registering core: collection1
   [junit4]   2> 1222825 INFO  (coreZkRegister-4245-thread-1-processing-n:127.0.0.1:54227_x_hpw%2Fzd x:collection1 s:shard1 c:control_collection r:core_node1) [n:127.0.0.1:54227_x_hpw%2Fzd c:control_collection s:shard1 r:core_node1 x:collection1] o.a.s.c.ZkController Register replica - core:collection1 address:http://127.0.0.1:54227/x_hpw/zd collection:control_collection shard:shard1
   [junit4]   2> 1222825 INFO  (coreZkRegister-4245-thread-1-processing-n:127.0.0.1:54227_x_hpw%2Fzd x:collection1 s:shard1 c:control_collection r:core_node1) [n:127.0.0.1:54227_x_hpw%2Fzd c:control_collection s:shard1 r:core_node1 x:collection1] o.a.s.c.c.SolrZkClient makePath: /collections/control_collection/leader_elect/shard1/election
   [junit4]   2> 1222826 INFO  (coreZkRegister-4245-thread-1-processing-n:127.0.0.1:54227_x_hpw%2Fzd x:collection1 s:shard1 c:control_collection r:core_node1) [n:127.0.0.1:54227_x_hpw%2Fzd c:control_collection s:shard1 r:core_node1 x:collection1] o.a.s.c.LeaderElector Joined leadership election with path: /collections/control_collection/leader_elect/shard1/election/94298322582568964-core_node1-n_0000000000
   [junit4]   2> 1222826 INFO  (coreZkRegister-4245-thread-1-processing-n:127.0.0.1:54227_x_hpw%2Fzd x:collection1 s:shard1 c:control_collection r:core_node1) [n:127.0.0.1:54227_x_hpw%2Fzd c:control_collection s:shard1 r:core_node1 x:collection1] o.a.s.c.ShardLeaderElectionContext Running the leader process for shard shard1
   [junit4]   2> 1222827 INFO  (zkCallback-1156-thread-1-processing-n:127.0.0.1:54227_x_hpw%2Fzd) [n:127.0.0.1:54227_x_hpw%2Fzd    ] o.a.s.c.DistributedQueue NodeChildrenChanged fired on path /overseer/queue state SyncConnected
   [junit4]   2> 1222827 INFO  (coreZkRegister-4245-thread-1-processing-n:127.0.0.1:54227_x_hpw%2Fzd x:collection1 s:shard1 c:control_collection r:core_node1) [n:127.0.0.1:54227_x_hpw%2Fzd c:control_collection s:shard1 r:core_node1 x:collection1] o.a.s.c.ShardLeaderElectionContext Enough replicas found to continue.
   [junit4]   2> 1222827 INFO  (coreZkRegister-4245-thread-1-processing-n:127.0.0.1:54227_x_hpw%2Fzd x:collection1 s:shard1 c:control_collection r:core_node1) [n:127.0.0.1:54227_x_hpw%2Fzd c:control_collection s:shard1 r:core_node1 x:collection1] o.a.s.c.ShardLeaderElectionContext I may be the new leader - try and sync
   [junit4]   2> 1222827 INFO  (OverseerStateUpdate-94298322582568964-127.0.0.1:54227_x_hpw%2Fzd-n_0000000000) [n:127.0.0.1:54227_x_hpw%2Fzd    ] o.a.s.c.Overseer processMessage: queueSize: 1, message = {
   [junit4]   2>   "operation":"leader",
   [junit4]   2>   "shard":"shard1",
   [junit4]   2>   "collection":"control_collection"} current state version: 1
   [junit4]   2> 1222827 INFO  (coreZkRegister-4245-thread-1-processing-n:127.0.0.1:54227_x_hpw%2Fzd x:collection1 s:shard1 c:control_collection r:core_node1) [n:127.0.0.1:54227_x_hpw%2Fzd c:control_collection s:shard1 r:core_node1 x:collection1] o.a.s.c.SyncStrategy Sync replicas to http://127.0.0.1:54227/x_hpw/zd/collection1/
   [junit4]   2> 1222827 INFO  (coreZkRegister-4245-thread-1-processing-n:127.0.0.1:54227_x_hpw%2Fzd x:collection1 s:shard1 c:control_collection r:core_node1) [n:127.0.0.1:54227_x_hpw%2Fzd c:control_collection s:shard1 r:core_node1 x:collection1] o.a.s.c.SyncStrategy Sync Success - now sync replicas to me
   [junit4]   2> 1222827 INFO  (coreZkRegister-4245-thread-1-processing-n:127.0.0.1:54227_x_hpw%2Fzd x:collection1 s:shard1 c:control_collection r:core_node1) [n:127.0.0.1:54227_x_hpw%2Fzd c:control_collection s:shard1 r:core_node1 x:collection1] o.a.s.c.SyncStrategy http://127.0.0.1:54227/x_hpw/zd/collection1/ has no replicas
   [junit4]   2> 1222827 INFO  (coreZkRegister-4245-thread-1-processing-n:127.0.0.1:54227_x_hpw%2Fzd x:collection1 s:shard1 c:control_collection r:core_node1) [n:127.0.0.1:54227_x_hpw%2Fzd c:control_collection s:shard1 r:core_node1 x:collection1] o.a.s.c.ShardLeaderElectionContext I am the new leader: http://127.0.0.1:54227/x_hpw/zd/collection1/ shard1
   [junit4]   2> 1222827 INFO  (coreZkRegister-4245-thread-1-processing-n:127.0.0.1:54227_x_hpw%2Fzd x:collection1 s:shard1 c:control_collection r:core_node1) [n:127.0.0.1:54227_x_hpw%2Fzd c:control_collection s:shard1 r:core_node1 x:collection1] o.a.s.c.c.SolrZkClient makePath: /collections/control_collection/leaders/shard1
   [junit4]   2> 1222828 INFO  (zkCallback-1156-thread-1-processing-n:127.0.0.1:54227_x_hpw%2Fzd) [n:127.0.0.1:54227_x_hpw%2Fzd    ] o.a.s.c.DistributedQueue NodeChildrenChanged fired on path /overseer/queue state SyncConnected
   [junit4]   2> 1222829 INFO  (OverseerStateUpdate-94298322582568964-127.0.0.1:54227_x_hpw%2Fzd-n_0000000000) [n:127.0.0.1:54227_x_hpw%2Fzd    ] o.a.s.c.Overseer processMessage: queueSize: 1, message = {
   [junit4]   2>   "operation":"leader",
   [junit4]   2>   "shard":"shard1",
   [junit4]   2>   "collection":"control_collection",
   [junit4]   2>   "base_url":"http://127.0.0.1:54227/x_hpw/zd",
   [junit4]   2>   "core":"collection1",
   [junit4]   2>   "state":"active"} current state version: 1
   [junit4]   2> 1222930 INFO  (zkCallback-1156-thread-1-processing-n:127.0.0.1:54227_x_hpw%2Fzd) [n:127.0.0.1:54227_x_hpw%2Fzd    ] o.a.s.c.c.ZkStateReader A cluster state change: WatchedEvent state:SyncConnected type:NodeDataChanged path:/clusterstate.json, has occurred - updating... (live nodes size: 1)
   [junit4]   2> 1222930 INFO  (zkCallback-1156-thread-1-processing-n:127.0.0.1:54227_x_hpw%2Fzd) [n:127.0.0.1:54227_x_hpw%2Fzd    ] o.a.s.c.c.ZkStateReader Updated cluster state version to 2
   [junit4]   2> 1222979 INFO  (coreZkRegister-4245-thread-1-processing-n:127.0.0.1:54227_x_hpw%2Fzd x:collection1 s:shard1 c:control_collection r:core_node1) [n:127.0.0.1:54227_x_hpw%2Fzd c:control_collection s:shard1 r:core_node1 x:collection1] o.a.s.c.ZkController We are http://127.0.0.1:54227/x_hpw/zd/collection1/ and leader is http://127.0.0.1:54227/x_hpw/zd/collection1/
   [junit4]   2> 1222979 INFO  (coreZkRegister-4245-thread-1-processing-n:127.0.0.1:54227_x_hpw%2Fzd x:collection1 s:shard1 c:control_collection r:core_node1) [n:127.0.0.1:54227_x_hpw%2Fzd c:control_collection s:shard1 r:core_node1 x:collection1] o.a.s.c.ZkController No LogReplay needed for core=collection1 baseURL=http://127.0.0.1:54227/x_hpw/zd
   [junit4]   2> 1222979 INFO  (coreZkRegister-4245-thread-1-processing-n:127.0.0.1:54227_x_hpw%2Fzd x:collection1 s:shard1 c:control_collection r:core_node1) [n:127.0.0.1:54227_x_hpw%2Fzd c:control_collection s:shard1 r:core_node1 x:collection1] o.a.s.c.ZkController I am the leader, no recovery necessary
   [junit4]   2> 1222979 INFO  (coreZkRegister-4245-thread-1-processing-n:127.0.0.1:54227_x_hpw%2Fzd x:collection1 s:shard1 c:control_collection r:core_node1) [n:127.0.0.1:54227_x_hpw%2Fzd c:control_collection s:shard1 r:core_node1 x:collection1] o.a.s.c.ZkController publishing state=active
   [junit4]   2> 1222979 INFO  (coreZkRegister-4245-thread-1-processing-n:127.0.0.1:54227_x_hpw%2Fzd x:collection1 s:shard1 c:control_collection r:core_node1) [n:127.0.0.1:54227_x_hpw%2Fzd c:control_collection s:shard1 r:core_node1 x:collection1] o.a.s.c.ZkController numShards not found on descriptor - reading it from system property
   [junit4]   2> 1222980 INFO  (zkCallback-1156-thread-1-processing-n:127.0.0.1:54227_x_hpw%2Fzd) [n:127.0.0.1:54227_x_hpw%2Fzd    ] o.a.s.c.DistributedQueue NodeChildrenChanged fired on path /overseer/queue state SyncConnected
   [junit4]   2> 1222980 INFO  (OverseerStateUpdate-94298322582568964-127.0.0.1:54227_x_hpw%2Fzd-n_0000000000) [n:127.0.0.1:54227_x_hpw%2Fzd    ] o.a.s.c.Overseer processMessage: queueSize: 1, message = {
   [junit4]   2>   "core":"collection1",
   [junit4]   2>   "core_node_name":"core_node1",
   [junit4]   2>   "roles":null,
   [junit4]   2>   "base_url":"http://127.0.0.1:54227/x_hpw/zd",
   [junit4]   2>   "node_name":"127.0.0.1:54227_x_hpw%2Fzd",
   [junit4]   2>   "numShards":"1",
   [junit4]   2>   "state":"active",
   [junit4]   2>   "shard":"shard1",
   [junit4]   2>   "collection":"control_collection",
   [junit4]   2>   "operation":"state"} current state version: 2
   [junit4]   2> 1222980 INFO  (OverseerStateUpdate-94298322582568964-127.0.0.1:54227_x_hpw%2Fzd-n_0000000000) [n:127.0.0.1:54227_x_hpw%2Fzd    ] o.a.s.c.o.ReplicaMutator Update state numShards=1 message={
   [junit4]   2>   "core":"collection1",
   [junit4]   2>   "core_node_name":"core_node1",
   [junit4]   2>   "roles":null,
   [junit4]   2>   "base_url":"http://127.0.0.1:54227/x_hpw/zd",
   [junit4]   2>   "node_name":"127.0.0.1:54227_x_hpw%2Fzd",
   [junit4]   2>   "numShards":"1",
   [junit4]   2>   "state":"active",
   [junit4]   2>   "shard":"shard1",
   [junit4]   2>   "collection":"control_collection",
   [junit4]   2>   "operation":"state"}
   [junit4]   2> 1223081 INFO  (zkCallback-1156-thread-1-processing-n:127.0.0.1:54227_x_hpw%2Fzd) [n:127.0.0.1:54227_x_hpw%2Fzd    ] o.a.s.c.c.ZkStateReader A cluster state change: WatchedEvent state:SyncConnected type:NodeDataChanged path:/clusterstate.json, has occurred - updating... (live nodes size: 1)
   [junit4]   2> 1223081 INFO  (zkCallback-1156-thread-1-processing-n:127.0.0.1:54227_x_hpw%2Fzd) [n:127.0.0.1:54227_x_hpw%2Fzd    ] o.a.s.c.c.ZkStateReader Updated cluster state version to 3
   [junit4]   2> 1223194 INFO  (TEST-HttpPartitionTest.test-seed#[3BD52B5944D56E06]) [    ] o.a.s.c.c.SolrZkClient Using default ZkCredentialsProvider
   [junit4]   2> 1223194 INFO  (TEST-HttpPartitionTest.test-seed#[3BD52B5944D56E06]) [    ] o.a.s.c.c.ConnectionManager Waiting for client to connect to ZooKeeper
   [junit4]   2> 1223195 INFO  (zkCallback-1158-thread-1) [    ] o.a.s.c.c.ConnectionManager Watcher org.apache.solr.common.cloud.ConnectionManager@67ed4ec4 name:ZooKeeperConnection Watcher:127.0.0.1:49737/solr got event WatchedEvent state:SyncConnected type:None path:null path:null type:None
   [junit4]   2> 1223195 INFO  (TEST-HttpPartitionTest.test-seed#[3BD52B5944D56E06]) [    ] o.a.s.c.c.ConnectionManager Client is connected to ZooKeeper
   [junit4]   2> 1223195 INFO  (TEST-HttpPartitionTest.test-seed#[3BD52B5944D56E06]) [    ] o.a.s.c.c.SolrZkClient Using default ZkACLProvider
   [junit4]   2> 1223195 INFO  (TEST-HttpPartitionTest.test-seed#[3BD52B5944D56E06]) [    ] o.a.s.c.c.ZkStateReader Updating cluster state from ZooKeeper... 
   [junit4]   2> 1223196 INFO  (TEST-HttpPartitionTest.test-seed#[3BD52B5944D56E06]) [    ] o.a.s.c.ChaosMonkey monkey: init - expire sessions:false cause connection loss:false
   [junit4]   2> 1223238 INFO  (TEST-HttpPartitionTest.test-seed#[3BD52B5944D56E06]) [    ] o.a.s.SolrTestCaseJ4 Writing core.properties file to /home/jenkins/workspace/Lucene-Solr-trunk-Linux/solr/build/solr-core/test/J2/temp/solr.cloud.HttpPartitionTest_3BD52B5944D56E06-001/shard-1-001/cores/collection1
   [junit4]   2> 1223238 INFO  (TEST-HttpPartitionTest.test-seed#[3BD52B5944D56E06]) [    ] o.a.s.c.AbstractFullDistribZkTestBase create jetty 1 in directory /home/jenkins/workspace/Lucene-Solr-trunk-Linux/solr/build/solr-core/test/J2/temp/solr.cloud.HttpPartitionTest_3BD52B5944D56E06-001/shard-1-001
   [junit4]   2> 1223239 INFO  (TEST-HttpPartitionTest.test-seed#[3BD52B5944D56E06]) [    ] o.e.j.s.Server jetty-9.2.11.v20150529
   [junit4]   2> 1223240 INFO  (TEST-HttpPartitionTest.test-seed#[3BD52B5944D56E06]) [    ] o.e.j.s.h.ContextHandler Started o.e.j.s.ServletContextHandler@797a4a32{/x_hpw/zd,null,AVAILABLE}
   [junit4]   2> 1223240 INFO  (TEST-HttpPartitionTest.test-seed#[3BD52B5944D56E06]) [    ] o.e.j.s.ServerConnector Started ServerConnector@7fc736fb{HTTP/1.1}{127.0.0.1:45355}
   [junit4]   2> 1223240 INFO  (TEST-HttpPartitionTest.test-seed#[3BD52B5944D56E06]) [    ] o.e.j.s.Server Started @1224838ms
   [junit4]   2> 1223240 INFO  (TEST-HttpPartitionTest.test-seed#[3BD52B5944D56E06]) [    ] o.a.s.c.s.e.JettySolrRunner Jetty properties: {solr.data.dir=/home/jenkins/workspace/Lucene-Solr-trunk-Linux/solr/build/solr-core/test/J2/temp/solr.cloud.HttpPartitionTest_3BD52B5944D56E06-001/tempDir-001/jetty1, solrconfig=solrconfig.xml, hostContext=/x_hpw/zd, hostPort=34093, coreRootDirectory=/home/jenkins/workspace/Lucene-Solr-trunk-Linux/solr/build/solr-core/test/J2/temp/solr.cloud.HttpPartitionTest_3BD52B5944D56E06-001/shard-1-001/cores}
   [junit4]   2> 1223240 INFO  (TEST-HttpPartitionTest.test-seed#[3BD52B5944D56E06]) [    ] o.a.s.s.SolrDispatchFilter SolrDispatchFilter.init(): sun.misc.Launcher$AppClassLoader@4e0e2f2a
   [junit4]   2> 1223240 INFO  (TEST-HttpPartitionTest.test-seed#[3BD52B5944D56E06]) [    ] o.a.s.c.SolrResourceLoader new SolrResourceLoader for directory: '/home/jenkins/workspace/Lucene-Solr-trunk-Linux/solr/build/solr-core/test/J2/temp/solr.cloud.HttpPartitionTest_3BD52B5944D56E06-001/shard-1-001/'
   [junit4]   2> 1223248 INFO  (TEST-HttpPartitionTest.test-seed#[3BD52B5944D56E06]) [    ] o.a.s.c.c.SolrZkClient Using default ZkCredentialsProvider
   [junit4]   2> 1223248 INFO  (TEST-HttpPartitionTest.test-seed#[3BD52B5944D56E06]) [    ] o.a.s.c.c.ConnectionManager Waiting for client to connect to ZooKeeper
   [junit4]   2> 1223249 INFO  (zkCallback-1159-thread-1) [    ] o.a.s.c.c.ConnectionManager Watcher org.apache.solr.common.cloud.ConnectionManager@7c777d86 name:ZooKeeperConnection Watcher:127.0.0.1:49737/solr got event WatchedEvent state:SyncConnected type:None path:null path:null type:None
   [junit4]   2> 1223249 INFO  (TEST-HttpPartitionTest.test-seed#[3BD52B5944D56E06]) [    ] o.a.s.c.c.ConnectionManager Client is connected to ZooKeeper
   [junit4]   2> 1223249 INFO  (TEST-HttpPartitionTest.test-seed#[3BD52B5944D56E06]) [    ] o.a.s.c.c.SolrZkClient Using default ZkACLProvider
   [junit4]   2> 1223250 INFO  (TEST-HttpPartitionTest.test-seed#[3BD52B5944D56E06]) [    ] o.a.s.s.SolrDispatchFilter Loading solr.xml from SolrHome (not found in ZooKeeper)
   [junit4]   2> 1223250 INFO  (TEST-HttpPartitionTest.test-seed#[3BD52B5944D56E06]) [    ] o.a.s.c.SolrXmlConfig Loading container configuration from /home/jenkins/workspace/Lucene-Solr-trunk-Linux/solr/build/solr-core/test/J2/temp/solr.cloud.HttpPartitionTest_3BD52B5944D56E06-001/shard-1-001/solr.xml
   [junit4]   2> 1223253 INFO  (TEST-HttpPartitionTest.test-seed#[3BD52B5944D56E06]) [    ] o.a.s.c.CoresLocator Config-defined core root directory: /home/jenkins/workspace/Lucene-Solr-trunk-Linux/solr/build/solr-core/test/J2/temp/solr.cloud.HttpPartitionTest_3BD52B5944D56E06-001/shard-1-001/cores
   [junit4]   2> 1223253 INFO  (TEST-HttpPartitionTest.test-seed#[3BD52B5944D56E06]) [    ] o.a.s.c.CoreContainer New CoreContainer 331476895
   [junit4]   2> 1223253 INFO  (TEST-HttpPartitionTest.test-seed#[3BD52B5944D56E06]) [    ] o.a.s.c.CoreContainer Loading cores into CoreContainer [instanceDir=/home/jenkins/workspace/Lucene-Solr-trunk-Linux/solr/build/solr-core/test/J2/temp/solr.cloud.HttpPartitionTest_3BD52B5944D56E06-001/shard-1-001/]
   [junit4]   2> 1223253 INFO  (TEST-HttpPartitionTest.test-seed#[3BD52B5944D56E06]) [    ] o.a.s.c.CoreContainer loading shared library: /home/jenkins/workspace/Lucene-Solr-trunk-Linux/solr/build/solr-core/test/J2/temp/solr.cloud.HttpPartitionTest_3BD52B5944D56E06-001/shard-1-001/lib
   [junit4]   2> 1223253 WARN  (TEST-HttpPartitionTest.test-seed#[3BD52B5944D56E06]) [    ] o.a.s.c.SolrResourceLoader Can't find (or read) directory to add to classloader: lib (resolved as: /home/jenkins/workspace/Lucene-Solr-trunk-Linux/solr/build/solr-core/test/J2/temp/solr.cloud.HttpPartitionTest_3BD52B5944D56E06-001/shard-1-001/lib).
   [junit4]   2> 1223257 INFO  (TEST-HttpPartitionTest.test-seed#[3BD52B5944D56E06]) [    ] o.a.s.h.c.HttpShardHandlerFactory created with socketTimeout : 90000,urlScheme : ,connTimeout : 15000,maxConnectionsPerHost : 20,maxConnections : 10000,corePoolSize : 0,maximumPoolSize : 2147483647,maxThreadIdleTime : 5,sizeOfQueue : -1,fairnessPolicy : false,useRetries : false,
   [junit4]   2> 1223257 INFO  (TEST-HttpPartitionTest.test-seed#[3BD52B5944D56E06]) [    ] o.a.s.u.UpdateShardHandler Creating UpdateShardHandler HTTP client with params: socketTimeout=340000&connTimeout=45000&retry=true
   [junit4]   2> 1223258 INFO  (TEST-HttpPartitionTest.test-seed#[3BD52B5944D56E06]) [    ] o.a.s.l.LogWatcher SLF4J impl is org.slf4j.impl.Log4jLoggerFactory
   [junit4]   2> 1223258 INFO  (TEST-HttpPartitionTest.test-seed#[3BD52B5944D56E06]) [    ] o.a.s.l.LogWatcher Registering Log Listener [Log4j (org.slf4j.impl.Log4jLoggerFactory)]
   [junit4]   2> 1223258 INFO  (TEST-HttpPartitionTest.test-seed#[3BD52B5944D56E06]) [    ] o.a.s.c.ZkContainer Zookeeper client=127.0.0.1:49737/solr
   [junit4]   2> 1223258 INFO  (TEST-HttpPartitionTest.test-seed#[3BD52B5944D56E06]) [    ] o.a.s.c.ZkController zkHost includes chroot
   [junit4]   2> 1223258 INFO  (TEST-HttpPartitionTest.test-seed#[3BD52B5944D56E06]) [    ] o.a.s.c.c.SolrZkClient Using default ZkCredentialsProvider
   [junit4]   2> 1223258 INFO  (TEST-HttpPartitionTest.test-seed#[3BD52B5944D56E06]) [    ] o.a.s.c.c.ConnectionManager Waiting for client to connect to ZooKeeper
   [junit4]   2> 1223259 INFO  (zkCallback-1161-thread-1) [    ] o.a.s.c.c.ConnectionManager Watcher org.apache.solr.common.cloud.ConnectionManager@5dc6eaab name:ZooKeeperConnection Watcher:127.0.0.1:49737 got event WatchedEvent state:SyncConnected type:None path:null path:null type:None
   [junit4]   2> 1223259 INFO  (TEST-HttpPartitionTest.test-seed#[3BD52B5944D56E06]) [    ] o.a.s.c.c.ConnectionManager Client is connected to ZooKeeper
   [junit4]   2> 1223259 INFO  (TEST-HttpPartitionTest.test-seed#[3BD52B5944D56E06]) [    ] o.a.s.c.c.SolrZkClient Using default ZkACLProvider
   [junit4]   2> 1223260 INFO  (TEST-HttpPartitionTest.test-seed#[3BD52B5944D56E06]) [n:127.0.0.1:34093_x_hpw%2Fzd    ] o.a.s.c.c.ConnectionManager Waiting for client to connect to ZooKeeper
   [junit4]   2> 1223260 INFO  (zkCallback-1162-thread-1-processing-n:127.0.0.1:34093_x_hpw%2Fzd) [n:127.0.0.1:34093_x_hpw%2Fzd    ] o.a.s.c.c.ConnectionManager Watcher org.apache.solr.common.cloud.ConnectionManager@70c54cdc name:ZooKeeperConnection Watcher:127.0.0.1:49737/solr got event WatchedEvent state:SyncConnected type:None path:null path:null type:None
   [junit4]   2> 1223261 INFO  (TEST-HttpPartitionTest.test-seed#[3BD52B5944D56E06]) [n:127.0.0.1:34093_x_hpw%2Fzd    ] o.a.s.c.c.ConnectionManager Client is connected to ZooKeeper
   [junit4]   2> 1223262 INFO  (TEST-HttpPartitionTest.test-seed#[3BD52B5944D56E06]) [n:127.0.0.1:34093_x_hpw%2Fzd    ] o.a.s.c.c.ZkStateReader Updating cluster state from ZooKeeper... 
   [junit4]   2> 1224263 INFO  (TEST-HttpPartitionTest.test-seed#[3BD52B5944D56E06]) [n:127.0.0.1:34093_x_hpw%2Fzd    ] o.a.s.c.ZkController Register node as live in ZooKeeper:/live_nodes/127.0.0.1:34093_x_hpw%2Fzd
   [junit4]   2> 1224263 INFO  (TEST-HttpPartitionTest.test-seed#[3BD52B5944D56E06]) [n:127.0.0.1:34093_x_hpw%2Fzd    ] o.a.s.c.c.SolrZkClient makePath: /live_nodes/127.0.0.1:34093_x_hpw%2Fzd
   [junit4]   2> 1224265 INFO  (TEST-HttpPartitionTest.test-seed#[3BD52B5944D56E06]) [n:127.0.0.1:34093_x_hpw%2Fzd    ] o.a.s.c.Overseer Overseer (id=null) closing
   [junit4]   2> 1224265 INFO  (TEST-HttpPartitionTest.test-seed#[3BD52B5944D56E06]) [n:127.0.0.1:34093_x_hpw%2Fzd    ] o.a.s.c.LeaderElector Joined leadership election with path: /overseer_elect/election/94298322582568968-127.0.0.1:34093_x_hpw%2Fzd-n_0000000001
   [junit4]   2> 1224265 INFO  (TEST-HttpPartitionTest.test-seed#[3BD52B5944D56E06]) [n:127.0.0.1:34093_x_hpw%2Fzd    ] o.a.s.c.LeaderElector Watching path /overseer_elect/election/94298322582568964-127.0.0.1:54227_x_hpw%2Fzd-n_0000000000 to know if I could be the leader
   [junit4]   2> 1224271 INFO  (TEST-HttpPartitionTest.test-seed#[3BD52B5944D56E06]) [n:127.0.0.1:34093_x_hpw%2Fzd    ] o.a.s.c.CoreContainer No authentication plugin used.
   [junit4]   2> 1224271 INFO  (TEST-HttpPartitionTest.test-seed#[3BD52B5944D56E06]) [n:127.0.0.1:34093_x_hpw%2Fzd    ] o.a.s.c.CoreContainer Security conf doesn't exist. Skipping setup for authorization module.
   [junit4]   2> 1224271 INFO  (TEST-HttpPartitionTest.test-seed#[3BD52B5944D56E06]) [n:127.0.0.1:34093_x_hpw%2Fzd    ] o.a.s.c.CoresLocator Looking for core definitions underneath /home/jenkins/workspace/Lucene-Solr-trunk-Linux/solr/build/solr-core/test/J2/temp/solr.cloud.HttpPartitionTest_3BD52B5944D56E06-001/shard-1-001/cores
   [junit4]   2> 1224272 INFO  (TEST-HttpPartitionTest.test-seed#[3BD52B5944D56E06]) [n:127.0.0.1:34093_x_hpw%2Fzd    ] o.a.s.c.SolrCore Created CoreDescriptor: {name=collection1, config=solrconfig.xml, transient=false, schema=schema.xml, loadOnStartup=true, configSetProperties=configsetprops.json, instanceDir=/home/jenkins/workspace/Lucene-Solr-trunk-Linux/solr/build/solr-core/test/J2/temp/solr.cloud.HttpPartitionTest_3BD52B5944D56E06-001/shard-1-001/cores/collection1, collection=collection1, absoluteInstDir=/home/jenkins/workspace/Lucene-Solr-trunk-Linux/solr/build/solr-core/test/J2/temp/solr.cloud.HttpPartitionTest_3BD52B5944D56E06-001/shard-1-001/cores/collection1/, coreNodeName=, dataDir=data/, shard=}
   [junit4]   2> 1224272 INFO  (TEST-HttpPartitionTest.test-seed#[3BD52B5944D56E06]) [n:127.0.0.1:34093_x_hpw%2Fzd    ] o.a.s.c.CoresLocator Found core collection1 in /home/jenkins/workspace/Lucene-Solr-trunk-Linux/solr/build/solr-core/test/J2/temp/solr.cloud.HttpPartitionTest_3BD52B5944D56E06-001/shard-1-001/cores/collection1/
   [junit4]   2> 1224272 INFO  (TEST-HttpPartitionTest.test-seed#[3BD52B5944D56E06]) [n:127.0.0.1:34093_x_hpw%2Fzd    ] o.a.s.c.CoresLocator Found 1 core definitions
   [junit4]   2> 1224272 INFO  (coreLoadExecutor-4262-thread-1-processing-n:127.0.0.1:34093_x_hpw%2Fzd) [n:127.0.0.1:34093_x_hpw%2Fzd c:collection1   x:collection1] o.a.s.c.ZkController publishing state=down
   [junit4]   2> 1224273 INFO  (TEST-HttpPartitionTest.test-seed#[3BD52B5944D56E06]) [n:127.0.0.1:34093_x_hpw%2Fzd    ] o.a.s.s.SolrDispatchFilter user.dir=/home/jenkins/workspace/Lucene-Solr-trunk-Linux/solr/build/solr-core/test/J2
   [junit4]   2> 1224273 INFO  (TEST-HttpPartitionTest.test-seed#[3BD52B5944D56E06]) [n:127.0.0.1:34093_x_hpw%2Fzd    ] o.a.s.s.SolrDispatchFilter SolrDispatchFilter.init() done
   [junit4]   2> 1224273 INFO  (coreLoadExecutor-4262-thread-1-processing-n:127.0.0.1:34093_x_hpw%2Fzd) [n:127.0.0.1:34093_x_hpw%2Fzd c:collection1   x:collection1] o.a.s.c.ZkController numShards not found on descriptor - reading it from system property
   [junit4]   2> 1224273 INFO  (coreLoadExecutor-4262-thread-1-processing-n:127.0.0.1:34093_x_hpw%2Fzd) [n:127.0.0.1:34093_x_hpw%2Fzd c:collection1   x:collection1] o.a.s.c.ZkController look for our core node name
   [junit4]   2> 1224273 INFO  (zkCallback-1156-thread-1-processing-n:127.0.0.1:54227_x_hpw%2Fzd) [n:127.0.0.1:54227_x_hpw%2Fzd    ] o.a.s.c.DistributedQueue NodeChildrenChanged fired on path /overseer/queue state SyncConnected
   [junit4]   2> 1224273 INFO  (OverseerStateUpdate-94298322582568964-127.0.0.1:54227_x_hpw%2Fzd-n_0000000000) [n:127.0.0.1:54227_x_hpw%2Fzd    ] o.a.s.c.Overseer processMessage: queueSize: 1, message = {
   [junit4]   2>   "core":"collection1",
   [junit4]   2>   "roles":null,
   [junit4]   2>   "base_url":"http://127.0.0.1:34093/x_hpw/zd",
   [junit4]   2>   "node_name":"127.0.0.1:34093_x_hpw%2Fzd",
   [junit4]   2>   "numShards":"2",
   [junit4]   2>   "state":"down",
   [junit4]   2>   "shard":null,
   [junit4]   2>   "collection":"collection1",
   [junit4]   2>   "operation":"state"} current state version: 3
   [junit4]   2> 1224274 INFO  (OverseerStateUpdate-94298322582568964-127.0.0.1:54227_x_hpw%2Fzd-n_0000000000) [n:127.0.0.1:54227_x_hpw%2Fzd    ] o.a.s.c.o.ReplicaMutator Update state numShards=2 message={
   [junit4]   2>   "core":"collection1",
   [junit4]   2>   "roles":null,
   [junit4]   2>   "base_url":"http://127.0.0.1:34093/x_hpw/zd",
   [junit4]   2>   "node_name":"127.0.0.1:34093_x_hpw%2Fzd",
   [junit4]   2>   "numShards":"2",
   [junit4]   2>   "state":"down",
   [junit4]   2>   "shard":null,
   [junit4]   2>   "collection":"collection1",
   [junit4]   2>   "operation":"state"}
   [junit4]   2> 1224274 INFO  (OverseerStateUpdate-94298322582568964-127.0.0.1:54227_x_hpw%2Fzd-n_0000000000) [n:127.0.0.1:54227_x_hpw%2Fzd    ] o.a.s.c.o.ClusterStateMutator building a new cName: collection1
   [junit4]   2> 1224274 INFO  (OverseerStateUpdate-94298322582568964-127.0.0.1:54227_x_hpw%2Fzd-n_0000000000) [n:127.0.0.1:54227_x_hpw%2Fzd    ] o.a.s.c.o.ReplicaMutator Assigning new node to shard shard=shard2
   [junit4]   2> 1224375 INFO  (zkCallback-1156-thread-1-processing-n:127.0.0.1:54227_x_hpw%2Fzd) [n:127.0.0.1:54227_x_hpw%2Fzd    ] o.a.s.c.c.ZkStateReader A cluster state change: WatchedEvent state:SyncConnected type:NodeDataChanged path:/clusterstate.json, has occurred - updating... (live nodes size: 2)
   [junit4]   2> 1224375 INFO  (zkCallback-1162-thread-1-processing-n:127.0.0.1:34093_x_hpw%2Fzd) [n:127.0.0.1:34093_x_hpw%2Fzd    ] o.a.s.c.c.ZkStateReader A cluster state change: WatchedEvent state:SyncConnected type:NodeDataChanged path:/clusterstate.json, has occurred - updating... (live nodes size: 2)
   [junit4]   2> 1224375 INFO  (zkCallback-1158-thread-1) [    ] o.a.s.c.c.ZkStateReader A cluster state change: WatchedEvent state:SyncConnected type:NodeDataChanged path:/clusterstate.json, has occurred - updating... (live nodes size: 2)
   [junit4]   2> 1224376 INFO  (zkCallback-1156-thread-1-processing-n:127.0.0.1:54227_x_hpw%2Fzd) [n:127.0.0.1:54227_x_hpw%2Fzd    ] o.a.s.c.c.ZkStateReader Updated cluster state version to 4
   [junit4]   2> 1224376 INFO  (zkCallback-1162-thread-1-processing-n:127.0.0.1:34093_x_hpw%2Fzd) [n:127.0.0.1:34093_x_hpw%2Fzd    ] o.a.s.c.c.ZkStateReader Updated cluster state version to 4
   [junit4]   2> 1224376 INFO  (zkCallback-1158-thread-1) [    ] o.a.s.c.c.ZkStateReader Updated cluster state version to 4
   [junit4]   2> 1225273 INFO  (coreLoadExecutor-4262-thread-1-processing-n:127.0.0.1:34093_x_hpw%2Fzd) [n:127.0.0.1:34093_x_hpw%2Fzd c:collection1   x:collection1] o.a.s.c.ZkController waiting to find shard id in clusterstate for collection1
   [junit4]   2> 1225273 INFO  (coreLoadExecutor-4262-thread-1-processing-n:127.0.0.1:34093_x_hpw%2Fzd) [n:127.0.0.1:34093_x_hpw%2Fzd c:collection1   x:collection1] o.a.s.c.ZkController Check for collection zkNode:collection1
   [junit4]   2> 1225274 INFO  (coreLoadExecutor-4262-thread-1-processing-n:127.0.0.1:34093_x_hpw%2Fzd) [n:127.0.0.1:34093_x_hpw%2Fzd c:collection1   x:collection1] o.a.s.c.ZkController Collection zkNode exists
   [junit4]   2> 1225274 INFO  (coreLoadExecutor-4262-thread-1-processing-n:127.0.0.1:34093_x_hpw%2Fzd) [n:127.0.0.1:34093_x_hpw%2Fzd c:collection1   x:collection1] o.a.s.c.c.ZkStateReader Load collection config from:/collections/collection1
   [junit4]   2> 1225274 INFO  (coreLoadExecutor-4262-thread-1-processing-n:127.0.0.1:34093_x_hpw%2Fzd) [n:127.0.0.1:34093_x_hpw%2Fzd c:collection1   x:collection1] o.a.s.c.c.ZkStateReader path=/collections/collection1 configName=conf1 specified config exists in ZooKeeper
   [junit4]   2> 1225274 INFO  (coreLoadExecutor-4262-thread-1-processing-n:127.0.0.1:34093_x_hpw%2Fzd) [n:127.0.0.1:34093_x_hpw%2Fzd c:collection1   x:collection1] o.a.s.c.SolrResourceLoader new SolrResourceLoader for directory: '/home/jenkins/workspace/Lucene-Solr-trunk-Linux/solr/build/solr-core/test/J2/temp/solr.cloud.HttpPartitionTest_3BD52B5944D56E06-001/shard-1-001/cores/collection1/'
   [junit4]   2> 1225280 INFO  (coreLoadExecutor-4262-thread-1-processing-n:127.0.0.1:34093_x_hpw%2Fzd) [n:127.0.0.1:34093_x_hpw%2Fzd c:collection1   x:collection1] o.a.s.c.Config loaded config solrconfig.xml with version 0 
   [junit4]   2> 1225283 INFO  (coreLoadExecutor-4262-thread-1-processing-n:127.0.0.1:34093_x_hpw%2Fzd) [n:127.0.0.1:34093_x_hpw%2Fzd c:collection1   x:collection1] o.a.s.c.SolrConfig current version of requestparams : -1
   [junit4]   2> 1225285 INFO  (coreLoadExecutor-4262-thread-1-processing-n:127.0.0.1:34093_x_hpw%2Fzd) [n:127.0.0.1:34093_x_hpw%2Fzd c:collection1   x:collection1] o.a.s.c.SolrConfig Using Lucene MatchVersion: 6.0.0
   [junit4]   2> 1225303 INFO  (coreLoadExecutor-4262-thread-1-processing-n:127.0.0.1:34093_x_hpw%2Fzd) [n:127.0.0.1:34093_x_hpw%2Fzd c:collection1   x:collection1] o.a.s.c.Config Loaded SolrConfig: solrconfig.xml
   [junit4]   2> 1225304 INFO  (coreLoadExecutor-4262-thread-1-processing-n:127.0.0.1:34093_x_hpw%2Fzd) [n:127.0.0.1:34093_x_hpw%2Fzd c:collection1   x:collection1] o.a.s.s.IndexSchema Reading Solr Schema from /configs/conf1/schema.xml
   [junit4]   2> 1225306 INFO  (coreLoadExecutor-4262-thread-1-processing-n:127.0.0.1:34093_x_hpw%2Fzd) [n:127.0.0.1:34093_x_hpw%2Fzd c:collection1   x:collection1] o.a.s.s.IndexSchema [collection1] Schema name=test
   [junit4]   2> 1225380 INFO  (coreLoadExecutor-4262-thread-1-processing-n:127.0.0.1:34093_x_hpw%2Fzd) [n:127.0.0.1:34093_x_hpw%2Fzd c:collection1   x:collection1] o.a.s.s.OpenExchangeRatesOrgProvider Initialized with rates=open-exchange-rates.json, refreshInterval=1440.
   [junit4]   2> 1225384 INFO  (coreLoadExecutor-4262-thread-1-processing-n:127.0.0.1:34093_x_hpw%2Fzd) [n:127.0.0.1:34093_x_hpw%2Fzd c:collection1   x:collection1] o.a.s.s.IndexSchema default search field in schema is text
   [junit4]   2> 1225384 INFO  (coreLoadExecutor-4262-thread-1-processing-n:127.0.0.1:34093_x_hpw%2Fzd) [n:127.0.0.1:34093_x_hpw%2Fzd c:collection1   x:collection1] o.a.s.s.IndexSchema unique key field: id
   [junit4]   2> 1225388 INFO  (coreLoadExecutor-4262-thread-1-processing-n:127.0.0.1:34093_x_hpw%2Fzd) [n:127.0.0.1:34093_x_hpw%2Fzd c:collection1   x:collection1] o.a.s.s.FileExchangeRateProvider Reloading exchange rates from file currency.xml
   [junit4]   2> 1225388 INFO  (coreLoadExecutor-4262-thread-1-processing-n:127.0.0.1:34093_x_hpw%2Fzd) [n:127.0.0.1:34093_x_hpw%2Fzd c:collection1   x:collection1] o.a.s.s.FileExchangeRateProvider Reloading exchange rates from file currency.xml
   [junit4]   2> 1225389 INFO  (coreLoadExecutor-4262-thread-1-processing-n:127.0.0.1:34093_x_hpw%2Fzd) [n:127.0.0.1:34093_x_hpw%2Fzd c:collection1   x:collection1] o.a.s.s.OpenExchangeRatesOrgProvider Reloading exchange rates from open-exchange-rates.json
   [junit4]   2> 1225390 WARN  (coreLoadExecutor-4262-thread-1-processing-n:127.0.0.1:34093_x_hpw%2Fzd) [n:127.0.0.1:34093_x_hpw%2Fzd c:collection1   x:collection1] o.a.s.s.OpenExchangeRatesOrgProvider Unknown key IMPORTANT NOTE
   [junit4]   2> 1225390 WARN  (coreLoadExecutor-4262-thread-1-processing-n:127.0.0.1:34093_x_hpw%2Fzd) [n:127.0.0.1:34093_x_hpw%2Fzd c:collection1   x:collection1] o.a.s.s.OpenExchangeRatesOrgProvider Expected key, got STRING
   [junit4]   2> 1225390 INFO  (coreLoadExecutor-4262-thread-1-processing-n:127.0.0.1:34093_x_hpw%2Fzd) [n:127.0.0.1:34093_x_hpw%2Fzd c:collection1   x:collection1] o.a.s.s.OpenExchangeRatesOrgProvider Reloading exchange rates from open-exchange-rates.json
   [junit4]   2> 1225390 WARN  (coreLoadExecutor-4262-thread-1-processing-n:127.0.0.1:34093_x_hpw%2Fzd) [n:127.0.0.1:34093_x_hpw%2Fzd c:collection1   x:collection1] o.a.s.s.OpenExchangeRatesOrgProvider Unknown key IMPORTANT NOTE
   [junit4]   2> 1225390 WARN  (coreLoadExecutor-4262-thread-1-processing-n:127.0.0.1:34093_x_hpw%2Fzd) [n:127.0.0.1:34093_x_hpw%2Fzd c:collection1   x:collection1] o.a.s.s.OpenExchangeRatesOrgProvider Expected key, got STRING
   [junit4]   2> 1225391 INFO  (coreLoadExecutor-4262-thread-1-processing-n:127.0.0.1:34093_x_hpw%2Fzd) [n:127.0.0.1:34093_x_hpw%2Fzd c:collection1   x:collection1] o.a.s.c.ConfigSet

[...truncated too long message...]

1",
   [junit4]    >             "base_url":"http://127.0.0.1:53917/x_hpw/zd",
   [junit4]    >             "node_name":"127.0.0.1:53917_x_hpw%2Fzd",
   [junit4]    >             "state":"active",
   [junit4]    >             "leader":"true"}}},
   [junit4]    >       "shard2":{
   [junit4]    >         "range":"0-7fffffff",
   [junit4]    >         "state":"active",
   [junit4]    >         "replicas":{
   [junit4]    >           "core_node1":{
   [junit4]    >             "core":"collection1",
   [junit4]    >             "base_url":"http://127.0.0.1:34093/x_hpw/zd",
   [junit4]    >             "node_name":"127.0.0.1:34093_x_hpw%2Fzd",
   [junit4]    >             "state":"active",
   [junit4]    >             "leader":"true"},
   [junit4]    >           "core_node3":{
   [junit4]    >             "core":"collection1",
   [junit4]    >             "base_url":"http://127.0.0.1:59645/x_hpw/zd",
   [junit4]    >             "node_name":"127.0.0.1:59645_x_hpw%2Fzd",
   [junit4]    >             "state":"active"}}}},
   [junit4]    >     "router":{"name":"compositeId"},
   [junit4]    >     "maxShardsPerNode":"1",
   [junit4]    >     "autoAddReplicas":"false",
   [junit4]    >     "autoCreated":"true"},
   [junit4]    >   "control_collection":{
   [junit4]    >     "replicationFactor":"1",
   [junit4]    >     "shards":{"shard1":{
   [junit4]    >         "range":"80000000-7fffffff",
   [junit4]    >         "state":"active",
   [junit4]    >         "replicas":{"core_node1":{
   [junit4]    >             "core":"collection1",
   [junit4]    >             "base_url":"http://127.0.0.1:54227/x_hpw/zd",
   [junit4]    >             "node_name":"127.0.0.1:54227_x_hpw%2Fzd",
   [junit4]    >             "state":"active",
   [junit4]    >             "leader":"true"}}}},
   [junit4]    >     "router":{"name":"compositeId"},
   [junit4]    >     "maxShardsPerNode":"1",
   [junit4]    >     "autoAddReplicas":"false",
   [junit4]    >     "autoCreated":"true"},
   [junit4]    >   "c8n_1x2":{
   [junit4]    >     "replicationFactor":"2",
   [junit4]    >     "shards":{"shard1":{
   [junit4]    >         "range":"80000000-7fffffff",
   [junit4]    >         "state":"active",
   [junit4]    >         "replicas":{
   [junit4]    >           "core_node1":{
   [junit4]    >             "core":"c8n_1x2_shard1_replica2",
   [junit4]    >             "base_url":"http://127.0.0.1:59645/x_hpw/zd",
   [junit4]    >             "node_name":"127.0.0.1:59645_x_hpw%2Fzd",
   [junit4]    >             "state":"active",
   [junit4]    >             "leader":"true"},
   [junit4]    >           "core_node2":{
   [junit4]    >             "core":"c8n_1x2_shard1_replica1",
   [junit4]    >             "base_url":"http://127.0.0.1:34093/x_hpw/zd",
   [junit4]    >             "node_name":"127.0.0.1:34093_x_hpw%2Fzd",
   [junit4]    >             "state":"recovering"}}}},
   [junit4]    >     "router":{"name":"compositeId"},
   [junit4]    >     "maxShardsPerNode":"1",
   [junit4]    >     "autoAddReplicas":"false"}}
   [junit4]    > 	at __randomizedtesting.SeedInfo.seed([3BD52B5944D56E06:B3811483EA2903FE]:0)
   [junit4]    > 	at org.apache.solr.cloud.AbstractFullDistribZkTestBase.ensureAllReplicasAreActive(AbstractFullDistribZkTestBase.java:1842)
   [junit4]    > 	at org.apache.solr.cloud.HttpPartitionTest.testRf2(HttpPartitionTest.java:248)
   [junit4]    > 	at org.apache.solr.cloud.HttpPartitionTest.test(HttpPartitionTest.java:102)
   [junit4]    > 	at org.apache.solr.BaseDistributedSearchTestCase$ShardsRepeatRule$ShardsFixedStatement.callStatement(BaseDistributedSearchTestCase.java:963)
   [junit4]    > 	at org.apache.solr.BaseDistributedSearchTestCase$ShardsRepeatRule$ShardsStatement.evaluate(BaseDistributedSearchTestCase.java:938)
   [junit4]    > 	at java.lang.Thread.run(Thread.java:745)
   [junit4]   2> 1325071 INFO  (SUITE-HttpPartitionTest-seed#[3BD52B5944D56E06]-worker) [n:127.0.0.1:59645_x_hpw%2Fzd c:c8n_1x2 s:shard1 r:core_node1 x:c8n_1x2_shard1_replica2] o.a.s.SolrTestCaseJ4 ###deleteCore
   [junit4]   2> NOTE: leaving temporary files on disk at: /home/jenkins/workspace/Lucene-Solr-trunk-Linux/solr/build/solr-core/test/J2/temp/solr.cloud.HttpPartitionTest_3BD52B5944D56E06-001
   [junit4]   2> Aug 06, 2015 4:25:16 PM com.carrotsearch.randomizedtesting.ThreadLeakControl checkThreadLeaks
   [junit4]   2> WARNING: Will linger awaiting termination of 1 leaked thread(s).
   [junit4]   2> NOTE: test params are: codec=Asserting(Lucene53): {range_facet_l_dv=BlockTreeOrds(blocksize=128), _version_=TestBloomFilteredLucenePostings(BloomFilteringPostingsFormat(Lucene50(blocksize=128))), multiDefault=PostingsFormat(name=LuceneVarGapFixedInterval), a_t=TestBloomFilteredLucenePostings(BloomFilteringPostingsFormat(Lucene50(blocksize=128))), intDefault=TestBloomFilteredLucenePostings(BloomFilteringPostingsFormat(Lucene50(blocksize=128))), id=BlockTreeOrds(blocksize=128), range_facet_i_dv=TestBloomFilteredLucenePostings(BloomFilteringPostingsFormat(Lucene50(blocksize=128))), text=Lucene50(blocksize=128), range_facet_l=TestBloomFilteredLucenePostings(BloomFilteringPostingsFormat(Lucene50(blocksize=128))), timestamp=TestBloomFilteredLucenePostings(BloomFilteringPostingsFormat(Lucene50(blocksize=128)))}, docValues:{range_facet_l_dv=DocValuesFormat(name=Asserting), range_facet_i_dv=DocValuesFormat(name=SimpleText), timestamp=DocValuesFormat(name=SimpleText)}, sim=DefaultSimilarity, locale=es_HN, timezone=America/Hermosillo
   [junit4]   2> NOTE: Linux 3.16.0-44-generic amd64/Oracle Corporation 1.8.0_60-ea (64-bit)/cpus=12,threads=1,free=321697544,total=518979584
   [junit4]   2> NOTE: All tests run in this JVM: [TriLevelCompositeIdRoutingTest, HLLSerializationTest, TestStressRecovery, PreAnalyzedUpdateProcessorTest, TestDocSet, TestDynamicLoading, QueryParsingTest, TestReRankQParserPlugin, TestBM25SimilarityFactory, TestNRTOpen, TestDistributedStatsComponentCardinality, TestJettySolrRunner, CleanupOldIndexTest, ExitableDirectoryReaderTest, TestSolrQueryParserResource, CoreAdminRequestStatusTest, AddSchemaFieldsUpdateProcessorFactoryTest, PathHierarchyTokenizerFactoryTest, TestQuerySenderNoQuery, SharedFSAutoReplicaFailoverUtilsTest, TestPerFieldSimilarity, CircularListTest, TestCloudSchemaless, NotRequiredUniqueKeyTest, SpatialRPTFieldTypeTest, TestUtils, CursorPagingTest, HdfsLockFactoryTest, AnalysisErrorHandlingTest, TestDistribDocBasedVersion, TestChildDocTransformer, TestFastOutputStream, TestConfigSetProperties, TestSchemaSimilarityResource, AliasIntegrationTest, FullSolrCloudDistribCmdsTest, TestAddFieldRealTimeGet, TestSurroundQueryParser, TestLuceneMatchVersion, JavabinLoaderTest, DataDrivenBlockJoinTest, TestDefaultStatsCache, TestEmbeddedSolrServerConstructors, OverseerCollectionProcessorTest, QueryEqualityTest, TestTrie, SOLR749Test, TestCustomDocTransformer, DOMUtilTest, SearchHandlerTest, RegexBoostProcessorTest, QueryResultKeyTest, TestRecovery, DistributedQueryElevationComponentTest, TestRandomRequestDistribution, BasicDistributedZk2Test, FileBasedSpellCheckerTest, MoreLikeThisHandlerTest, SpellCheckCollatorTest, DirectUpdateHandlerOptimizeTest, ParsingFieldUpdateProcessorsTest, VersionInfoTest, TestPartialUpdateDeduplication, CdcrRequestHandlerTest, HdfsWriteToMultipleCollectionsTest, TestConfigReload, TestBulkSchemaAPI, EnumFieldTest, SimpleFacetsTest, BadCopyFieldTest, CdcrVersionReplicationTest, TestQueryTypes, NumericFieldsTest, ResponseLogComponentTest, TestQueryUtils, DocExpirationUpdateProcessorFactoryTest, TermVectorComponentDistributedTest, CdcrUpdateLogTest, TestBinaryResponseWriter, TestSolrConfigHandler, DirectUpdateHandlerTest, BitVectorTest, AssignTest, TestCrossCoreJoin, ChaosMonkeySafeLeaderTest, UnloadDistributedZkTest, SyncSliceTest, ShardRoutingTest, ClusterStateUpdateTest, TestRandomFaceting, TestZkChroot, ZkCLITest, ShardRoutingCustomTest, TestHashPartitioner, ZkControllerTest, TestJoin, TestSolr4Spatial, StatsComponentTest, TestFiltering, TestCSVLoader, SolrCoreCheckLockOnStartupTest, TestAtomicUpdateErrorCases, DefaultValueUpdateProcessorTest, SortByFunctionTest, SolrInfoMBeanTest, IndexBasedSpellCheckerTest, XmlUpdateRequestHandlerTest, FieldAnalysisRequestHandlerTest, FastVectorHighlighterTest, TestCollationField, TestCSVResponseWriter, BinaryUpdateRequestHandlerTest, TestComponentsName, TestQuerySenderListener, AlternateDirectoryTest, TestSolrIndexConfig, SolrIndexConfigTest, MinimalSchemaTest, OutputWriterTest, TestPostingsSolrHighlighter, TestPhraseSuggestions, SynonymTokenizerTest, TestDFRSimilarityFactory, TestIBSimilarityFactory, OpenExchangeRatesOrgProviderTest, ChaosMonkeyNothingIsSafeTest, ConnectionManagerTest, CustomCollectionTest, DistribJoinFromCollectionTest, HttpPartitionTest]
   [junit4] Completed [418/534] on J2 in 103.90s, 1 test, 1 failure <<< FAILURES!

[...truncated 378 lines...]
BUILD FAILED
/home/jenkins/workspace/Lucene-Solr-trunk-Linux/build.xml:716: The following error occurred while executing this line:
/home/jenkins/workspace/Lucene-Solr-trunk-Linux/build.xml:660: The following error occurred while executing this line:
/home/jenkins/workspace/Lucene-Solr-trunk-Linux/build.xml:59: The following error occurred while executing this line:
/home/jenkins/workspace/Lucene-Solr-trunk-Linux/solr/build.xml:230: The following error occurred while executing this line:
/home/jenkins/workspace/Lucene-Solr-trunk-Linux/solr/common-build.xml:514: The following error occurred while executing this line:
/home/jenkins/workspace/Lucene-Solr-trunk-Linux/lucene/common-build.xml:1429: The following error occurred while executing this line:
/home/jenkins/workspace/Lucene-Solr-trunk-Linux/lucene/common-build.xml:984: There were test failures: 534 suites, 2111 tests, 1 failure, 67 ignored (31 assumptions)

Total time: 44 minutes 48 seconds
Build step 'Invoke Ant' marked build as failure
Archiving artifacts
Recording test results
Email was triggered for: Failure - Any
Sending email for trigger: Failure - Any



Mime
View raw message