lucene-dev mailing list archives

Site index · List index
Message view « Date » · « Thread »
Top « Date » · « Thread »
From Apache Jenkins Server <jenk...@builds.apache.org>
Subject [JENKINS] Lucene-Solr-NightlyTests-5.x - Build # 934 - Still Failing
Date Sat, 22 Aug 2015 10:52:34 GMT
Build: https://builds.apache.org/job/Lucene-Solr-NightlyTests-5.x/934/

2 tests failed.
FAILED:  org.apache.lucene.codecs.lucene46.TestLucene46FieldInfoFormat.testRandomExceptions

Error Message:
hit unexpected FileNotFoundException: file=_5k.si

Stack Trace:
java.lang.AssertionError: hit unexpected FileNotFoundException: file=_5k.si
	at __randomizedtesting.SeedInfo.seed([DE5D0B60FB3DAD54:B67265A46533F4F4]:0)
	at org.apache.lucene.index.IndexFileDeleter.deleteFile(IndexFileDeleter.java:753)
	at org.apache.lucene.index.IndexFileDeleter.deletePendingFiles(IndexFileDeleter.java:530)
	at org.apache.lucene.index.IndexFileDeleter.refresh(IndexFileDeleter.java:456)
	at org.apache.lucene.index.IndexWriter.merge(IndexWriter.java:3680)
	at org.apache.lucene.index.SerialMergeScheduler.merge(SerialMergeScheduler.java:40)
	at org.apache.lucene.index.IndexWriter.maybeMerge(IndexWriter.java:1929)
	at org.apache.lucene.index.IndexWriter.doAfterSegmentFlushed(IndexWriter.java:4731)
	at org.apache.lucene.index.DocumentsWriter$MergePendingEvent.process(DocumentsWriter.java:695)
	at org.apache.lucene.index.IndexWriter.processEvents(IndexWriter.java:4757)
	at org.apache.lucene.index.IndexWriter.processEvents(IndexWriter.java:4748)
	at org.apache.lucene.index.IndexWriter.updateDocument(IndexWriter.java:1476)
	at org.apache.lucene.index.IndexWriter.addDocument(IndexWriter.java:1254)
	at org.apache.lucene.index.BaseIndexFileFormatTestCase.testRandomExceptions(BaseIndexFileFormatTestCase.java:429)
	at org.apache.lucene.index.BaseFieldInfoFormatTestCase.testRandomExceptions(BaseFieldInfoFormatTestCase.java:50)
	at sun.reflect.NativeMethodAccessorImpl.invoke0(Native Method)
	at sun.reflect.NativeMethodAccessorImpl.invoke(NativeMethodAccessorImpl.java:57)
	at sun.reflect.DelegatingMethodAccessorImpl.invoke(DelegatingMethodAccessorImpl.java:43)
	at java.lang.reflect.Method.invoke(Method.java:606)
	at com.carrotsearch.randomizedtesting.RandomizedRunner.invoke(RandomizedRunner.java:1627)
	at com.carrotsearch.randomizedtesting.RandomizedRunner$6.evaluate(RandomizedRunner.java:836)
	at com.carrotsearch.randomizedtesting.RandomizedRunner$7.evaluate(RandomizedRunner.java:872)
	at com.carrotsearch.randomizedtesting.RandomizedRunner$8.evaluate(RandomizedRunner.java:886)
	at org.apache.lucene.util.TestRuleSetupTeardownChained$1.evaluate(TestRuleSetupTeardownChained.java:50)
	at org.apache.lucene.util.AbstractBeforeAfterRule$1.evaluate(AbstractBeforeAfterRule.java:46)
	at org.apache.lucene.util.TestRuleThreadAndTestName$1.evaluate(TestRuleThreadAndTestName.java:49)
	at org.apache.lucene.util.TestRuleIgnoreAfterMaxFailures$1.evaluate(TestRuleIgnoreAfterMaxFailures.java:65)
	at org.apache.lucene.util.TestRuleMarkFailure$1.evaluate(TestRuleMarkFailure.java:48)
	at com.carrotsearch.randomizedtesting.rules.StatementAdapter.evaluate(StatementAdapter.java:36)
	at com.carrotsearch.randomizedtesting.ThreadLeakControl$StatementRunner.run(ThreadLeakControl.java:365)
	at com.carrotsearch.randomizedtesting.ThreadLeakControl.forkTimeoutingTask(ThreadLeakControl.java:798)
	at com.carrotsearch.randomizedtesting.ThreadLeakControl$3.evaluate(ThreadLeakControl.java:458)
	at com.carrotsearch.randomizedtesting.RandomizedRunner.runSingleTest(RandomizedRunner.java:845)
	at com.carrotsearch.randomizedtesting.RandomizedRunner$3.evaluate(RandomizedRunner.java:747)
	at com.carrotsearch.randomizedtesting.RandomizedRunner$4.evaluate(RandomizedRunner.java:781)
	at com.carrotsearch.randomizedtesting.RandomizedRunner$5.evaluate(RandomizedRunner.java:792)
	at org.apache.lucene.util.AbstractBeforeAfterRule$1.evaluate(AbstractBeforeAfterRule.java:46)
	at com.carrotsearch.randomizedtesting.rules.StatementAdapter.evaluate(StatementAdapter.java:36)
	at org.apache.lucene.util.TestRuleStoreClassName$1.evaluate(TestRuleStoreClassName.java:42)
	at com.carrotsearch.randomizedtesting.rules.NoShadowingOrOverridesOnMethodsRule$1.evaluate(NoShadowingOrOverridesOnMethodsRule.java:39)
	at com.carrotsearch.randomizedtesting.rules.NoShadowingOrOverridesOnMethodsRule$1.evaluate(NoShadowingOrOverridesOnMethodsRule.java:39)
	at com.carrotsearch.randomizedtesting.rules.StatementAdapter.evaluate(StatementAdapter.java:36)
	at com.carrotsearch.randomizedtesting.rules.StatementAdapter.evaluate(StatementAdapter.java:36)
	at com.carrotsearch.randomizedtesting.rules.StatementAdapter.evaluate(StatementAdapter.java:36)
	at org.apache.lucene.util.TestRuleAssertionsRequired$1.evaluate(TestRuleAssertionsRequired.java:54)
	at org.apache.lucene.util.TestRuleMarkFailure$1.evaluate(TestRuleMarkFailure.java:48)
	at org.apache.lucene.util.TestRuleIgnoreAfterMaxFailures$1.evaluate(TestRuleIgnoreAfterMaxFailures.java:65)
	at org.apache.lucene.util.TestRuleIgnoreTestSuites$1.evaluate(TestRuleIgnoreTestSuites.java:55)
	at com.carrotsearch.randomizedtesting.rules.StatementAdapter.evaluate(StatementAdapter.java:36)
	at com.carrotsearch.randomizedtesting.ThreadLeakControl$StatementRunner.run(ThreadLeakControl.java:365)
	at java.lang.Thread.run(Thread.java:745)


FAILED:  org.apache.lucene.codecs.lucene46.TestLucene46SegmentInfoFormat.testRandomExceptions

Error Message:
hit unexpected FileNotFoundException: file=_5k.si

Stack Trace:
java.lang.AssertionError: hit unexpected FileNotFoundException: file=_5k.si
	at __randomizedtesting.SeedInfo.seed([DE5D0B60FB3DAD54:B67265A46533F4F4]:0)
	at org.apache.lucene.index.IndexFileDeleter.deleteFile(IndexFileDeleter.java:753)
	at org.apache.lucene.index.IndexFileDeleter.deletePendingFiles(IndexFileDeleter.java:530)
	at org.apache.lucene.index.IndexFileDeleter.refresh(IndexFileDeleter.java:456)
	at org.apache.lucene.index.IndexWriter.merge(IndexWriter.java:3680)
	at org.apache.lucene.index.SerialMergeScheduler.merge(SerialMergeScheduler.java:40)
	at org.apache.lucene.index.IndexWriter.maybeMerge(IndexWriter.java:1929)
	at org.apache.lucene.index.IndexWriter.doAfterSegmentFlushed(IndexWriter.java:4731)
	at org.apache.lucene.index.DocumentsWriter$MergePendingEvent.process(DocumentsWriter.java:695)
	at org.apache.lucene.index.IndexWriter.processEvents(IndexWriter.java:4757)
	at org.apache.lucene.index.IndexWriter.processEvents(IndexWriter.java:4748)
	at org.apache.lucene.index.IndexWriter.updateDocument(IndexWriter.java:1476)
	at org.apache.lucene.index.IndexWriter.addDocument(IndexWriter.java:1254)
	at org.apache.lucene.index.BaseIndexFileFormatTestCase.testRandomExceptions(BaseIndexFileFormatTestCase.java:429)
	at org.apache.lucene.index.BaseSegmentInfoFormatTestCase.testRandomExceptions(BaseSegmentInfoFormatTestCase.java:48)
	at sun.reflect.NativeMethodAccessorImpl.invoke0(Native Method)
	at sun.reflect.NativeMethodAccessorImpl.invoke(NativeMethodAccessorImpl.java:57)
	at sun.reflect.DelegatingMethodAccessorImpl.invoke(DelegatingMethodAccessorImpl.java:43)
	at java.lang.reflect.Method.invoke(Method.java:606)
	at com.carrotsearch.randomizedtesting.RandomizedRunner.invoke(RandomizedRunner.java:1627)
	at com.carrotsearch.randomizedtesting.RandomizedRunner$6.evaluate(RandomizedRunner.java:836)
	at com.carrotsearch.randomizedtesting.RandomizedRunner$7.evaluate(RandomizedRunner.java:872)
	at com.carrotsearch.randomizedtesting.RandomizedRunner$8.evaluate(RandomizedRunner.java:886)
	at org.apache.lucene.util.TestRuleSetupTeardownChained$1.evaluate(TestRuleSetupTeardownChained.java:50)
	at org.apache.lucene.util.AbstractBeforeAfterRule$1.evaluate(AbstractBeforeAfterRule.java:46)
	at org.apache.lucene.util.TestRuleThreadAndTestName$1.evaluate(TestRuleThreadAndTestName.java:49)
	at org.apache.lucene.util.TestRuleIgnoreAfterMaxFailures$1.evaluate(TestRuleIgnoreAfterMaxFailures.java:65)
	at org.apache.lucene.util.TestRuleMarkFailure$1.evaluate(TestRuleMarkFailure.java:48)
	at com.carrotsearch.randomizedtesting.rules.StatementAdapter.evaluate(StatementAdapter.java:36)
	at com.carrotsearch.randomizedtesting.ThreadLeakControl$StatementRunner.run(ThreadLeakControl.java:365)
	at com.carrotsearch.randomizedtesting.ThreadLeakControl.forkTimeoutingTask(ThreadLeakControl.java:798)
	at com.carrotsearch.randomizedtesting.ThreadLeakControl$3.evaluate(ThreadLeakControl.java:458)
	at com.carrotsearch.randomizedtesting.RandomizedRunner.runSingleTest(RandomizedRunner.java:845)
	at com.carrotsearch.randomizedtesting.RandomizedRunner$3.evaluate(RandomizedRunner.java:747)
	at com.carrotsearch.randomizedtesting.RandomizedRunner$4.evaluate(RandomizedRunner.java:781)
	at com.carrotsearch.randomizedtesting.RandomizedRunner$5.evaluate(RandomizedRunner.java:792)
	at org.apache.lucene.util.AbstractBeforeAfterRule$1.evaluate(AbstractBeforeAfterRule.java:46)
	at com.carrotsearch.randomizedtesting.rules.StatementAdapter.evaluate(StatementAdapter.java:36)
	at org.apache.lucene.util.TestRuleStoreClassName$1.evaluate(TestRuleStoreClassName.java:42)
	at com.carrotsearch.randomizedtesting.rules.NoShadowingOrOverridesOnMethodsRule$1.evaluate(NoShadowingOrOverridesOnMethodsRule.java:39)
	at com.carrotsearch.randomizedtesting.rules.NoShadowingOrOverridesOnMethodsRule$1.evaluate(NoShadowingOrOverridesOnMethodsRule.java:39)
	at com.carrotsearch.randomizedtesting.rules.StatementAdapter.evaluate(StatementAdapter.java:36)
	at com.carrotsearch.randomizedtesting.rules.StatementAdapter.evaluate(StatementAdapter.java:36)
	at com.carrotsearch.randomizedtesting.rules.StatementAdapter.evaluate(StatementAdapter.java:36)
	at org.apache.lucene.util.TestRuleAssertionsRequired$1.evaluate(TestRuleAssertionsRequired.java:54)
	at org.apache.lucene.util.TestRuleMarkFailure$1.evaluate(TestRuleMarkFailure.java:48)
	at org.apache.lucene.util.TestRuleIgnoreAfterMaxFailures$1.evaluate(TestRuleIgnoreAfterMaxFailures.java:65)
	at org.apache.lucene.util.TestRuleIgnoreTestSuites$1.evaluate(TestRuleIgnoreTestSuites.java:55)
	at com.carrotsearch.randomizedtesting.rules.StatementAdapter.evaluate(StatementAdapter.java:36)
	at com.carrotsearch.randomizedtesting.ThreadLeakControl$StatementRunner.run(ThreadLeakControl.java:365)
	at java.lang.Thread.run(Thread.java:745)




Build Log:
[...truncated 4569 lines...]
   [junit4] Suite: org.apache.lucene.codecs.lucene46.TestLucene46SegmentInfoFormat
   [junit4]   1> Unexpected exception: dumping fake-exception-log:...
   [junit4]   1> 
   [junit4]   1> TEST: got expected fake exc:a random IOException (_7_Lucene41_0.tim)
   [junit4]   1> java.io.IOException: a random IOException (_7_Lucene41_0.tim)
   [junit4]   1> 	at org.apache.lucene.store.MockDirectoryWrapper.maybeThrowIOExceptionOnOpen(MockDirectoryWrapper.java:456)
   [junit4]   1> 	at org.apache.lucene.store.MockDirectoryWrapper.createOutput(MockDirectoryWrapper.java:548)
   [junit4]   1> 	at org.apache.lucene.store.LockValidatingDirectoryWrapper.createOutput(LockValidatingDirectoryWrapper.java:44)
   [junit4]   1> 	at org.apache.lucene.store.TrackingDirectoryWrapper.createOutput(TrackingDirectoryWrapper.java:43)
   [junit4]   1> 	at org.apache.lucene.codecs.blocktree.Lucene40BlockTreeTermsWriter.<init>(Lucene40BlockTreeTermsWriter.java:279)
   [junit4]   1> 	at org.apache.lucene.codecs.lucene41.Lucene41RWPostingsFormat.fieldsConsumer(Lucene41RWPostingsFormat.java:44)
   [junit4]   1> 	at org.apache.lucene.codecs.perfield.PerFieldPostingsFormat$FieldsWriter.write(PerFieldPostingsFormat.java:196)
   [junit4]   1> 	at org.apache.lucene.index.FreqProxTermsWriter.flush(FreqProxTermsWriter.java:107)
   [junit4]   1> 	at org.apache.lucene.index.DefaultIndexingChain.flush(DefaultIndexingChain.java:112)
   [junit4]   1> 	at org.apache.lucene.index.DocumentsWriterPerThread.flush(DocumentsWriterPerThread.java:422)
   [junit4]   1> 	at org.apache.lucene.index.DocumentsWriter.doFlush(DocumentsWriter.java:503)
   [junit4]   1> 	at org.apache.lucene.index.DocumentsWriter.flushAllThreads(DocumentsWriter.java:615)
   [junit4]   1> 	at org.apache.lucene.index.IndexWriter.getReader(IndexWriter.java:423)
   [junit4]   1> 	at org.apache.lucene.index.DirectoryReader.open(DirectoryReader.java:86)
   [junit4]   1> 	at org.apache.lucene.index.BaseIndexFileFormatTestCase.testRandomExceptions(BaseIndexFileFormatTestCase.java:459)
   [junit4]   1> 	at org.apache.lucene.index.BaseSegmentInfoFormatTestCase.testRandomExceptions(BaseSegmentInfoFormatTestCase.java:48)
   [junit4]   1> 	at sun.reflect.NativeMethodAccessorImpl.invoke0(Native Method)
   [junit4]   1> 	at sun.reflect.NativeMethodAccessorImpl.invoke(NativeMethodAccessorImpl.java:57)
   [junit4]   1> 	at sun.reflect.DelegatingMethodAccessorImpl.invoke(DelegatingMethodAccessorImpl.java:43)
   [junit4]   1> 	at java.lang.reflect.Method.invoke(Method.java:606)
   [junit4]   1> 	at com.carrotsearch.randomizedtesting.RandomizedRunner.invoke(RandomizedRunner.java:1627)
   [junit4]   1> 	at com.carrotsearch.randomizedtesting.RandomizedRunner$6.evaluate(RandomizedRunner.java:836)
   [junit4]   1> 	at com.carrotsearch.randomizedtesting.RandomizedRunner$7.evaluate(RandomizedRunner.java:872)
   [junit4]   1> 	at com.carrotsearch.randomizedtesting.RandomizedRunner$8.evaluate(RandomizedRunner.java:886)
   [junit4]   1> 	at org.apache.lucene.util.TestRuleSetupTeardownChained$1.evaluate(TestRuleSetupTeardownChained.java:50)
   [junit4]   1> 	at org.apache.lucene.util.AbstractBeforeAfterRule$1.evaluate(AbstractBeforeAfterRule.java:46)
   [junit4]   1> 	at org.apache.lucene.util.TestRuleThreadAndTestName$1.evaluate(TestRuleThreadAndTestName.java:49)
   [junit4]   1> 	at org.apache.lucene.util.TestRuleIgnoreAfterMaxFailures$1.evaluate(TestRuleIgnoreAfterMaxFailures.java:65)
   [junit4]   1> 	at org.apache.lucene.util.TestRuleMarkFailure$1.evaluate(TestRuleMarkFailure.java:48)
   [junit4]   1> 	at com.carrotsearch.randomizedtesting.rules.StatementAdapter.evaluate(StatementAdapter.java:36)
   [junit4]   1> 	at com.carrotsearch.randomizedtesting.ThreadLeakControl$StatementRunner.run(ThreadLeakControl.java:365)
   [junit4]   1> 	at com.carrotsearch.randomizedtesting.ThreadLeakControl.forkTimeoutingTask(ThreadLeakControl.java:798)
   [junit4]   1> 	at com.carrotsearch.randomizedtesting.ThreadLeakControl$3.evaluate(ThreadLeakControl.java:458)
   [junit4]   1> 	at com.carrotsearch.randomizedtesting.RandomizedRunner.runSingleTest(RandomizedRunner.java:845)
   [junit4]   1> 	at com.carrotsearch.randomizedtesting.RandomizedRunner$3.evaluate(RandomizedRunner.java:747)
   [junit4]   1> 	at com.carrotsearch.randomizedtesting.RandomizedRunner$4.evaluate(RandomizedRunner.java:781)
   [junit4]   1> 	at com.carrotsearch.randomizedtesting.RandomizedRunner$5.evaluate(RandomizedRunner.java:792)
   [junit4]   1> 	at org.apache.lucene.util.AbstractBeforeAfterRule$1.evaluate(AbstractBeforeAfterRule.java:46)
   [junit4]   1> 	at com.carrotsearch.randomizedtesting.rules.StatementAdapter.evaluate(StatementAdapter.java:36)
   [junit4]   1> 	at org.apache.lucene.util.TestRuleStoreClassName$1.evaluate(TestRuleStoreClassName.java:42)
   [junit4]   1> 	at com.carrotsearch.randomizedtesting.rules.NoShadowingOrOverridesOnMethodsRule$1.evaluate(NoShadowingOrOverridesOnMethodsRule.java:39)
   [junit4]   1> 	at com.carrotsearch.randomizedtesting.rules.NoShadowingOrOverridesOnMethodsRule$1.evaluate(NoShadowingOrOverridesOnMethodsRule.java:39)
   [junit4]   1> 	at com.carrotsearch.randomizedtesting.rules.StatementAdapter.evaluate(StatementAdapter.java:36)
   [junit4]   1> 	at com.carrotsearch.randomizedtesting.rules.StatementAdapter.evaluate(StatementAdapter.java:36)
   [junit4]   1> 	at com.carrotsearch.randomizedtesting.rules.StatementAdapter.evaluate(StatementAdapter.java:36)
   [junit4]   1> 	at org.apache.lucene.util.TestRuleAssertionsRequired$1.evaluate(TestRuleAssertionsRequired.java:54)
   [junit4]   1> 	at org.apache.lucene.util.TestRuleMarkFailure$1.evaluate(TestRuleMarkFailure.java:48)
   [junit4]   1> 	at org.apache.lucene.util.TestRuleIgnoreAfterMaxFailures$1.evaluate(TestRuleIgnoreAfterMaxFailures.java:65)
   [junit4]   1> 	at org.apache.lucene.util.TestRuleIgnoreTestSuites$1.evaluate(TestRuleIgnoreTestSuites.java:55)
   [junit4]   1> 	at com.carrotsearch.randomizedtesting.rules.StatementAdapter.evaluate(StatementAdapter.java:36)
   [junit4]   1> 	at com.carrotsearch.randomizedtesting.ThreadLeakControl$StatementRunner.run(ThreadLeakControl.java:365)
   [junit4]   1> 	at java.lang.Thread.run(Thread.java:745)
   [junit4]   1> 
   [junit4]   1> TEST: got expected fake exc:a random IOException (_a.fdx)
   [junit4]   1> java.nio.file.NoSuchFileException: a random IOException (_a.fdx)
   [junit4]   1> 	at org.apache.lucene.store.MockDirectoryWrapper.maybeThrowIOExceptionOnOpen(MockDirectoryWrapper.java:458)
   [junit4]   1> 	at org.apache.lucene.store.MockDirectoryWrapper.openInput(MockDirectoryWrapper.java:635)
   [junit4]   1> 	at org.apache.lucene.store.Directory.openChecksumInput(Directory.java:109)
   [junit4]   1> 	at org.apache.lucene.store.MockDirectoryWrapper.openChecksumInput(MockDirectoryWrapper.java:1009)
   [junit4]   1> 	at org.apache.lucene.codecs.lucene41.Lucene41StoredFieldsReader.<init>(Lucene41StoredFieldsReader.java:131)
   [junit4]   1> 	at org.apache.lucene.codecs.lucene41.Lucene41StoredFieldsFormat.fieldsReader(Lucene41StoredFieldsFormat.java:44)
   [junit4]   1> 	at org.apache.lucene.index.SegmentCoreReaders.<init>(SegmentCoreReaders.java:117)
   [junit4]   1> 	at org.apache.lucene.index.SegmentReader.<init>(SegmentReader.java:65)
   [junit4]   1> 	at org.apache.lucene.index.ReadersAndUpdates.getReader(ReadersAndUpdates.java:145)
   [junit4]   1> 	at org.apache.lucene.index.ReadersAndUpdates.getReadOnlyClone(ReadersAndUpdates.java:197)
   [junit4]   1> 	at org.apache.lucene.index.StandardDirectoryReader.open(StandardDirectoryReader.java:99)
   [junit4]   1> 	at org.apache.lucene.index.IndexWriter.getReader(IndexWriter.java:434)
   [junit4]   1> 	at org.apache.lucene.index.DirectoryReader.open(DirectoryReader.java:86)
   [junit4]   1> 	at org.apache.lucene.index.BaseIndexFileFormatTestCase.testRandomExceptions(BaseIndexFileFormatTestCase.java:459)
   [junit4]   1> 	at org.apache.lucene.index.BaseSegmentInfoFormatTestCase.testRandomExceptions(BaseSegmentInfoFormatTestCase.java:48)
   [junit4]   1> 	at sun.reflect.NativeMethodAccessorImpl.invoke0(Native Method)
   [junit4]   1> 	at sun.reflect.NativeMethodAccessorImpl.invoke(NativeMethodAccessorImpl.java:57)
   [junit4]   1> 	at sun.reflect.DelegatingMethodAccessorImpl.invoke(DelegatingMethodAccessorImpl.java:43)
   [junit4]   1> 	at java.lang.reflect.Method.invoke(Method.java:606)
   [junit4]   1> 	at com.carrotsearch.randomizedtesting.RandomizedRunner.invoke(RandomizedRunner.java:1627)
   [junit4]   1> 	at com.carrotsearch.randomizedtesting.RandomizedRunner$6.evaluate(RandomizedRunner.java:836)
   [junit4]   1> 	at com.carrotsearch.randomizedtesting.RandomizedRunner$7.evaluate(RandomizedRunner.java:872)
   [junit4]   1> 	at com.carrotsearch.randomizedtesting.RandomizedRunner$8.evaluate(RandomizedRunner.java:886)
   [junit4]   1> 	at org.apache.lucene.util.TestRuleSetupTeardownChained$1.evaluate(TestRuleSetupTeardownChained.java:50)
   [junit4]   1> 	at org.apache.lucene.util.AbstractBeforeAfterRule$1.evaluate(AbstractBeforeAfterRule.java:46)
   [junit4]   1> 	at org.apache.lucene.util.TestRuleThreadAndTestName$1.evaluate(TestRuleThreadAndTestName.java:49)
   [junit4]   1> 	at org.apache.lucene.util.TestRuleIgnoreAfterMaxFailures$1.evaluate(TestRuleIgnoreAfterMaxFailures.java:65)
   [junit4]   1> 	at org.apache.lucene.util.TestRuleMarkFailure$1.evaluate(TestRuleMarkFailure.java:48)
   [junit4]   1> 	at com.carrotsearch.randomizedtesting.rules.StatementAdapter.evaluate(StatementAdapter.java:36)
   [junit4]   1> 	at com.carrotsearch.randomizedtesting.ThreadLeakControl$StatementRunner.run(ThreadLeakControl.java:365)
   [junit4]   1> 	at com.carrotsearch.randomizedtesting.ThreadLeakControl.forkTimeoutingTask(ThreadLeakControl.java:798)
   [junit4]   1> 	at com.carrotsearch.randomizedtesting.ThreadLeakControl$3.evaluate(ThreadLeakControl.java:458)
   [junit4]   1> 	at com.carrotsearch.randomizedtesting.RandomizedRunner.runSingleTest(RandomizedRunner.java:845)
   [junit4]   1> 	at com.carrotsearch.randomizedtesting.RandomizedRunner$3.evaluate(RandomizedRunner.java:747)
   [junit4]   1> 	at com.carrotsearch.randomizedtesting.RandomizedRunner$4.evaluate(RandomizedRunner.java:781)
   [junit4]   1> 	at com.carrotsearch.randomizedtesting.RandomizedRunner$5.evaluate(RandomizedRunner.java:792)
   [junit4]   1> 	at org.apache.lucene.util.AbstractBeforeAfterRule$1.evaluate(AbstractBeforeAfterRule.java:46)
   [junit4]   1> 	at com.carrotsearch.randomizedtesting.rules.StatementAdapter.evaluate(StatementAdapter.java:36)
   [junit4]   1> 	at org.apache.lucene.util.TestRuleStoreClassName$1.evaluate(TestRuleStoreClassName.java:42)
   [junit4]   1> 	at com.carrotsearch.randomizedtesting.rules.NoShadowingOrOverridesOnMethodsRule$1.evaluate(NoShadowingOrOverridesOnMethodsRule.java:39)
   [junit4]   1> 	at com.carrotsearch.randomizedtesting.rules.NoShadowingOrOverridesOnMethodsRule$1.evaluate(NoShadowingOrOverridesOnMethodsRule.java:39)
   [junit4]   1> 	at com.carrotsearch.randomizedtesting.rules.StatementAdapter.evaluate(StatementAdapter.java:36)
   [junit4]   1> 	at com.carrotsearch.randomizedtesting.rules.StatementAdapter.evaluate(StatementAdapter.java:36)
   [junit4]   1> 	at com.carrotsearch.randomizedtesting.rules.StatementAdapter.evaluate(StatementAdapter.java:36)
   [junit4]   1> 	at org.apache.lucene.util.TestRuleAssertionsRequired$1.evaluate(TestRuleAssertionsRequired.java:54)
   [junit4]   1> 	at org.apache.lucene.util.TestRuleMarkFailure$1.evaluate(TestRuleMarkFailure.java:48)
   [junit4]   1> 	at org.apache.lucene.util.TestRuleIgnoreAfterMaxFailures$1.evaluate(TestRuleIgnoreAfterMaxFailures.java:65)
   [junit4]   1> 	at org.apache.lucene.util.TestRuleIgnoreTestSuites$1.evaluate(TestRuleIgnoreTestSuites.java:55)
   [junit4]   1> 	at com.carrotsearch.randomizedtesting.rules.StatementAdapter.evaluate(StatementAdapter.java:36)
   [junit4]   1> 	at com.carrotsearch.randomizedtesting.ThreadLeakControl$StatementRunner.run(ThreadLeakControl.java:365)
   [junit4]   1> 	at java.lang.Thread.run(Thread.java:745)
   [junit4]   1> 
   [junit4]   1> TEST: got expected fake exc:a random IOException (_f_1.del)
   [junit4]   1> java.io.IOException: a random IOException (_f_1.del)
   [junit4]   1> 	at org.apache.lucene.store.MockDirectoryWrapper.maybeThrowIOExceptionOnOpen(MockDirectoryWrapper.java:456)
   [junit4]   1> 	at org.apache.lucene.store.MockDirectoryWrapper.openInput(MockDirectoryWrapper.java:635)
   [junit4]   1> 	at org.apache.lucene.store.Directory.openChecksumInput(Directory.java:109)
   [junit4]   1> 	at org.apache.lucene.store.MockDirectoryWrapper.openChecksumInput(MockDirectoryWrapper.java:1009)
   [junit4]   1> 	at org.apache.lucene.codecs.lucene40.BitVector.<init>(BitVector.java:273)
   [junit4]   1> 	at org.apache.lucene.codecs.lucene40.Lucene40LiveDocsFormat.readLiveDocs(Lucene40LiveDocsFormat.java:62)
   [junit4]   1> 	at org.apache.lucene.index.SegmentReader.<init>(SegmentReader.java:73)
   [junit4]   1> 	at org.apache.lucene.index.ReadersAndUpdates.getReader(ReadersAndUpdates.java:145)
   [junit4]   1> 	at org.apache.lucene.index.ReadersAndUpdates.getReadOnlyClone(ReadersAndUpdates.java:197)
   [junit4]   1> 	at org.apache.lucene.index.StandardDirectoryReader.open(StandardDirectoryReader.java:99)
   [junit4]   1> 	at org.apache.lucene.index.IndexWriter.getReader(IndexWriter.java:434)
   [junit4]   1> 	at org.apache.lucene.index.DirectoryReader.open(DirectoryReader.java:86)
   [junit4]   1> 	at org.apache.lucene.index.BaseIndexFileFormatTestCase.testRandomExceptions(BaseIndexFileFormatTestCase.java:459)
   [junit4]   1> 	at org.apache.lucene.index.BaseSegmentInfoFormatTestCase.testRandomExceptions(BaseSegmentInfoFormatTestCase.java:48)
   [junit4]   1> 	at sun.reflect.NativeMethodAccessorImpl.invoke0(Native Method)
   [junit4]   1> 	at sun.reflect.NativeMethodAccessorImpl.invoke(NativeMethodAccessorImpl.java:57)
   [junit4]   1> 	at sun.reflect.DelegatingMethodAccessorImpl.invoke(DelegatingMethodAccessorImpl.java:43)
   [junit4]   1> 	at java.lang.reflect.Method.invoke(Method.java:606)
   [junit4]   1> 	at com.carrotsearch.randomizedtesting.RandomizedRunner.invoke(RandomizedRunner.java:1627)
   [junit4]   1> 	at com.carrotsearch.randomizedtesting.RandomizedRunner$6.evaluate(RandomizedRunner.java:836)
   [junit4]   1> 	at com.carrotsearch.randomizedtesting.RandomizedRunner$7.evaluate(RandomizedRunner.java:872)
   [junit4]   1> 	at com.carrotsearch.randomizedtesting.RandomizedRunner$8.evaluate(RandomizedRunner.java:886)
   [junit4]   1> 	at org.apache.lucene.util.TestRuleSetupTeardownChained$1.evaluate(TestRuleSetupTeardownChained.java:50)
   [junit4]   1> 	at org.apache.lucene.util.AbstractBeforeAfterRule$1.evaluate(AbstractBeforeAfterRule.java:46)
   [junit4]   1> 	at org.apache.lucene.util.TestRuleThreadAndTestName$1.evaluate(TestRuleThreadAndTestName.java:49)
   [junit4]   1> 	at org.apache.lucene.util.TestRuleIgnoreAfterMaxFailures$1.evaluate(TestRuleIgnoreAfterMaxFailures.java:65)
   [junit4]   1> 	at org.apache.lucene.util.TestRuleMarkFailure$1.evaluate(TestRuleMarkFailure.java:48)
   [junit4]   1> 	at com.carrotsearch.randomizedtesting.rules.StatementAdapter.evaluate(StatementAdapter.java:36)
   [junit4]   1> 	at com.carrotsearch.randomizedtesting.ThreadLeakControl$StatementRunner.run(ThreadLeakControl.java:365)
   [junit4]   1> 	at com.carrotsearch.randomizedtesting.ThreadLeakControl.forkTimeoutingTask(ThreadLeakControl.java:798)
   [junit4]   1> 	at com.carrotsearch.randomizedtesting.ThreadLeakControl$3.evaluate(ThreadLeakControl.java:458)
   [junit4]   1> 	at com.carrotsearch.randomizedtesting.RandomizedRunner.runSingleTest(RandomizedRunner.java:845)
   [junit4]   1> 	at com.carrotsearch.randomizedtesting.RandomizedRunner$3.evaluate(RandomizedRunner.java:747)
   [junit4]   1> 	at com.carrotsearch.randomizedtesting.RandomizedRunner$4.evaluate(RandomizedRunner.java:781)
   [junit4]   1> 	at com.carrotsearch.randomizedtesting.RandomizedRunner$5.evaluate(RandomizedRunner.java:792)
   [junit4]   1> 	at org.apache.lucene.util.AbstractBeforeAfterRule$1.evaluate(AbstractBeforeAfterRule.java:46)
   [junit4]   1> 	at com.carrotsearch.randomizedtesting.rules.StatementAdapter.evaluate(StatementAdapter.java:36)
   [junit4]   1> 	at org.apache.lucene.util.TestRuleStoreClassName$1.evaluate(TestRuleStoreClassName.java:42)
   [junit4]   1> 	at com.carrotsearch.randomizedtesting.rules.NoShadowingOrOverridesOnMethodsRule$1.evaluate(NoShadowingOrOverridesOnMethodsRule.java:39)
   [junit4]   1> 	at com.carrotsearch.randomizedtesting.rules.NoShadowingOrOverridesOnMethodsRule$1.evaluate(NoShadowingOrOverridesOnMethodsRule.java:39)
   [junit4]   1> 	at com.carrotsearch.randomizedtesting.rules.StatementAdapter.evaluate(StatementAdapter.java:36)
   [junit4]   1> 	at com.carrotsearch.randomizedtesting.rules.StatementAdapter.evaluate(StatementAdapter.java:36)
   [junit4]   1> 	at com.carrotsearch.randomizedtesting.rules.StatementAdapter.evaluate(StatementAdapter.java:36)
   [junit4]   1> 	at org.apache.lucene.util.TestRuleAssertionsRequired$1.evaluate(TestRuleAssertionsRequired.java:54)
   [junit4]   1> 	at org.apache.lucene.util.TestRuleMarkFailure$1.evaluate(TestRuleMarkFailure.java:48)
   [junit4]   1> 	at org.apache.lucene.util.TestRuleIgnoreAfterMaxFailures$1.evaluate(TestRuleIgnoreAfterMaxFailures.java:65)
   [junit4]   1> 	at org.apache.lucene.util.TestRuleIgnoreTestSuites$1.evaluate(TestRuleIgnoreTestSuites.java:55)
   [junit4]   1> 	at com.carrotsearch.randomizedtesting.rules.StatementAdapter.evaluate(StatementAdapter.java:36)
   [junit4]   1> 	at com.carrotsearch.randomizedtesting.ThreadLeakControl$StatementRunner.run(ThreadLeakControl.java:365)
   [junit4]   1> 	at java.lang.Thread.run(Thread.java:745)
   [junit4]   1> 
   [junit4]   1> TEST: got expected fake exc:a random IOException (_k_Lucene41_0.tip)
   [junit4]   1> java.io.IOException: a random IOException (_k_Lucene41_0.tip)
   [junit4]   1> 	at org.apache.lucene.store.MockDirectoryWrapper.maybeThrowIOExceptionOnOpen(MockDirectoryWrapper.java:456)
   [junit4]   1> 	at org.apache.lucene.store.MockDirectoryWrapper.openInput(MockDirectoryWrapper.java:635)
   [junit4]   1> 	at org.apache.lucene.codecs.blocktree.Lucene40BlockTreeTermsReader.<init>(Lucene40BlockTreeTermsReader.java:145)
   [junit4]   1> 	at org.apache.lucene.codecs.lucene41.Lucene41PostingsFormat.fieldsProducer(Lucene41PostingsFormat.java:104)
   [junit4]   1> 	at org.apache.lucene.codecs.perfield.PerFieldPostingsFormat$FieldsReader.<init>(PerFieldPostingsFormat.java:261)
   [junit4]   1> 	at org.apache.lucene.codecs.perfield.PerFieldPostingsFormat.fieldsProducer(PerFieldPostingsFormat.java:341)
   [junit4]   1> 	at org.apache.lucene.index.SegmentCoreReaders.<init>(SegmentCoreReaders.java:104)
   [junit4]   1> 	at org.apache.lucene.index.SegmentReader.<init>(SegmentReader.java:65)
   [junit4]   1> 	at org.apache.lucene.index.ReadersAndUpdates.getReader(ReadersAndUpdates.java:145)
   [junit4]   1> 	at org.apache.lucene.index.ReadersAndUpdates.getReadOnlyClone(ReadersAndUpdates.java:197)
   [junit4]   1> 	at org.apache.lucene.index.StandardDirectoryReader.open(StandardDirectoryReader.java:99)
   [junit4]   1> 	at org.apache.lucene.index.IndexWriter.getReader(IndexWriter.java:434)
   [junit4]   1> 	at org.apache.lucene.index.DirectoryReader.open(DirectoryReader.java:86)
   [junit4]   1> 	at org.apache.lucene.index.BaseIndexFileFormatTestCase.testRandomExceptions(BaseIndexFileFormatTestCase.java:459)
   [junit4]   1> 	at org.apache.lucene.index.BaseSegmentInfoFormatTestCase.testRandomExceptions(BaseSegmentInfoFormatTestCase.java:48)
   [junit4]   1> 	at sun.reflect.NativeMethodAccessorImpl.invoke0(Native Method)
   [junit4]   1> 	at sun.reflect.NativeMethodAccessorImpl.invoke(NativeMethodAccessorImpl.java:57)
   [junit4]   1> 	at sun.reflect.DelegatingMethodAccessorImpl.invoke(DelegatingMethodAccessorImpl.java:43)
   [junit4]   1> 	at java.lang.reflect.Method.invoke(Method.java:606)
   [junit4]   1> 	at com.carrotsearch.randomizedtesting.RandomizedRunner.invoke(RandomizedRunner.java:1627)
   [junit4]   1> 	at com.carrotsearch.randomizedtesting.RandomizedRunner$6.evaluate(RandomizedRunner.java:836)
   [junit4]   1> 	at com.carrotsearch.randomizedtesting.RandomizedRunner$7.evaluate(RandomizedRunner.java:872)
   [junit4]   1> 	at com.carrotsearch.randomizedtesting.RandomizedRunner$8.evaluate(RandomizedRunner.java:886)
   [junit4]   1> 	at org.apache.lucene.util.TestRuleSetupTeardownChained$1.evaluate(TestRuleSetupTeardownChained.java:50)
   [junit4]   1> 	at org.apache.lucene.util.AbstractBeforeAfterRule$1.evaluate(AbstractBeforeAfterRule.java:46)
   [junit4]   1> 	at org.apache.lucene.util.TestRuleThreadAndTestName$1.evaluate(TestRuleThreadAndTestName.java:49)
   [junit4]   1> 	at org.apache.lucene.util.TestRuleIgnoreAfterMaxFailures$1.evaluate(TestRuleIgnoreAfterMaxFailures.java:65)
   [junit4]   1> 	at org.apache.lucene.util.TestRuleMarkFailure$1.evaluate(TestRuleMarkFailure.java:48)
   [junit4]   1> 	at com.carrotsearch.randomizedtesting.rules.StatementAdapter.evaluate(StatementAdapter.java:36)
   [junit4]   1> 	at com.carrotsearch.randomizedtesting.ThreadLeakControl$StatementRunner.run(ThreadLeakControl.java:365)
   [junit4]   1> 	at com.carrotsearch.randomizedtesting.ThreadLeakControl.forkTimeoutingTask(ThreadLeakControl.java:798)
   [junit4]   1> 	at com.carrotsearch.randomizedtesting.ThreadLeakControl$3.evaluate(ThreadLeakControl.java:458)
   [junit4]   1> 	at com.carrotsearch.randomizedtesting.RandomizedRunner.runSingleTest(RandomizedRunner.java:845)
   [junit4]   1> 	at com.carrotsearch.randomizedtesting.RandomizedRunner$3.evaluate(RandomizedRunner.java:747)
   [junit4]   1> 	at com.carrotsearch.randomizedtesting.RandomizedRunner$4.evaluate(RandomizedRunner.java:781)
   [junit4]   1> 	at com.carrotsearch.randomizedtesting.RandomizedRunner$5.evaluate(RandomizedRunner.java:792)
   [junit4]   1> 	at org.apache.lucene.util.AbstractBeforeAfterRule$1.evaluate(AbstractBeforeAfterRule.java:46)
   [junit4]   1> 	at com.carrotsearch.randomizedtesting.rules.StatementAdapter.evaluate(StatementAdapter.java:36)
   [junit4]   1> 	at org.apache.lucene.util.TestRuleStoreClassName$1.evaluate(TestRuleStoreClassName.java:42)
   [junit4]   1> 	at com.carrotsearch.randomizedtesting.rules.NoShadowingOrOverridesOnMethodsRule$1.evaluate(NoShadowingOrOverridesOnMethodsRule.java:39)
   [junit4]   1> 	at com.carrotsearch.randomizedtesting.rules.NoShadowingOrOverridesOnMethodsRule$1.evaluate(NoShadowingOrOverridesOnMethodsRule.java:39)
   [junit4]   1> 	at com.carrotsearch.randomizedtesting.rules.StatementAdapter.evaluate(StatementAdapter.java:36)
   [junit4]   1> 	at com.carrotsearch.randomizedtesting.rules.StatementAdapter.evaluate(StatementAdapter.java:36)
   [junit4]   1> 	at com.carrotsearch.randomizedtesting.rules.StatementAdapter.evaluate(StatementAdapter.java:36)
   [junit4]   1> 	at org.apache.lucene.util.TestRuleAssertionsRequired$1.evaluate(TestRuleAssertionsRequired.java:54)
   [junit4]   1> 	at org.apache.lucene.util.TestRuleMarkFailure$1.evaluate(TestRuleMarkFailure.java:48)
   [junit4]   1> 	at org.apache.lucene.util.TestRuleIgnoreAfterMaxFailures$1.evaluate(TestRuleIgnoreAfterMaxFailures.java:65)
   [junit4]   1> 	at org.apache.lucene.util.TestRuleIgnoreTestSuites$1.evaluate(TestRuleIgnoreTestSuites.java:55)
   [junit4]   1> 	at com.carrotsearch.randomizedtesting.rules.StatementAdapter.evaluate(StatementAdapter.java:36)
   [junit4]   1> 	at com.carrotsearch.randomizedtesting.ThreadLeakControl$StatementRunner.run(ThreadLeakControl.java:365)
   [junit4]   1> 	at java.lang.Thread.run(Thread.java:745)
   [junit4]   1> 
   [junit4]   1> TEST: got expected fake exc:a random IOException (_l.fdx)
   [junit4]   1> java.io.IOException: a random IOException (_l.fdx)
   [junit4]   1> 	at org.apache.lucene.store.MockDirectoryWrapper.maybeThrowIOExceptionOnOpen(MockDirectoryWrapper.java:456)
   [junit4]   1> 	at org.apache.lucene.store.MockDirectoryWrapper.createOutput(MockDirectoryWrapper.java:548)
   [junit4]   1> 	at org.apache.lucene.store.LockValidatingDirectoryWrapper.createOutput(LockValidatingDirectoryWrapper.java:44)
   [junit4]   1> 	at org.apache.lucene.store.TrackingDirectoryWrapper.createOutput(TrackingDirectoryWrapper.java:43)
   [junit4]   1> 	at org.apache.lucene.codecs.lucene41.Lucene41StoredFieldsWriter.<init>(Lucene41StoredFieldsWriter.java:96)
   [junit4]   1> 	at org.apache.lucene.codecs.lucene41.Lucene41RWStoredFieldsFormat.fieldsWriter(Lucene41RWStoredFieldsFormat.java:35)
   [junit4]   1> 	at org.apache.lucene.index.DefaultIndexingChain.initStoredFieldsWriter(DefaultIndexingChain.java:81)
   [junit4]   1> 	at org.apache.lucene.index.DefaultIndexingChain.startStoredFields(DefaultIndexingChain.java:258)
   [junit4]   1> 	at org.apache.lucene.index.DefaultIndexingChain.processDocument(DefaultIndexingChain.java:295)
   [junit4]   1> 	at org.apache.lucene.index.DocumentsWriterPerThread.updateDocument(DocumentsWriterPerThread.java:234)
   [junit4]   1> 	at org.apache.lucene.index.DocumentsWriter.updateDocument(DocumentsWriter.java:450)
   [junit4]   1> 	at org.apache.lucene.index.IndexWriter.updateDocument(IndexWriter.java:1475)
   [junit4]   1> 	at org.apache.lucene.index.IndexWriter.addDocument(IndexWriter.java:1254)
   [junit4]   1> 	at org.apache.lucene.index.BaseIndexFileFormatTestCase.testRandomExceptions(BaseIndexFileFormatTestCase.java:429)
   [junit4]   1> 	at org.apache.lucene.index.BaseSegmentInfoFormatTestCase.testRandomExceptions(BaseSegmentInfoFormatTestCase.java:48)
   [junit4]   1> 	at sun.reflect.NativeMethodAccessorImpl.invoke0(Native Method)
   [junit4]   1> 	at sun.reflect.NativeMethodAccessorImpl.invoke(NativeMethodAccessorImpl.java:57)
   [junit4]   1> 	at sun.reflect.DelegatingMethodAccessorImpl.invoke(DelegatingMethodAccessorImpl.java:43)
   [junit4]   1> 	at java.lang.reflect.Method.invoke(Method.java:606)
   [junit4]   1> 	at com.carrotsearch.randomizedtesting.RandomizedRunner.invoke(RandomizedRunner.java:1627)
   [junit4]   1> 	at com.carrotsearch.randomizedtesting.RandomizedRunner$6.evaluate(RandomizedRunner.java:836)
   [junit4]   1> 	at com.carrotsearch.randomizedtesting.RandomizedRunner$7.evaluate(RandomizedRunner.java:872)
   [junit4]   1> 	at com.carrotsearch.randomizedtesting.RandomizedRunner$8.evaluate(RandomizedRunner.java:886)
   [junit4]   1> 	at org.apache.lucene.util.TestRuleSetupTeardownChained$1.evaluate(TestRuleSetupTeardownChained.java:50)
   [junit4]   1> 	at org.apache.lucene.util.AbstractBeforeAfterRule$1.evaluate(AbstractBeforeAfterRule.java:46)
   [junit4]   1> 	at org.apache.lucene.util.TestRuleThreadAndTestName$1.evaluate(TestRuleThreadAndTestName.java:49)
   [junit4]   1> 	at org.apache.lucene.util.TestRuleIgnoreAfterMaxFailures$1.evaluate(TestRuleIgnoreAfterMaxFailures.java:65)
   [junit4]   1> 	at org.apache.lucene.util.TestRuleMarkFailure$1.evaluate(TestRuleMarkFailure.java:48)
   [junit4]   1> 	at com.carrotsearch.randomizedtesting.rules.StatementAdapter.evaluate(StatementAdapter.java:36)
   [junit4]   1> 	at com.carrotsearch.randomizedtesting.ThreadLeakControl$StatementRunner.run(ThreadLeakControl.java:365)
   [junit4]   1> 	at com.carrotsearch.randomizedtesting.ThreadLeakControl.forkTimeoutingTask(ThreadLeakControl.java:798)
   [junit4]   1> 	at com.carrotsearch.randomizedtesting.ThreadLeakControl$3.evaluate(ThreadLeakControl.java:458)
   [junit4]   1> 	at com.carrotsearch.randomizedtesting.RandomizedRunner.runSingleTest(RandomizedRunner.java:845)
   [junit4]   1> 	at com.carrotsearch.randomizedtesting.RandomizedRunner$3.evaluate(RandomizedRunner.java:747)
   [junit4]   1> 	at com.carrotsearch.randomizedtesting.RandomizedRunner$4.evaluate(RandomizedRunner.java:781)
   [junit4]   1> 	at com.carrotsearch.randomizedtesting.RandomizedRunner$5.evaluate(RandomizedRunner.java:792)
   [junit4]   1> 	at org.apache.lucene.util.AbstractBeforeAfterRule$1.evaluate(AbstractBeforeAfterRule.java:46)
   [junit4]   1> 	at com.carrotsearch.randomizedtesting.rules.StatementAdapter.evaluate(StatementAdapter.java:36)
   [junit4]   1> 	at org.apache.lucene.util.TestRuleStoreClassName$1.evaluate(TestRuleStoreClassName.java:42)
   [junit4]   1> 	at com.carrotsearch.randomizedtesting.rules.NoShadowingOrOverridesOnMethodsRule$1.evaluate(NoShadowingOrOverridesOnMethodsRule.java:39)
   [junit4]   1> 	at com.carrotsearch.randomizedtesting.rules.NoShadowingOrOverridesOnMethodsRule$1.evaluate(NoShadowingOrOverridesOnMethodsRule.java:39)
   [junit4]   1> 	at com.carrotsearch.randomizedtesting.rules.StatementAdapter.evaluate(StatementAdapter.java:36)
   [junit4]   1> 	at com.carrotsearch.randomizedtesting.rules.StatementAdapter.evaluate(StatementAdapter.java:36)
   [junit4]   1> 	at com.carrotsearch.randomizedtesting.rules.StatementAdapter.evaluate(StatementAdapter.java:36)
   [junit4]   1> 	at org.apache.lucene.util.TestRuleAssertionsRequired$1.evaluate(TestRuleAssertionsRequired.java:54)
   [junit4]   1> 	at org.apache.lucene.util.TestRuleMarkFailure$1.evaluate(TestRuleMarkFailure.java:48)
   [junit4]   1> 	at org.apache.lucene.util.TestRuleIgnoreAfterMaxFailures$1.evaluate(TestRuleIgnoreAfterMaxFailures.java:65)
   [junit4]   1> 	at org.apache.lucene.util.TestRuleIgnoreTestSuites$1.evaluate(TestRuleIgnoreTestSuites.java:55)
   [junit4]   1> 	at com.carrotsearch.randomizedtesting.rules.StatementAdapter.evaluate(StatementAdapter.java:36)
   [junit4]   1> 	at com.carrotsearch.randomizedtesting.ThreadLeakControl$StatementRunner.run(ThreadLeakControl.java:365)
   [junit4]   1> 	at java.lang.Thread.run(Thread.java:745)
   [junit4]   1> 
   [junit4]   1> TEST: got expected fake exc:a random IOException (_l.cfs)
   [junit4]   1> java.io.FileNotFoundException: a random IOException (_l.cfs)
   [junit4]   1> 	at org.apache.lucene.store.MockDirectoryWrapper.maybeThrowIOExceptionOnOpen(MockDirectoryWrapper.java:458)
   [junit4]   1> 	at org.apache.lucene.store.MockDirectoryWrapper.createOutput(MockDirectoryWrapper.java:548)
   [junit4]   1> 	at org.apache.lucene.store.LockValidatingDirectoryWrapper.createOutput(LockValidatingDirectoryWrapper.java:44)
   [junit4]   1> 	at org.apache.lucene.store.TrackingDirectoryWrapper.createOutput(TrackingDirectoryWrapper.java:43)
   [junit4]   1> 	at org.apache.lucene.store.TrackingDirectoryWrapper.createOutput(TrackingDirectoryWrapper.java:43)
   [junit4]   1> 	at org.apache.lucene.codecs.lucene40.Lucene40CompoundWriter.getOutput(Lucene40CompoundWriter.java:107)
   [junit4]   1> 	at org.apache.lucene.codecs.lucene40.Lucene40CompoundWriter.createOutput(Lucene40CompoundWriter.java:244)
   [junit4]   1> 	at org.apache.lucene.codecs.lucene40.Lucene40CompoundReader.createOutput(Lucene40CompoundReader.java:229)
   [junit4]   1> 	at org.apache.lucene.store.Directory.copyFrom(Directory.java:151)
   [junit4]   1> 	at org.apache.lucene.codecs.lucene40.Lucene40CompoundFormat.write(Lucene40CompoundFormat.java:51)
   [junit4]   1> 	at org.apache.lucene.index.IndexWriter.createCompoundFile(IndexWriter.java:4680)
   [junit4]   1> 	at org.apache.lucene.index.DocumentsWriterPerThread.sealFlushedSegment(DocumentsWriterPerThread.java:492)
   [junit4]   1> 	at org.apache.lucene.index.DocumentsWriterPerThread.flush(DocumentsWriterPerThread.java:459)
   [junit4]   1> 	at org.apache.lucene.index.DocumentsWriter.doFlush(DocumentsWriter.java:503)
   [junit4]   1> 	at org.apache.lucene.index.DocumentsWriter.flushAllThreads(DocumentsWriter.java:615)
   [junit4]   1> 	at org.apache.lucene.index.IndexWriter.getReader(IndexWriter.java:423)
   [junit4]   1> 	at org.apache.lucene.index.DirectoryReader.open(DirectoryReader.java:86)
   [junit4]   1> 	at org.apache.lucene.index.BaseIndexFileFormatTestCase.testRandomExceptions(BaseIndexFileFormatTestCase.java:459)
   [junit4]   1> 	at org.apache.lucene.index.BaseSegmentInfoFormatTestCase.testRandomExceptions(BaseSegmentInfoFormatTestCase.java:48)
   [junit4]   1> 	at sun.reflect.NativeMethodAccessorImpl.invoke0(Native Method)
   [junit4]   1> 	at sun.reflect.NativeMethodAccessorImpl.invoke(NativeMethodAccessorImpl.java:57)
   [junit4]   1> 	at sun.reflect.DelegatingMethodAccessorImpl.invoke(DelegatingMethodAccessorImpl.java:43)
   [junit4]   1> 	at java.lang.reflect.Method.invoke(Method.java:606)
   [junit4]   1> 	at com.carrotsearch.randomizedtesting.RandomizedRunner.invoke(RandomizedRunner.java:1627)
   [junit4]   1> 	at com.carrotsearch.randomizedtesting.RandomizedRunner$6.evaluate(RandomizedRunner.java:836)
   [junit4]   1> 	at com.carrotsearch.randomizedtesting.RandomizedRunner$7.evaluate(RandomizedRunner.java:872)
   [junit4]   1> 	at com.carrotsearch.randomizedtesting.RandomizedRunner$8.evaluate(RandomizedRunner.java:886)
   [junit4]   1> 	at org.apache.lucene.util.TestRuleSetupTeardownChained$1.evaluate(TestRuleSetupTeardownChained.java:50)
   [junit4]   1> 	at org.apache.lucene.util.AbstractBeforeAfterRule$1.evaluate(AbstractBeforeAfterRule.java:46)
   [junit4]   1> 	at org.apache.lucene.util.TestRuleThreadAndTestName$1.evaluate(TestRuleThreadAndTestName.java:49)
   [junit4]   1> 	at org.apache.lucene.util.TestRuleIgnoreAfterMaxFailures$1.evaluate(TestRuleIgnoreAfterMaxFailures.java:65)
   [junit4]   1> 	at org.apache.lucene.util.TestRuleMarkFailure$1.evaluate(TestRuleMarkFailure.java:48)
   [junit4]   1> 	at com.carrotsearch.randomizedtesting.rules.StatementAdapter.evaluate(StatementAdapter.java:36)
   [junit4]   1> 	at com.carrotsearch.randomizedtesting.ThreadLeakControl$StatementRunner.run(ThreadLeakControl.java:365)
   [junit4]   1> 	at com.carrotsearch.randomizedtesting.ThreadLeakControl.forkTimeoutingTask(ThreadLeakControl.java:798)
   [junit4]   1> 	at com.carrotsearch.randomizedtesting.ThreadLeakControl$3.evaluate(ThreadLeakControl.java:458)
   [junit4]   1> 	at com.carrotsearch.randomizedtesting.RandomizedRunner.runSingleTest(RandomizedRunner.java:845)
   [junit4]   1> 	at com.carrotsearch.randomizedtesting.RandomizedRunner$3.evaluate(RandomizedRunner.java:747)
   [junit4]   1> 	at com.carrotsearch.randomizedtesting.RandomizedRunner$4.evaluate(RandomizedRunner.java:781)
   [junit4]   1> 	at com.carrotsearch.randomizedtesting.RandomizedRunner$5.evaluate(RandomizedRunner.java:792)
   [junit4]   1> 	at org.apache.lucene.util.AbstractBeforeAfterRule$1.evaluate(AbstractBeforeAfterRule.java:46)
   [junit4]   1> 	at com.carrotsearch.randomizedtesting.rules.StatementAdapter.evaluate(StatementAdapter.java:36)
   [junit4]   1> 	at org.apache.lucene.util.TestRuleStoreClassName$1.evaluate(TestRuleStoreClassName.java:42)
   [junit4]   1> 	at com.carrotsearch.randomizedtesting.rules.NoShadowingOrOverridesOnMethodsRule$1.evaluate(NoShadowingOrOverridesOnMethodsRule.java:39)
   [junit4]   1> 	at com.carrotsearch.randomizedtesting.rules.NoShadowingOrOverridesOnMethodsRule$1.evaluate(NoShadowingOrOverridesOnMethodsRule.java:39)
   [junit4]   1> 	at com.carrotsearch.randomizedtesting.rules.StatementAdapter.evaluate(StatementAdapter.java:36)
   [junit4]   1> 	at com.carrotsearch.randomizedtesting.rules.StatementAdapter.evaluate(StatementAdapter.java:36)
   [junit4]   1> 	at com.carrotsearch.randomizedtesting.rules.StatementAdapter.evaluate(StatementAdapter.java:36)
   [junit4]   1> 	at org.apache.lucene.util.TestRuleAssertionsRequired$1.evaluate(TestRuleAssertionsRequired.java:54)
   [junit4]   1> 	at org.apache.lucene.util.TestRuleMarkFailure$1.evaluate(TestRuleMarkFailure.java:48)
   [junit4]   1> 	at org.apache.lucene.util.TestRuleIgnoreAfterMaxFailures$1.evaluate(TestRuleIgnoreAfterMaxFailures.java:65)
   [junit4]   1> 	at org.apache.lucene.util.TestRuleIgnoreTestSuites$1.evaluate(TestRuleIgnoreTestSuites.java:55)
   [junit4]   1> 	at com.carrotsearch.randomizedtesting.rules.StatementAdapter.evaluate(StatementAdapter.java:36)
   [junit4]   1> 	at com.carrotsearch.randomizedtesting.ThreadLeakControl$StatementRunner.run(ThreadLeakControl.java:365)
   [junit4]   1> 	at java.lang.Thread.run(Thread.java:745)
   [junit4]   1> 
   [junit4]   1> TEST: got expected fake exc:a random IOException (_m.cfs)
   [junit4]   1> java.io.FileNotFoundException: a random IOException (_m.cfs)
   [junit4]   1> 	at org.apache.lucene.store.MockDirectoryWrapper.maybeThrowIOExceptionOnOpen(MockDirectoryWrapper.java:458)
   [junit4]   1> 	at org.apache.lucene.store.MockDirectoryWrapper.openInput(MockDirectoryWrapper.java:635)
   [junit4]   1> 	at org.apache.lucene.codecs.lucene40.Lucene40CompoundReader.<init>(Lucene40CompoundReader.java:76)
   [junit4]   1> 	at org.apache.lucene.codecs.lucene40.Lucene40CompoundFormat.getCompoundReader(Lucene40CompoundFormat.java:43)
   [junit4]   1> 	at org.apache.lucene.index.SegmentCoreReaders.<init>(SegmentCoreReaders.java:93)
   [junit4]   1> 	at org.apache.lucene.index.SegmentReader.<init>(SegmentReader.java:65)
   [junit4]   1> 	at org.apache.lucene.index.ReadersAndUpdates.getReader(ReadersAndUpdates.java:145)
   [junit4]   1> 	at org.apache.lucene.index.ReadersAndUpdates.getReadOnlyClone(ReadersAndUpdates.java:197)
   [junit4]   1> 	at org.apache.lucene.index.StandardDirectoryReader.open(StandardDirectoryReader.java:99)
   [junit4]   1> 	at org.apache.lucene.index.IndexWriter.getReader(IndexWriter.java:434)
   [junit4]   1> 	at org.apache.lucene.index.DirectoryReader.open(DirectoryReader.java:86)
   [junit4]   1> 	at org.apache.lucene.index.BaseIndexFileFormatTestCase.testRandomExceptions(BaseIndexFileFormatTestCase.java:459)
   [junit4]   1> 	at org.apache.lucene.index.BaseSegmentInfoFormatTestCase.testRandomExceptions(BaseSegmentInfoFormatTestCase.java:48)
   [junit4]   1> 	at sun.reflect.NativeMethodAccessorImpl.invoke0(Native Method)
   [junit4]   1> 	at sun.reflect.NativeMethodAccessorImpl.invoke(NativeMethodAccessorImpl.java:57)
   [junit4]   1> 	at sun.reflect.DelegatingMethodAccessorImpl.invoke(DelegatingMethodAccessorImpl.java:43)
   [junit4]   1> 	at java.lang.reflect.Method.invoke(Method.java:606)
   [junit4]   1> 	at com.carrotsearch.randomizedtesting.RandomizedRunner.invoke(RandomizedRunner.java:1627)
   [junit4]   1> 	at com.carrotsearch.randomizedtesting.RandomizedRunner$6.evaluate(RandomizedRunner.java:836)
   [junit4]   1> 	at com.carrotsearch.randomizedtesting.RandomizedRunner$7.evaluate(RandomizedRunner.java:872)
   [junit4]   1> 	at com.carrotsearch.randomizedtesting.RandomizedRunner$8.evaluate(RandomizedRunner.java:886)
   [junit4]   1> 	at org.apache.lucene.util.TestRuleSetupTeardownChained$1.evaluate(TestRuleSetupTeardownChained.java:50)
   [junit4]   1> 	at org.apache.lucene.util.AbstractBeforeAfterRule$1.evaluate(AbstractBeforeAfterRule.java:46)
   [junit4]   1> 	at org.apache.lucene.util.TestRuleThreadAndTestName$1.evaluate(TestRuleThreadAndTestName.java:49)
   [junit4]   1> 	at org.apache.lucene.util.TestRuleIgnoreAfterMaxFailures$1.evaluate(TestRuleIgnoreAfterMaxFailures.java:65)
   [junit4]   1> 	at org.apache.lucene.util.TestRuleMarkFailure$1.evaluate(TestRuleMarkFailure.java:48)
   [junit4]   1> 	at com.carrotsearch.randomizedtesting.rules.StatementAdapter.evaluate(StatementAdapter.java:36)
   [junit4]   1> 	at com.carrotsearch.randomizedtesting.ThreadLeakControl$StatementRunner.run(ThreadLeakControl.java:365)
   [junit4]   1> 	at com.carrotsearch.randomizedtesting.ThreadLeakControl.forkTimeoutingTask(ThreadLeakControl.java:798)
   [junit4]   1> 	at com.carrotsearch.randomizedtesting.ThreadLeakControl$3.evaluate(ThreadLeakControl.java:458)
   [junit4]   1> 	at com.carrotsearch.randomizedtesting.RandomizedRunner.runSingleTest(RandomizedRunner.java:845)
   [junit4]   1> 	at com.carrotsearch.randomizedtesting.RandomizedRunner$3.evaluate(RandomizedRunner.java:747)
   [junit4]   1> 	at com.carrotsearch.randomizedtesting.RandomizedRunner$4.evaluate(RandomizedRunner.java:781)
   [junit4]   1> 	at com.carrotsearch.randomizedtesting.RandomizedRunner$5.evaluate(RandomizedRunner.java:792)
   [junit4]   1> 	at org.apache.lucene.util.AbstractBeforeAfterRule$1.evaluate(AbstractBeforeAfterRule.java:46)
   [junit4]   1> 	at com.carrotsearch.randomizedtesting.rules.StatementAdapter.evaluate(StatementAdapter.java:36)
   [junit4]   1> 	at org.apache.lucene.util.TestRuleStoreClassName$1.evaluate(TestRuleStoreClassName.java:42)
   [junit4]   1> 	at com.carrotsearch.randomizedtesting.rules.NoShadowingOrOverridesOnMethodsRule$1.evaluate(NoShadowingOrOverridesOnMethodsRule.java:39)
   [junit4]   1> 	at com.carrotsearch.randomizedtesting.rules.NoShadowingOrOverridesOnMethodsRule$1.evaluate(NoShadowingOrOverridesOnMethodsRule.java:39)
   [junit4]   1> 	at com.carrotsearch.randomizedtesting.rules.StatementAdapter.evaluate(StatementAdapter.java:36)
   [junit4]   1> 	at com.carrotsearch.randomizedtesting.rules.StatementAdapter.evaluate(StatementAdapter.java:36)
   [junit4]   1> 	at com.carrotsearch.randomizedtesting.rules.StatementAdapter.evaluate(StatementAdapter.java:36)
   [junit4]   1> 	at org.apache.lucene.util.TestRuleAssertionsRequired$1.evaluate(TestRuleAssertionsRequired.java:54)
   [junit4]   1> 	at org.apache.lucene.util.TestRuleMarkFailure$1.evaluate(TestRuleMarkFailure.java:48)
   [junit4]   1> 	at org.apache.lucene.util.TestRuleIgnoreAfterMaxFailures$1.evaluate(TestRuleIgnoreAfterMaxFailures.java:65)
   [junit4]   1> 	at org.apache.lucene.util.TestRuleIgnoreTestSuites$1.evaluate(TestRuleIgnoreTestSuites.java:55)
   [junit4]   1> 	at com.carrotsearch.randomizedtesting.rules.StatementAdapter.evaluate(StatementAdapter.java:36)
   [junit4]   1> 	at com.carrotsearch.randomizedtesting.ThreadLeakControl$StatementRunner.run(ThreadLeakControl.java:365)
   [junit4]   1> 	at java.lang.Thread.run(Thread.java:745)
   [junit4]   1> 
   [junit4]   1> TEST: got expected fake exc:a random IOException (_u.si)
   [junit4]   1> java.io.IOException: a random IOException (_u.si)
   [junit4]   1> 	at org.apache.lucene.store.MockDirectoryWrapper.maybeThrowIOExceptionOnOpen(MockDirectoryWrapper.java:456)
   [junit4]   1> 	at org.apache.lucene.store.MockDirectoryWrapper.createOutput(MockDirectoryWrapper.java:548)
   [junit4]   1> 	at org.apache.lucene.store.LockValidatingDirectoryWrapper.createOutput(LockValidatingDirectoryWrapper.java:44)
   [junit4]   1> 	at org.apache.lucene.store.TrackingDirectoryWrapper.createOutput(TrackingDirectoryWrapper.java:43)
   [junit4]   1> 	at org.apache.lucene.codecs.lucene46.Lucene46RWSegmentInfoFormat.write(Lucene46RWSegmentInfoFormat.java:42)
   [junit4]   1> 	at org.apache.lucene.index.DocumentsWriterPerThread.sealFlushedSegment(DocumentsWriterPerThread.java:501)
   [junit4]   1> 	at org.apache.lucene.index.DocumentsWriterPerThread.flush(DocumentsWriterPerThread.java:459)
   [junit4]   1> 	at org.apache.lucene.index.DocumentsWriter.doFlush(DocumentsWriter.java:503)
   [junit4]   1> 	at org.apache.lucene.index.DocumentsWriter.flushAllThreads(DocumentsWriter.java:615)
   [junit4]   1> 	at org.apache.lucene.index.IndexWriter.getReader(IndexWriter.java:423)
   [junit4]   1> 	at org.apache.lucene.index.DirectoryReader.open(DirectoryReader.java:86)
   [junit4]   1> 	at org.apache.lucene.index.BaseIndexFileFormatTestCase.testRandomExceptions(BaseIndexFileFormatTestCase.java:459)
   [junit4]   1> 	at org.apache.lucene.index.BaseSegmentInfoFormatTestCase.testRandomExceptions(BaseSegmentInfoFormatTestCase.java:48)
   [junit4]   1> 	at sun.reflect.NativeMethodAccessorImpl.invoke0(Native Method)
   [junit4]   1> 	at sun.reflect.NativeMethodAccessorImpl.invoke(NativeMethodAccessorImpl.java:57)
   [junit4]   1> 	at sun.reflect.DelegatingMethodAccessorImpl.invoke(DelegatingMethodAccessorImpl.java:43)
   [junit4]   1> 	at java.lang.reflect.Method.invoke(Method.java:606)
   [junit4]   1> 	at com.carrotsearch.randomizedtesting.RandomizedRunner.invoke(RandomizedRunner.java:1627)
   [junit4]   1> 	at com.carrotsearch.randomizedtesting.RandomizedRunner$6.evaluate(RandomizedRunner.java:836)
   [junit4]   1> 	at com.carrotsearch.randomizedtesting.RandomizedRunner$7.evaluate(RandomizedRunner.java:872)
   [junit4]   1> 	at com.carrotsearch.randomizedtesting.RandomizedRunner$8.evaluate(RandomizedRunner.java:886)
   [junit4]   1> 	at org.apache.lucene.util.TestRuleSetupTeardownChained$1.evaluate(TestRuleSetupTeardownChained.java:50)
   [junit4]   1> 	at org.apache.lucene.util.AbstractBeforeAfterRule$1.evaluate(AbstractBeforeAfterRule.java:46)
   [junit4]   1> 	at org.apache.lucene.util.TestRuleThreadAndTestName$1.evaluate(TestRuleThreadAndTestName.java:49)
   [junit4]   1> 	at org.apache.lucene.util.TestRuleIgnoreAfterMaxFailures$1.evaluate(TestRuleIgnoreAfterMaxFailures.java:65)
   [junit4]   1> 	at org.apache.lucene.util.TestRuleMarkFailure$1.evaluate(TestRuleMarkFailure.java:48)
   [junit4]   1> 	at com.carrotsearch.randomizedtesting.rules.StatementAdapter.evaluate(StatementAdapter.java:36)
   [junit4]   1> 	at com.carrotsearch.randomizedtesting.ThreadLeakControl$StatementRunner.run(ThreadLeakControl.java:365)
   [junit4]   1> 	at com.carrotsearch.randomizedtesting.ThreadLeakControl.forkTimeoutingTask(ThreadLeakControl.java:798)
   [junit4]   1> 	at com.carrotsearch.randomizedtesting.ThreadLeakControl$3.evaluate(ThreadLeakControl.java:458)
   [junit4]   1> 	at com.carrotsearch.randomizedtesting.RandomizedRunner.runSingleTest(RandomizedRunner.java:845)
   [junit4]   1> 	at com.carrotsearch.randomizedtesting.RandomizedRunner$3.evaluate(RandomizedRunner.java:747)
   [junit4]   1> 	at com.carrotsearch.randomizedtesting.RandomizedRunner$4.evaluate(RandomizedRunner.java:781)
   [junit4]   1> 	at com.carrotsearch.randomizedtesting.RandomizedRunner$5.evaluate(RandomizedRunner.java:792)
   [junit4]   1> 	at org.apache.lucene.util.AbstractBeforeAfterRule$1.evaluate(AbstractBeforeAfterRule.java:46)
   [junit4]   1> 	at com.carrotsearch.randomizedtesting.rules.StatementAdapter.evaluate(StatementAdapter.java:36)
   [junit4]   1> 	at org.apache.lucene.util.TestRuleStoreClassName$1.evaluate(TestRuleStoreClassName.java:42)
   [junit4]   1> 	at com.carrotsearch.randomizedtesting.rules.NoShadowingOrOverridesOnMethodsRule$1.evaluate(NoShadowingOrOverridesOnMethodsRule.java:39)
   [junit4]   1> 	at com.carrotsearch.randomizedtesting.rules.NoShadowingOrOverridesOnMethodsRule$1.evaluate(NoShadowingOrOverridesOnMethodsRule.java:39)
   [junit4]   1> 	at com.carrotsearch.randomizedtesting.rules.StatementAdapter.evaluate(StatementAdapter.java:36)
   [junit4]   1> 	at com.carrotsearch.randomizedtesting.rules.StatementAdapter.evaluate(StatementAdapter.java:36)
   [junit4]   1> 	at com.carrotsearch.randomizedtesting.rules.StatementAdapter.evaluate(StatementAdapter.java:36)
   [junit4]   1> 	at org.apache.lucene.util.TestRuleAssertionsRequired$1.evaluate(TestRuleAssertionsRequired.java:54)
   [junit4]   1> 	at org.apache.lucene.util.TestRuleMarkFailure$1.evaluate(TestRuleMarkFailure.java:48)
   [junit4]   1> 	at org.apache.lucene.util.TestRuleIgnoreAfterMaxFailures$1.evaluate(TestRuleIgnoreAfterMaxFailures.java:65)
   [junit4]   1> 	at org.apache.lucene.util.TestRuleIgnoreTestSuites$1.evaluate(TestRuleIgnoreTestSuites.java:55)
   [junit4]   1> 	at com.carrotsearch.randomizedtesting.rules.StatementAdapter.evaluate(StatementAdapter.java:36)
   [junit4]   1> 	at com.carrotsearch.randomizedtesting.ThreadLeakControl$StatementRunner.run(ThreadLeakControl.java:365)
   [junit4]   1> 	at java.lang.Thread.run(Thread.java:745)
   [junit4]   1> 
   [junit4]   1> TEST: got expected fake exc:a random IOException (_12.fdt)
   [junit4]   1> java.io.FileNotFoundException: a random IOException (_12.fdt)
   [junit4]   1> 	at org.apache.lucene.store.MockDirectoryWrapper.maybeThrowIOExceptionOnOpen(MockDirectoryWrapper.java:458)
   [junit4]   1> 	at org.apache.lucene.store.MockDirectoryWrapper.createOutput(MockDirectoryWrapper.java:548)
   [junit4]   1> 	at org.apache.lucene.store.LockValidatingDirectoryWrapper.createOutput(LockValidatingDirectoryWrapper.java:44)
   [junit4]   1> 	at org.apache.lucene.store.TrackingDirectoryWrapper.createOutput(TrackingDirectoryWrapper.java:43)
   [junit4]   1> 	at org.apache.lucene.codecs.lucene41.Lucene41StoredFieldsWriter.<init>(Lucene41StoredFieldsWriter.java:99)
   [junit4]   1> 	at org.apache.lucene.codecs.lucene41.Lucene41RWStoredFieldsFormat.fieldsWriter(Lucene41RWStoredFieldsFormat.java:35)
   [junit4]   1> 	at org.apache.lucene.index.DefaultIndexingChain.initStoredFieldsWriter(DefaultIndexingChain.java:81)
   [junit4]   1> 	at org.apache.lucene.index.DefaultIndexingChain.startStoredFields(DefaultIndexingChain.java:258)
   [junit4]   1> 	at org.apache.lucene.index.DefaultIndexingChain.processDocument(DefaultIndexingChain.java:295)
   [junit4]   1> 	at org.apache.lucene.index.DocumentsWriterPerThread.updateDocument(DocumentsWriterPerThread.java:234)
   [junit4]   1> 	at org.apache.lucene.index.DocumentsWriter.updateDocument(DocumentsWriter.java:450)
   [junit4]   1> 	at org.apache.lucene.index.IndexWriter.updateDocument(IndexWriter.java:1475)
   [junit4]   1> 	at org.apache.lucene.index.IndexWriter.addDocument(IndexWriter.java:1254)
   [junit4]   1> 	at org.apache.lucene.index.BaseIndexFileFormatTestCase.testRandomExceptions(BaseIndexFileFormatTestCase.java:429)
   [junit4]   1> 	at org.apache.lucene.index.BaseSegmentInfoFormatTestCase.testRandomExceptions(BaseSegmentInfoFormatTestCase.java:48)
   [junit4]   1> 	at sun.reflect.NativeMethodAccessorImpl.invoke0(Native Method)
   [junit4]   1> 	at sun.reflect.NativeMethodAccessorImpl.invoke(NativeMethodAccessorImpl.java:57)
   [junit4]   1> 	at sun.reflect.DelegatingMethodAccessorImpl.invoke(DelegatingMethodAccessorImpl.java:43)
   [junit4]   1> 	at java.lang.reflect.Method.invoke(Method.java:606)
   [junit4]   1> 	at com.carrotsearch.randomizedtesting.RandomizedRunner.invoke(RandomizedRunner.java:1627)
   [junit4]   1> 	at com.carrotsearch.randomizedtesting.RandomizedRunner$6.evaluate(RandomizedRunner.java:836)
   [junit4]   1> 	at com.carrotsearch.randomizedtesting.RandomizedRunner$7.evaluate(RandomizedRunner.java:872)
   [junit4]   1> 	at com.carrotsearch.randomizedtesting.RandomizedRunner$8.evaluate(RandomizedRunner.java:886)
   [junit4]   1> 	at org.apache.lucene.util.TestRuleSetupTeardownChained$1.evaluate(TestRuleSetupTeardownChained.java:50)
   [junit4]   1> 	at org.apache.lucene.util.AbstractBeforeAfterRule$1.evaluate(AbstractBeforeAfterRule.java:46)
   [junit4]   1> 	at org.apache.lucene.util.TestRuleThreadAndTestName$1.evaluate(TestRuleThreadAndTestName.java:49)
   [junit4]   1> 	at org.apache.lucene.util.TestRuleIgnoreAfterMaxFailures$1.evaluate(TestRuleIgnoreAfterMaxFailures.java:65)
   [junit4]   1> 	at org.apache.lucene.util.TestRuleMarkFailure$1.evaluate(TestRuleMarkFailure.java:48)
   [junit4]   1> 	at com.carrotsearch.randomizedtesting.rules.StatementAdapter.evaluate(StatementAdapter.java:36)
   [junit4]   1> 	at com.carrotsearch.randomizedtesting.ThreadLeakControl$StatementRunner.run(ThreadLeakControl.java:365)
   [junit4]   1> 	at com.carrotsearch.randomizedtesting.ThreadLeakControl.forkTimeoutingTask(ThreadLeakControl.java:798)
   [junit4]   1> 	at com.carrotsearch.randomizedtesting.ThreadLeakControl$3.evaluate(ThreadLeakControl.java:458)
   [junit4]   1> 	at com.carrotsearch.randomizedtesting.RandomizedRunner.runSingleTest(RandomizedRunner.java:845)
   [junit4]   1> 	at com.carrotsearch.randomizedtesting.RandomizedRunner$3.evaluate(RandomizedRunner.java:747)
   [junit4]   1> 	at com.carrotsearch.randomizedtesting.RandomizedRunner$4.evaluate(RandomizedRunner.java:781)
   [junit4]   1> 	at com.carrotsearch.randomizedtesting.RandomizedRunner$5.evaluate(RandomizedRunner.java:792)
   [junit4]   1> 	at org.apache.lucene.util.AbstractBeforeAfterRule$1.evaluate(AbstractBeforeAfterRule.java:46)
   [junit4]   1> 	at com.carrotsearch.randomizedtesting.rules.StatementAdapter.evaluate(StatementAdapter.java:36)
   [junit4]   1> 	at org.apache.lucene.util.TestRuleStoreClassName$1.evaluate(TestRuleStoreClassName.java:42)
   [junit4]   1> 	at com.carrotsearch.randomizedtesting.rules.NoShadowingOrOverridesOnMethodsRule$1.evaluate(NoShadowingOrOverridesOnMethodsRule.java:39)
   [junit4]   1> 	at com.carrotsearch.randomizedtesting.rules.NoShadowingOrOverridesOnMethodsRule$1.evaluate(NoShadowingOrOverridesOnMethodsRule.java:39)
   [junit4]   1> 	at com.carrotsearch.randomizedtesting.rules.StatementAdapter.evaluate(StatementAdapter.java:36)
   [junit4]   1> 	at com.carrotsearch.randomizedtesting.rules.StatementAdapter.evaluate(StatementAdapter.java:36)
   [junit4]   1> 	at com.carrotsearch.randomizedtesting.rules.StatementAdapter.evaluate(StatementAdapter.java:36)
   [junit4]   1> 	at org.apache.lucene.util.TestRuleAssertionsRequired$1.evaluate(TestRuleAssertionsRequired.java:54)
   [junit4]   1> 	at org.apache.lucene.util.TestRuleMarkFailure$1.evaluate(TestRuleMarkFailure.java:48)
   [junit4]   1> 	at org.apache.lucene.util.TestRuleIgnoreAfterMaxFailures$1.evaluate(TestRuleIgnoreAfterMaxFailures.java:65)
   [junit4]   1> 	at org.apache.lucene.util.TestRuleIgnoreTestSuites$1.evaluate(TestRuleIgnoreTestSuites.java:55)
   [junit4]   1> 	at com.carrotsearch.randomizedtesting.rules.StatementAdapter.evaluate(StatementAdapter.java:36)
   [junit4]   1> 	at com.carrotsearch.randomizedtesting.ThreadLeakControl$StatementRunner.run(ThreadLeakControl.java:365)
   [junit4]   1> 	at java.lang.Thread.run(Thread.java:745)
   [junit4]   1> 
   [junit4]   1> TEST: got expected fake exc:a random IOException (_18.cfs)
   [junit4]   1> java.nio.file.NoSuchFileException: a random IOException (_18.cfs)
   [junit4]   1> 	at org.apache.lucene.store.MockDirectoryWrapper.maybeThrowIOExceptionOnOpen(MockDirectoryWrapper.java:458)
   [junit4]   1> 	at org.apache.lucene.store.MockDirectoryWrapper.createOutput(MockDirectoryWrapper.java:548)
   [junit4]   1> 	at org.apache.lucene.store.LockValidatingDirectoryWrapper.createOutput(LockValidatingDirectoryWrapper.java:44)
   [junit4]   1> 	at org.apache.lucene.store.TrackingDirectoryWrapper.createOutput(TrackingDirectoryWrapper.java:43)
   [junit4]   1> 	at org.apache.lucene.store.TrackingDirectoryWrapper.createOutput(TrackingDirectoryWrapper.java:43)
   [junit4]   1> 	at org.apache.lucene.codecs.lucene40.Lucene40CompoundWriter.getOutput(Lucene40CompoundWriter.java:107)
   [junit4]   1> 	at org.apache.lucene.codecs.lucene40.Lucene40CompoundWriter.createOutput(Lucene40CompoundWriter.java:244)
   [junit4]   1> 	at org.apache.lucene.codecs.lucene40.Lucene40CompoundReader.createOutput(Lucene40CompoundReader.java:229)
   [junit4]   1> 	at org.apache.lucene.store.Directory.copyFrom(Directory.java:151)
   [junit4]   1> 	at org.apache.lucene.codecs.lucene40.Lucene40CompoundFormat.write(Lucene40CompoundFormat.java:51)
   [junit4]   1> 	at org.apache.lucene.index.IndexWriter.createCompoundFile(IndexWriter.java:4680)
   [junit4]   1> 	at org.apache.lucene.index.DocumentsWriterPerThread.sealFlushedSegment(DocumentsWriterPerThread.java:492)
   [junit4]   1> 	at org.apache.lucene.index.DocumentsWriterPerThread.flush(DocumentsWriterPerThread.java:459)
   [junit4]   1> 	at org.apache.lucene.index.DocumentsWriter.doFlush(DocumentsWriter.java:503)
   [junit4]   1> 	at org.apache.lucene.index.DocumentsWriter.flushAllThreads(DocumentsWriter.java:615)
   [junit4]   1> 	at org.apache.lucene.index.IndexWriter.getReader(IndexWriter.java:423)
   [junit4]   1> 	at org.apache.lucene.index.DirectoryReader.open(DirectoryReader.java:86)
   [junit4]   1> 	at org.apache.lucene.index.BaseIndexFileFormatTestCase.testRandomExceptions(BaseIndexFileFormatTestCase.java:459)
   [junit4]   1> 	at org.apache.lucene.index.BaseSegmentInfoFormatTestCase.testRandomExceptions(BaseSegmentInfoFormatTestCase.java:48)
   [junit4]   1> 	at sun.reflect.NativeMethodAccessorImpl.invoke0(Native Method)
   [junit4]   1> 	at sun.reflect.NativeMethodAccessorImpl.invoke(NativeMethodAccessorImpl.java:57)
   [junit4]   1> 	at sun.reflect.DelegatingMethodAccessorImpl.invoke(DelegatingMethodAccessorImpl.java:43)
   [junit4]   1> 	at java.lang.reflect.Method.invoke(Method.java:606)
   [junit4]   1> 	at com.carrotsearch.randomizedtesting.RandomizedRunner.invoke(RandomizedRunner.java:1627)
   [junit4]   1> 	at com.carrotsearch.randomizedtesting.RandomizedRunner$6.evaluate(RandomizedRunner.java:836)
   [junit4]   1> 	at com.carrotsearch.randomizedtesting.RandomizedRunner$7.evaluate(RandomizedRunner.java:872)
   [junit4]   1> 	at com.carrotsearch.randomizedtesting.RandomizedRunner$8.evaluate(RandomizedRunner.java:886)
   [junit4]   1> 	at org.apache.lucene.util.TestRuleSetupTeardownChained$1.evaluate(TestRuleSetupTeardownChained.java:50)
   [junit4]   1> 	at org.apache.lucene.util.AbstractBeforeAfterRule$1.evaluate(AbstractBeforeAfterRule.java:46)
   [junit4]   1> 	at org.apache.lucene.util.TestRuleThreadAndTestName$1.evaluate(TestRuleThreadAndTestName.java:49)
   [junit4]   1> 	at org.apache.lucene.util.TestRuleIgnoreAfterMaxFailures$1.evaluate(TestRuleIgnoreAfterMaxFailures.java:65)
   [junit4]   1> 	at org.apache.lucene.util.TestRuleMarkFailure$1.evaluate(TestRuleMarkFailure.java:48)
   [junit4]   1> 	at com.carrotsearch.randomizedtesting.rules.StatementAdapter.evaluate(StatementAdapter.java:36)
   [junit4]   1> 	at com.carrotsearch.randomizedtesting.ThreadLeakControl$StatementRunner.run(ThreadLeakControl.java:365)
   [junit4]   1> 	at com.carrotsearch.randomizedtesting.ThreadLeakControl.forkTimeoutingTask(ThreadLeakControl.java:798)
   [junit4]   1> 	at com.carrotsearch.randomizedtesting.ThreadLeakControl$3.evaluate(ThreadLeakControl.java:458)
   [junit4]   1> 	at com.carrotsearch.randomizedtesting.RandomizedRunner.runSingleTest(RandomizedRunner.java:845)
   [junit4]   1> 	at com.carrotsearch.randomizedtesting.RandomizedRunner$3.evaluate(RandomizedRunner.java:747)
   [junit4]   1> 	at com.carrotsearch.randomizedtesting.RandomizedRunner$4.evaluate(RandomizedRunner.java:781)
   [junit4]   1> 	at com.carrotsearch.randomizedtesting.RandomizedRunner$5.evaluate(RandomizedRunner.java:792)
   [junit4]   1> 	at org.apache.lucene.util.AbstractBeforeAfterRule$1.evaluate(AbstractBeforeAfterRule.java:46)
   [junit4]   1> 	at com.carrotsearch.randomizedtesting.rules.StatementAdapter.evaluate(StatementAdapter.java:36)
   [junit4]   1> 	at org.apache.lucene.util.TestRuleStoreClassName$1.evaluate(TestRuleStoreClassName.java:42)
   [junit4]   1> 	at com.carrotsearch.randomizedtesting.rules.NoShadowingOrOverridesOnMethodsRule$1.evaluate(NoShadowingOrOverridesOnMethodsRule.java:39)
   [junit4]   1> 	at com.carrotsearch.randomizedtesting.rules.NoShadowingOrOverridesOnMethodsRule$1.evaluate(NoShadowingOrOverridesOnMethodsRule.java:39)
   [junit4]   1> 	at com.carrotsearch.randomizedtesting.rules.StatementAdapter.evaluate(StatementAdapter.java:36)
   [junit4]   1> 	at com.carrotsearch.randomizedtesting.rules.StatementAdapter.evaluate(StatementAdapter.java:36)
   [junit4]   1> 	at com.carrotsearch.randomizedtesting.rules.StatementAdapter.evaluate(StatementAdapter.java:36)
   [junit4]   1> 	at org.apache.lucene.util.TestRuleAssertionsRequired$1.evaluate(TestRuleAssertionsRequired.java:54)
   [junit4]   1> 	at org.apache.lucene.util.TestRuleMarkFailure$1.evaluate(TestRuleMarkFailure.java:48)
   [junit4]   1> 	at org.apache.lucene.util.TestRuleIgnoreAfterMaxFailures$1.evaluate(TestRuleIgnoreAfterMaxFailures.java:65)
   [junit4]   1> 	at org.apache.lucene.util.TestRuleIgnoreTestSuites$1.evaluate(TestRuleIgnoreTestSuites.java:55)
   [junit4]   1> 	at com.carrotsearch.randomizedtesting.rules.StatementAdapter.evaluate(StatementAdapter.java:36)
   [junit4]   1> 	at com.carrotsearch.randomizedtesting.ThreadLeakControl$StatementRunner.run(ThreadLeakControl.java:365)
   [junit4]   1> 	at java.lang.Thread.run(Thread.java:745)
   [junit4]   1> 
   [junit4]   1> TEST: got expected fake exc:a random IOException (_1f.cfe)
   [junit4]   1> java.io.FileNotFoundException: a random IOException (_1f.cfe)
   [junit4]   1> 	at org.apache.lucene.store.MockDirectoryWrapper.maybeThrowIOExceptionOnOpen(MockDirectoryWrapper.java:458)
   [junit4]   1> 	at org.apache.lucene.store.MockDirectoryWrapper.createOutput(MockDirectoryWrapper.java:548)
   [junit4]   1> 	at org.apache.lucene.store.LockValidatingDirectoryWrapper.createOutput(LockValidatingDirectoryWrapper.java:44)
   [junit4]   1> 	at org.apache.lucene.store.TrackingDirectoryWrapper.createOutput(TrackingDirectoryWrapper.java:43)
   [junit4]   1> 	at org.apache.lucene.store.TrackingDirectoryWrapper.createOutput(TrackingDirectoryWrapper.java:43)
   [junit4]   1> 	at org.apache.lucene.codecs.lucene40.Lucene40CompoundWriter.close(Lucene40CompoundWriter.java:163)
   [junit4]   1> 	at org.apache.lucene.codecs.lucene40.Lucene40CompoundReader.close(Lucene40CompoundReader.java:160)
   [junit4]   1> 	at org.apache.lucene.codecs.lucene40.Lucene40CompoundFormat.write(Lucene40CompoundFormat.java:53)
   [junit4]   1> 	at org.apache.lucene.index.IndexWriter.createCompoundFile(IndexWriter.java:4680)
   [junit4]   1> 	at org.apache.lucene.index.DocumentsWriterPerThread.sealFlushedSegment(DocumentsWriterPerThread.java:492)
   [junit4]   1> 	at org.apache.lucene.index.DocumentsWriterPerThread.flush(DocumentsWriterPerThread.java:459)
   [junit4]   1> 	at org.apache.lucene.index.DocumentsWriter.doFlush(DocumentsWriter.java:503)
   [junit4]   1> 	at org.apache.lucene.index.DocumentsWriter.flushAllThreads(DocumentsWriter.java:615)
   [junit4]   1> 	at org.apache.lucene.index.IndexWriter.getReader(IndexWriter.java:423)
   [junit4]   1> 	at org.apache.lucene.index.DirectoryReader.open(DirectoryReader.java:86)
   [junit4]   1> 	at org.apache.lucene.index.BaseIndexFileFormatTestCase.testRandomExceptions(BaseIndexFileFormatTestCase.java:459)
   [junit4]   1> 	at org.apache.lucene.index.BaseSegmentInfoFormatTestCase.testRandomExceptions(BaseSegmentInfoFormatTestCase.java:48)
   [junit4]   1> 	at sun.reflect.NativeMethodAccessorImpl.invoke0(Native Method)
   [junit4]   1> 	at sun.reflect.NativeMethodAccessorImpl.invoke(NativeMethodAccessorImpl.java:57)
   [junit4]   1> 	at sun.reflect.DelegatingMethodAccessorImpl.invoke(DelegatingMethodAccessorImpl.java:43)
   [junit4]   1> 	at java.lang.reflect.Method.invoke(Method.java:606)
   [junit4]   1> 	at com.carrotsearch.randomizedtesting.RandomizedRunner.invoke(RandomizedRunner.java:1627)
   [junit4]   1> 	at com.carrotsearch.randomizedtesting.RandomizedRunner$6.evaluate(RandomizedRunner.java:836)
   [junit4]   1> 	at com.carrotsearch.randomizedtesting.RandomizedRunner$7.evaluate(RandomizedRunner.java:872)
   [junit4]   1> 	at com.carrotsearch.randomizedtesting.RandomizedRunner$8.evaluate(RandomizedRunner.java:886)
   [junit4]   1> 	at org.apache.lucene.util.TestRuleSetupTeardownChained$1.evaluate(TestRuleSetupTeardownChained.java:50)
   [junit4]   1> 	at org.apache.lucene.util.AbstractBeforeAfterRule$1.evaluate(AbstractBeforeAfterRule.java:46)
   [junit4]   1> 	at org.apache.lucene.util.TestRuleThreadAndTestName$1.evaluate(TestRuleThreadAndTestName.java:49)
   [junit4]   1> 	at org.apache.lucene.util.TestRuleIgnoreAfterMaxFailures$1.evaluate(TestRuleIgnoreAfterMaxFailures.java:65)
   [junit4]   1> 	at org.apache.lucene.util.TestRuleMarkFailure$1.evaluate(TestRuleMarkFailure.java:48)
   [junit4]   1> 	at com.carrotsearch.randomizedtesting.rules.StatementAdapter.evaluate(StatementAdapter.java:36)
   [junit4]   1> 	at com.carrotsearch.randomizedtesting.ThreadLeakControl$StatementRunner.run(ThreadLeakControl.java:365)
   [junit4]   1> 	at com.carrotsearch.randomizedtesting.ThreadLeakControl.forkTimeoutingTask(ThreadLeakControl.java:798)
   [junit4]   1> 	at com.carrotsearch.randomizedtesting.ThreadLeakControl$3.evaluate(ThreadLeakControl.java:458)
   [junit4]   1> 	at com.carrotsearch.randomizedtesting.RandomizedRunner.runSingleTest(RandomizedRunner.java:845)
   [junit4]   1> 	at com.carrotsearch.randomizedtesting.RandomizedRunner$3.evaluate(RandomizedRunner.java:747)
   [junit4]   1> 	at com.carrotsearch.randomizedtesting.RandomizedRunner$4.evaluate(RandomizedRunner.java:781)
   [junit4]   1> 	at com.carrotsearch.randomizedtesting.RandomizedRunner$5.evaluate(RandomizedRunner.java:792)
   [junit4]   1> 	at org.apache.lucene.util.AbstractBeforeAfterRule$1.evaluate(AbstractBeforeAfterRule.java:46)
   [junit4]   1> 	at com.carrotsearch.randomizedtesting.rules.StatementAdapter.evaluate(StatementAdapter.java:36)
   [junit4]   1> 	at org.apache.lucene.util.TestRuleStoreClassName$1.evaluate(TestRuleStoreClassName.java:42)
   [junit4]   1> 	at com.carrotsearch.randomizedtesting.rules.NoShadowingOrOverridesOnMethodsRule$1.evaluate(NoShadowingOrOverridesOnMethodsRule.java:39)
   [junit4]   1> 	at com.carrotsearch.randomizedtesting.rules.NoShadowingOrOverridesOnMethodsRule$1.evaluate(NoShadowingOrOverridesOnMethodsRule.java:39)
   [junit4]   1> 	at com.carrotsearch.randomizedtesting.rules.StatementAdapter.evaluate(StatementAdapter.java:36)
   [junit4]   1> 	at com.carrotsearch.randomizedtesting.rules.StatementAdapter.evaluate(StatementAdapter.java:36)
   [junit4]   1> 	at com.carrotsearch.randomizedtesting.rules.StatementAdapter.evaluate(StatementAdapter.java:36)
   [junit4]   1> 	at org.apache.lucene.util.TestRuleAssertionsRequired$1.evaluate(TestRuleAssertionsRequired.java:54)
   [junit4]   1> 	at org.apache.lucene.util.TestRuleMarkFailure$1.evaluate(TestRuleMarkFailure.java:48)
   [junit4]   1> 	at org.apache.lucene.util.TestRuleIgnoreAfterMaxFailures$1.evaluate(TestRuleIgnoreAfterMaxFailures.java:65)
   [junit4]   1> 	at org.apache.lucene.util.TestRuleIgnoreTestSuites$1.evaluate(TestRuleIgnoreTestSuites.java:55)
   [junit4]   1> 	at com.carrotsearch.randomizedtesting.rules.StatementAdapter.evaluate(StatementAdapter.java:36)
   [junit4]   1> 	at com.carrotsearch.randomizedtesting.ThreadLeakControl$StatementRunner.run(ThreadLeakControl.java:365)
   [junit4]   1> 	at java.lang.Thread.run(Thread.java:745)
   [junit4]   1> 
   [junit4]   1> TEST: got expected fake exc:a random IOException (_1i_Lucene41_0.tim)
   [junit4]   1> java.io.FileNotFoundException: a random IOException (_1i_Lucene41_0.tim)
   [junit4]   1> 	at org.apache.lucene.store.MockDirectoryWrapper.maybeThrowIOExceptionOnOpen(MockDirectoryWrapper.java:458)
   [junit4]   1> 	at org.apache.lucene.store.MockDirectoryWrapper.openInput(MockDirectoryWrapper.java:635)
   [junit4]   1> 	at org.apache.lucene.codecs.blocktree.Lucene40BlockTreeTermsReader.<init>(Lucene40BlockTreeTermsReader.java:137)
   [junit4]   1> 	at org.apache.lucene.codecs.lucene41.Lucene41PostingsFormat.fieldsProducer(Lucene41PostingsFormat.java:104)
   [junit4]   1> 	at org.apache.lucene.codecs.perfield.PerFieldPostingsFormat$FieldsReader.<init>(PerFieldPostingsFormat.java:261)
   [junit4]   1> 	at org.apache.lucene.codecs.perfield.PerFieldPostingsFormat.fieldsProducer(PerFieldPostingsFormat.java:341)
   [junit4]   1> 	at org.apache.lucene.index.SegmentCoreReaders.<init>(SegmentCoreReaders.java:104)
   [junit4]   1> 	at org.apache.lucene.index.SegmentReader.<init>(SegmentReader.java:65)
   [junit4]   1> 	at org.apache.lucene.index.ReadersAndUpdates.getReader(ReadersAndUpdates.java:145)
   [junit4]   1> 	at org.apache.lucene.index.BufferedUpdatesStream$SegmentState.<init>(BufferedUpdatesStream.java:384)
   [junit4]   1> 	at org.apache.lucene.index.BufferedUpdatesStream.openSegmentStates(BufferedUpdatesStream.java:416)
   [junit4]   1> 	at org.apache.lucene.index.BufferedUpdatesStream.applyDeletesAndUpdates(BufferedUpdatesStream.java:261)
   [junit4]   1> 	at org.apache.lucene.index.IndexWriter.applyAllDeletesAndUpdates(IndexWriter.java:3170)
   [junit4]   1> 	at org.apache.lucene.index.IndexWriter.maybeApplyDeletes(IndexWriter.java:3156)
   [junit4]   1> 	at org.apache.lucene.index.IndexWriter.getReader(IndexWriter.java:433)
   [junit4]   1> 	at org.apache.lucene.index.DirectoryReader.open(DirectoryReader.java:86)
   [junit4]   1> 	at org.apache.lucene.index.BaseIndexFileFormatTestCase.testRandomExceptions(BaseIndexFileFormatTestCase.java:459)
   [junit4]   1> 	at org.apache.lucene.index.BaseSegmentInfoFormatTestCase.testRandomExceptions(BaseSegmentInfoFormatTestCase.java:48)
   [junit4]   1> 	at sun.reflect.NativeMethodAccessorImpl.invoke0(Native Method)
   [junit4]   1> 	at sun.reflect.NativeMethodAccessorImpl.invoke(NativeMethodAccessorImpl.java:57)
   [junit4]   1> 	at sun.reflect.DelegatingMethodAccessorImpl.invoke(DelegatingMethodAccessorImpl.java:43)
   [junit4]   1> 	at java.lang.reflect.Method.invoke(Method.java:606)
   [junit4]   1> 	at com.carrotsearch.randomizedtesting.RandomizedRunner.invoke(RandomizedRunner.java:1627)
   [junit4]   1> 	at com.carrotsearch.randomizedtesting.RandomizedRunner$6.evaluate(RandomizedRunner.java:836)
   [junit4]   1> 	at com.carrotsearch.randomizedtesting.RandomizedRunner$7.evaluate(RandomizedRunner.java:872)
   [junit4]   1> 	at com.carrotsearch.randomizedtesting.RandomizedRunner$8.evaluate(RandomizedRunner.java:886)
   [junit4]   1> 	at org.apache.lucene.util.TestRuleSetupTeardownChained$1.evaluate(TestRuleSetupTeardownChained.java:50)
   [junit4]   1> 	at org.apache.lucene.util.AbstractBeforeAfterRule$1.evaluate(AbstractBeforeAfterRule.java:46)
   [junit4]   1> 	at org.apache.lucene.util.TestRuleThreadAndTestName$1.evaluate(TestRuleThreadAndTestName.java:49)
   [junit4]   1> 	at org.apache.lucene.util.TestRuleIgnoreAfterMaxFailures$1.evaluate(TestRuleIgnoreAfterMaxFailures.java:65)
   [junit4]   1> 	at org.apache.lucene.util.TestRuleMarkFailure$1.evaluate(TestRuleMarkFailure.java:48)
   [junit4]   1> 	at com.carrotsearch.randomizedtesting.rules.StatementAdapter.evaluate(StatementAdapter.java:36)
   [junit4]   1> 	at com.carrotsearch.randomizedtesting.ThreadLeakControl$StatementRunner.run(ThreadLeakControl.java:365)
   [junit4]   1> 	at com.carrotsearch.randomizedtesting.ThreadLeakControl.forkTimeoutingTask(ThreadLeakControl.java:798)
   [junit4]   1> 	at com.carrotsearch.randomizedtesting.ThreadLeakControl$3.evaluate(ThreadLeakControl.java:458)
   [junit4]   1> 	at com.carrotsearch.randomizedtesting.RandomizedRunner.runSingleTest(RandomizedRunner.java:845)
   [junit4]   1> 	at com.carrotsearch.randomizedtesting.RandomizedRunner$3.evaluate(RandomizedRunner.java:747)
   [junit4]   1> 	at com.carrotsearch.randomizedtesting.RandomizedRunner$4.evaluate(RandomizedRunner.java:781)
   [junit4]   1> 	at com.carrotsearch.randomizedtesting.RandomizedRunner$5.evaluate(RandomizedRunner.java:792)
   [junit4]   1> 	at org.apache.lucene.util.AbstractBeforeAfterRule$1.evaluate(AbstractBeforeAfterRule.java:46)
   [junit4]   1> 	at com.carrotsearch.randomizedtesting.rules.StatementAdapter.evaluate(StatementAdapter.java:36)
   [junit4]   1> 	at org.apache.lucene.util.TestRuleStoreClassName$1.evaluate(TestRuleStoreClassName.java:42)
   [junit4]   1> 	at com.carrotsearch.randomizedtesting.rules.NoShadowingOrOverridesOnMethodsRule$1.evaluate(NoShadowingOrOverridesOnMethodsRule.java:39)
   [junit4]   1> 	at com.carrotsearch.randomizedtesting.rules.NoShadowingOrOverridesOnMethodsRule$1.evaluate(NoShadowingOrOverridesOnMethodsRule.java:39)
   [junit4]   1> 	at com.carrotsearch.randomizedtesting.rules.StatementAdapter.evaluate(StatementAdapter.java:36)
   [junit4]   1> 	at com.carrotsearch.randomizedtesting.rules.StatementAdapter.evaluate(StatementAdapter.java:36)
   [junit4]   1> 	at com.carrotsearch.randomizedtesting.rules.StatementAdapter.evaluate(StatementAdapter.java:36)
   [junit4]   1> 	at org.apache.lucene.util.TestRuleAssertionsRequired$1.evaluate(TestRuleAssertionsRequired.java:54)
   [junit4]   1> 	at org.apache.lucene.util.TestRuleMarkFailure$1.evaluate(TestRuleMarkFailure.java:48)
   [junit4]   1> 	at org.apache.lucene.util.TestRuleIgnoreAfterMaxFailures$1.evaluate(TestRuleIgnoreAfterMaxFailures.java:65)
   [junit4]   1> 	at org.apache.lucene.util.TestRuleIgnoreTestSuites$1.evaluate(TestRuleIgnoreTestSuites.java:55)
   [junit4]   1> 	at com.carrotsearch.randomizedtesting.rules.StatementAdapter.evaluate(StatementAdapter.java:36)
   [junit4]   1> 	at com.carrotsearch.randomizedtesting.ThreadLeakControl$StatementRunner.run(ThreadLeakControl.java:365)
   [junit4]   1> 	at java.lang.Thread.run(Thread.java:745)
   [junit4]   1> 
   [junit4]   1> TEST: got expected fake exc:a random IOException (_1o_Lucene41_0.tip)
   [junit4]   1> java.nio.file.NoSuchFileException: a random IOException (_1o_Lucene41_0.tip)
   [junit4]   1> 	at org.apache.lucene.store.MockDirectoryWrapper.maybeThrowIOExceptionOnOpen(MockDirectoryWrapper.java:458)
   [junit4]   1> 	at org.apache.lucene.store.MockDirectoryWrapper.openInput(MockDirectoryWrapper.java:635)
   [junit4]   1> 	at org.apache.lucene.codecs.blocktree.Lucene40BlockTreeTermsReader.<init>(Lucene40BlockTreeTermsReader.java:145)
   [junit4]   1> 	at org.apache.lucene.codecs.lucene41.Lucene41PostingsFormat.fieldsProducer(Lucene41PostingsFormat.java:104)
   [junit4]   1> 	at org.apache.lucene.codecs.perfield.PerFieldPostingsFormat$FieldsReader.<init>(PerFieldPostingsFormat.java:261)
   [junit4]   1> 	at org.apache.lucene.codecs.perfield.PerFieldPostingsFormat.fieldsProducer(PerFieldPostingsFormat.java:341)
   [junit4]   1> 	at org.apache.lucene.index.SegmentCoreReaders.<init>(SegmentCoreReaders.java:104)
   [junit4]   1> 	at org.apache.lucene.index.SegmentReader.<init>(SegmentReader.java:65)
   [junit4]   1> 	at org.apache.lucene.index.ReadersAndUpdates.getReader(ReadersAndUpdates.java:145)
   [junit4]   1> 	at org.apache.lucene.index.ReadersAndUpdates.getReadOnlyClone(ReadersAndUpdates.java:197)
   [junit4]   1> 	at org.apache.lucene.index.StandardDirectoryReader.open(StandardDirectoryReader.java:99)
   [junit4]   1> 	at org.apache.lucene.index.IndexWriter.getReader(IndexWriter.java:434)
   [junit4]   1> 	at org.apache.lucene.index.DirectoryReader.open(DirectoryReader.java:86)
   [junit4]   1> 	at org.apache.lucene.index.BaseIndexFileFormatTestCase.testRandomExceptions(BaseIndexFileFormatTestCase.java:459)
   [junit4]   1> 	at org.apache.lucene.index.BaseSegmentInfoFormatTestCase.testRandomExceptions(BaseSegmentInfoFormatTestCase.java:48)
   [junit4]   1> 	at sun.reflect.NativeMethodAccessorImpl.invoke0(Native Method)
   [junit4]   1> 	at sun.reflect.NativeMethodAccessorImpl.invoke(NativeMethodAccessorImpl.java:57)
   [junit4]   1> 	at sun.reflect.DelegatingMethodAccessorImpl.invoke(DelegatingMethodAccessorImpl.java:43)
   [junit4]   1> 	at java.lang.reflect.Method.invoke(Method.java:606)
   [junit4]   1> 	at com.carrotsearch.randomizedtesting.RandomizedRunner.invoke(RandomizedRunner.java:1627)
   [junit4]   1> 	at com.carrotsearch.randomizedtesting.RandomizedRunner$6.evaluate(RandomizedRunner.java:836)
   [junit4]   1> 	at com.carrotsearch.randomizedtesting.RandomizedRunner$7.evaluate(RandomizedRunner.java:872)
   [junit4]   1> 	at com.carrotsearch.randomizedtesting.RandomizedRunner$8.evaluate(RandomizedRunner.java:886)
   [junit4]   1> 	at org.apache.lucene.util.TestRuleSetupTeardownChained$1.evaluate(TestRuleSetupTeardownChained.java:50)
   [junit4]   1> 	at org.apache.lucene.util.AbstractBeforeAfterRule$1.evaluate(AbstractBeforeAfterRule.java:46)
   [junit4]   1> 	at org.apache.lucene.util.TestRuleThreadAndTestName$1.evaluate(TestRuleThreadAndTestName.java:49)
   [junit4]   1> 	at org.apache.lucene.util.TestRuleIgnoreAfterMaxFailures$1.evaluate(TestRuleIgnoreAfterMaxFailures.java:65)
   [junit4]   1> 	at org.apache.lucene.util.TestRuleMarkFailure$1.evaluate(TestRuleMarkFailure.java:48)
   [junit4]   1> 	at com.carrotsearch.randomizedtesting.rules.StatementAdapter.evaluate(StatementAdapter.java:36)
   [junit4]   1> 	at com.carrotsearch.randomizedtesting.ThreadLeakControl$StatementRunner.run(ThreadLeakControl.java:365)
   [junit4]   1> 	at com.carrotsearch.randomizedtesting.ThreadLeakControl.forkTimeoutingTask(ThreadLeakControl.java:798)
   [junit4]   1> 	at com.carrotsearch.randomizedtesting.ThreadLeakControl$3.evaluate(ThreadLeakControl.java:458)
   [junit4]   1> 	at com.carrotsearch.randomizedtesting.RandomizedRunner.runSingleTest(RandomizedRunner.java:845)
   [junit4]   1> 	at com.carrotsearch.randomizedtesting.RandomizedRunner$3.evaluate(RandomizedRunner.java:747)
   [junit4]   1> 	at com.carrotsearch.randomizedtesting.RandomizedRunner$4.evaluate(RandomizedRunner.java:781)
   [junit4]   1> 	at com.carrotsearch.randomizedtesting.RandomizedRunner$5.evaluate(RandomizedRunner.java:792)
   [junit4]   1> 	at org.apache.lucene.util.AbstractBeforeAfterRule$1.evaluate(AbstractBeforeAfterRule.java:46)
   [junit4]   1> 	at com.carrotsearch.randomizedtesting.rules.StatementAdapter.evaluate(StatementAdapter.java:36)
   [junit4]   1> 	at org.apache.lucene.util.TestRuleStoreClassName$1.evaluate(TestRuleStoreClassName.java:42)
   [junit4]   1> 	at com.carrotsearch.randomizedtesting.rules.NoShadowingOrOverridesOnMethodsRule$1.evaluate(NoShadowingOrOverridesOnMethodsRule.java:39)
   [junit4]   1> 	at com.carrotsearch.randomizedtesting.rules.NoShadowingOrOverridesOnMethodsRule$1.evaluate(NoShadowingOrOverridesOnMethodsRule.java:39)
   [junit4]   1> 	at com.carrotsearch.randomizedtesting.rules.StatementAdapter.evaluate(StatementAdapter.java:36)
   [junit4]   1> 	at com.carrotsearch.randomizedtesting.rules.StatementAdapter.evaluate(StatementAdapter.java:36)
   [junit4]   1> 	at com.carrotsearch.randomizedtesting.rules.StatementAdapter.evaluate(StatementAdapter.java:36)
   [junit4]   1> 	at org.apache.lucene.util.TestRuleAssertionsRequired$1.evaluate(TestRuleAssertionsRequired.java:54)
   [junit4]   1> 	at org.apache.lucene.util.TestRuleMarkFailure$1.evaluate(TestRuleMarkFailure.java:48)
   [junit4]   1> 	at org.apache.lucene.util.TestRuleIgnoreAfterMaxFailures$1.evaluate(TestRuleIgnoreAfterMaxFailures.java:65)
   [junit4]   1> 	at org.apache.lucene.util.TestRuleIgnoreTestSuites$1.evaluate(TestRuleIgnoreTestSuites.java:55)
   [junit4]   1> 	at com.carrotsearch.randomizedtesting.rules.StatementAdapter.evaluate(StatementAdapter.java:36)
   [junit4]   1> 	at com.carrotsearch.randomizedtesting.ThreadLeakControl$StatementRunner.run(ThreadLeakControl.java:365)
   [junit4]   1> 	at java.lang.Thread.run(Thread.java:745)
   [junit4]   1> 
   [junit4]   1> TEST: got expected fake exc:a random IOException (_1s_Lucene41_0.doc)
   [junit4]   1> java.io.IOException: a random IOException (_1s_Lucene41_0.doc)
   [junit4]   1> 	at org.apache.lucene.store.MockDirectoryWrapper.maybeThrowIOExceptionOnOpen(MockDirectoryWrapper.java:456)
   [junit4]   1> 	at org.apache.lucene.store.MockDirectoryWrapper.openInput(MockDirectoryWrapper.java:635)
   [junit4]   1> 	at org.apache.lucene.codecs.lucene41.Lucene41PostingsReader.<init>(Lucene41PostingsReader.java:74)
   [junit4]   1> 	at org.apache.lucene.codecs.lucene41.Lucene41PostingsFormat.fieldsProducer(Lucene41PostingsFormat.java:97)
   [junit4]   1> 	at org.apache.lucene.codecs.perfield.PerFieldPostingsFormat$FieldsReader.<init>(PerFieldPostingsFormat.java:261)
   [junit4]   1> 	at org.apache.lucene.codecs.perfield.PerFieldPostingsFormat.fieldsProducer(PerFieldPostingsFormat.java:341)
   [junit4]   1> 	at org.apache.lucene.index.SegmentCoreReaders.<init>(SegmentCoreReaders.java:104)
   [junit4]   1> 	at org.apache.lucene.index.SegmentReader.<init>(SegmentReader.java:65)
   [junit4]   1> 	at org.apache.lucene.index.ReadersAndUpdates.getReader(ReadersAndUpdates.java:145)
   [junit4]   1> 	at org.apache.lucene.index.BufferedUpdatesStream$SegmentState.<init>(BufferedUpdatesStream.java:384)
   [junit4]   1> 	at org.apache.lucene.index.BufferedUpdatesStream.openSegmentStates(BufferedUpdatesStream.java:416)
   [junit4]   1> 	at org.apache.lucene.index.BufferedUpdatesStream.applyDeletesAndUpdates(BufferedUpdatesStream.java:261)
   [junit4]   1> 	at org.apache.lucene.index.IndexWriter.applyAllDeletesAndUpdates(IndexWriter.java:3170)
   [junit4]   1> 	at org.apache.lucene.index.IndexWriter.maybeApplyDeletes(IndexWriter.java:3156)
   [junit4]   1> 	at org.apache.lucene.index.IndexWriter.getReader(IndexWriter.java:433)
   [junit4]   1> 	at org.apache.lucene.index.DirectoryReader.open(DirectoryRead

[...truncated too long message...]

  1> 	at org.apache.lucene.codecs.lucene41.Lucene41StoredFieldsWriter.<init>(Lucene41StoredFieldsWriter.java:105)
   [junit4]   1> 	at org.apache.lucene.codecs.lucene41.Lucene41RWStoredFieldsFormat.fieldsWriter(Lucene41RWStoredFieldsFormat.java:35)
   [junit4]   1> 	at org.apache.lucene.index.DefaultIndexingChain.initStoredFieldsWriter(DefaultIndexingChain.java:81)
   [junit4]   1> 	at org.apache.lucene.index.DefaultIndexingChain.startStoredFields(DefaultIndexingChain.java:258)
   [junit4]   1> 	at org.apache.lucene.index.DefaultIndexingChain.processDocument(DefaultIndexingChain.java:295)
   [junit4]   1> 	at org.apache.lucene.index.DocumentsWriterPerThread.updateDocument(DocumentsWriterPerThread.java:234)
   [junit4]   1> 	at org.apache.lucene.index.DocumentsWriter.updateDocument(DocumentsWriter.java:450)
   [junit4]   1> 	at org.apache.lucene.index.IndexWriter.updateDocument(IndexWriter.java:1475)
   [junit4]   1> 	at org.apache.lucene.index.IndexWriter.addDocument(IndexWriter.java:1254)
   [junit4]   1> 	at org.apache.lucene.index.BaseIndexFileFormatTestCase.testRandomExceptions(BaseIndexFileFormatTestCase.java:429)
   [junit4]   1> 	at org.apache.lucene.index.BaseFieldInfoFormatTestCase.testRandomExceptions(BaseFieldInfoFormatTestCase.java:50)
   [junit4]   1> 	at sun.reflect.NativeMethodAccessorImpl.invoke0(Native Method)
   [junit4]   1> 	at sun.reflect.NativeMethodAccessorImpl.invoke(NativeMethodAccessorImpl.java:57)
   [junit4]   1> 	at sun.reflect.DelegatingMethodAccessorImpl.invoke(DelegatingMethodAccessorImpl.java:43)
   [junit4]   1> 	at java.lang.reflect.Method.invoke(Method.java:606)
   [junit4]   1> 	at com.carrotsearch.randomizedtesting.RandomizedRunner.invoke(RandomizedRunner.java:1627)
   [junit4]   1> 	at com.carrotsearch.randomizedtesting.RandomizedRunner$6.evaluate(RandomizedRunner.java:836)
   [junit4]   1> 	at com.carrotsearch.randomizedtesting.RandomizedRunner$7.evaluate(RandomizedRunner.java:872)
   [junit4]   1> 	at com.carrotsearch.randomizedtesting.RandomizedRunner$8.evaluate(RandomizedRunner.java:886)
   [junit4]   1> 	at org.apache.lucene.util.TestRuleSetupTeardownChained$1.evaluate(TestRuleSetupTeardownChained.java:50)
   [junit4]   1> 	at org.apache.lucene.util.AbstractBeforeAfterRule$1.evaluate(AbstractBeforeAfterRule.java:46)
   [junit4]   1> 	at org.apache.lucene.util.TestRuleThreadAndTestName$1.evaluate(TestRuleThreadAndTestName.java:49)
   [junit4]   1> 	at org.apache.lucene.util.TestRuleIgnoreAfterMaxFailures$1.evaluate(TestRuleIgnoreAfterMaxFailures.java:65)
   [junit4]   1> 	at org.apache.lucene.util.TestRuleMarkFailure$1.evaluate(TestRuleMarkFailure.java:48)
   [junit4]   1> 	at com.carrotsearch.randomizedtesting.rules.StatementAdapter.evaluate(StatementAdapter.java:36)
   [junit4]   1> 	at com.carrotsearch.randomizedtesting.ThreadLeakControl$StatementRunner.run(ThreadLeakControl.java:365)
   [junit4]   1> 	at com.carrotsearch.randomizedtesting.ThreadLeakControl.forkTimeoutingTask(ThreadLeakControl.java:798)
   [junit4]   1> 	at com.carrotsearch.randomizedtesting.ThreadLeakControl$3.evaluate(ThreadLeakControl.java:458)
   [junit4]   1> 	at com.carrotsearch.randomizedtesting.RandomizedRunner.runSingleTest(RandomizedRunner.java:845)
   [junit4]   1> 	at com.carrotsearch.randomizedtesting.RandomizedRunner$3.evaluate(RandomizedRunner.java:747)
   [junit4]   1> 	at com.carrotsearch.randomizedtesting.RandomizedRunner$4.evaluate(RandomizedRunner.java:781)
   [junit4]   1> 	at com.carrotsearch.randomizedtesting.RandomizedRunner$5.evaluate(RandomizedRunner.java:792)
   [junit4]   1> 	at org.apache.lucene.util.AbstractBeforeAfterRule$1.evaluate(AbstractBeforeAfterRule.java:46)
   [junit4]   1> 	at com.carrotsearch.randomizedtesting.rules.StatementAdapter.evaluate(StatementAdapter.java:36)
   [junit4]   1> 	at org.apache.lucene.util.TestRuleStoreClassName$1.evaluate(TestRuleStoreClassName.java:42)
   [junit4]   1> 	at com.carrotsearch.randomizedtesting.rules.NoShadowingOrOverridesOnMethodsRule$1.evaluate(NoShadowingOrOverridesOnMethodsRule.java:39)
   [junit4]   1> 	at com.carrotsearch.randomizedtesting.rules.NoShadowingOrOverridesOnMethodsRule$1.evaluate(NoShadowingOrOverridesOnMethodsRule.java:39)
   [junit4]   1> 	at com.carrotsearch.randomizedtesting.rules.StatementAdapter.evaluate(StatementAdapter.java:36)
   [junit4]   1> 	at com.carrotsearch.randomizedtesting.rules.StatementAdapter.evaluate(StatementAdapter.java:36)
   [junit4]   1> 	at com.carrotsearch.randomizedtesting.rules.StatementAdapter.evaluate(StatementAdapter.java:36)
   [junit4]   1> 	at org.apache.lucene.util.TestRuleAssertionsRequired$1.evaluate(TestRuleAssertionsRequired.java:54)
   [junit4]   1> 	at org.apache.lucene.util.TestRuleMarkFailure$1.evaluate(TestRuleMarkFailure.java:48)
   [junit4]   1> 	at org.apache.lucene.util.TestRuleIgnoreAfterMaxFailures$1.evaluate(TestRuleIgnoreAfterMaxFailures.java:65)
   [junit4]   1> 	at org.apache.lucene.util.TestRuleIgnoreTestSuites$1.evaluate(TestRuleIgnoreTestSuites.java:55)
   [junit4]   1> 	at com.carrotsearch.randomizedtesting.rules.StatementAdapter.evaluate(StatementAdapter.java:36)
   [junit4]   1> 	at com.carrotsearch.randomizedtesting.ThreadLeakControl$StatementRunner.run(ThreadLeakControl.java:365)
   [junit4]   1> 	at java.lang.Thread.run(Thread.java:745)
   [junit4]   1> 
   [junit4]   2> NOTE: download the large Jenkins line-docs file by running 'ant get-jenkins-line-docs' in the lucene directory.
   [junit4]   2> NOTE: reproduce with: ant test  -Dtestcase=TestLucene46FieldInfoFormat -Dtests.method=testRandomExceptions -Dtests.seed=DE5D0B60FB3DAD54 -Dtests.multiplier=2 -Dtests.nightly=true -Dtests.slow=true -Dtests.linedocsfile=/x1/jenkins/lucene-data/enwiki.random.lines.txt -Dtests.locale=sr_BA -Dtests.timezone=Asia/Tashkent -Dtests.asserts=true -Dtests.file.encoding=US-ASCII
   [junit4] FAILURE 0.48s J0 | TestLucene46FieldInfoFormat.testRandomExceptions <<<
   [junit4]    > Throwable #1: java.lang.AssertionError: hit unexpected FileNotFoundException: file=_5k.si
   [junit4]    > 	at __randomizedtesting.SeedInfo.seed([DE5D0B60FB3DAD54:B67265A46533F4F4]:0)
   [junit4]    > 	at org.apache.lucene.index.IndexFileDeleter.deleteFile(IndexFileDeleter.java:753)
   [junit4]    > 	at org.apache.lucene.index.IndexFileDeleter.deletePendingFiles(IndexFileDeleter.java:530)
   [junit4]    > 	at org.apache.lucene.index.IndexFileDeleter.refresh(IndexFileDeleter.java:456)
   [junit4]    > 	at org.apache.lucene.index.IndexWriter.merge(IndexWriter.java:3680)
   [junit4]    > 	at org.apache.lucene.index.SerialMergeScheduler.merge(SerialMergeScheduler.java:40)
   [junit4]    > 	at org.apache.lucene.index.IndexWriter.maybeMerge(IndexWriter.java:1929)
   [junit4]    > 	at org.apache.lucene.index.IndexWriter.doAfterSegmentFlushed(IndexWriter.java:4731)
   [junit4]    > 	at org.apache.lucene.index.DocumentsWriter$MergePendingEvent.process(DocumentsWriter.java:695)
   [junit4]    > 	at org.apache.lucene.index.IndexWriter.processEvents(IndexWriter.java:4757)
   [junit4]    > 	at org.apache.lucene.index.IndexWriter.processEvents(IndexWriter.java:4748)
   [junit4]    > 	at org.apache.lucene.index.IndexWriter.updateDocument(IndexWriter.java:1476)
   [junit4]    > 	at org.apache.lucene.index.IndexWriter.addDocument(IndexWriter.java:1254)
   [junit4]    > 	at org.apache.lucene.index.BaseIndexFileFormatTestCase.testRandomExceptions(BaseIndexFileFormatTestCase.java:429)
   [junit4]    > 	at org.apache.lucene.index.BaseFieldInfoFormatTestCase.testRandomExceptions(BaseFieldInfoFormatTestCase.java:50)
   [junit4]    > 	at java.lang.Thread.run(Thread.java:745)
   [junit4]   2> NOTE: leaving temporary files on disk at: /x1/jenkins/jenkins-slave/workspace/Lucene-Solr-NightlyTests-5.x/lucene/build/backward-codecs/test/J0/temp/lucene.codecs.lucene46.TestLucene46FieldInfoFormat_DE5D0B60FB3DAD54-001
   [junit4]   2> NOTE: test params are: codec=Asserting(Lucene53): {}, docValues:{}, sim=RandomSimilarityProvider(queryNorm=true,coord=no): {}, locale=sr_BA, timezone=Asia/Tashkent
   [junit4]   2> NOTE: Linux 3.13.0-52-generic amd64/Oracle Corporation 1.7.0_72 (64-bit)/cpus=4,threads=1,free=85800248,total=157810688
   [junit4]   2> NOTE: All tests run in this JVM: [TestLucene46UndeadNorms, TestLucene410DocValuesFormat, TestLucene46FieldInfoFormat]
   [junit4] Completed [26/30] on J0 in 0.77s, 11 tests, 1 failure <<< FAILURES!

[...truncated 30 lines...]
BUILD FAILED
/x1/jenkins/jenkins-slave/workspace/Lucene-Solr-NightlyTests-5.x/build.xml:792: The following error occurred while executing this line:
/x1/jenkins/jenkins-slave/workspace/Lucene-Solr-NightlyTests-5.x/build.xml:729: The following error occurred while executing this line:
/x1/jenkins/jenkins-slave/workspace/Lucene-Solr-NightlyTests-5.x/build.xml:59: The following error occurred while executing this line:
/x1/jenkins/jenkins-slave/workspace/Lucene-Solr-NightlyTests-5.x/lucene/build.xml:471: The following error occurred while executing this line:
/x1/jenkins/jenkins-slave/workspace/Lucene-Solr-NightlyTests-5.x/lucene/common-build.xml:2248: The following error occurred while executing this line:
/x1/jenkins/jenkins-slave/workspace/Lucene-Solr-NightlyTests-5.x/lucene/module-build.xml:58: The following error occurred while executing this line:
/x1/jenkins/jenkins-slave/workspace/Lucene-Solr-NightlyTests-5.x/lucene/common-build.xml:1452: The following error occurred while executing this line:
/x1/jenkins/jenkins-slave/workspace/Lucene-Solr-NightlyTests-5.x/lucene/common-build.xml:1006: There were test failures: 30 suites, 806 tests, 2 failures, 81 ignored (81 assumptions)

Total time: 80 minutes 47 seconds
Build step 'Invoke Ant' marked build as failure
Archiving artifacts
Sending artifact delta relative to Lucene-Solr-NightlyTests-5.x #911
Archived 4 artifacts
Archive block size is 32768
Received 0 blocks and 2032136 bytes
Compression is 0.0%
Took 0.68 sec
Recording test results
Email was triggered for: Failure
Sending email for trigger: Failure



Mime
View raw message