lucene-dev mailing list archives

Site index · List index
Message view « Date » · « Thread »
Top « Date » · « Thread »
From Apache Jenkins Server <jenk...@builds.apache.org>
Subject [JENKINS] Lucene-Solr-NightlyTests-5.x - Build # 938 - Still Failing
Date Tue, 25 Aug 2015 23:57:46 GMT
Build: https://builds.apache.org/job/Lucene-Solr-NightlyTests-5.x/938/

3 tests failed.
FAILED:  org.apache.solr.handler.TestReplicationHandler.doTestStressReplication

Error Message:
timed out waiting for collection1 startAt time to exceed: Wed Aug 26 10:23:08 MIST 2015

Stack Trace:
java.lang.AssertionError: timed out waiting for collection1 startAt time to exceed: Wed Aug 26 10:23:08 MIST 2015
	at __randomizedtesting.SeedInfo.seed([6663C668C56EB0BE:BDC8C6AEC046D90D]:0)
	at org.junit.Assert.fail(Assert.java:93)
	at org.apache.solr.handler.TestReplicationHandler.watchCoreStartAt(TestReplicationHandler.java:1417)
	at org.apache.solr.handler.TestReplicationHandler.doTestStressReplication(TestReplicationHandler.java:769)
	at sun.reflect.NativeMethodAccessorImpl.invoke0(Native Method)
	at sun.reflect.NativeMethodAccessorImpl.invoke(NativeMethodAccessorImpl.java:57)
	at sun.reflect.DelegatingMethodAccessorImpl.invoke(DelegatingMethodAccessorImpl.java:43)
	at java.lang.reflect.Method.invoke(Method.java:606)
	at com.carrotsearch.randomizedtesting.RandomizedRunner.invoke(RandomizedRunner.java:1627)
	at com.carrotsearch.randomizedtesting.RandomizedRunner$6.evaluate(RandomizedRunner.java:836)
	at com.carrotsearch.randomizedtesting.RandomizedRunner$7.evaluate(RandomizedRunner.java:872)
	at com.carrotsearch.randomizedtesting.RandomizedRunner$8.evaluate(RandomizedRunner.java:886)
	at com.carrotsearch.randomizedtesting.rules.SystemPropertiesRestoreRule$1.evaluate(SystemPropertiesRestoreRule.java:57)
	at org.apache.lucene.util.TestRuleSetupTeardownChained$1.evaluate(TestRuleSetupTeardownChained.java:50)
	at org.apache.lucene.util.AbstractBeforeAfterRule$1.evaluate(AbstractBeforeAfterRule.java:46)
	at org.apache.lucene.util.TestRuleThreadAndTestName$1.evaluate(TestRuleThreadAndTestName.java:49)
	at org.apache.lucene.util.TestRuleIgnoreAfterMaxFailures$1.evaluate(TestRuleIgnoreAfterMaxFailures.java:65)
	at org.apache.lucene.util.TestRuleMarkFailure$1.evaluate(TestRuleMarkFailure.java:48)
	at com.carrotsearch.randomizedtesting.rules.StatementAdapter.evaluate(StatementAdapter.java:36)
	at com.carrotsearch.randomizedtesting.ThreadLeakControl$StatementRunner.run(ThreadLeakControl.java:365)
	at com.carrotsearch.randomizedtesting.ThreadLeakControl.forkTimeoutingTask(ThreadLeakControl.java:798)
	at com.carrotsearch.randomizedtesting.ThreadLeakControl$3.evaluate(ThreadLeakControl.java:458)
	at com.carrotsearch.randomizedtesting.RandomizedRunner.runSingleTest(RandomizedRunner.java:845)
	at com.carrotsearch.randomizedtesting.RandomizedRunner$3.evaluate(RandomizedRunner.java:747)
	at com.carrotsearch.randomizedtesting.RandomizedRunner$4.evaluate(RandomizedRunner.java:781)
	at com.carrotsearch.randomizedtesting.RandomizedRunner$5.evaluate(RandomizedRunner.java:792)
	at com.carrotsearch.randomizedtesting.rules.StatementAdapter.evaluate(StatementAdapter.java:36)
	at com.carrotsearch.randomizedtesting.rules.SystemPropertiesRestoreRule$1.evaluate(SystemPropertiesRestoreRule.java:57)
	at org.apache.lucene.util.AbstractBeforeAfterRule$1.evaluate(AbstractBeforeAfterRule.java:46)
	at com.carrotsearch.randomizedtesting.rules.StatementAdapter.evaluate(StatementAdapter.java:36)
	at org.apache.lucene.util.TestRuleStoreClassName$1.evaluate(TestRuleStoreClassName.java:42)
	at com.carrotsearch.randomizedtesting.rules.NoShadowingOrOverridesOnMethodsRule$1.evaluate(NoShadowingOrOverridesOnMethodsRule.java:39)
	at com.carrotsearch.randomizedtesting.rules.NoShadowingOrOverridesOnMethodsRule$1.evaluate(NoShadowingOrOverridesOnMethodsRule.java:39)
	at com.carrotsearch.randomizedtesting.rules.StatementAdapter.evaluate(StatementAdapter.java:36)
	at com.carrotsearch.randomizedtesting.rules.StatementAdapter.evaluate(StatementAdapter.java:36)
	at com.carrotsearch.randomizedtesting.rules.StatementAdapter.evaluate(StatementAdapter.java:36)
	at org.apache.lucene.util.TestRuleAssertionsRequired$1.evaluate(TestRuleAssertionsRequired.java:54)
	at org.apache.lucene.util.TestRuleMarkFailure$1.evaluate(TestRuleMarkFailure.java:48)
	at org.apache.lucene.util.TestRuleIgnoreAfterMaxFailures$1.evaluate(TestRuleIgnoreAfterMaxFailures.java:65)
	at org.apache.lucene.util.TestRuleIgnoreTestSuites$1.evaluate(TestRuleIgnoreTestSuites.java:55)
	at com.carrotsearch.randomizedtesting.rules.StatementAdapter.evaluate(StatementAdapter.java:36)
	at com.carrotsearch.randomizedtesting.ThreadLeakControl$StatementRunner.run(ThreadLeakControl.java:365)
	at java.lang.Thread.run(Thread.java:745)


FAILED:  org.apache.solr.cloud.CollectionsAPIDistributedZkTest.test

Error Message:
Error from server at http://127.0.0.1:42181: Could not load collection from ZK:halfcollectionblocker

Stack Trace:
org.apache.solr.client.solrj.impl.HttpSolrClient$RemoteSolrException: Error from server at http://127.0.0.1:42181: Could not load collection from ZK:halfcollectionblocker
	at org.apache.solr.client.solrj.impl.HttpSolrClient.executeMethod(HttpSolrClient.java:560)
	at org.apache.solr.client.solrj.impl.HttpSolrClient.request(HttpSolrClient.java:234)
	at org.apache.solr.client.solrj.impl.HttpSolrClient.request(HttpSolrClient.java:226)
	at org.apache.solr.client.solrj.SolrClient.request(SolrClient.java:1220)
	at org.apache.solr.cloud.CollectionsAPIDistributedZkTest.makeRequest(CollectionsAPIDistributedZkTest.java:302)
	at org.apache.solr.cloud.CollectionsAPIDistributedZkTest.testErrorHandling(CollectionsAPIDistributedZkTest.java:419)
	at org.apache.solr.cloud.CollectionsAPIDistributedZkTest.test(CollectionsAPIDistributedZkTest.java:169)
	at sun.reflect.NativeMethodAccessorImpl.invoke0(Native Method)
	at sun.reflect.NativeMethodAccessorImpl.invoke(NativeMethodAccessorImpl.java:57)
	at sun.reflect.DelegatingMethodAccessorImpl.invoke(DelegatingMethodAccessorImpl.java:43)
	at java.lang.reflect.Method.invoke(Method.java:606)
	at com.carrotsearch.randomizedtesting.RandomizedRunner.invoke(RandomizedRunner.java:1627)
	at com.carrotsearch.randomizedtesting.RandomizedRunner$6.evaluate(RandomizedRunner.java:836)
	at com.carrotsearch.randomizedtesting.RandomizedRunner$7.evaluate(RandomizedRunner.java:872)
	at com.carrotsearch.randomizedtesting.RandomizedRunner$8.evaluate(RandomizedRunner.java:886)
	at org.apache.solr.BaseDistributedSearchTestCase$ShardsRepeatRule$ShardsFixedStatement.callStatement(BaseDistributedSearchTestCase.java:963)
	at org.apache.solr.BaseDistributedSearchTestCase$ShardsRepeatRule$ShardsStatement.evaluate(BaseDistributedSearchTestCase.java:938)
	at com.carrotsearch.randomizedtesting.rules.SystemPropertiesRestoreRule$1.evaluate(SystemPropertiesRestoreRule.java:57)
	at org.apache.lucene.util.TestRuleSetupTeardownChained$1.evaluate(TestRuleSetupTeardownChained.java:50)
	at org.apache.lucene.util.AbstractBeforeAfterRule$1.evaluate(AbstractBeforeAfterRule.java:46)
	at org.apache.lucene.util.TestRuleThreadAndTestName$1.evaluate(TestRuleThreadAndTestName.java:49)
	at org.apache.lucene.util.TestRuleIgnoreAfterMaxFailures$1.evaluate(TestRuleIgnoreAfterMaxFailures.java:65)
	at org.apache.lucene.util.TestRuleMarkFailure$1.evaluate(TestRuleMarkFailure.java:48)
	at com.carrotsearch.randomizedtesting.rules.StatementAdapter.evaluate(StatementAdapter.java:36)
	at com.carrotsearch.randomizedtesting.ThreadLeakControl$StatementRunner.run(ThreadLeakControl.java:365)
	at com.carrotsearch.randomizedtesting.ThreadLeakControl.forkTimeoutingTask(ThreadLeakControl.java:798)
	at com.carrotsearch.randomizedtesting.ThreadLeakControl$3.evaluate(ThreadLeakControl.java:458)
	at com.carrotsearch.randomizedtesting.RandomizedRunner.runSingleTest(RandomizedRunner.java:845)
	at com.carrotsearch.randomizedtesting.RandomizedRunner$3.evaluate(RandomizedRunner.java:747)
	at com.carrotsearch.randomizedtesting.RandomizedRunner$4.evaluate(RandomizedRunner.java:781)
	at com.carrotsearch.randomizedtesting.RandomizedRunner$5.evaluate(RandomizedRunner.java:792)
	at com.carrotsearch.randomizedtesting.rules.StatementAdapter.evaluate(StatementAdapter.java:36)
	at com.carrotsearch.randomizedtesting.rules.SystemPropertiesRestoreRule$1.evaluate(SystemPropertiesRestoreRule.java:57)
	at org.apache.lucene.util.AbstractBeforeAfterRule$1.evaluate(AbstractBeforeAfterRule.java:46)
	at com.carrotsearch.randomizedtesting.rules.StatementAdapter.evaluate(StatementAdapter.java:36)
	at org.apache.lucene.util.TestRuleStoreClassName$1.evaluate(TestRuleStoreClassName.java:42)
	at com.carrotsearch.randomizedtesting.rules.NoShadowingOrOverridesOnMethodsRule$1.evaluate(NoShadowingOrOverridesOnMethodsRule.java:39)
	at com.carrotsearch.randomizedtesting.rules.NoShadowingOrOverridesOnMethodsRule$1.evaluate(NoShadowingOrOverridesOnMethodsRule.java:39)
	at com.carrotsearch.randomizedtesting.rules.StatementAdapter.evaluate(StatementAdapter.java:36)
	at com.carrotsearch.randomizedtesting.rules.StatementAdapter.evaluate(StatementAdapter.java:36)
	at com.carrotsearch.randomizedtesting.rules.StatementAdapter.evaluate(StatementAdapter.java:36)
	at org.apache.lucene.util.TestRuleAssertionsRequired$1.evaluate(TestRuleAssertionsRequired.java:54)
	at org.apache.lucene.util.TestRuleMarkFailure$1.evaluate(TestRuleMarkFailure.java:48)
	at org.apache.lucene.util.TestRuleIgnoreAfterMaxFailures$1.evaluate(TestRuleIgnoreAfterMaxFailures.java:65)
	at org.apache.lucene.util.TestRuleIgnoreTestSuites$1.evaluate(TestRuleIgnoreTestSuites.java:55)
	at com.carrotsearch.randomizedtesting.rules.StatementAdapter.evaluate(StatementAdapter.java:36)
	at com.carrotsearch.randomizedtesting.ThreadLeakControl$StatementRunner.run(ThreadLeakControl.java:365)
	at java.lang.Thread.run(Thread.java:745)


FAILED:  org.apache.solr.cloud.hdfs.HdfsCollectionsAPIDistributedZkTest.test

Error Message:
Captured an uncaught exception in thread: Thread[id=62308, name=collection2, state=RUNNABLE, group=TGRP-HdfsCollectionsAPIDistributedZkTest]

Stack Trace:
com.carrotsearch.randomizedtesting.UncaughtExceptionError: Captured an uncaught exception in thread: Thread[id=62308, name=collection2, state=RUNNABLE, group=TGRP-HdfsCollectionsAPIDistributedZkTest]
Caused by: org.apache.solr.client.solrj.impl.HttpSolrClient$RemoteSolrException: Error from server at http://127.0.0.1:40454/n/ai: Could not find collection : awholynewstresscollection_collection2_0
	at __randomizedtesting.SeedInfo.seed([6663C668C56EB0BE]:0)
	at org.apache.solr.client.solrj.impl.HttpSolrClient.executeMethod(HttpSolrClient.java:560)
	at org.apache.solr.client.solrj.impl.HttpSolrClient.request(HttpSolrClient.java:234)
	at org.apache.solr.client.solrj.impl.HttpSolrClient.request(HttpSolrClient.java:226)
	at org.apache.solr.client.solrj.impl.LBHttpSolrClient.doRequest(LBHttpSolrClient.java:372)
	at org.apache.solr.client.solrj.impl.LBHttpSolrClient.request(LBHttpSolrClient.java:325)
	at org.apache.solr.client.solrj.impl.CloudSolrClient.sendRequest(CloudSolrClient.java:1086)
	at org.apache.solr.client.solrj.impl.CloudSolrClient.requestWithRetryOnStaleState(CloudSolrClient.java:857)
	at org.apache.solr.client.solrj.impl.CloudSolrClient.request(CloudSolrClient.java:800)
	at org.apache.solr.client.solrj.SolrClient.request(SolrClient.java:1220)
	at org.apache.solr.cloud.CollectionsAPIDistributedZkTest$1CollectionThread.run(CollectionsAPIDistributedZkTest.java:895)




Build Log:
[...truncated 10482 lines...]
   [junit4] Suite: org.apache.solr.cloud.CollectionsAPIDistributedZkTest
   [junit4]   2> Creating dataDir: /x1/jenkins/jenkins-slave/workspace/Lucene-Solr-NightlyTests-5.x/solr/build/solr-core/test/J1/temp/solr.cloud.CollectionsAPIDistributedZkTest_6663C668C56EB0BE-001/init-core-data-001
   [junit4]   2> 363097 INFO  (SUITE-CollectionsAPIDistributedZkTest-seed#[6663C668C56EB0BE]-worker) [    ] o.a.s.SolrTestCaseJ4 Randomized ssl (false) and clientAuth (false)
   [junit4]   2> 363097 INFO  (SUITE-CollectionsAPIDistributedZkTest-seed#[6663C668C56EB0BE]-worker) [    ] o.a.s.BaseDistributedSearchTestCase Setting hostContext system property: /
   [junit4]   2> 363102 INFO  (TEST-CollectionsAPIDistributedZkTest.test-seed#[6663C668C56EB0BE]) [    ] o.a.s.c.ZkTestServer STARTING ZK TEST SERVER
   [junit4]   2> 363102 INFO  (Thread-1293) [    ] o.a.s.c.ZkTestServer client port:0.0.0.0/0.0.0.0:0
   [junit4]   2> 363103 INFO  (Thread-1293) [    ] o.a.s.c.ZkTestServer Starting server
   [junit4]   2> 363202 INFO  (TEST-CollectionsAPIDistributedZkTest.test-seed#[6663C668C56EB0BE]) [    ] o.a.s.c.ZkTestServer start zk server on port:53004
   [junit4]   2> 363203 INFO  (TEST-CollectionsAPIDistributedZkTest.test-seed#[6663C668C56EB0BE]) [    ] o.a.s.c.c.SolrZkClient Using default ZkCredentialsProvider
   [junit4]   2> 363203 INFO  (TEST-CollectionsAPIDistributedZkTest.test-seed#[6663C668C56EB0BE]) [    ] o.a.s.c.c.ConnectionManager Waiting for client to connect to ZooKeeper
   [junit4]   2> 363206 INFO  (zkCallback-221-thread-1) [    ] o.a.s.c.c.ConnectionManager Watcher org.apache.solr.common.cloud.ConnectionManager@3f3cad5e name:ZooKeeperConnection Watcher:127.0.0.1:53004 got event WatchedEvent state:SyncConnected type:None path:null path:null type:None
   [junit4]   2> 363206 INFO  (TEST-CollectionsAPIDistributedZkTest.test-seed#[6663C668C56EB0BE]) [    ] o.a.s.c.c.ConnectionManager Client is connected to ZooKeeper
   [junit4]   2> 363206 INFO  (TEST-CollectionsAPIDistributedZkTest.test-seed#[6663C668C56EB0BE]) [    ] o.a.s.c.c.SolrZkClient Using default ZkACLProvider
   [junit4]   2> 363206 INFO  (TEST-CollectionsAPIDistributedZkTest.test-seed#[6663C668C56EB0BE]) [    ] o.a.s.c.c.SolrZkClient makePath: /solr
   [junit4]   2> 363209 WARN  (NIOServerCxn.Factory:0.0.0.0/0.0.0.0:0) [    ] o.a.z.s.NIOServerCnxn caught end of stream exception
   [junit4]   2> EndOfStreamException: Unable to read additional data from client sessionid 0x14f67112b950000, likely client has closed socket
   [junit4]   2> 	at org.apache.zookeeper.server.NIOServerCnxn.doIO(NIOServerCnxn.java:228)
   [junit4]   2> 	at org.apache.zookeeper.server.NIOServerCnxnFactory.run(NIOServerCnxnFactory.java:208)
   [junit4]   2> 	at java.lang.Thread.run(Thread.java:745)
   [junit4]   2> 363209 INFO  (TEST-CollectionsAPIDistributedZkTest.test-seed#[6663C668C56EB0BE]) [    ] o.a.s.c.c.SolrZkClient Using default ZkCredentialsProvider
   [junit4]   2> 363210 INFO  (TEST-CollectionsAPIDistributedZkTest.test-seed#[6663C668C56EB0BE]) [    ] o.a.s.c.c.ConnectionManager Waiting for client to connect to ZooKeeper
   [junit4]   2> 363212 INFO  (zkCallback-222-thread-1) [    ] o.a.s.c.c.ConnectionManager Watcher org.apache.solr.common.cloud.ConnectionManager@2bb6c738 name:ZooKeeperConnection Watcher:127.0.0.1:53004/solr got event WatchedEvent state:SyncConnected type:None path:null path:null type:None
   [junit4]   2> 363212 INFO  (TEST-CollectionsAPIDistributedZkTest.test-seed#[6663C668C56EB0BE]) [    ] o.a.s.c.c.ConnectionManager Client is connected to ZooKeeper
   [junit4]   2> 363212 INFO  (TEST-CollectionsAPIDistributedZkTest.test-seed#[6663C668C56EB0BE]) [    ] o.a.s.c.c.SolrZkClient Using default ZkACLProvider
   [junit4]   2> 363212 INFO  (TEST-CollectionsAPIDistributedZkTest.test-seed#[6663C668C56EB0BE]) [    ] o.a.s.c.c.SolrZkClient makePath: /collections/collection1
   [junit4]   2> 363214 INFO  (TEST-CollectionsAPIDistributedZkTest.test-seed#[6663C668C56EB0BE]) [    ] o.a.s.c.c.SolrZkClient makePath: /collections/collection1/shards
   [junit4]   2> 363216 INFO  (TEST-CollectionsAPIDistributedZkTest.test-seed#[6663C668C56EB0BE]) [    ] o.a.s.c.c.SolrZkClient makePath: /collections/control_collection
   [junit4]   2> 363218 INFO  (TEST-CollectionsAPIDistributedZkTest.test-seed#[6663C668C56EB0BE]) [    ] o.a.s.c.c.SolrZkClient makePath: /collections/control_collection/shards
   [junit4]   2> 363220 INFO  (TEST-CollectionsAPIDistributedZkTest.test-seed#[6663C668C56EB0BE]) [    ] o.a.s.c.AbstractZkTestCase put /x1/jenkins/jenkins-slave/workspace/Lucene-Solr-NightlyTests-5.x/solr/core/src/test-files/solr/collection1/conf/solrconfig-tlog.xml to /configs/conf1/solrconfig.xml
   [junit4]   2> 363220 INFO  (TEST-CollectionsAPIDistributedZkTest.test-seed#[6663C668C56EB0BE]) [    ] o.a.s.c.c.SolrZkClient makePath: /configs/conf1/solrconfig.xml
   [junit4]   2> 363223 INFO  (TEST-CollectionsAPIDistributedZkTest.test-seed#[6663C668C56EB0BE]) [    ] o.a.s.c.AbstractZkTestCase put /x1/jenkins/jenkins-slave/workspace/Lucene-Solr-NightlyTests-5.x/solr/core/src/test-files/solr/collection1/conf/schema.xml to /configs/conf1/schema.xml
   [junit4]   2> 363223 INFO  (TEST-CollectionsAPIDistributedZkTest.test-seed#[6663C668C56EB0BE]) [    ] o.a.s.c.c.SolrZkClient makePath: /configs/conf1/schema.xml
   [junit4]   2> 363225 INFO  (TEST-CollectionsAPIDistributedZkTest.test-seed#[6663C668C56EB0BE]) [    ] o.a.s.c.AbstractZkTestCase put /x1/jenkins/jenkins-slave/workspace/Lucene-Solr-NightlyTests-5.x/solr/core/src/test-files/solr/collection1/conf/solrconfig.snippet.randomindexconfig.xml to /configs/conf1/solrconfig.snippet.randomindexconfig.xml
   [junit4]   2> 363226 INFO  (TEST-CollectionsAPIDistributedZkTest.test-seed#[6663C668C56EB0BE]) [    ] o.a.s.c.c.SolrZkClient makePath: /configs/conf1/solrconfig.snippet.randomindexconfig.xml
   [junit4]   2> 363228 INFO  (TEST-CollectionsAPIDistributedZkTest.test-seed#[6663C668C56EB0BE]) [    ] o.a.s.c.AbstractZkTestCase put /x1/jenkins/jenkins-slave/workspace/Lucene-Solr-NightlyTests-5.x/solr/core/src/test-files/solr/collection1/conf/stopwords.txt to /configs/conf1/stopwords.txt
   [junit4]   2> 363228 INFO  (TEST-CollectionsAPIDistributedZkTest.test-seed#[6663C668C56EB0BE]) [    ] o.a.s.c.c.SolrZkClient makePath: /configs/conf1/stopwords.txt
   [junit4]   2> 363230 INFO  (TEST-CollectionsAPIDistributedZkTest.test-seed#[6663C668C56EB0BE]) [    ] o.a.s.c.AbstractZkTestCase put /x1/jenkins/jenkins-slave/workspace/Lucene-Solr-NightlyTests-5.x/solr/core/src/test-files/solr/collection1/conf/protwords.txt to /configs/conf1/protwords.txt
   [junit4]   2> 363230 INFO  (TEST-CollectionsAPIDistributedZkTest.test-seed#[6663C668C56EB0BE]) [    ] o.a.s.c.c.SolrZkClient makePath: /configs/conf1/protwords.txt
   [junit4]   2> 363232 INFO  (TEST-CollectionsAPIDistributedZkTest.test-seed#[6663C668C56EB0BE]) [    ] o.a.s.c.AbstractZkTestCase put /x1/jenkins/jenkins-slave/workspace/Lucene-Solr-NightlyTests-5.x/solr/core/src/test-files/solr/collection1/conf/currency.xml to /configs/conf1/currency.xml
   [junit4]   2> 363233 INFO  (TEST-CollectionsAPIDistributedZkTest.test-seed#[6663C668C56EB0BE]) [    ] o.a.s.c.c.SolrZkClient makePath: /configs/conf1/currency.xml
   [junit4]   2> 363234 INFO  (TEST-CollectionsAPIDistributedZkTest.test-seed#[6663C668C56EB0BE]) [    ] o.a.s.c.AbstractZkTestCase put /x1/jenkins/jenkins-slave/workspace/Lucene-Solr-NightlyTests-5.x/solr/core/src/test-files/solr/collection1/conf/enumsConfig.xml to /configs/conf1/enumsConfig.xml
   [junit4]   2> 363235 INFO  (TEST-CollectionsAPIDistributedZkTest.test-seed#[6663C668C56EB0BE]) [    ] o.a.s.c.c.SolrZkClient makePath: /configs/conf1/enumsConfig.xml
   [junit4]   2> 363236 INFO  (TEST-CollectionsAPIDistributedZkTest.test-seed#[6663C668C56EB0BE]) [    ] o.a.s.c.AbstractZkTestCase put /x1/jenkins/jenkins-slave/workspace/Lucene-Solr-NightlyTests-5.x/solr/core/src/test-files/solr/collection1/conf/open-exchange-rates.json to /configs/conf1/open-exchange-rates.json
   [junit4]   2> 363237 INFO  (TEST-CollectionsAPIDistributedZkTest.test-seed#[6663C668C56EB0BE]) [    ] o.a.s.c.c.SolrZkClient makePath: /configs/conf1/open-exchange-rates.json
   [junit4]   2> 363238 INFO  (TEST-CollectionsAPIDistributedZkTest.test-seed#[6663C668C56EB0BE]) [    ] o.a.s.c.AbstractZkTestCase put /x1/jenkins/jenkins-slave/workspace/Lucene-Solr-NightlyTests-5.x/solr/core/src/test-files/solr/collection1/conf/mapping-ISOLatin1Accent.txt to /configs/conf1/mapping-ISOLatin1Accent.txt
   [junit4]   2> 363239 INFO  (TEST-CollectionsAPIDistributedZkTest.test-seed#[6663C668C56EB0BE]) [    ] o.a.s.c.c.SolrZkClient makePath: /configs/conf1/mapping-ISOLatin1Accent.txt
   [junit4]   2> 363240 INFO  (TEST-CollectionsAPIDistributedZkTest.test-seed#[6663C668C56EB0BE]) [    ] o.a.s.c.AbstractZkTestCase put /x1/jenkins/jenkins-slave/workspace/Lucene-Solr-NightlyTests-5.x/solr/core/src/test-files/solr/collection1/conf/old_synonyms.txt to /configs/conf1/old_synonyms.txt
   [junit4]   2> 363241 INFO  (TEST-CollectionsAPIDistributedZkTest.test-seed#[6663C668C56EB0BE]) [    ] o.a.s.c.c.SolrZkClient makePath: /configs/conf1/old_synonyms.txt
   [junit4]   2> 363243 INFO  (TEST-CollectionsAPIDistributedZkTest.test-seed#[6663C668C56EB0BE]) [    ] o.a.s.c.AbstractZkTestCase put /x1/jenkins/jenkins-slave/workspace/Lucene-Solr-NightlyTests-5.x/solr/core/src/test-files/solr/collection1/conf/synonyms.txt to /configs/conf1/synonyms.txt
   [junit4]   2> 363243 INFO  (TEST-CollectionsAPIDistributedZkTest.test-seed#[6663C668C56EB0BE]) [    ] o.a.s.c.c.SolrZkClient makePath: /configs/conf1/synonyms.txt
   [junit4]   2> 363523 INFO  (TEST-CollectionsAPIDistributedZkTest.test-seed#[6663C668C56EB0BE]) [    ] o.a.s.SolrTestCaseJ4 Writing core.properties file to /x1/jenkins/jenkins-slave/workspace/Lucene-Solr-NightlyTests-5.x/solr/build/solr-core/test/J1/temp/solr.cloud.CollectionsAPIDistributedZkTest_6663C668C56EB0BE-001/control-001/cores/collection1
   [junit4]   2> 363525 INFO  (TEST-CollectionsAPIDistributedZkTest.test-seed#[6663C668C56EB0BE]) [    ] o.e.j.s.Server jetty-9.2.13.v20150730
   [junit4]   2> 363527 INFO  (TEST-CollectionsAPIDistributedZkTest.test-seed#[6663C668C56EB0BE]) [    ] o.e.j.s.h.ContextHandler Started o.e.j.s.ServletContextHandler@60ac3905{/,null,AVAILABLE}
   [junit4]   2> 363530 INFO  (TEST-CollectionsAPIDistributedZkTest.test-seed#[6663C668C56EB0BE]) [    ] o.e.j.s.ServerConnector Started ServerConnector@4ad3a8d8{HTTP/1.1}{127.0.0.1:39900}
   [junit4]   2> 363530 INFO  (TEST-CollectionsAPIDistributedZkTest.test-seed#[6663C668C56EB0BE]) [    ] o.e.j.s.Server Started @367032ms
   [junit4]   2> 363530 INFO  (TEST-CollectionsAPIDistributedZkTest.test-seed#[6663C668C56EB0BE]) [    ] o.a.s.c.s.e.JettySolrRunner Jetty properties: {hostPort=39900, solr.data.dir=/x1/jenkins/jenkins-slave/workspace/Lucene-Solr-NightlyTests-5.x/solr/build/solr-core/test/J1/temp/solr.cloud.CollectionsAPIDistributedZkTest_6663C668C56EB0BE-001/tempDir-001/control/data, coreRootDirectory=/x1/jenkins/jenkins-slave/workspace/Lucene-Solr-NightlyTests-5.x/solr/build/solr-core/test/J1/../../../../../../../../../../x1/jenkins/jenkins-slave/workspace/Lucene-Solr-NightlyTests-5.x/solr/build/solr-core/test/J1/temp/solr.cloud.CollectionsAPIDistributedZkTest_6663C668C56EB0BE-001/control-001/cores, hostContext=/}
   [junit4]   2> 363530 INFO  (TEST-CollectionsAPIDistributedZkTest.test-seed#[6663C668C56EB0BE]) [    ] o.a.s.s.SolrDispatchFilter SolrDispatchFilter.init(): sun.misc.Launcher$AppClassLoader@4e0add57
   [junit4]   2> 363530 INFO  (TEST-CollectionsAPIDistributedZkTest.test-seed#[6663C668C56EB0BE]) [    ] o.a.s.c.SolrResourceLoader new SolrResourceLoader for directory: '/x1/jenkins/jenkins-slave/workspace/Lucene-Solr-NightlyTests-5.x/solr/build/solr-core/test/J1/../../../../../../../../../../x1/jenkins/jenkins-slave/workspace/Lucene-Solr-NightlyTests-5.x/solr/build/solr-core/test/J1/temp/solr.cloud.CollectionsAPIDistributedZkTest_6663C668C56EB0BE-001/control-001/'
   [junit4]   2> 363547 INFO  (TEST-CollectionsAPIDistributedZkTest.test-seed#[6663C668C56EB0BE]) [    ] o.a.s.c.c.SolrZkClient Using default ZkCredentialsProvider
   [junit4]   2> 363550 INFO  (TEST-CollectionsAPIDistributedZkTest.test-seed#[6663C668C56EB0BE]) [    ] o.a.s.c.c.ConnectionManager Waiting for client to connect to ZooKeeper
   [junit4]   2> 363553 INFO  (zkCallback-223-thread-1) [    ] o.a.s.c.c.ConnectionManager Watcher org.apache.solr.common.cloud.ConnectionManager@5ab2ecd3 name:ZooKeeperConnection Watcher:127.0.0.1:53004/solr got event WatchedEvent state:SyncConnected type:None path:null path:null type:None
   [junit4]   2> 363553 INFO  (TEST-CollectionsAPIDistributedZkTest.test-seed#[6663C668C56EB0BE]) [    ] o.a.s.c.c.ConnectionManager Client is connected to ZooKeeper
   [junit4]   2> 363553 INFO  (TEST-CollectionsAPIDistributedZkTest.test-seed#[6663C668C56EB0BE]) [    ] o.a.s.c.c.SolrZkClient Using default ZkACLProvider
   [junit4]   2> 363555 INFO  (TEST-CollectionsAPIDistributedZkTest.test-seed#[6663C668C56EB0BE]) [    ] o.a.s.s.SolrDispatchFilter Loading solr.xml from SolrHome (not found in ZooKeeper)
   [junit4]   2> 363555 INFO  (TEST-CollectionsAPIDistributedZkTest.test-seed#[6663C668C56EB0BE]) [    ] o.a.s.c.SolrXmlConfig Loading container configuration from /x1/jenkins/jenkins-slave/workspace/Lucene-Solr-NightlyTests-5.x/solr/build/solr-core/test/J1/../../../../../../../../../../x1/jenkins/jenkins-slave/workspace/Lucene-Solr-NightlyTests-5.x/solr/build/solr-core/test/J1/temp/solr.cloud.CollectionsAPIDistributedZkTest_6663C668C56EB0BE-001/control-001/solr.xml
   [junit4]   2> 363570 INFO  (TEST-CollectionsAPIDistributedZkTest.test-seed#[6663C668C56EB0BE]) [    ] o.a.s.c.CoresLocator Config-defined core root directory: /x1/jenkins/jenkins-slave/workspace/Lucene-Solr-NightlyTests-5.x/solr/build/solr-core/test/J1/../../../../../../../../../../x1/jenkins/jenkins-slave/workspace/Lucene-Solr-NightlyTests-5.x/solr/build/solr-core/test/J1/temp/solr.cloud.CollectionsAPIDistributedZkTest_6663C668C56EB0BE-001/control-001/cores
   [junit4]   2> 363570 INFO  (TEST-CollectionsAPIDistributedZkTest.test-seed#[6663C668C56EB0BE]) [    ] o.a.s.c.CoreContainer New CoreContainer 1521765746
   [junit4]   2> 363570 INFO  (TEST-CollectionsAPIDistributedZkTest.test-seed#[6663C668C56EB0BE]) [    ] o.a.s.c.CoreContainer Loading cores into CoreContainer [instanceDir=/x1/jenkins/jenkins-slave/workspace/Lucene-Solr-NightlyTests-5.x/solr/build/solr-core/test/J1/../../../../../../../../../../x1/jenkins/jenkins-slave/workspace/Lucene-Solr-NightlyTests-5.x/solr/build/solr-core/test/J1/temp/solr.cloud.CollectionsAPIDistributedZkTest_6663C668C56EB0BE-001/control-001/]
   [junit4]   2> 363570 INFO  (TEST-CollectionsAPIDistributedZkTest.test-seed#[6663C668C56EB0BE]) [    ] o.a.s.c.CoreContainer loading shared library: /x1/jenkins/jenkins-slave/workspace/Lucene-Solr-NightlyTests-5.x/solr/build/solr-core/test/J1/../../../../../../../../../../x1/jenkins/jenkins-slave/workspace/Lucene-Solr-NightlyTests-5.x/solr/build/solr-core/test/J1/temp/solr.cloud.CollectionsAPIDistributedZkTest_6663C668C56EB0BE-001/control-001/lib
   [junit4]   2> 363570 WARN  (TEST-CollectionsAPIDistributedZkTest.test-seed#[6663C668C56EB0BE]) [    ] o.a.s.c.SolrResourceLoader Can't find (or read) directory to add to classloader: lib (resolved as: /x1/jenkins/jenkins-slave/workspace/Lucene-Solr-NightlyTests-5.x/solr/build/solr-core/test/J1/../../../../../../../../../../x1/jenkins/jenkins-slave/workspace/Lucene-Solr-NightlyTests-5.x/solr/build/solr-core/test/J1/temp/solr.cloud.CollectionsAPIDistributedZkTest_6663C668C56EB0BE-001/control-001/lib).
   [junit4]   2> 363578 INFO  (TEST-CollectionsAPIDistributedZkTest.test-seed#[6663C668C56EB0BE]) [    ] o.a.s.h.c.HttpShardHandlerFactory created with socketTimeout : 90000,urlScheme : ,connTimeout : 15000,maxConnectionsPerHost : 20,maxConnections : 10000,corePoolSize : 0,maximumPoolSize : 2147483647,maxThreadIdleTime : 5,sizeOfQueue : -1,fairnessPolicy : false,useRetries : false,
   [junit4]   2> 363580 INFO  (TEST-CollectionsAPIDistributedZkTest.test-seed#[6663C668C56EB0BE]) [    ] o.a.s.u.UpdateShardHandler Creating UpdateShardHandler HTTP client with params: socketTimeout=340000&connTimeout=45000&retry=true
   [junit4]   2> 363580 INFO  (TEST-CollectionsAPIDistributedZkTest.test-seed#[6663C668C56EB0BE]) [    ] o.a.s.l.LogWatcher SLF4J impl is org.slf4j.impl.Log4jLoggerFactory
   [junit4]   2> 363580 INFO  (TEST-CollectionsAPIDistributedZkTest.test-seed#[6663C668C56EB0BE]) [    ] o.a.s.l.LogWatcher Registering Log Listener [Log4j (org.slf4j.impl.Log4jLoggerFactory)]
   [junit4]   2> 363581 INFO  (TEST-CollectionsAPIDistributedZkTest.test-seed#[6663C668C56EB0BE]) [    ] o.a.s.c.ZkContainer Zookeeper client=127.0.0.1:53004/solr
   [junit4]   2> 363581 INFO  (TEST-CollectionsAPIDistributedZkTest.test-seed#[6663C668C56EB0BE]) [    ] o.a.s.c.ZkController zkHost includes chroot
   [junit4]   2> 363581 INFO  (TEST-CollectionsAPIDistributedZkTest.test-seed#[6663C668C56EB0BE]) [    ] o.a.s.c.c.SolrZkClient Using default ZkCredentialsProvider
   [junit4]   2> 363581 INFO  (TEST-CollectionsAPIDistributedZkTest.test-seed#[6663C668C56EB0BE]) [    ] o.a.s.c.c.ConnectionManager Waiting for client to connect to ZooKeeper
   [junit4]   2> 363583 INFO  (zkCallback-225-thread-1) [    ] o.a.s.c.c.ConnectionManager Watcher org.apache.solr.common.cloud.ConnectionManager@1f7244bb name:ZooKeeperConnection Watcher:127.0.0.1:53004 got event WatchedEvent state:SyncConnected type:None path:null path:null type:None
   [junit4]   2> 363583 INFO  (TEST-CollectionsAPIDistributedZkTest.test-seed#[6663C668C56EB0BE]) [    ] o.a.s.c.c.ConnectionManager Client is connected to ZooKeeper
   [junit4]   2> 363584 INFO  (TEST-CollectionsAPIDistributedZkTest.test-seed#[6663C668C56EB0BE]) [    ] o.a.s.c.c.SolrZkClient Using default ZkACLProvider
   [junit4]   2> 363585 INFO  (TEST-CollectionsAPIDistributedZkTest.test-seed#[6663C668C56EB0BE]) [n:127.0.0.1:39900_    ] o.a.s.c.c.ConnectionManager Waiting for client to connect to ZooKeeper
   [junit4]   2> 363586 INFO  (zkCallback-226-thread-1-processing-n:127.0.0.1:39900_) [n:127.0.0.1:39900_    ] o.a.s.c.c.ConnectionManager Watcher org.apache.solr.common.cloud.ConnectionManager@425c045e name:ZooKeeperConnection Watcher:127.0.0.1:53004/solr got event WatchedEvent state:SyncConnected type:None path:null path:null type:None
   [junit4]   2> 363587 INFO  (TEST-CollectionsAPIDistributedZkTest.test-seed#[6663C668C56EB0BE]) [n:127.0.0.1:39900_    ] o.a.s.c.c.ConnectionManager Client is connected to ZooKeeper
   [junit4]   2> 363588 INFO  (TEST-CollectionsAPIDistributedZkTest.test-seed#[6663C668C56EB0BE]) [n:127.0.0.1:39900_    ] o.a.s.c.c.SolrZkClient makePath: /overseer/queue
   [junit4]   2> 363590 INFO  (TEST-CollectionsAPIDistributedZkTest.test-seed#[6663C668C56EB0BE]) [n:127.0.0.1:39900_    ] o.a.s.c.c.SolrZkClient makePath: /overseer/collection-queue-work
   [junit4]   2> 363592 INFO  (TEST-CollectionsAPIDistributedZkTest.test-seed#[6663C668C56EB0BE]) [n:127.0.0.1:39900_    ] o.a.s.c.c.SolrZkClient makePath: /overseer/collection-map-running
   [junit4]   2> 363594 INFO  (TEST-CollectionsAPIDistributedZkTest.test-seed#[6663C668C56EB0BE]) [n:127.0.0.1:39900_    ] o.a.s.c.c.SolrZkClient makePath: /overseer/collection-map-completed
   [junit4]   2> 363596 INFO  (TEST-CollectionsAPIDistributedZkTest.test-seed#[6663C668C56EB0BE]) [n:127.0.0.1:39900_    ] o.a.s.c.c.SolrZkClient makePath: /overseer/collection-map-failure
   [junit4]   2> 363599 INFO  (TEST-CollectionsAPIDistributedZkTest.test-seed#[6663C668C56EB0BE]) [n:127.0.0.1:39900_    ] o.a.s.c.c.SolrZkClient makePath: /live_nodes
   [junit4]   2> 363600 INFO  (TEST-CollectionsAPIDistributedZkTest.test-seed#[6663C668C56EB0BE]) [n:127.0.0.1:39900_    ] o.a.s.c.c.SolrZkClient makePath: /aliases.json
   [junit4]   2> 363602 INFO  (TEST-CollectionsAPIDistributedZkTest.test-seed#[6663C668C56EB0BE]) [n:127.0.0.1:39900_    ] o.a.s.c.c.SolrZkClient makePath: /clusterstate.json
   [junit4]   2> 363603 INFO  (TEST-CollectionsAPIDistributedZkTest.test-seed#[6663C668C56EB0BE]) [n:127.0.0.1:39900_    ] o.a.s.c.c.SolrZkClient makePath: /security.json
   [junit4]   2> 363604 INFO  (TEST-CollectionsAPIDistributedZkTest.test-seed#[6663C668C56EB0BE]) [n:127.0.0.1:39900_    ] o.a.s.c.ZkController Register node as live in ZooKeeper:/live_nodes/127.0.0.1:39900_
   [junit4]   2> 363605 INFO  (TEST-CollectionsAPIDistributedZkTest.test-seed#[6663C668C56EB0BE]) [n:127.0.0.1:39900_    ] o.a.s.c.c.SolrZkClient makePath: /live_nodes/127.0.0.1:39900_
   [junit4]   2> 363607 INFO  (TEST-CollectionsAPIDistributedZkTest.test-seed#[6663C668C56EB0BE]) [n:127.0.0.1:39900_    ] o.a.s.c.c.SolrZkClient makePath: /overseer_elect
   [junit4]   2> 363608 INFO  (TEST-CollectionsAPIDistributedZkTest.test-seed#[6663C668C56EB0BE]) [n:127.0.0.1:39900_    ] o.a.s.c.c.SolrZkClient makePath: /overseer_elect/election
   [junit4]   2> 363610 INFO  (TEST-CollectionsAPIDistributedZkTest.test-seed#[6663C668C56EB0BE]) [n:127.0.0.1:39900_    ] o.a.s.c.Overseer Overseer (id=null) closing
   [junit4]   2> 363611 INFO  (TEST-CollectionsAPIDistributedZkTest.test-seed#[6663C668C56EB0BE]) [n:127.0.0.1:39900_    ] o.a.s.c.LeaderElector Joined leadership election with path: /overseer_elect/election/94407440641359876-127.0.0.1:39900_-n_0000000000
   [junit4]   2> 363611 INFO  (TEST-CollectionsAPIDistributedZkTest.test-seed#[6663C668C56EB0BE]) [n:127.0.0.1:39900_    ] o.a.s.c.OverseerElectionContext I am going to be the leader 127.0.0.1:39900_
   [junit4]   2> 363612 INFO  (TEST-CollectionsAPIDistributedZkTest.test-seed#[6663C668C56EB0BE]) [n:127.0.0.1:39900_    ] o.a.s.c.c.SolrZkClient makePath: /overseer_elect/leader
   [junit4]   2> 363613 INFO  (TEST-CollectionsAPIDistributedZkTest.test-seed#[6663C668C56EB0BE]) [n:127.0.0.1:39900_    ] o.a.s.c.Overseer Overseer (id=94407440641359876-127.0.0.1:39900_-n_0000000000) starting
   [junit4]   2> 363615 INFO  (TEST-CollectionsAPIDistributedZkTest.test-seed#[6663C668C56EB0BE]) [n:127.0.0.1:39900_    ] o.a.s.c.c.SolrZkClient makePath: /overseer/queue-work
   [junit4]   2> 363623 INFO  (TEST-CollectionsAPIDistributedZkTest.test-seed#[6663C668C56EB0BE]) [n:127.0.0.1:39900_    ] o.a.s.c.OverseerAutoReplicaFailoverThread Starting OverseerAutoReplicaFailoverThread autoReplicaFailoverWorkLoopDelay=10000 autoReplicaFailoverWaitAfterExpiration=10000 autoReplicaFailoverBadNodeExpiration=60000
   [junit4]   2> 363623 INFO  (TEST-CollectionsAPIDistributedZkTest.test-seed#[6663C668C56EB0BE]) [n:127.0.0.1:39900_    ] o.a.s.c.c.ZkStateReader Updating cluster state from ZooKeeper... 
   [junit4]   2> 363623 INFO  (OverseerCollectionProcessor-94407440641359876-127.0.0.1:39900_-n_0000000000) [n:127.0.0.1:39900_    ] o.a.s.c.OverseerProcessor Process current queue of overseer operations
   [junit4]   2> 363625 INFO  (OverseerStateUpdate-94407440641359876-127.0.0.1:39900_-n_0000000000) [n:127.0.0.1:39900_    ] o.a.s.c.Overseer Starting to work on the main queue
   [junit4]   2> 363641 INFO  (TEST-CollectionsAPIDistributedZkTest.test-seed#[6663C668C56EB0BE]) [n:127.0.0.1:39900_    ] o.a.s.c.CoreContainer Security conf doesn't exist. Skipping setup for authorization module.
   [junit4]   2> 363641 INFO  (TEST-CollectionsAPIDistributedZkTest.test-seed#[6663C668C56EB0BE]) [n:127.0.0.1:39900_    ] o.a.s.c.CoreContainer No authentication plugin used.
   [junit4]   2> 363643 INFO  (TEST-CollectionsAPIDistributedZkTest.test-seed#[6663C668C56EB0BE]) [n:127.0.0.1:39900_    ] o.a.s.c.CoresLocator Looking for core definitions underneath /x1/jenkins/jenkins-slave/workspace/Lucene-Solr-NightlyTests-5.x/solr/build/solr-core/test/J1/../../../../../../../../../../x1/jenkins/jenkins-slave/workspace/Lucene-Solr-NightlyTests-5.x/solr/build/solr-core/test/J1/temp/solr.cloud.CollectionsAPIDistributedZkTest_6663C668C56EB0BE-001/control-001/cores
   [junit4]   2> 363644 INFO  (TEST-CollectionsAPIDistributedZkTest.test-seed#[6663C668C56EB0BE]) [n:127.0.0.1:39900_    ] o.a.s.c.SolrCore Created CoreDescriptor: {absoluteInstDir=/x1/jenkins/jenkins-slave/workspace/Lucene-Solr-NightlyTests-5.x/solr/build/solr-core/test/J1/../../../../../../../../../../x1/jenkins/jenkins-slave/workspace/Lucene-Solr-NightlyTests-5.x/solr/build/solr-core/test/J1/temp/solr.cloud.CollectionsAPIDistributedZkTest_6663C668C56EB0BE-001/control-001/cores/collection1/, coreNodeName=, shard=, config=solrconfig.xml, dataDir=data/, configSetProperties=configsetprops.json, collection=control_collection, loadOnStartup=true, name=collection1, transient=false, instanceDir=/x1/jenkins/jenkins-slave/workspace/Lucene-Solr-NightlyTests-5.x/solr/build/solr-core/test/J1/../../../../../../../../../../x1/jenkins/jenkins-slave/workspace/Lucene-Solr-NightlyTests-5.x/solr/build/solr-core/test/J1/temp/solr.cloud.CollectionsAPIDistributedZkTest_6663C668C56EB0BE-001/control-001/cores/collection1, schema=schema.xml}
   [junit4]   2> 363644 INFO  (TEST-CollectionsAPIDistributedZkTest.test-seed#[6663C668C56EB0BE]) [n:127.0.0.1:39900_    ] o.a.s.c.CoresLocator Found core collection1 in /x1/jenkins/jenkins-slave/workspace/Lucene-Solr-NightlyTests-5.x/solr/build/solr-core/test/J1/../../../../../../../../../../x1/jenkins/jenkins-slave/workspace/Lucene-Solr-NightlyTests-5.x/solr/build/solr-core/test/J1/temp/solr.cloud.CollectionsAPIDistributedZkTest_6663C668C56EB0BE-001/control-001/cores/collection1/
   [junit4]   2> 363644 INFO  (TEST-CollectionsAPIDistributedZkTest.test-seed#[6663C668C56EB0BE]) [n:127.0.0.1:39900_    ] o.a.s.c.CoresLocator Found 1 core definitions
   [junit4]   2> 363645 INFO  (TEST-CollectionsAPIDistributedZkTest.test-seed#[6663C668C56EB0BE]) [n:127.0.0.1:39900_    ] o.a.s.s.SolrDispatchFilter user.dir=/x1/jenkins/jenkins-slave/workspace/Lucene-Solr-NightlyTests-5.x/solr/build/solr-core/test/J1
   [junit4]   2> 363646 INFO  (TEST-CollectionsAPIDistributedZkTest.test-seed#[6663C668C56EB0BE]) [n:127.0.0.1:39900_    ] o.a.s.s.SolrDispatchFilter SolrDispatchFilter.init() done
   [junit4]   2> 363646 INFO  (coreLoadExecutor-872-thread-1-processing-n:127.0.0.1:39900_) [n:127.0.0.1:39900_ c:control_collection   x:collection1] o.a.s.c.ZkController publishing state=down
   [junit4]   2> 363646 INFO  (coreLoadExecutor-872-thread-1-processing-n:127.0.0.1:39900_) [n:127.0.0.1:39900_ c:control_collection   x:collection1] o.a.s.c.ZkController numShards not found on descriptor - reading it from system property
   [junit4]   2> 363648 INFO  (OverseerStateUpdate-94407440641359876-127.0.0.1:39900_-n_0000000000) [n:127.0.0.1:39900_    ] o.a.s.c.Overseer processMessage: queueSize: 1, message = {
   [junit4]   2>   "state":"down",
   [junit4]   2>   "collection":"control_collection",
   [junit4]   2>   "node_name":"127.0.0.1:39900_",
   [junit4]   2>   "base_url":"http://127.0.0.1:39900",
   [junit4]   2>   "numShards":"1",
   [junit4]   2>   "operation":"state",
   [junit4]   2>   "roles":null,
   [junit4]   2>   "core":"collection1",
   [junit4]   2>   "shard":null} current state version: 0
   [junit4]   2> 363648 INFO  (coreLoadExecutor-872-thread-1-processing-n:127.0.0.1:39900_) [n:127.0.0.1:39900_ c:control_collection   x:collection1] o.a.s.c.ZkController look for our core node name
   [junit4]   2> 363649 INFO  (OverseerStateUpdate-94407440641359876-127.0.0.1:39900_-n_0000000000) [n:127.0.0.1:39900_    ] o.a.s.c.o.ReplicaMutator Update state numShards=1 message={
   [junit4]   2>   "state":"down",
   [junit4]   2>   "collection":"control_collection",
   [junit4]   2>   "node_name":"127.0.0.1:39900_",
   [junit4]   2>   "base_url":"http://127.0.0.1:39900",
   [junit4]   2>   "numShards":"1",
   [junit4]   2>   "operation":"state",
   [junit4]   2>   "roles":null,
   [junit4]   2>   "core":"collection1",
   [junit4]   2>   "shard":null}
   [junit4]   2> 363649 INFO  (OverseerStateUpdate-94407440641359876-127.0.0.1:39900_-n_0000000000) [n:127.0.0.1:39900_    ] o.a.s.c.o.ClusterStateMutator building a new cName: control_collection
   [junit4]   2> 363650 INFO  (OverseerStateUpdate-94407440641359876-127.0.0.1:39900_-n_0000000000) [n:127.0.0.1:39900_    ] o.a.s.c.o.ReplicaMutator Assigning new node to shard shard=shard1
   [junit4]   2> 363652 INFO  (zkCallback-226-thread-1-processing-n:127.0.0.1:39900_) [n:127.0.0.1:39900_    ] o.a.s.c.c.ZkStateReader A cluster state change: WatchedEvent state:SyncConnected type:NodeDataChanged path:/clusterstate.json, has occurred - updating... (live nodes size: 1)
   [junit4]   2> 364649 INFO  (coreLoadExecutor-872-thread-1-processing-n:127.0.0.1:39900_) [n:127.0.0.1:39900_ c:control_collection   x:collection1] o.a.s.c.ZkController waiting to find shard id in clusterstate for collection1
   [junit4]   2> 364649 INFO  (coreLoadExecutor-872-thread-1-processing-n:127.0.0.1:39900_) [n:127.0.0.1:39900_ c:control_collection   x:collection1] o.a.s.c.ZkController Check for collection zkNode:control_collection
   [junit4]   2> 364650 INFO  (coreLoadExecutor-872-thread-1-processing-n:127.0.0.1:39900_) [n:127.0.0.1:39900_ c:control_collection   x:collection1] o.a.s.c.ZkController Collection zkNode exists
   [junit4]   2> 364650 INFO  (coreLoadExecutor-872-thread-1-processing-n:127.0.0.1:39900_) [n:127.0.0.1:39900_ c:control_collection   x:collection1] o.a.s.c.c.ZkStateReader Load collection config from:/collections/control_collection
   [junit4]   2> 364651 INFO  (coreLoadExecutor-872-thread-1-processing-n:127.0.0.1:39900_) [n:127.0.0.1:39900_ c:control_collection   x:collection1] o.a.s.c.c.ZkStateReader path=/collections/control_collection configName=conf1 specified config exists in ZooKeeper
   [junit4]   2> 364651 INFO  (coreLoadExecutor-872-thread-1-processing-n:127.0.0.1:39900_) [n:127.0.0.1:39900_ c:control_collection   x:collection1] o.a.s.c.SolrResourceLoader new SolrResourceLoader for directory: '/x1/jenkins/jenkins-slave/workspace/Lucene-Solr-NightlyTests-5.x/solr/build/solr-core/test/J1/../../../../../../../../../../x1/jenkins/jenkins-slave/workspace/Lucene-Solr-NightlyTests-5.x/solr/build/solr-core/test/J1/temp/solr.cloud.CollectionsAPIDistributedZkTest_6663C668C56EB0BE-001/control-001/cores/collection1/'
   [junit4]   2> 364667 INFO  (coreLoadExecutor-872-thread-1-processing-n:127.0.0.1:39900_) [n:127.0.0.1:39900_ c:control_collection   x:collection1] o.a.s.c.Config loaded config solrconfig.xml with version 0 
   [junit4]   2> 364674 INFO  (coreLoadExecutor-872-thread-1-processing-n:127.0.0.1:39900_) [n:127.0.0.1:39900_ c:control_collection   x:collection1] o.a.s.c.SolrConfig current version of requestparams : -1
   [junit4]   2> 364687 INFO  (coreLoadExecutor-872-thread-1-processing-n:127.0.0.1:39900_) [n:127.0.0.1:39900_ c:control_collection   x:collection1] o.a.s.c.SolrConfig Using Lucene MatchVersion: 5.4.0
   [junit4]   2> 364716 INFO  (coreLoadExecutor-872-thread-1-processing-n:127.0.0.1:39900_) [n:127.0.0.1:39900_ c:control_collection   x:collection1] o.a.s.c.Config Loaded SolrConfig: solrconfig.xml
   [junit4]   2> 364718 INFO  (coreLoadExecutor-872-thread-1-processing-n:127.0.0.1:39900_) [n:127.0.0.1:39900_ c:control_collection   x:collection1] o.a.s.s.IndexSchema Reading Solr Schema from /configs/conf1/schema.xml
   [junit4]   2> 364732 INFO  (coreLoadExecutor-872-thread-1-processing-n:127.0.0.1:39900_) [n:127.0.0.1:39900_ c:control_collection   x:collection1] o.a.s.s.IndexSchema [collection1] Schema name=test
   [junit4]   2> 364993 INFO  (coreLoadExecutor-872-thread-1-processing-n:127.0.0.1:39900_) [n:127.0.0.1:39900_ c:control_collection   x:collection1] o.a.s.s.OpenExchangeRatesOrgProvider Initialized with rates=open-exchange-rates.json, refreshInterval=1440.
   [junit4]   2> 365002 INFO  (coreLoadExecutor-872-thread-1-processing-n:127.0.0.1:39900_) [n:127.0.0.1:39900_ c:control_collection   x:collection1] o.a.s.s.IndexSchema default search field in schema is text
   [junit4]   2> 365005 INFO  (coreLoadExecutor-872-thread-1-processing-n:127.0.0.1:39900_) [n:127.0.0.1:39900_ c:control_collection   x:collection1] o.a.s.s.IndexSchema unique key field: id
   [junit4]   2> 365016 INFO  (coreLoadExecutor-872-thread-1-processing-n:127.0.0.1:39900_) [n:127.0.0.1:39900_ c:control_collection   x:collection1] o.a.s.s.FileExchangeRateProvider Reloading exchange rates from file currency.xml
   [junit4]   2> 365020 INFO  (coreLoadExecutor-872-thread-1-processing-n:127.0.0.1:39900_) [n:127.0.0.1:39900_ c:control_collection   x:collection1] o.a.s.s.FileExchangeRateProvider Reloading exchange rates from file currency.xml
   [junit4]   2> 365022 INFO  (coreLoadExecutor-872-thread-1-processing-n:127.0.0.1:39900_) [n:127.0.0.1:39900_ c:control_collection   x:collection1] o.a.s.s.OpenExchangeRatesOrgProvider Reloading exchange rates from open-exchange-rates.json
   [junit4]   2> 365023 WARN  (coreLoadExecutor-872-thread-1-processing-n:127.0.0.1:39900_) [n:127.0.0.1:39900_ c:control_collection   x:collection1] o.a.s.s.OpenExchangeRatesOrgProvider Unknown key IMPORTANT NOTE
   [junit4]   2> 365023 WARN  (coreLoadExecutor-872-thread-1-processing-n:127.0.0.1:39900_) [n:127.0.0.1:39900_ c:control_collection   x:collection1] o.a.s.s.OpenExchangeRatesOrgProvider Expected key, got STRING
   [junit4]   2> 365024 INFO  (coreLoadExecutor-872-thread-1-processing-n:127.0.0.1:39900_) [n:127.0.0.1:39900_ c:control_collection   x:collection1] o.a.s.s.OpenExchangeRatesOrgProvider Reloading exchange rates from open-exchange-rates.json
   [junit4]   2> 365024 WARN  (coreLoadExecutor-872-thread-1-processing-n:127.0.0.1:39900_) [n:127.0.0.1:39900_ c:control_collection   x:collection1] o.a.s.s.OpenExchangeRatesOrgProvider Unknown key IMPORTANT NOTE
   [junit4]   2> 365025 WARN  (coreLoadExecutor-872-thread-1-processing-n:127.0.0.1:39900_) [n:127.0.0.1:39900_ c:control_collection   x:collection1] o.a.s.s.OpenExchangeRatesOrgProvider Expected key, got STRING
   [junit4]   2> 365026 INFO  (coreLoadExecutor-872-thread-1-processing-n:127.0.0.1:39900_) [n:127.0.0.1:39900_ c:control_collection   x:collection1] o.a.s.c.ConfigSetProperties Did not find ConfigSet properties, assuming default properties: Can't find resource 'configsetprops.json' in classpath or '/configs/conf1', cwd=/x1/jenkins/jenkins-slave/workspace/Lucene-Solr-NightlyTests-5.x/solr/build/solr-core/test/J1
   [junit4]   2> 365026 INFO  (coreLoadExecutor-872-thread-1-processing-n:127.0.0.1:39900_) [n:127.0.0.1:39900_ c:control_collection   x:collection1] o.a.s.c.CoreContainer Creating SolrCore 'collection1' using configuration from collection control_collection
   [junit4]   2> 365026 INFO  (coreLoadExecutor-872-thread-1-processing-n:127.0.0.1:39900_) [n:127.0.0.1:39900_ c:control_collection s:shard1 r:core_node1 x:collection1] o.a.s.c.SolrCore org.apache.solr.core.MockDirectoryFactory
   [junit4]   2> 365026 INFO  (coreLoadExecutor-872-thread-1-processing-n:127.0.0.1:39900_) [n:127.0.0.1:39900_ c:control_collection s:shard1 r:core_node1 x:collection1] o.a.s.c.SolrCore [[collection1] ] Opening new SolrCore at [/x1/jenkins/jenkins-slave/workspace/Lucene-Solr-NightlyTests-5.x/solr/build/solr-core/test/J1/../../../../../../../../../../x1/jenkins/jenkins-slave/workspace/Lucene-Solr-NightlyTests-5.x/solr/build/solr-core/test/J1/temp/solr.cloud.CollectionsAPIDistributedZkTest_6663C668C56EB0BE-001/control-001/cores/collection1/], dataDir=[null]
   [junit4]   2> 365026 INFO  (coreLoadExecutor-872-thread-1-processing-n:127.0.0.1:39900_) [n:127.0.0.1:39900_ c:control_collection s:shard1 r:core_node1 x:collection1] o.a.s.c.JmxMonitoredMap JMX monitoring is enabled. Adding Solr mbeans to JMX Server: com.sun.jmx.mbeanserver.JmxMBeanServer@460dab4d
   [junit4]   2> 365027 INFO  (coreLoadExecutor-872-thread-1-processing-n:127.0.0.1:39900_) [n:127.0.0.1:39900_ c:control_collection s:shard1 r:core_node1 x:collection1] o.a.s.c.CachingDirectoryFactory return new directory for /x1/jenkins/jenkins-slave/workspace/Lucene-Solr-NightlyTests-5.x/solr/build/solr-core/test/J1/../../../../../../../../../../x1/jenkins/jenkins-slave/workspace/Lucene-Solr-NightlyTests-5.x/solr/build/solr-core/test/J1/temp/solr.cloud.CollectionsAPIDistributedZkTest_6663C668C56EB0BE-001/control-001/cores/collection1/data
   [junit4]   2> 365028 INFO  (coreLoadExecutor-872-thread-1-processing-n:127.0.0.1:39900_) [n:127.0.0.1:39900_ c:control_collection s:shard1 r:core_node1 x:collection1] o.a.s.c.SolrCore New index directory detected: old=null new=/x1/jenkins/jenkins-slave/workspace/Lucene-Solr-NightlyTests-5.x/solr/build/solr-core/test/J1/../../../../../../../../../../x1/jenkins/jenkins-slave/workspace/Lucene-Solr-NightlyTests-5.x/solr/build/solr-core/test/J1/temp/solr.cloud.CollectionsAPIDistributedZkTest_6663C668C56EB0BE-001/control-001/cores/collection1/data/index/
   [junit4]   2> 365028 WARN  (coreLoadExecutor-872-thread-1-processing-n:127.0.0.1:39900_) [n:127.0.0.1:39900_ c:control_collection s:shard1 r:core_node1 x:collection1] o.a.s.c.SolrCore [collection1] Solr index directory '/x1/jenkins/jenkins-slave/workspace/Lucene-Solr-NightlyTests-5.x/solr/build/solr-core/test/J1/../../../../../../../../../../x1/jenkins/jenkins-slave/workspace/Lucene-Solr-NightlyTests-5.x/solr/build/solr-core/test/J1/temp/solr.cloud.CollectionsAPIDistributedZkTest_6663C668C56EB0BE-001/control-001/cores/collection1/data/index' doesn't exist. Creating new index...
   [junit4]   2> 365028 INFO  (coreLoadExecutor-872-thread-1-processing-n:127.0.0.1:39900_) [n:127.0.0.1:39900_ c:control_collection s:shard1 r:core_node1 x:collection1] o.a.s.c.CachingDirectoryFactory return new directory for /x1/jenkins/jenkins-slave/workspace/Lucene-Solr-NightlyTests-5.x/solr/build/solr-core/test/J1/../../../../../../../../../../x1/jenkins/jenkins-slave/workspace/Lucene-Solr-NightlyTests-5.x/solr/build/solr-core/test/J1/temp/solr.cloud.CollectionsAPIDistributedZkTest_6663C668C56EB0BE-001/control-001/cores/collection1/data/index
   [junit4]   2> 365029 INFO  (coreLoadExecutor-872-thread-1-processing-n:127.0.0.1:39900_) [n:127.0.0.1:39900_ c:control_collection s:shard1 r:core_node1 x:collection1] o.a.s.u.RandomMergePolicy RandomMergePolicy wrapping class org.apache.lucene.index.AlcoholicMergePolicy: [AlcoholicMergePolicy: minMergeSize=0, mergeFactor=10, maxMergeSize=758179315, maxMergeSizeForForcedMerge=9223372036854775807, calibrateSizeByDeletes=true, maxMergeDocs=2147483647, maxCFSSegmentSizeMB=8.796093022207999E12, noCFSRatio=0.1]
   [junit4]   2> 365029 INFO  (coreLoadExecutor-872-thread-1-processing-n:127.0.0.1:39900_) [n:127.0.0.1:39900_ c:control_collection s:shard1 r:core_node1 x:collection1] o.a.s.c.SolrCore SolrDeletionPolicy.onCommit: commits: num=1
   [junit4]   2> 	commit{dir=MockDirectoryWrapper(RAMDirectory@4a423551 lockFactory=org.apache.lucene.store.SingleInstanceLockFactory@40ba7eed),segFN=segments_1,generation=1}
   [junit4]   2> 365030 INFO  (coreLoadExecutor-872-thread-1-processing-n:127.0.0.1:39900_) [n:127.0.0.1:39900_ c:control_collection s:shard1 r:core_node1 x:collection1] o.a.s.c.SolrCore newest commit generation = 1
   [junit4]   2> 365030 INFO  (OldIndexDirectoryCleanupThreadForCore-collection1) [n:127.0.0.1:39900_ c:control_collection s:shard1 r:core_node1 x:collection1] o.a.s.c.SolrCore Looking for old index directories to cleanup for core collection1 in /x1/jenkins/jenkins-slave/workspace/Lucene-Solr-NightlyTests-5.x/solr/build/solr-core/test/J1/../../../../../../../../../../x1/jenkins/jenkins-slave/workspace/Lucene-Solr-NightlyTests-5.x/solr/build/solr-core/test/J1/temp/solr.cloud.CollectionsAPIDistributedZkTest_6663C668C56EB0BE-001/control-001/cores/collection1/data/
   [junit4]   2> 365030 WARN  (OldIndexDirectoryCleanupThreadForCore-collection1) [n:127.0.0.1:39900_ c:control_collection s:shard1 r:core_node1 x:collection1] o.a.s.c.DirectoryFactory /x1/jenkins/jenkins-slave/workspace/Lucene-Solr-NightlyTests-5.x/solr/build/solr-core/test/J1/../../../../../../../../../../x1/jenkins/jenkins-slave/workspace/Lucene-Solr-NightlyTests-5.x/solr/build/solr-core/test/J1/temp/solr.cloud.CollectionsAPIDistributedZkTest_6663C668C56EB0BE-001/control-001/cores/collection1/data/ does not point to a valid data directory; skipping clean-up of old index directories.
   [junit4]   2> 365034 INFO  (coreLoadExecutor-872-thread-1-processing-n:127.0.0.1:39900_) [n:127.0.0.1:39900_ c:control_collection s:shard1 r:core_node1 x:collection1] o.a.s.u.p.UpdateRequestProcessorChain creating updateRequestProcessorChain "nodistrib"
   [junit4]   2> 365034 INFO  (coreLoadExecutor-872-thread-1-processing-n:127.0.0.1:39900_) [n:127.0.0.1:39900_ c:control_collection s:shard1 r:core_node1 x:collection1] o.a.s.u.p.UpdateRequestProcessorChain creating updateRequestProcessorChain "dedupe"
   [junit4]   2> 365035 INFO  (coreLoadExecutor-872-thread-1-processing-n:127.0.0.1:39900_) [n:127.0.0.1:39900_ c:control_collection s:shard1 r:core_node1 x:collection1] o.a.s.u.p.UpdateRequestProcessorChain inserting DistributedUpdateProcessorFactory into updateRequestProcessorChain "dedupe"
   [junit4]   2> 365035 INFO  (coreLoadExecutor-872-thread-1-processing-n:127.0.0.1:39900_) [n:127.0.0.1:39900_ c:control_collection s:shard1 r:core_node1 x:collection1] o.a.s.u.p.UpdateRequestProcessorChain creating updateRequestProcessorChain "stored_sig"
   [junit4]   2> 365035 INFO  (coreLoadExecutor-872-thread-1-processing-n:127.0.0.1:39900_) [n:127.0.0.1:39900_ c:control_collection s:shard1 r:core_node1 x:collection1] o.a.s.u.p.UpdateRequestProcessorChain inserting DistributedUpdateProcessorFactory into updateRequestProcessorChain "stored_sig"
   [junit4]   2> 365035 INFO  (coreLoadExecutor-872-thread-1-processing-n:127.0.0.1:39900_) [n:127.0.0.1:39900_ c:control_collection s:shard1 r:core_node1 x:collection1] o.a.s.u.p.UpdateRequestProcessorChain creating updateRequestProcessorChain "distrib-dup-test-chain-explicit"
   [junit4]   2> 365035 INFO  (coreLoadExecutor-872-thread-1-processing-n:127.0.0.1:39900_) [n:127.0.0.1:39900_ c:control_collection s:shard1 r:core_node1 x:collection1] o.a.s.u.p.UpdateRequestProcessorChain creating updateRequestProcessorChain "distrib-dup-test-chain-implicit"
   [junit4]   2> 365035 INFO  (coreLoadExecutor-872-thread-1-processing-n:127.0.0.1:39900_) [n:127.0.0.1:39900_ c:control_collection s:shard1 r:core_node1 x:collection1] o.a.s.u.p.UpdateRequestProcessorChain inserting DistributedUpdateProcessorFactory into updateRequestProcessorChain "distrib-dup-test-chain-implicit"
   [junit4]   2> 365036 INFO  (coreLoadExecutor-872-thread-1-processing-n:127.0.0.1:39900_) [n:127.0.0.1:39900_ c:control_collection s:shard1 r:core_node1 x:collection1] o.a.s.c.SolrCore no updateRequestProcessorChain defined as default, creating implicit default
   [junit4]   2> 365038 INFO  (coreLoadExecutor-872-thread-1-processing-n:127.0.0.1:39900_) [n:127.0.0.1:39900_ c:control_collection s:shard1 r:core_node1 x:collection1] o.a.s.h.l.XMLLoader xsltCacheLifetimeSeconds=60
   [junit4]   2> 365040 INFO  (coreLoadExecutor-872-thread-1-processing-n:127.0.0.1:39900_) [n:127.0.0.1:39900_ c:control_collection s:shard1 r:core_node1 x:collection1] o.a.s.h.l.XMLLoader xsltCacheLifetimeSeconds=60
   [junit4]   2> 365041 INFO  (coreLoadExecutor-872-thread-1-processing-n:127.0.0.1:39900_) [n:127.0.0.1:39900_ c:control_collection s:shard1 r:core_node1 x:collection1] o.a.s.h.l.XMLLoader xsltCacheLifetimeSeconds=60
   [junit4]   2> 365042 INFO  (coreLoadExecutor-872-thread-1-processing-n:127.0.0.1:39900_) [n:127.0.0.1:39900_ c:control_collection s:shard1 r:core_node1 x:collection1] o.a.s.h.l.XMLLoader xsltCacheLifetimeSeconds=60
   [junit4]   2> 365046 INFO  (coreLoadExecutor-872-thread-1-processing-n:127.0.0.1:39900_) [n:127.0.0.1:39900_ c:control_collection s:shard1 r:core_node1 x:collection1] o.a.s.c.RequestHandlers Registered paths: /admin/luke,/admin/system,/admin/file,/admin/properties,/admin/plugins,standard,/update/csv,/get,/update,/config,/admin/mbeans,/replication,/update/json/docs,/admin/segments,/schema,/update/json,/admin/threads,/admin/ping,/admin/logging
   [junit4]   2> 365047 INFO  (coreLoadExecutor-872-thread-1-processing-n:127.0.0.1:39900_) [n:127.0.0.1:39900_ c:control_collection s:shard1 r:core_node1 x:collection1] o.a.s.c.SolrCore Using default statsCache cache: org.apache.solr.search.stats.LocalStatsCache
   [junit4]   2> 365048 INFO  (coreLoadExecutor-872-thread-1-processing-n:127.0.0.1:39900_) [n:127.0.0.1:39900_ c:control_collection s:shard1 r:core_node1 x:collection1] o.a.s.u.UpdateHandler Using UpdateLog implementation: org.apache.solr.update.UpdateLog
   [junit4]   2> 365048 INFO  (coreLoadExecutor-872-thread-1-processing-n:127.0.0.1:39900_) [n:127.0.0.1:39900_ c:control_collection s:shard1 r:core_node1 x:collection1] o.a.s.u.UpdateLog Initializing UpdateLog: dataDir= defaultSyncLevel=FLUSH numRecordsToKeep=100 maxNumLogsToKeep=10 numVersionBuckets=65536
   [junit4]   2> 365049 INFO  (coreLoadExecutor-872-thread-1-processing-n:127.0.0.1:39900_) [n:127.0.0.1:39900_ c:control_collection s:shard1 r:core_node1 x:collection1] o.a.s.c.SolrCore Hard AutoCommit: disabled
   [junit4]   2> 365049 INFO  (coreLoadExecutor-872-thread-1-processing-n:127.0.0.1:39900_) [n:127.0.0.1:39900_ c:control_collection s:shard1 r:core_node1 x:collection1] o.a.s.c.SolrCore Soft AutoCommit: disabled
   [junit4]   2> 365050 INFO  (coreLoadExecutor-872-thread-1-processing-n:127.0.0.1:39900_) [n:127.0.0.1:39900_ c:control_collection s:shard1 r:core_node1 x:collection1] o.a.s.u.RandomMergePolicy RandomMergePolicy wrapping class org.apache.lucene.index.LogDocMergePolicy: [LogDocMergePolicy: minMergeSize=1000, mergeFactor=14, maxMergeSize=9223372036854775807, maxMergeSizeForForcedMerge=9223372036854775807, calibrateSizeByDeletes=true, maxMergeDocs=2147483647, maxCFSSegmentSizeMB=8.796093022207999E12, noCFSRatio=1.0]
   [junit4]   2> 365050 INFO  (coreLoadExecutor-872-thread-1-processing-n:127.0.0.1:39900_) [n:127.0.0.1:39900_ c:control_collection s:shard1 r:core_node1 x:collection1] o.a.s.c.SolrCore SolrDeletionPolicy.onInit: commits: num=1
   [junit4]   2> 	commit{dir=MockDirectoryWrapper(RAMDirectory@4a423551 lockFactory=org.apache.lucene.store.SingleInstanceLockFactory@40ba7eed),segFN=segments_1,generation=1}
   [junit4]   2> 365050 INFO  (coreLoadExecutor-872-thread-1-processing-n:127.0.0.1:39900_) [n:127.0.0.1:39900_ c:control_collection s:shard1 r:core_node1 x:collection1] o.a.s.c.SolrCore newest commit generation = 1
   [junit4]   2> 365050 INFO  (coreLoadExecutor-872-thread-1-processing-n:127.0.0.1:39900_) [n:127.0.0.1:39900_ c:control_collection s:shard1 r:core_node1 x:collection1] o.a.s.s.SolrIndexSearcher Opening Searcher@18c1d69b[collection1] main
   [junit4]   2> 365051 INFO  (coreLoadExecutor-872-thread-1-processing-n:127.0.0.1:39900_) [n:127.0.0.1:39900_ c:control_collection s:shard1 r:core_node1 x:collection1] o.a.s.c.c.ZkStateReader Load collection config from:/collections/control_collection
   [junit4]   2> 365052 INFO  (coreLoadExecutor-872-thread-1-processing-n:127.0.0.1:39900_) [n:127.0.0.1:39900_ c:control_collection s:shard1 r:core_node1 x:collection1] o.a.s.c.c.ZkStateReader path=/collections/control_collection configName=conf1 specified config exists in ZooKeeper
   [junit4]   2> 365052 INFO  (coreLoadExecutor-872-thread-1-processing-n:127.0.0.1:39900_) [n:127.0.0.1:39900_ c:control_collection s:shard1 r:core_node1 x:collection1] o.a.s.r.ManagedResourceStorage Setting up ZooKeeper-based storage for the RestManager with znodeBase: /configs/conf1
   [junit4]   2> 365052 INFO  (coreLoadExecutor-872-thread-1-processing-n:127.0.0.1:39900_) [n:127.0.0.1:39900_ c:control_collection s:shard1 r:core_node1 x:collection1] o.a.s.r.ManagedResourceStorage Configured ZooKeeperStorageIO with znodeBase: /configs/conf1
   [junit4]   2> 365052 INFO  (coreLoadExecutor-872-thread-1-processing-n:127.0.0.1:39900_) [n:127.0.0.1:39900_ c:control_collection s:shard1 r:core_node1 x:collection1] o.a.s.r.RestManager Initializing RestManager with initArgs: {}
   [junit4]   2> 365052 INFO  (coreLoadExecutor-872-thread-1-processing-n:127.0.0.1:39900_) [n:127.0.0.1:39900_ c:control_collection s:shard1 r:core_node1 x:collection1] o.a.s.r.ManagedResourceStorage Reading _rest_managed.json using ZooKeeperStorageIO:path=/configs/conf1
   [junit4]   2> 365053 INFO  (coreLoadExecutor-872-thread-1-processing-n:127.0.0.1:39900_) [n:127.0.0.1:39900_ c:control_collection s:shard1 r:core_node1 x:collection1] o.a.s.r.ManagedResourceStorage No data found for znode /configs/conf1/_rest_managed.json
   [junit4]   2> 365053 INFO  (coreLoadExecutor-872-thread-1-processing-n:127.0.0.1:39900_) [n:127.0.0.1:39900_ c:control_collection s:shard1 r:core_node1 x:collection1] o.a.s.r.ManagedResourceStorage Loaded null at path _rest_managed.json using ZooKeeperStorageIO:path=/configs/conf1
   [junit4]   2> 365053 INFO  (coreLoadExecutor-872-thread-1-processing-n:127.0.0.1:39900_) [n:127.0.0.1:39900_ c:control_collection s:shard1 r:core_node1 x:collection1] o.a.s.r.RestManager Initializing 0 registered ManagedResources
   [junit4]   2> 365053 INFO  (coreLoadExecutor-872-thread-1-processing-n:127.0.0.1:39900_) [n:127.0.0.1:39900_ c:control_collection s:shard1 r:core_node1 x:collection1] o.a.s.h.ReplicationHandler Commits will be reserved for  10000
   [junit4]   2> 365054 INFO  (searcherExecutor-873-thread-1-processing-c:control_collection n:127.0.0.1:39900_ x:collection1 r:core_node1 s:shard1) [n:127.0.0.1:39900_ c:control_collection s:shard1 r:core_node1 x:collection1] o.a.s.c.SolrCore [collection1] Registered new searcher Searcher@18c1d69b[collection1] main{ExitableDirectoryReader(UninvertingDirectoryReader())}
   [junit4]   2> 365054 INFO  (coreLoadExecutor-872-thread-1-processing-n:127.0.0.1:39900_) [n:127.0.0.1:39900_ c:control_collection s:shard1 r:core_node1 x:collection1] o.a.s.u.UpdateLog Looking up max value of version field to seed version buckets
   [junit4]   2> 365054 INFO  (coreLoadExecutor-872-thread-1-processing-n:127.0.0.1:39900_) [n:127.0.0.1:39900_ c:control_collection s:shard1 r:core_node1 x:collection1] o.a.s.u.VersionInfo Refreshing highest value of _version_ for 65536 version buckets from index
   [junit4]   2> 365054 INFO  (coreLoadExecutor-872-thread-1-processing-n:127.0.0.1:39900_) [n:127.0.0.1:39900_ c:control_collection s:shard1 r:core_node1 x:collection1] o.a.s.u.VersionInfo No terms found for _version_, cannot seed version bucket highest value from index
   [junit4]   2> 365054 INFO  (coreLoadExecutor-872-thread-1-processing-n:127.0.0.1:39900_) [n:127.0.0.1:39900_ c:control_collection s:shard1 r:core_node1 x:collection1] o.a.s.u.UpdateLog Could not find max version in index or recent updates, using new clock 1510519052301238272
   [junit4]   2> 365056 INFO  (coreLoadExecutor-872-thread-1-processing-n:127.0.0.1:39900_) [n:127.0.0.1:39900_ c:control_collection s:shard1 r:core_node1 x:collection1] o.a.s.u.UpdateLog Took 2.0ms to seed version buckets with highest version 1510519052301238272
   [junit4]   2> 365057 INFO  (coreLoadExecutor-872-thread-1-processing-n:127.0.0.1:39900_) [n:127.0.0.1:39900_ c:control_collection s:shard1 r:core_node1 x:collection1] o.a.s.c.ZkController watch zkdir /configs/conf1
   [junit4]   2> 365057 INFO  (coreLoadExecutor-872-thread-1-processing-n:127.0.0.1:39900_) [n:127.0.0.1:39900_ c:control_collection s:shard1 r:core_node1 x:collection1] o.a.s.c.CoreContainer registering core: collection1
   [junit4]   2> 365058 INFO  (coreZkRegister-866-thread-1-processing-c:control_collection n:127.0.0.1:39900_ x:collection1 r:core_node1 s:shard1) [n:127.0.0.1:39900_ c:control_collection s:shard1 r:core_node1 x:collection1] o.a.s.c.ZkController Register replica - core:collection1 address:http://127.0.0.1:39900 collection:control_collection shard:shard1
   [junit4]   2> 365059 INFO  (coreZkRegister-866-thread-1-processing-c:control_collection n:127.0.0.1:39900_ x:collection1 r:core_node1 s:shard1) [n:127.0.0.1:39900_ c:control_collection s:shard1 r:core_node1 x:collection1] o.a.s.c.c.SolrZkClient makePath: /collections/control_collection/leader_elect/shard1/election
   [junit4]   2> 365062 INFO  (coreZkRegister-866-thread-1-processing-c:control_collection n:127.0.0.1:39900_ x:collection1 r:core_node1 s:shard1) [n:127.0.0.1:39900_ c:control_collection s:shard1 r:core_node1 x:collection1] o.a.s.c.LeaderElector Joined leadership election with path: /collections/control_collection/leader_elect/shard1/election/94407440641359876-core_node1-n_0000000000
   [junit4]   2> 365063 INFO  (coreZkRegister-866-thread-1-processing-c:control_collection n:127.0.0.1:39900_ x:collection1 r:core_node1 s:shard1) [n:127.0.0.1:39900_ c:control_collection s:shard1 r:core_node1 x:collection1] o.a.s.c.ShardLeaderElectionContext Running the leader process for shard shard1
   [junit4]   2> 365065 INFO  (coreZkRegister-866-thread-1-processing-c:control_collection n:127.0.0.1:39900_ x:collection1 r:core_node1 s:shard1) [n:127.0.0.1:39900_ c:control_collection s:shard1 r:core_node1 x:collection1] o.a.s.c.ShardLeaderElectionContext Enough replicas found to continue.
   [junit4]   2> 365066 INFO  (OverseerStateUpdate-94407440641359876-127.0.0.1:39900_-n_0000000000) [n:127.0.0.1:39900_    ] o.a.s.c.Overseer processMessage: queueSize: 1, message = {
   [junit4]   2>   "operation":"leader",
   [junit4]   2>   "shard":"shard1",
   [junit4]   2>   "collection":"control_collection"} current state version: 1
   [junit4]   2> 365066 INFO  (coreZkRegister-866-thread-1-processing-c:control_collection n:127.0.0.1:39900_ x:collection1 r:core_node1 s:shard1) [n:127.0.0.1:39900_ c:control_collection s:shard1 r:core_node1 x:collection1] o.a.s.c.ShardLeaderElectionContext I may be the new leader - try and sync
   [junit4]   2> 365066 INFO  (coreZkRegister-866-thread-1-processing-c:control_collection n:127.0.0.1:39900_ x:collection1 r:core_node1 s:shard1) [n:127.0.0.1:39900_ c:control_collection s:shard1 r:core_node1 x:collection1] o.a.s.c.SyncStrategy Sync replicas to http://127.0.0.1:39900/collection1/
   [junit4]   2> 365066 INFO  (coreZkRegister-866-thread-1-processing-c:control_collection n:127.0.0.1:39900_ x:collection1 r:core_node1 s:shard1) [n:127.0.0.1:39900_ c:control_collection s:shard1 r:core_node1 x:collection1] o.a.s.c.SyncStrategy Sync Success - now sync replicas to me
   [junit4]   2> 365075 INFO  (coreZkRegister-866-thread-1-processing-c:control_collection n:127.0.0.1:39900_ x:collection1 r:core_node1 s:shard1) [n:127.0.0.1:39900_ c:control_collection s:shard1 r:core_node1 x:collection1] o.a.s.c.SyncStrategy http://127.0.0.1:39900/collection1/ has no replicas
   [junit4]   2> 365076 INFO  (coreZkRegister-866-thread-1-processing-c:control_collection n:127.0.0.1:39900_ x:collection1 r:core_node1 s:shard1) [n:127.0.0.1:39900_ c:control_collection s:shard1 r:core_node1 x:collection1] o.a.s.c.ShardLeaderElectionContext I am the new leader: http://127.0.0.1:39900/collection1/ shard1
   [junit4]   2> 365076 INFO  (coreZkRegister-866-thread-1-processing-c:control_collection n:127.0.0.1:39900_ x:collection1 r:core_node1 s:shard1) [n:127.0.0.1:39900_ c:control_collection s:shard1 r:core_node1 x:collection1] o.a.s.c.c.SolrZkClient makePath: /collections/control_collection/leaders/shard1
   [junit4]   2> 365081 INFO  (OverseerStateUpdate-94407440641359876-127.0.0.1:39900_-n_0000000000) [n:127.0.0.1:39900_    ] o.a.s.c.Overseer processMessage: queueSize: 1, message = {
   [junit4]   2>   "operation":"leader",
   [junit4]   2>   "shard":"shard1",
   [junit4]   2>   "collection":"control_collection",
   [junit4]   2>   "base_url":"http://127.0.0.1:39900",
   [junit4]   2>   "core":"collection1",
   [junit4]   2>   "state":"active"} current state version: 1
   [junit4]   2> 365148 INFO  (TEST-CollectionsAPIDistributedZkTest.test-seed#[6663C668C56EB0BE]) [    ] o.a.s.c.c.SolrZkClient Using default ZkCredentialsProvider
   [junit4]   2> 365148 INFO  (TEST-CollectionsAPIDistributedZkTest.test-seed#[6663C668C56EB0BE]) [    ] o.a.s.c.c.ConnectionManager Waiting for client to connect to ZooKeeper
   [junit4]   2> 365151 INFO  (zkCallback-228-thread-1) [    ] o.a.s.c.c.ConnectionManager Watcher org.apache.solr.common.cloud.ConnectionManager@56b6a996 name:ZooKeeperConnection Watcher:127.0.0.1:53004/solr got event WatchedEvent state:SyncConnected type:None path:null path:null type:None
   [junit4]   2> 365151 INFO  (TEST-CollectionsAPIDistributedZkTest.test-seed#[6663C668C56EB0BE]) [    ] o.a.s.c.c.ConnectionManager Client is connected to ZooKeeper
   [junit4]   2> 365152 INFO  (TEST-CollectionsAPIDistributedZkTest.test-seed#[6663C668C56EB0BE]) [    ] o.a.s.c.c.SolrZkClient Using default ZkACLProvider
   [junit4]   2> 365152 INFO  (TEST-CollectionsAPIDistributedZkTest.test-seed#[6663C668C56EB0BE]) [    ] o.a.s.c.c.ZkStateReader Updating cluster state from ZooKeeper... 
   [junit4]   2> 365155 INFO  (TEST-CollectionsAPIDistributedZkTest.test-seed#[6663C668C56EB0BE]) [    ] o.a.s.c.ChaosMonkey monkey: init - expire sessions:false cause connection loss:false
   [junit4]   2> 365184 INFO  (zkCallback-228-thread-1) [    ] o.a.s.c.c.ZkStateReader A cluster state change: WatchedEvent state:SyncConnected type:NodeDataChanged path:/clusterstate.json, has occurred - updating... (live nodes size: 1)
   [junit4]   2> 365184 INFO  (zkCallback-226-thread-1-processing-n:127.0.0.1:39900_) [n:127.0.0.1:39900_    ] o.a.s.c.c.ZkStateReader A cluster state change: WatchedEvent state:SyncConnected type:NodeDataChanged path:/clusterstate.json, has occurred - updating... (live nodes size: 1)
   [junit4]   2> 365232 INFO  (coreZkRegister-866-thread-1-processing-c:control_collection n:127.0.0.1:39900_ x:collection1 r:core_node1 s:shard1) [n:127.0.0.1:39900_ c:control_collection s:shard1 r:core_node1 x:collection1] o.a.s.c.ZkController We are http://127.0.0.1:39900/collection1/ and leader is http://127.0.0.1:39900/collection1/
   [junit4]   2> 365232 INFO  (coreZkRegister-866-thread-1-processing-c:control_collection n:127.0.0.1:39900_ x:collection1 r:core_node1 s:shard1) [n:127.0.0.1:39900_ c:control_collection s:shard1 r:core_node1 x:collection1] o.a.s.c.ZkController No LogReplay needed for core=collection1 baseURL=http://127.0.0.1:39900
   [junit4]   2> 365232 INFO  (coreZkRegister-866-thread-1-processing-c:control_collection n:127.0.0.1:39900_ x:collection1 r:core_node1 s:shard1) [n:127.0.0.1:39900_ c:control_collection s:shard1 r:core_node1 x:collection1] o.a.s.c.ZkController I am the leader, no recovery necessary
   [junit4]   2> 365233 INFO  (coreZkRegister-866-thread-1-processing-c:control_collection n:127.0.0.1:39900_ x:collection1 r:core_node1 s:shard1) [n:127.0.0.1:39900_ c:control_collection s:shard1 r:core_node1 x:collection1] o.a.s.c.ZkController publishing state=active
   [junit4]   2> 365233 INFO  (coreZkRegister-866-thread-1-processing-c:control_collection n:127.0.0.1:39900_ x:collection1 r:core_node1 s:shard1) [n:127.0.0.1:39900_ c:control_collection s:shard1 r:core_node1 x:collection1] o.a.s.c.ZkController numShards not found on descriptor - reading it from system property
   [junit4]   2> 365235 INFO  (OverseerStateUpdate-94407440641359876-127.0.0.1:39900_-n_0000000000) [n:127.0.0.1:39900_    ] o.a.s.c.Overseer processMessage: queueSize: 1, message = {
   [junit4]   2>   "state":"active",
   [junit4]   2>   "collection":"control_collection",
   [junit4]   2>   "core_node_name":"core_node1",
   [junit4]   2>   "node_name":"127.0.0.1:39900_",
   [junit4]   2>   "base_url":"http://127.0.0.1:39900",
   [junit4]   2>   "numShards":"2",
   [junit4]   2>   "operation":"state",
   [junit4]   2>   "roles":null,
   [junit4]   2>   "core":"collection1",
   [junit4]   2>   "shard":"shard1"} current state version: 2
   [junit4]   2> 365236 INFO  (OverseerStateUpdate-94407440641359876-127.0.0.1:39900_-n_0000000000) [n:127.0.0.1:39900_    ] o.a.s.c.o.ReplicaMutator Update state numShards=2 message={
   [junit4]   2>   "state":"active",
   [junit4]   2>   "collection":"control_collection",
   [junit4]   2>   "core_node_name":"core_node1",
   [junit4]   2>   "node_name":"127.0.0.1:39900_",
   [junit4]   2>   "base_url":"http://127.0.0.1:39900",
   [junit4]   2>   "numShards":"2",
   [junit4]   2>   "operation":"state",
   [junit4]   2>   "roles":null,
   [junit4]   2>   "core":"collection1",
   [junit4]   2>   "shard":"shard1"}
   [junit4]   2> 365339 INFO  (zkCallback-226-thread-1-processing-n:127.0.0.1:39900_) [n:127.0.0.1:39900_    ] o.a.s.c.c.ZkStateReader A cluster state change: WatchedEvent state:SyncConnected type:NodeDataChanged path:/clusterstate.json, has occurred - updating... (live nodes size: 1)
   [junit4]   2> 365339 INFO  (zkCallback-228-thread-1) [    ] o.a.s.c.c.ZkStateReader A cluster state change: WatchedEvent state:SyncConnected type:NodeDataChanged path:/clusterstate.json, has occurred - updating... (live nodes size: 1)
   [junit4]   2> 365449 INFO  (TEST-CollectionsAPIDistributedZkTest.test-seed#[6663C668C56EB0BE]) [    ] o.a.s.SolrTestCaseJ4 Writing core.properties file to /x1/jenkins/jenkins-slave/workspace/Lucene-Solr-NightlyTests-5.x/solr/build/solr-core/test/J1/temp/solr.cloud.CollectionsAPIDistributedZkTest_6663C668C56EB0BE-001/shard-1-001/cores/collection1
   [junit4]   2> 365450 INFO  (TEST-CollectionsAPIDistributedZkTest.test-seed#[6663C668C56EB0BE]) [    ] o.a.s.c.AbstractFullDistribZkTestBase create jetty 1 in directory /x1/jenkins/jenkins-slave/workspace/Lucene-Solr-NightlyTests-5.x/solr/build/solr-core/test/J1/temp/solr.cloud.CollectionsAPIDistributedZkTest_6663C668C56EB0BE-001/shard-1-001
   [junit4]   2> 365451 INFO  (TEST-CollectionsAPIDistributedZkTest.test-seed#[6663C668C56EB0BE]) [    ] o.e.j.s.Server jetty-9.2.13.v20150730
   [junit4]   2> 365453 INFO  (TEST-CollectionsAPIDistributedZkTest.test-seed#[6663C668C56EB0BE]) [    ] o.e.j.s.h.ContextHandler Started o.e.j.s.ServletContextHandler@7f507799{/,null,AVAILABLE}
   [junit4]   2> 365453 INFO  (TEST-CollectionsAPIDistributedZkTest.test-seed#[6663C668C56EB0BE]) [    ] o.e.j.s.ServerConnector Started ServerConnector@307e6524{HTTP/1.1}{127.0.0.1:42181}
   [junit4]   2> 365453 INFO  (TEST-CollectionsAPIDistributedZkTest.test-seed#[6663C668C56EB0BE]) [    ] o.e.j.s.Server Started @368955ms
   [junit4]   2> 365453 INFO  (TEST-CollectionsAPIDistributedZkTest.test-seed#[6663C668C56EB0BE]) [    ] o.a.s.c.s.e.JettySolrRunner Jetty properties: {hostContext=/, coreRootDirectory=/x1/jenkins/jenkins-slave/workspace/Lucene-Solr-NightlyTests-5.x/solr/build/solr-core/test/J1/temp/solr.cloud.CollectionsAPIDistributedZkTest_6663C668C56EB0BE-001/shard-1-001/cores, solrconfig=solrconfig.xml, hostPort=42181, solr.data.dir=/x1/jenkins/jenkins-slave/workspace/Lucene-Solr-NightlyTests-5.x/solr/build/solr-core/test/J1/temp/solr.cloud.CollectionsAPIDistributedZkTest_6663C668C56EB0BE-001/tempDir-001/jetty1}
   [junit4]   2> 365454 INFO  (TEST-CollectionsAPIDistributedZkTest.test-seed#[6663C668C56EB0BE]) [    ] o.a.s.s.SolrDispatchFilter SolrDispatchFilter.init(): sun.misc.Launcher$AppClassLoader@4e0add57
   [junit4]   2> 365454 INFO  (TEST-CollectionsAPIDistributedZkTest.test-seed#[6663C668C56EB0BE]) [    ] o.a.s.c.SolrResourceLoader new SolrResourceLoader for directory: '/x1/jenkins/jenkins-slave/workspace/Lucene-Solr-NightlyTests-5.x/solr/build/solr-core/test/J1/temp/solr.cloud.CollectionsAPIDistributedZkTest_6663C668C56EB0BE-001/shard-1-001/'
   [junit4]   2> 365470 INFO  (TEST-CollectionsAPIDistributedZkTest.test-seed#[6663C668C56EB0BE]) [    ] o.a.s.c.c.SolrZkClient Using default ZkCredentialsProvider
   [junit4]   2> 365471 INFO  (TEST-CollectionsAPIDistributedZkTest.test-seed#[6663C668C56EB0BE]) [    ] o.a.s.c.c.ConnectionManager Waiting for client to connect to ZooKeeper
   [junit4]   2> 365472 INFO  (zkCallback-229-thread-1) [    ] o.a.s.c.c.ConnectionManager Watcher org.apache.solr.common.cloud.ConnectionManager@1ca32981 name:ZooKeeperConnection Watcher:127.0.0.1:53004/solr got event WatchedEvent state:SyncConnected type:None path:null path:null type:None
   [junit4]   2> 365472 INFO  (TEST-CollectionsAPIDistributedZkTest.test-seed#[6663C668C56EB0BE]) [    ] o.a.s.c.c.ConnectionManager Client is connected to ZooKeeper
   [junit4]   2> 365473 INFO  (TEST-CollectionsAPIDistributedZkTest.test-seed#[6663C668C56EB0BE]) [    ] o.a.s.c.c.SolrZkClient Using default ZkACLProvider
   [junit4]   2> 365474 INFO  (TEST-CollectionsAPIDistributedZkTest.test-seed#[6663C668C56EB0BE]) [    ] o.a.s.s.SolrDispatchFilter Loading solr.xml from SolrHome (not found in ZooKeeper)
   [junit4]   2> 365474 INFO  (TEST-CollectionsAPIDistributedZkTest.test-seed#[6663C668C56EB0BE]) [    ] o.a.s.c.SolrXmlConfig Loading container configuration from /x1/jenkins/jenkins-slave/workspace/Lucene-Solr-NightlyTests-5.x/solr/build/solr-core/test/J1/temp/solr.cloud.CollectionsAPIDistributedZkTest_6663C668C56EB0BE-001/shard-1-001/solr.xml
   [junit4]   2> 365489 INFO  (TEST-CollectionsAPIDistributedZkTest.test-seed#[6663C668C56EB0BE]) [    ] o.a.s.c.CoresLocator Config-defined core root directory: /x1/jenkins/jenkins-slave/workspace/Lucene-Solr-NightlyTests-5.x/solr/build/solr-core/test/J1/temp/solr.cloud.CollectionsAPIDistributedZkTest_6663C668C56EB0BE-001/shard-1-001/cores
   [junit4]   2> 365489 INFO  (TEST-CollectionsAPIDistributedZkTest.test-seed#[6663C668C56EB0BE]) [    ] o.a.s.c.CoreContainer New CoreContainer 936293789
   [junit4]   2> 365489 INFO  (TEST-CollectionsAPIDistributedZkTest.test-seed#[6663C668C56EB0BE]) [    ] o.a.s.c.CoreContainer Loading cores into CoreContainer [instanceDir=/x1/jenkins/jenkins-slave/workspace/Lucene-Solr-NightlyTests-5.x/solr/build/solr-core/test/J1/temp/solr.cloud.CollectionsAPIDistributedZkTest_6663C668C56EB0BE-001/shard-1-001/]
   [junit4]   2> 365489 INFO  (TEST-CollectionsAPIDistributedZkTest.test-seed#[6663C668C56EB0BE]) [    ] o.a.s.c.CoreContainer loading shared library: /x1/jenkins/jenkins-slave/workspace/Lucene-Solr-NightlyTests-5.x/solr/build/solr-core/test/J1/temp/solr.cloud.CollectionsAPIDistributedZkTest_6663C668C56EB0BE-001/shard-1-001/lib
   [junit4]   2> 365489 WARN  (TEST-CollectionsAPIDistributedZkTest.test-seed#[6663C668C56EB0BE]) [    ] o.a.s.c.SolrResourceLoader Can't find (or read) directory to add to classloader: lib (resolved as: /x1/jenkins/jenkins-slave/workspace/Lucene-Solr-NightlyTests-5.x/solr/build/solr-core/test/J1/temp/solr.cloud.CollectionsAPIDistributedZkTest_6663C668C56EB0BE-001/shard-1-001/lib).
   [junit4]   2> 365497 INFO  (TEST-CollectionsAPIDistributedZkTest.test-seed#[6663C668C56EB0BE]) [    ] o.a.s.h.c.HttpShardHandlerFactory created with socketTimeout : 90000,urlScheme : ,connTimeout : 15000,maxConnectionsPerHost : 20,maxConnections : 10000,corePoolSize : 0,maximumPoolSize : 2147483647,maxThreadIdleTime : 5,sizeOfQueue : -1,fairnessPolicy : false,useRetries : false,
   [junit4]   2> 365499 INFO  (TEST-CollectionsAPIDistributedZkTest.test-seed#[6663C668C56EB0BE]) [    ] o.a.s.u.UpdateShardHandler Creating UpdateShardHandler HTTP client with params: socketTimeout=340000&connTimeout=45000&retry=true
   [junit4]   2> 365500 INFO  (TEST-CollectionsAPIDistributedZkTest.test-seed#[6663C668C56EB0BE]) [    ] o.a.s.l.LogWatcher SLF4J impl is org.slf4j.impl.Log4jLoggerFactory
   [junit4]   2> 365500 INFO  (TEST-CollectionsAPIDistributedZkTest.test-seed#[6663C668C56EB0BE]) [    ] o.a.s.l.LogWatcher Registering Log Listener [Log4j (org.slf4j.impl.Log4jLoggerFactory)]
   [junit4]   2> 365500 INFO  (TEST-CollectionsAPIDistributedZkTest.test-seed#[6663C668C56EB0BE]) [    ] o.a.s.c.ZkContainer Zookeeper client=127.0.0.1:53004/solr
   [junit4]   2> 365500 INFO  (TEST-CollectionsAPIDistributedZkTest.test-seed#[6663C668C56EB0BE]) [    ] o.a.s.c.ZkController zkHost includes chroot
   [junit4]   2> 365500 INFO  (TEST-CollectionsAPIDistributedZkTest.test-seed#[6663C668C56EB0BE]) [    ] o.a.s.c.c.SolrZkClient Using default ZkCredentialsProvider
   [junit4]   2> 365501 INFO  (TEST-CollectionsAPIDistributedZkTest.test-seed#[6663C668C56EB0BE]) [    ] o.a.s.c.c.ConnectionManager Waiting for client to connect to ZooKeeper
   [junit4]   2> 365502 INFO  (zkCallback-231-thread-1) [    ] o.a.s.c.c.ConnectionManager Watcher org.apache.solr.common.cloud.ConnectionManager@5d65d824 name:ZooKeeperConnection Watcher:127.0.0.1:53004 got event WatchedEvent state:SyncConnected type:None path:null path:null type:None
   [junit4]   2> 365503 INFO  (TEST-CollectionsAPIDistributedZkTest.test-seed#[6663C668C56EB0BE]) [    ] o.a.s.c.c.ConnectionManager Client is connected to ZooKeeper
   [junit4]   2> 365503 INFO  (TEST-CollectionsAPIDistributedZkTest.test-seed#[6663C668C56EB0BE]) [    ] o.a.s.c.c.SolrZkClient Using default ZkACLProvider
   [junit4]   2> 365505 INFO  (TEST-CollectionsAPIDistributedZkTest.test-seed#[6663C668C56EB0BE]) [n:127.0.0.1:42181_    ] o.a.s.c.c.ConnectionManager Waiting for client to connect to ZooKeeper
   [junit4]   2> 365507 INFO  (zkCallback-232-thread-1-processing-n:127.0.0.1:42181_) [n:127.0.0.1:42181_    ] o.a.s.c.c.ConnectionManager Watcher org.apache.solr.common.cloud.ConnectionManager@86e3392 name:ZooKeeperConnection Watcher:127.0.0.1:53004/solr got event WatchedEvent state:SyncConnected type:None path:null path:null type:None
   [junit4]   2> 365507 INFO  (TEST-CollectionsAPIDistributedZkTest.test-seed#[6663C668C56EB0BE]) [n:127.0.0.1:42181_    ] o.a.s.c.c.ConnectionManager Client is connected to ZooKeeper
   [junit4]   2> 365511 INFO  (TEST-CollectionsAPIDistributedZkTest.test-seed#[6663C668C56EB0BE]) [n:127.0.0.1:42181_    ] o.a.s.c.c.ZkStateReader Updating cluster state from ZooKeeper... 
   [junit4]   2> 366516 INFO  (TEST-CollectionsAPIDistributedZkTest.test-seed#[6663C668C56EB0BE]) [n:127.0.0.1:42181_    ] o.a.s.c.ZkController Register node as live in ZooKeeper:/live_nodes/127.0.0.1:42181_
   [junit4]   2> 366517 INFO  (TEST-CollectionsAPIDistributedZkTest.test-seed#[6663C668C56EB0BE]) [n:127.0.0.1:42181_    ] o.a.s.c.c.SolrZkClient makePath: /live_nodes/127.0.0.1:42181_
   [junit4]   2> 366518 INFO  (zkCallback-232-thread-1-processing-n:127.0.0.1:42181_) [n:127.0.0.1:42181_    ] o.a.s.c.c.ZkStateReader A live node change: WatchedEvent state:SyncConnected type:NodeChildrenChanged path:/live_nodes, has occurred - updating... (live nodes size: 1)
   [junit4]   2> 366518 INFO  (zkCallback-228-thread-1) [    ] o.a.s.c.c.ZkStateReader A live node change: WatchedEvent state:SyncConnected type:NodeChildrenChanged path:/live_nodes, has occurred - updating... (live nodes size: 1)
   [junit4]   2> 366519 INFO  (zkCallback-226-thread-1-processing-n:127.0.0.1:39900_) [n:127.0.0.1:39900_    ] o.a.s.c.c.ZkStateReader A live node change: WatchedEvent state:SyncConnected type:NodeChildrenChanged path:/live_nodes, has occurred - updating... (live nodes size: 1)
   [junit4]   2> 366520 INFO  (TEST-CollectionsAPIDistributedZkTest.test-seed#[6663C668C56EB0BE]) [n:127.0.0.1:42181_    ] o.a.s.c.Overseer Overseer (id=null) closing
   [junit4]   2> 366521 INFO  (TEST-CollectionsAPIDistributedZkTest.test-seed#[6663C668C56EB0BE]) [n:127.0.0.1:42181_    ] o.a.s.c.LeaderElector Joined leadership election with path: /overseer_elect/election/94407440641359880-127.0.0.1:42181_-n_0000000001
   [junit4]   2> 366522 INFO  (TEST-CollectionsAPIDistributedZkTest.test-seed#[6663C668C56EB0BE]) [n:127.0.0.1:42181_    ] o.a.s.c.LeaderElector Watching path /overseer_elect/election/94407440641359876-127.0.0.1:39900_-n_0000000000 to know if I could be the leader
   [junit4]   2> 366532 INFO  (TEST-CollectionsAPIDistributedZkTest.test-seed#[6663C668C56EB0BE]) [n:127.0.0.1:42181_    ] o.a.s.c.CoreContainer Security conf doesn't exist. Skipping setup for authorization module.
   [junit4]   2> 366532 INFO  (TEST-CollectionsAPIDistributedZkTest.test-seed#[6663C668C56EB0BE]) [n:127.0.0.1:42181_    ] o.a.s.c.CoreContainer No authentication plugin used.
   [junit4]   2> 366533 INFO  (TEST-CollectionsAPIDistributedZkTest.test-seed#[6663C668C56EB0BE]) [n:127.0.0.1:42181_    ] o.a.s.c.CoresLocator Looking for core definitions underneath /x1/jenkins/jenkins-slave/workspace/Lucene-Solr-NightlyTests-5.x/solr/build/solr-core/test/J1/temp/solr.cloud.CollectionsAPIDistributedZkTest_6663C668C56EB0BE-001/shard-1-001/cores
   [junit4]   2> 366534 INFO  (TEST-CollectionsAPIDistributedZkTest.test-seed#[6663C668C56EB0BE]) [n:127.0.0.1:42181_    ] o.a.s.c.SolrCore Created CoreDescriptor: {instanceDir=/x1/jenkins/jenkins-slave/workspace/Lucene-Solr-NightlyTests-5.x/solr/build/solr-core/test/J1/temp/solr.cloud.CollectionsAPIDistributedZkTest_6663C668C56EB0BE-001/shard-1-001/cores/collection1, configSetProperties=configsetprops.json, absoluteInstDir=/x1/jenkins/jenkins-slave/workspace/Lucene-Solr-NightlyTests-5.x/solr/build/solr-core/test/J1/temp/solr.cloud.CollectionsAPIDistributedZkTest_6663C668C56EB0BE-001/shard-1-001/cores/collection1/, name=collection1, collection=collection1, transient=false, schema=schema.xml, dataDir=data/, loadOnStartup=true, config=solrconfig.xml, shard=, coreNodeName=}
   [junit4]   2> 366534 INFO  (TEST-CollectionsAPIDistributedZkTest.test-seed#[6663C668C56EB0BE]) [n:127.0.0.1:42181_    ] o.a.s.c.CoresLocator Found core collection1 in /x1/jenkins/jenkins-slave/workspace/Lucene-Solr-NightlyTests-5.x/solr/build/solr-core/test/J1/temp/solr.cloud.CollectionsAPIDistributedZkTest_6663C668C56EB0BE-001/shard-1-001/cores/collection1/
   [junit4]   2> 366534 INFO  (TEST-CollectionsAPIDistributedZkTest.test-seed#[6663C668C56EB0BE]) [n:127.0.0.1:42181_    ] o.a.s.c.CoresLocator Found 1 core definitions
   [junit4]   2> 366535 INFO  (TEST-CollectionsAPIDistributedZkTest.test-seed#[6663C668C56EB0BE]) [n:127.0.0.1:42181_    ] o.a.s.s.SolrDispatchFilter user.dir=/x1/jenkins/jenkins-slave/workspace/Lucene-Solr-NightlyTests-5.x/solr/build/solr-core/test/J1
   [junit4]   2> 366536 INFO  (TEST-CollectionsAPIDistributedZkTest.test-seed#[6663C668C56EB0BE]) [n:127.0.0.1:42181_    ] o.a.s.s.SolrDispatchFilter SolrDispatchFilter.init() done
   [junit4]   2> 366536 INFO  (coreLoadExecutor-883-thread-1-processing-n:127.0.0.1:42181_) [n:127.0.0.1:42181_ c:collection1   x:collection1] o.a.s.c.ZkController publishing state=down
   [junit4]   2> 366536 INFO  (coreLoadExecutor-883-thread-1-processing-n:127.0.0.1:42181_) [n:127.0.0.1:42181_ c:collection1   x:collection1] o.a.s.c.ZkController numShards not found on descriptor - reading it from system property
   [junit4]   2> 366538 INFO  (OverseerStateUpdate-94407440641359876-127.0.0.1:39900_-n_0000000000) [n:127.0.0.1:39900_    ] o.a.s.c.Overseer processMessage: queueSize: 1, message = {
   [junit4]   2>   "state":"down",
   [junit4]   2>   "collection":"collection1",
   [junit4]   2>   "node_name":"127.0.0.1:42181_",
   [junit4]   2>   "base_url":"http://127.0.0.1:42181",
   [junit4]   2>   "numShards":"2",
   [junit4]   2>   "operation":"state",
   [junit4]   2>   "roles":null,
   [junit4]   2>   "core":"collection1",
   [junit4]   2>   "shard":null} current state version: 3
   [junit4]   2> 366538 INFO  (coreLoadExecutor-883-thread-1-processing-n:127.0.0.1:42181_) [n:127.0.0.1:42181_ c:collection1   x:collection1] o.a.s.c.ZkController look for our core node name
   [junit4]   2> 366538 INFO  (OverseerStateUpdate-94407440641359876-127.0.0.1:39900_-n_0000000000) [n:127.0.0.1:39900_    ] o.a.s.c.o.ReplicaMutator Update state numShards=2 message={
   [junit4]   2>   "state":"down",
   [junit4]   2>   "collection":"collection1",
   [junit4]   2>   "node_name":"127.0.0.1:42181_",
   [junit4]   2>   "base_url":"http://127.0.0.1:42181",
   [junit4]   2>   "numShards":"2",
   [junit4]   2>   "operation":"state",
   [junit4]   2>   "roles":null,
   [junit4]   2>   "core":"collection1",
   [junit4]   2>   "shard":null}
   [junit4]   2> 366538 INFO  (OverseerStateUpdate-94407440641359876-127.0.0.1:39900_-n_0000000000) [n:127.0.0.1:39900_    ] o.a.s.c.o.ClusterStateMutator building a new cName: collection1
   [junit4]   2> 366539 INFO  (OverseerStateUpdate-94407440641359876-127.0.0.1:39900_-n_0000000000) [n:127.0.0.1:39900_    ] o.a.s.c.o.ReplicaMutator Assigning new node to shard shard=shard1
   [junit4]   2> 366642 INFO  (zkCallback-232-thread-1-processing-n:127.0.0.1:42181_) [n:127.0.0.1:42181_    ] o.a.s.c.c.ZkStateReader A cluster state change: WatchedEvent state:SyncConnected type:NodeDataChanged path:/clusterstate.json, has occurred - updating... (live nodes size: 2)
   [junit4]   2> 366642 INFO  (zkCallback-228-thread-1) [    ] o.a.s.c.c.ZkStateReader A cluster state change: WatchedEvent state:SyncConnected type:NodeDataChanged path:/clusterstate.json, has occurred - updating... (live nodes size: 2)
   [junit4]   2> 366642 INFO  (zkCallback-226-thread-1-processing-n:127.0.0.1:39900_) [n:127.0.0.1:39900_    ] o.a.s.c.c.ZkStateReader A cluster state change: WatchedEvent state:SyncConnected type:NodeDataChanged path:/clusterstate.json, has occurred - updating... (live nodes size: 2)
   [junit4]   2> 367539 INFO  (coreLoadExecutor-883-thread-1-processing-n:127.0.0.1:42181_) [n:127.0.0.1:42181_ c:collection1   x:collection1] o.a.s.c.ZkController waiting to find shard id in clusterstate for collection1
   [junit4]   2> 367539 INFO  (coreLoadExecutor-883-thread-1-processing-n:127.0.0.1:42181_) [n:127.0.0.1:42181_ c:collection1   x:collection1] o.a.s.c.ZkController Check for collection zkNode:collection1
   [junit4]   2> 367540 INFO  (coreLoadExecutor-883-thread-1-processing-n:127.0.0.1:42181_) [n:127.0.0.1:42181_ c:collection1   x:collection1] o.a.s.c.ZkController Collection zkNode exists
   [junit4]   2> 367540 INFO  (coreLoadExecutor-883-thread-1-processing-n:127.0.0.1:42181_) [n:127.0.0.1:42181_ c:collection1   x:collection1] o.a.s.c.c.ZkStateReader Load collection config from:/collections/collection1
   [junit4]   2> 367541 INFO  (coreLoadExecutor-883-thread-1-processing-n:127.0.0.1:42181_) [n:127.0.0.1:42181_ c:collection1   x:collection1] o.a.s.c.c.ZkStateReader path=/collections/collection1 configName=conf1 specified config exists in ZooKeeper
   [junit4]   2> 367541 INFO  (coreLoadExecutor-883-thread-1-processing-n:127.0.0.1:42181_) [n:127.0.0.1:42181_ c:collection1   x:collection1] o.a.s.c.SolrResourceLoader new SolrResourceLoader for directory: '/x1/jenkins/jenkins-slave/workspace/Lucene-Solr-NightlyTests-5.x/solr/build/solr-core/test/J1/temp/solr.cloud.CollectionsAPIDistributedZkTest_6663C668C56EB0BE-001/shard-1-001/cores/collection1/'
   [junit4]   2> 367559 INFO  (coreLoadExecutor-883-thread-1-processing-n:127.0.0.1:42181_) [n:127.0.0.1:42181_ c:collection1   x:collection1] o.a.s.c.Config loaded config solrconfig.xml with version 0 
   [junit4]   2> 367569 INFO  (coreLoadExecutor-883-thread-1-processing-n:127.0.0.1:42181_) [n

[...truncated too long message...]

eckMBeanPermission(DefaultMBeanServerInterceptor.java:1813)
   [junit4]   2> 	at com.sun.jmx.interceptor.DefaultMBeanServerInterceptor.exclusiveUnregisterMBean(DefaultMBeanServerInterceptor.java:430)
   [junit4]   2> 	at com.sun.jmx.interceptor.DefaultMBeanServerInterceptor.unregisterMBean(DefaultMBeanServerInterceptor.java:415)
   [junit4]   2> 	at com.sun.jmx.mbeanserver.JmxMBeanServer.unregisterMBean(JmxMBeanServer.java:546)
   [junit4]   2> 	at org.apache.hadoop.metrics2.util.MBeans.unregister(MBeans.java:81)
   [junit4]   2> 	at org.apache.hadoop.metrics2.impl.MetricsSourceAdapter.stopMBeans(MetricsSourceAdapter.java:227)
   [junit4]   2> 	at org.apache.hadoop.metrics2.impl.MetricsSourceAdapter.stop(MetricsSourceAdapter.java:212)
   [junit4]   2> 	at org.apache.hadoop.metrics2.impl.MetricsSystemImpl.stopSources(MetricsSystemImpl.java:461)
   [junit4]   2> 	at org.apache.hadoop.metrics2.impl.MetricsSystemImpl.stop(MetricsSystemImpl.java:212)
   [junit4]   2> 	at org.apache.hadoop.metrics2.impl.MetricsSystemImpl.shutdown(MetricsSystemImpl.java:592)
   [junit4]   2> 	at org.apache.hadoop.metrics2.lib.DefaultMetricsSystem.shutdownInstance(DefaultMetricsSystem.java:72)
   [junit4]   2> 	at org.apache.hadoop.metrics2.lib.DefaultMetricsSystem.shutdown(DefaultMetricsSystem.java:68)
   [junit4]   2> 	at org.apache.hadoop.hdfs.server.namenode.metrics.NameNodeMetrics.shutdown(NameNodeMetrics.java:145)
   [junit4]   2> 	at org.apache.hadoop.hdfs.server.namenode.NameNode.stop(NameNode.java:822)
   [junit4]   2> 	at org.apache.hadoop.hdfs.MiniDFSCluster.shutdown(MiniDFSCluster.java:1720)
   [junit4]   2> 	at org.apache.hadoop.hdfs.MiniDFSCluster.shutdown(MiniDFSCluster.java:1699)
   [junit4]   2> 	at org.apache.solr.cloud.hdfs.HdfsTestUtil.teardownClass(HdfsTestUtil.java:197)
   [junit4]   2> 	at org.apache.solr.cloud.hdfs.HdfsCollectionsAPIDistributedZkTest.teardownClass(HdfsCollectionsAPIDistributedZkTest.java:50)
   [junit4]   2> 	at sun.reflect.NativeMethodAccessorImpl.invoke0(Native Method)
   [junit4]   2> 	at sun.reflect.NativeMethodAccessorImpl.invoke(NativeMethodAccessorImpl.java:57)
   [junit4]   2> 	at sun.reflect.DelegatingMethodAccessorImpl.invoke(DelegatingMethodAccessorImpl.java:43)
   [junit4]   2> 	at java.lang.reflect.Method.invoke(Method.java:606)
   [junit4]   2> 	at com.carrotsearch.randomizedtesting.RandomizedRunner.invoke(RandomizedRunner.java:1627)
   [junit4]   2> 	at com.carrotsearch.randomizedtesting.RandomizedRunner$5.evaluate(RandomizedRunner.java:799)
   [junit4]   2> 	at com.carrotsearch.randomizedtesting.rules.StatementAdapter.evaluate(StatementAdapter.java:36)
   [junit4]   2> 	at com.carrotsearch.randomizedtesting.rules.SystemPropertiesRestoreRule$1.evaluate(SystemPropertiesRestoreRule.java:57)
   [junit4]   2> 	at org.apache.lucene.util.AbstractBeforeAfterRule$1.evaluate(AbstractBeforeAfterRule.java:46)
   [junit4]   2> 	at com.carrotsearch.randomizedtesting.rules.StatementAdapter.evaluate(StatementAdapter.java:36)
   [junit4]   2> 	at org.apache.lucene.util.TestRuleStoreClassName$1.evaluate(TestRuleStoreClassName.java:42)
   [junit4]   2> 	at com.carrotsearch.randomizedtesting.rules.NoShadowingOrOverridesOnMethodsRule$1.evaluate(NoShadowingOrOverridesOnMethodsRule.java:39)
   [junit4]   2> 	at com.carrotsearch.randomizedtesting.rules.NoShadowingOrOverridesOnMethodsRule$1.evaluate(NoShadowingOrOverridesOnMethodsRule.java:39)
   [junit4]   2> 	at com.carrotsearch.randomizedtesting.rules.StatementAdapter.evaluate(StatementAdapter.java:36)
   [junit4]   2> 	at com.carrotsearch.randomizedtesting.rules.StatementAdapter.evaluate(StatementAdapter.java:36)
   [junit4]   2> 	at com.carrotsearch.randomizedtesting.rules.StatementAdapter.evaluate(StatementAdapter.java:36)
   [junit4]   2> 	at org.apache.lucene.util.TestRuleAssertionsRequired$1.evaluate(TestRuleAssertionsRequired.java:54)
   [junit4]   2> 	at org.apache.lucene.util.TestRuleMarkFailure$1.evaluate(TestRuleMarkFailure.java:48)
   [junit4]   2> 	at org.apache.lucene.util.TestRuleIgnoreAfterMaxFailures$1.evaluate(TestRuleIgnoreAfterMaxFailures.java:65)
   [junit4]   2> 	at org.apache.lucene.util.TestRuleIgnoreTestSuites$1.evaluate(TestRuleIgnoreTestSuites.java:55)
   [junit4]   2> 	at com.carrotsearch.randomizedtesting.rules.StatementAdapter.evaluate(StatementAdapter.java:36)
   [junit4]   2> 	at com.carrotsearch.randomizedtesting.ThreadLeakControl$StatementRunner.run(ThreadLeakControl.java:365)
   [junit4]   2> 	at java.lang.Thread.run(Thread.java:745)
   [junit4]   2> Caused by: java.lang.NullPointerException
   [junit4]   2> 	at org.apache.hadoop.hdfs.server.blockmanagement.BlocksMap.size(BlocksMap.java:198)
   [junit4]   2> 	at org.apache.hadoop.hdfs.server.blockmanagement.BlockManager.getTotalBlocks(BlockManager.java:3291)
   [junit4]   2> 	at org.apache.hadoop.hdfs.server.namenode.FSNamesystem.getBlocksTotal(FSNamesystem.java:6223)
   [junit4]   2> 	... 53 more
   [junit4]   2> 3726157 INFO  (SUITE-HdfsCollectionsAPIDistributedZkTest-seed#[6663C668C56EB0BE]-worker) [n:127.0.0.1:42279_n%2Fai c:addReplicaColl s:shard1 r:core_node7 x:propertyDotName] o.a.s.SolrTestCaseJ4 ###deleteCore
   [junit4]   2> Aug 25, 2015 7:49:46 PM com.carrotsearch.randomizedtesting.ThreadLeakControl checkThreadLeaks
   [junit4]   2> WARNING: Will linger awaiting termination of 2 leaked thread(s).
   [junit4]   2> NOTE: test params are: codec=Asserting(Lucene53), sim=RandomSimilarityProvider(queryNorm=true,coord=crazy): {}, locale=sr_BA, timezone=SystemV/CST6CDT
   [junit4]   2> NOTE: Linux 3.13.0-52-generic amd64/Oracle Corporation 1.7.0_72 (64-bit)/cpus=4,threads=2,free=269762608,total=532676608
   [junit4]   2> NOTE: All tests run in this JVM: [TestFieldSortValues, JavabinLoaderTest, TestRealTimeGet, ShardSplitTest, TestCloudInspectUtil, TestCollectionAPI, SpatialRPTFieldTypeTest, ExternalFileFieldSortTest, URLClassifyProcessorTest, AsyncCallRequestStatusResponseTest, MinimalSchemaTest, QueryElevationComponentTest, UniqFieldsUpdateProcessorFactoryTest, RequestHandlersTest, UpdateRequestProcessorFactoryTest, TestSolrIndexConfig, DebugComponentTest, TestIntervalFaceting, TestMiniSolrCloudClusterSSL, IndexBasedSpellCheckerTest, TestAnalyzeInfixSuggestions, BadCopyFieldTest, CollectionsAPIAsyncDistributedZkTest, TestRandomRequestDistribution, TestQuerySenderListener, TestHdfsUpdateLog, TestRebalanceLeaders, TestPhraseSuggestions, TestCSVLoader, TestLazyCores, SolrCoreTest, DistributedFacetPivotLongTailTest, TermVectorComponentTest, SuggesterWFSTTest, DateFieldTest, TestFieldTypeResource, TestMergePolicyConfig, DefaultValueUpdateProcessorTest, TestWordDelimiterFilterFactory, SchemaVersionSpecificBehaviorTest, HdfsRecoverLeaseTest, IndexSchemaTest, TestBulkSchemaConcurrent, TestFaceting, TestJmxMonitoredMap, HdfsBasicDistributedZk2Test, TestRandomFaceting, HdfsDirectoryTest, HdfsUnloadDistributedZkTest, IgnoreCommitOptimizeUpdateProcessorFactoryTest, SimpleCollectionCreateDeleteTest, TestManagedSchema, ConcurrentDeleteAndCreateCollectionTest, CachingDirectoryFactoryTest, PingRequestHandlerTest, TestExactStatsCache, TestReplicationHandler, AddSchemaFieldsUpdateProcessorFactoryTest, TestReversedWildcardFilterFactory, TimeZoneUtilsTest, SimplePostToolTest, UUIDUpdateProcessorFallbackTest, CoreMergeIndexesAdminHandlerTest, SmileWriterTest, TestDynamicFieldResource, TestRestoreCore, HdfsChaosMonkeySafeLeaderTest, TestConfigSets, SegmentsInfoRequestHandlerTest, TestSolrDynamicMBean, DeleteShardTest, TestJettySolrRunner, HighlighterConfigTest, TestFunctionQuery, DistribCursorPagingTest, TestSolrCLIRunExample, ClusterStateTest, TestCodecSupport, PeerSyncTest, BufferStoreTest, TestSolr4Spatial, BitVectorTest, StressHdfsTest, TestJmxIntegration, TermsComponentTest, SolrTestCaseJ4Test, TestCrossCoreJoin, TestHighlightDedupGrouping, TestSimpleTrackingShardHandler, TestTolerantSearch, ActionThrottleTest, AliasIntegrationTest, CleanupOldIndexTest, CollectionTooManyReplicasTest, DeleteInactiveReplicaTest, DeleteLastCustomShardedReplicaTest, DistribJoinFromCollectionTest, LeaderFailoverAfterPartitionTest, LeaderInitiatedRecoveryOnCommitTest, MigrateRouteKeyTest, OverseerCollectionQueueTest, OverseerRolesTest, RemoteQueryErrorTest, SharedFSAutoReplicaFailoverUtilsTest, SolrCloudExampleTest, SolrXmlInZkTest, TestCloudPivotFacet, TestDownShardTolerantSearch, TestLeaderElectionZkExpiry, TestRequestStatusCollectionAPI, HdfsCollectionsAPIDistributedZkTest]
   [junit4] Completed [451/534] on J0 in 390.32s, 1 test, 1 error <<< FAILURES!

[...truncated 261 lines...]
BUILD FAILED
/x1/jenkins/jenkins-slave/workspace/Lucene-Solr-NightlyTests-5.x/build.xml:792: The following error occurred while executing this line:
/x1/jenkins/jenkins-slave/workspace/Lucene-Solr-NightlyTests-5.x/build.xml:729: The following error occurred while executing this line:
/x1/jenkins/jenkins-slave/workspace/Lucene-Solr-NightlyTests-5.x/build.xml:59: The following error occurred while executing this line:
/x1/jenkins/jenkins-slave/workspace/Lucene-Solr-NightlyTests-5.x/solr/build.xml:233: The following error occurred while executing this line:
/x1/jenkins/jenkins-slave/workspace/Lucene-Solr-NightlyTests-5.x/solr/common-build.xml:524: The following error occurred while executing this line:
/x1/jenkins/jenkins-slave/workspace/Lucene-Solr-NightlyTests-5.x/lucene/common-build.xml:1452: The following error occurred while executing this line:
/x1/jenkins/jenkins-slave/workspace/Lucene-Solr-NightlyTests-5.x/lucene/common-build.xml:1006: There were test failures: 534 suites, 2119 tests, 2 errors, 1 failure, 26 ignored (14 assumptions)

Total time: 184 minutes 51 seconds
Build step 'Invoke Ant' marked build as failure
Archiving artifacts
Sending artifact delta relative to Lucene-Solr-NightlyTests-5.x #911
Archived 4 artifacts
Archive block size is 32768
Received 0 blocks and 1137962082 bytes
Compression is 0.0%
Took 3 min 7 sec
Recording test results
Email was triggered for: Failure
Sending email for trigger: Failure



Mime
View raw message