lucene-dev mailing list archives

Site index · List index
Message view « Date » · « Thread »
Top « Date » · « Thread »
From Apache Jenkins Server <jenk...@builds.apache.org>
Subject [JENKINS] Lucene-Solr-NightlyTests-5.x - Build # 930 - Still Failing
Date Mon, 17 Aug 2015 19:09:13 GMT
Build: https://builds.apache.org/job/Lucene-Solr-NightlyTests-5.x/930/

4 tests failed.
REGRESSION:  org.apache.solr.cloud.CollectionsAPIDistributedZkTest.test

Error Message:
Captured an uncaught exception in thread: Thread[id=101104, name=collection2, state=RUNNABLE, group=TGRP-CollectionsAPIDistributedZkTest]

Stack Trace:
com.carrotsearch.randomizedtesting.UncaughtExceptionError: Captured an uncaught exception in thread: Thread[id=101104, name=collection2, state=RUNNABLE, group=TGRP-CollectionsAPIDistributedZkTest]
Caused by: org.apache.solr.client.solrj.impl.HttpSolrClient$RemoteSolrException: Error from server at http://127.0.0.1:40599: collection already exists: awholynewstresscollection_collection2_0
	at __randomizedtesting.SeedInfo.seed([456BEE68EFC74744]:0)
	at org.apache.solr.client.solrj.impl.HttpSolrClient.executeMethod(HttpSolrClient.java:560)
	at org.apache.solr.client.solrj.impl.HttpSolrClient.request(HttpSolrClient.java:234)
	at org.apache.solr.client.solrj.impl.HttpSolrClient.request(HttpSolrClient.java:226)
	at org.apache.solr.client.solrj.impl.LBHttpSolrClient.doRequest(LBHttpSolrClient.java:372)
	at org.apache.solr.client.solrj.impl.LBHttpSolrClient.request(LBHttpSolrClient.java:325)
	at org.apache.solr.client.solrj.impl.CloudSolrClient.sendRequest(CloudSolrClient.java:1086)
	at org.apache.solr.client.solrj.impl.CloudSolrClient.requestWithRetryOnStaleState(CloudSolrClient.java:857)
	at org.apache.solr.client.solrj.impl.CloudSolrClient.request(CloudSolrClient.java:800)
	at org.apache.solr.client.solrj.SolrClient.request(SolrClient.java:1220)
	at org.apache.solr.cloud.AbstractFullDistribZkTestBase.createCollection(AbstractFullDistribZkTestBase.java:1574)
	at org.apache.solr.cloud.AbstractFullDistribZkTestBase.createCollection(AbstractFullDistribZkTestBase.java:1595)
	at org.apache.solr.cloud.CollectionsAPIDistributedZkTest$1CollectionThread.run(CollectionsAPIDistributedZkTest.java:888)


REGRESSION:  org.apache.solr.handler.TestReplicationHandler.doTestReplicateAfterCoreReload

Error Message:
expected:<[{indexVersion=1439836692008,generation=2,filelist=[_1.cfe, _1.cfs, _1.si, _2.cfe, _2.cfs, _2.si, _3.cfe, _3.cfs, _3.si, _4.cfe, _4.cfs, _4.si, _5.fdt, _5.fdx, _5.fnm, _5.nvd, _5.nvm, _5.si, _5_LuceneVarGapFixedInterval_0.doc, _5_LuceneVarGapFixedInterval_0.tib, _5_LuceneVarGapFixedInterval_0.tiv, _6.cfe, _6.cfs, _6.si, segments_2]}]> but was:<[{indexVersion=1439836692008,generation=2,filelist=[_1.cfe, _1.cfs, _1.si, _2.cfe, _2.cfs, _2.si, _3.cfe, _3.cfs, _3.si, _4.cfe, _4.cfs, _4.si, _5.fdt, _5.fdx, _5.fnm, _5.nvd, _5.nvm, _5.si, _5_LuceneVarGapFixedInterval_0.doc, _5_LuceneVarGapFixedInterval_0.tib, _5_LuceneVarGapFixedInterval_0.tiv, _6.cfe, _6.cfs, _6.si, segments_2]}, {indexVersion=1439836692008,generation=3,filelist=[_5.fdt, _5.fdx, _5.fnm, _5.nvd, _5.nvm, _5.si, _5_LuceneVarGapFixedInterval_0.doc, _5_LuceneVarGapFixedInterval_0.tib, _5_LuceneVarGapFixedInterval_0.tiv, _6.cfe, _6.cfs, _6.si, _7.fdt, _7.fdx, _7.fnm, _7.nvd, _7.nvm, _7.si, _7_LuceneVarGapFixedInterval_0.doc, _7_LuceneVarGapFixedInterval_0.tib, _7_LuceneVarGapFixedInterval_0.tiv, _8.cfe, _8.cfs, _8.si, segments_3]}]>

Stack Trace:
java.lang.AssertionError: expected:<[{indexVersion=1439836692008,generation=2,filelist=[_1.cfe, _1.cfs, _1.si, _2.cfe, _2.cfs, _2.si, _3.cfe, _3.cfs, _3.si, _4.cfe, _4.cfs, _4.si, _5.fdt, _5.fdx, _5.fnm, _5.nvd, _5.nvm, _5.si, _5_LuceneVarGapFixedInterval_0.doc, _5_LuceneVarGapFixedInterval_0.tib, _5_LuceneVarGapFixedInterval_0.tiv, _6.cfe, _6.cfs, _6.si, segments_2]}]> but was:<[{indexVersion=1439836692008,generation=2,filelist=[_1.cfe, _1.cfs, _1.si, _2.cfe, _2.cfs, _2.si, _3.cfe, _3.cfs, _3.si, _4.cfe, _4.cfs, _4.si, _5.fdt, _5.fdx, _5.fnm, _5.nvd, _5.nvm, _5.si, _5_LuceneVarGapFixedInterval_0.doc, _5_LuceneVarGapFixedInterval_0.tib, _5_LuceneVarGapFixedInterval_0.tiv, _6.cfe, _6.cfs, _6.si, segments_2]}, {indexVersion=1439836692008,generation=3,filelist=[_5.fdt, _5.fdx, _5.fnm, _5.nvd, _5.nvm, _5.si, _5_LuceneVarGapFixedInterval_0.doc, _5_LuceneVarGapFixedInterval_0.tib, _5_LuceneVarGapFixedInterval_0.tiv, _6.cfe, _6.cfs, _6.si, _7.fdt, _7.fdx, _7.fnm, _7.nvd, _7.nvm, _7.si, _7_LuceneVarGapFixedInterval_0.doc, _7_LuceneVarGapFixedInterval_0.tib, _7_LuceneVarGapFixedInterval_0.tiv, _8.cfe, _8.cfs, _8.si, segments_3]}]>
	at __randomizedtesting.SeedInfo.seed([456BEE68EFC74744:60BCF5589F8F4947]:0)
	at org.junit.Assert.fail(Assert.java:93)
	at org.junit.Assert.failNotEquals(Assert.java:647)
	at org.junit.Assert.assertEquals(Assert.java:128)
	at org.junit.Assert.assertEquals(Assert.java:147)
	at org.apache.solr.handler.TestReplicationHandler.doTestReplicateAfterCoreReload(TestReplicationHandler.java:1138)
	at sun.reflect.NativeMethodAccessorImpl.invoke0(Native Method)
	at sun.reflect.NativeMethodAccessorImpl.invoke(NativeMethodAccessorImpl.java:57)
	at sun.reflect.DelegatingMethodAccessorImpl.invoke(DelegatingMethodAccessorImpl.java:43)
	at java.lang.reflect.Method.invoke(Method.java:606)
	at com.carrotsearch.randomizedtesting.RandomizedRunner.invoke(RandomizedRunner.java:1627)
	at com.carrotsearch.randomizedtesting.RandomizedRunner$6.evaluate(RandomizedRunner.java:836)
	at com.carrotsearch.randomizedtesting.RandomizedRunner$7.evaluate(RandomizedRunner.java:872)
	at com.carrotsearch.randomizedtesting.RandomizedRunner$8.evaluate(RandomizedRunner.java:886)
	at com.carrotsearch.randomizedtesting.rules.SystemPropertiesRestoreRule$1.evaluate(SystemPropertiesRestoreRule.java:57)
	at org.apache.lucene.util.TestRuleSetupTeardownChained$1.evaluate(TestRuleSetupTeardownChained.java:50)
	at org.apache.lucene.util.AbstractBeforeAfterRule$1.evaluate(AbstractBeforeAfterRule.java:46)
	at org.apache.lucene.util.TestRuleThreadAndTestName$1.evaluate(TestRuleThreadAndTestName.java:49)
	at org.apache.lucene.util.TestRuleIgnoreAfterMaxFailures$1.evaluate(TestRuleIgnoreAfterMaxFailures.java:65)
	at org.apache.lucene.util.TestRuleMarkFailure$1.evaluate(TestRuleMarkFailure.java:48)
	at com.carrotsearch.randomizedtesting.rules.StatementAdapter.evaluate(StatementAdapter.java:36)
	at com.carrotsearch.randomizedtesting.ThreadLeakControl$StatementRunner.run(ThreadLeakControl.java:365)
	at com.carrotsearch.randomizedtesting.ThreadLeakControl.forkTimeoutingTask(ThreadLeakControl.java:798)
	at com.carrotsearch.randomizedtesting.ThreadLeakControl$3.evaluate(ThreadLeakControl.java:458)
	at com.carrotsearch.randomizedtesting.RandomizedRunner.runSingleTest(RandomizedRunner.java:845)
	at com.carrotsearch.randomizedtesting.RandomizedRunner$3.evaluate(RandomizedRunner.java:747)
	at com.carrotsearch.randomizedtesting.RandomizedRunner$4.evaluate(RandomizedRunner.java:781)
	at com.carrotsearch.randomizedtesting.RandomizedRunner$5.evaluate(RandomizedRunner.java:792)
	at com.carrotsearch.randomizedtesting.rules.StatementAdapter.evaluate(StatementAdapter.java:36)
	at com.carrotsearch.randomizedtesting.rules.SystemPropertiesRestoreRule$1.evaluate(SystemPropertiesRestoreRule.java:57)
	at org.apache.lucene.util.AbstractBeforeAfterRule$1.evaluate(AbstractBeforeAfterRule.java:46)
	at com.carrotsearch.randomizedtesting.rules.StatementAdapter.evaluate(StatementAdapter.java:36)
	at org.apache.lucene.util.TestRuleStoreClassName$1.evaluate(TestRuleStoreClassName.java:42)
	at com.carrotsearch.randomizedtesting.rules.NoShadowingOrOverridesOnMethodsRule$1.evaluate(NoShadowingOrOverridesOnMethodsRule.java:39)
	at com.carrotsearch.randomizedtesting.rules.NoShadowingOrOverridesOnMethodsRule$1.evaluate(NoShadowingOrOverridesOnMethodsRule.java:39)
	at com.carrotsearch.randomizedtesting.rules.StatementAdapter.evaluate(StatementAdapter.java:36)
	at com.carrotsearch.randomizedtesting.rules.StatementAdapter.evaluate(StatementAdapter.java:36)
	at com.carrotsearch.randomizedtesting.rules.StatementAdapter.evaluate(StatementAdapter.java:36)
	at org.apache.lucene.util.TestRuleAssertionsRequired$1.evaluate(TestRuleAssertionsRequired.java:54)
	at org.apache.lucene.util.TestRuleMarkFailure$1.evaluate(TestRuleMarkFailure.java:48)
	at org.apache.lucene.util.TestRuleIgnoreAfterMaxFailures$1.evaluate(TestRuleIgnoreAfterMaxFailures.java:65)
	at org.apache.lucene.util.TestRuleIgnoreTestSuites$1.evaluate(TestRuleIgnoreTestSuites.java:55)
	at com.carrotsearch.randomizedtesting.rules.StatementAdapter.evaluate(StatementAdapter.java:36)
	at com.carrotsearch.randomizedtesting.ThreadLeakControl$StatementRunner.run(ThreadLeakControl.java:365)
	at java.lang.Thread.run(Thread.java:745)


FAILED:  org.apache.solr.cloud.hdfs.HdfsCollectionsAPIDistributedZkTest.test

Error Message:
Captured an uncaught exception in thread: Thread[id=36948, name=collection5, state=RUNNABLE, group=TGRP-HdfsCollectionsAPIDistributedZkTest]

Stack Trace:
com.carrotsearch.randomizedtesting.UncaughtExceptionError: Captured an uncaught exception in thread: Thread[id=36948, name=collection5, state=RUNNABLE, group=TGRP-HdfsCollectionsAPIDistributedZkTest]
Caused by: org.apache.solr.client.solrj.impl.HttpSolrClient$RemoteSolrException: Error from server at https://127.0.0.1:56766/frj: Could not find collection : awholynewstresscollection_collection5_1
	at __randomizedtesting.SeedInfo.seed([456BEE68EFC74744]:0)
	at org.apache.solr.client.solrj.impl.HttpSolrClient.executeMethod(HttpSolrClient.java:560)
	at org.apache.solr.client.solrj.impl.HttpSolrClient.request(HttpSolrClient.java:234)
	at org.apache.solr.client.solrj.impl.HttpSolrClient.request(HttpSolrClient.java:226)
	at org.apache.solr.client.solrj.impl.LBHttpSolrClient.doRequest(LBHttpSolrClient.java:372)
	at org.apache.solr.client.solrj.impl.LBHttpSolrClient.request(LBHttpSolrClient.java:325)
	at org.apache.solr.client.solrj.impl.CloudSolrClient.sendRequest(CloudSolrClient.java:1086)
	at org.apache.solr.client.solrj.impl.CloudSolrClient.requestWithRetryOnStaleState(CloudSolrClient.java:857)
	at org.apache.solr.client.solrj.impl.CloudSolrClient.request(CloudSolrClient.java:800)
	at org.apache.solr.client.solrj.SolrClient.request(SolrClient.java:1220)
	at org.apache.solr.cloud.CollectionsAPIDistributedZkTest$1CollectionThread.run(CollectionsAPIDistributedZkTest.java:895)


FAILED:  org.apache.solr.search.TestReloadDeadlock.testReloadDeadlock

Error Message:
Captured an uncaught exception in thread: Thread[id=5279, name=WRITER8, state=RUNNABLE, group=TGRP-TestReloadDeadlock]

Stack Trace:
com.carrotsearch.randomizedtesting.UncaughtExceptionError: Captured an uncaught exception in thread: Thread[id=5279, name=WRITER8, state=RUNNABLE, group=TGRP-TestReloadDeadlock]
	at __randomizedtesting.SeedInfo.seed([456BEE68EFC74744:78EA4AC9BB8CA406]:0)
Caused by: java.lang.RuntimeException: org.apache.solr.common.SolrException: Error opening new searcher
	at __randomizedtesting.SeedInfo.seed([456BEE68EFC74744]:0)
	at org.apache.solr.search.TestReloadDeadlock$1.run(TestReloadDeadlock.java:166)
Caused by: org.apache.solr.common.SolrException: Error opening new searcher
	at org.apache.solr.core.SolrCore.openNewSearcher(SolrCore.java:1673)
	at org.apache.solr.core.SolrCore.getRealtimeSearcher(SolrCore.java:1530)
	at org.apache.solr.update.VersionInfo.getVersionFromIndex(VersionInfo.java:201)
	at org.apache.solr.update.UpdateLog.lookupVersion(UpdateLog.java:779)
	at org.apache.solr.update.VersionInfo.lookupVersion(VersionInfo.java:194)
	at org.apache.solr.update.processor.DistributedUpdateProcessor.versionAdd(DistributedUpdateProcessor.java:1088)
	at org.apache.solr.update.processor.DistributedUpdateProcessor.processAdd(DistributedUpdateProcessor.java:705)
	at org.apache.solr.update.processor.LogUpdateProcessor.processAdd(LogUpdateProcessorFactory.java:104)
	at org.apache.solr.handler.loader.JsonLoader$SingleThreadedJsonLoader.handleAdds(JsonLoader.java:470)
	at org.apache.solr.handler.loader.JsonLoader$SingleThreadedJsonLoader.processUpdate(JsonLoader.java:134)
	at org.apache.solr.handler.loader.JsonLoader$SingleThreadedJsonLoader.load(JsonLoader.java:113)
	at org.apache.solr.handler.loader.JsonLoader.load(JsonLoader.java:76)
	at org.apache.solr.handler.UpdateRequestHandler$1.load(UpdateRequestHandler.java:98)
	at org.apache.solr.handler.ContentStreamHandlerBase.handleRequestBody(ContentStreamHandlerBase.java:74)
	at org.apache.solr.handler.RequestHandlerBase.handleRequest(RequestHandlerBase.java:151)
	at org.apache.solr.core.SolrCore.execute(SolrCore.java:2079)
	at org.apache.solr.servlet.DirectSolrConnection.request(DirectSolrConnection.java:131)
	at org.apache.solr.SolrTestCaseJ4.updateJ(SolrTestCaseJ4.java:1104)
	at org.apache.solr.SolrTestCaseJ4.addAndGetVersion(SolrTestCaseJ4.java:1250)
	at org.apache.solr.search.TestReloadDeadlock.addDoc(TestReloadDeadlock.java:200)
	at org.apache.solr.search.TestReloadDeadlock.access$100(TestReloadDeadlock.java:46)
	at org.apache.solr.search.TestReloadDeadlock$1.run(TestReloadDeadlock.java:156)
Caused by: java.lang.NullPointerException
	at org.apache.solr.core.SolrCore.openNewSearcher(SolrCore.java:1642)
	... 21 more




Build Log:
[...truncated 10253 lines...]
   [junit4] Suite: org.apache.solr.search.TestReloadDeadlock
   [junit4]   2> Creating dataDir: /x1/jenkins/jenkins-slave/workspace/Lucene-Solr-NightlyTests-5.x/solr/build/solr-core/test/J1/temp/solr.search.TestReloadDeadlock_456BEE68EFC74744-001/init-core-data-001
   [junit4]   2> 426673 INFO  (SUITE-TestReloadDeadlock-seed#[456BEE68EFC74744]-worker) [    ] o.a.s.SolrTestCaseJ4 Randomized ssl (false) and clientAuth (false)
   [junit4]   2> 426673 INFO  (SUITE-TestReloadDeadlock-seed#[456BEE68EFC74744]-worker) [    ] o.a.s.SolrTestCaseJ4 ####initCore
   [junit4]   2> 426673 INFO  (SUITE-TestReloadDeadlock-seed#[456BEE68EFC74744]-worker) [    ] o.a.s.c.SolrResourceLoader new SolrResourceLoader for directory: '/x1/jenkins/jenkins-slave/workspace/Lucene-Solr-NightlyTests-5.x/solr/core/src/test-files/solr/collection1/'
   [junit4]   2> 426674 INFO  (SUITE-TestReloadDeadlock-seed#[456BEE68EFC74744]-worker) [    ] o.a.s.c.SolrResourceLoader Adding 'file:/x1/jenkins/jenkins-slave/workspace/Lucene-Solr-NightlyTests-5.x/solr/core/src/test-files/solr/collection1/lib/.svn/' to classloader
   [junit4]   2> 426674 INFO  (SUITE-TestReloadDeadlock-seed#[456BEE68EFC74744]-worker) [    ] o.a.s.c.SolrResourceLoader Adding 'file:/x1/jenkins/jenkins-slave/workspace/Lucene-Solr-NightlyTests-5.x/solr/core/src/test-files/solr/collection1/lib/classes/' to classloader
   [junit4]   2> 426674 INFO  (SUITE-TestReloadDeadlock-seed#[456BEE68EFC74744]-worker) [    ] o.a.s.c.SolrResourceLoader Adding 'file:/x1/jenkins/jenkins-slave/workspace/Lucene-Solr-NightlyTests-5.x/solr/core/src/test-files/solr/collection1/lib/README' to classloader
   [junit4]   2> 426706 INFO  (SUITE-TestReloadDeadlock-seed#[456BEE68EFC74744]-worker) [    ] o.a.s.c.SolrConfig current version of requestparams : -1
   [junit4]   2> 426721 INFO  (SUITE-TestReloadDeadlock-seed#[456BEE68EFC74744]-worker) [    ] o.a.s.c.SolrConfig Using Lucene MatchVersion: 5.4.0
   [junit4]   2> 426751 INFO  (SUITE-TestReloadDeadlock-seed#[456BEE68EFC74744]-worker) [    ] o.a.s.c.Config Loaded SolrConfig: solrconfig-tlog.xml
   [junit4]   2> 426752 INFO  (SUITE-TestReloadDeadlock-seed#[456BEE68EFC74744]-worker) [    ] o.a.s.s.IndexSchema Reading Solr Schema from /x1/jenkins/jenkins-slave/workspace/Lucene-Solr-NightlyTests-5.x/solr/core/src/test-files/solr/collection1/conf/schema15.xml
   [junit4]   2> 426758 INFO  (SUITE-TestReloadDeadlock-seed#[456BEE68EFC74744]-worker) [    ] o.a.s.s.IndexSchema [null] Schema name=test
   [junit4]   2> 427006 INFO  (SUITE-TestReloadDeadlock-seed#[456BEE68EFC74744]-worker) [    ] o.a.s.s.IndexSchema default search field in schema is text
   [junit4]   2> 427007 INFO  (SUITE-TestReloadDeadlock-seed#[456BEE68EFC74744]-worker) [    ] o.a.s.s.IndexSchema unique key field: id
   [junit4]   2> 427009 INFO  (SUITE-TestReloadDeadlock-seed#[456BEE68EFC74744]-worker) [    ] o.a.s.s.FileExchangeRateProvider Reloading exchange rates from file currency.xml
   [junit4]   2> 427012 INFO  (SUITE-TestReloadDeadlock-seed#[456BEE68EFC74744]-worker) [    ] o.a.s.s.FileExchangeRateProvider Reloading exchange rates from file currency.xml
   [junit4]   2> 427023 INFO  (SUITE-TestReloadDeadlock-seed#[456BEE68EFC74744]-worker) [    ] o.a.s.c.SolrResourceLoader JNDI not configured for solr (NoInitialContextEx)
   [junit4]   2> 427023 INFO  (SUITE-TestReloadDeadlock-seed#[456BEE68EFC74744]-worker) [    ] o.a.s.c.SolrResourceLoader using system property solr.solr.home: /x1/jenkins/jenkins-slave/workspace/Lucene-Solr-NightlyTests-5.x/solr/core/src/test-files/solr
   [junit4]   2> 427023 INFO  (SUITE-TestReloadDeadlock-seed#[456BEE68EFC74744]-worker) [    ] o.a.s.c.SolrResourceLoader new SolrResourceLoader for directory: '/x1/jenkins/jenkins-slave/workspace/Lucene-Solr-NightlyTests-5.x/solr/core/src/test-files/solr/'
   [junit4]   2> 427040 INFO  (SUITE-TestReloadDeadlock-seed#[456BEE68EFC74744]-worker) [    ] o.a.s.c.CoreContainer New CoreContainer 2125804009
   [junit4]   2> 427040 INFO  (SUITE-TestReloadDeadlock-seed#[456BEE68EFC74744]-worker) [    ] o.a.s.c.CoreContainer Loading cores into CoreContainer [instanceDir=/x1/jenkins/jenkins-slave/workspace/Lucene-Solr-NightlyTests-5.x/solr/core/src/test-files/solr/]
   [junit4]   2> 427040 INFO  (SUITE-TestReloadDeadlock-seed#[456BEE68EFC74744]-worker) [    ] o.a.s.c.CoreContainer loading shared library: /x1/jenkins/jenkins-slave/workspace/Lucene-Solr-NightlyTests-5.x/solr/core/src/test-files/solr/lib
   [junit4]   2> 427040 WARN  (SUITE-TestReloadDeadlock-seed#[456BEE68EFC74744]-worker) [    ] o.a.s.c.SolrResourceLoader Can't find (or read) directory to add to classloader: lib (resolved as: /x1/jenkins/jenkins-slave/workspace/Lucene-Solr-NightlyTests-5.x/solr/core/src/test-files/solr/lib).
   [junit4]   2> 427050 INFO  (SUITE-TestReloadDeadlock-seed#[456BEE68EFC74744]-worker) [    ] o.a.s.h.c.HttpShardHandlerFactory created with socketTimeout : 600000,connTimeout : 60000,maxConnectionsPerHost : 20,maxConnections : 10000,corePoolSize : 0,maximumPoolSize : 2147483647,maxThreadIdleTime : 5,sizeOfQueue : -1,fairnessPolicy : false,useRetries : false,
   [junit4]   2> 427053 INFO  (SUITE-TestReloadDeadlock-seed#[456BEE68EFC74744]-worker) [    ] o.a.s.u.UpdateShardHandler Creating UpdateShardHandler HTTP client with params: socketTimeout=30000&connTimeout=30000&retry=true
   [junit4]   2> 427053 INFO  (SUITE-TestReloadDeadlock-seed#[456BEE68EFC74744]-worker) [    ] o.a.s.l.LogWatcher SLF4J impl is org.slf4j.impl.Log4jLoggerFactory
   [junit4]   2> 427054 INFO  (SUITE-TestReloadDeadlock-seed#[456BEE68EFC74744]-worker) [    ] o.a.s.l.LogWatcher Registering Log Listener [Log4j (org.slf4j.impl.Log4jLoggerFactory)]
   [junit4]   2> 427054 INFO  (SUITE-TestReloadDeadlock-seed#[456BEE68EFC74744]-worker) [    ] o.a.s.c.CoreContainer Security conf doesn't exist. Skipping setup for authorization module.
   [junit4]   2> 427054 INFO  (SUITE-TestReloadDeadlock-seed#[456BEE68EFC74744]-worker) [    ] o.a.s.c.CoreContainer No authentication plugin used.
   [junit4]   2> 427056 INFO  (SUITE-TestReloadDeadlock-seed#[456BEE68EFC74744]-worker) [    ] o.a.s.c.SolrCore Created CoreDescriptor: {shard=shard1, absoluteInstDir=/x1/jenkins/jenkins-slave/workspace/Lucene-Solr-NightlyTests-5.x/solr/core/src/test-files/solr/collection1/, name=collection1, collection=collection1, configSetProperties=configsetprops.json, transient=false, config=solrconfig-tlog.xml, schema=schema15.xml, instanceDir=collection1, dataDir=/x1/jenkins/jenkins-slave/workspace/Lucene-Solr-NightlyTests-5.x/solr/build/solr-core/test/J1/temp/solr.search.TestReloadDeadlock_456BEE68EFC74744-001/init-core-data-001, loadOnStartup=true}
   [junit4]   2> 427064 INFO  (coreLoadExecutor-1028-thread-1) [    ] o.a.s.c.SolrResourceLoader new SolrResourceLoader for directory: '/x1/jenkins/jenkins-slave/workspace/Lucene-Solr-NightlyTests-5.x/solr/core/src/test-files/solr/collection1/'
   [junit4]   2> 427068 INFO  (coreLoadExecutor-1028-thread-1) [    ] o.a.s.c.SolrResourceLoader Adding 'file:/x1/jenkins/jenkins-slave/workspace/Lucene-Solr-NightlyTests-5.x/solr/core/src/test-files/solr/collection1/lib/.svn/' to classloader
   [junit4]   2> 427068 INFO  (coreLoadExecutor-1028-thread-1) [    ] o.a.s.c.SolrResourceLoader Adding 'file:/x1/jenkins/jenkins-slave/workspace/Lucene-Solr-NightlyTests-5.x/solr/core/src/test-files/solr/collection1/lib/classes/' to classloader
   [junit4]   2> 427068 INFO  (coreLoadExecutor-1028-thread-1) [    ] o.a.s.c.SolrResourceLoader Adding 'file:/x1/jenkins/jenkins-slave/workspace/Lucene-Solr-NightlyTests-5.x/solr/core/src/test-files/solr/collection1/lib/README' to classloader
   [junit4]   2> 427095 INFO  (coreLoadExecutor-1028-thread-1) [    ] o.a.s.c.SolrConfig current version of requestparams : -1
   [junit4]   2> 427111 INFO  (coreLoadExecutor-1028-thread-1) [    ] o.a.s.c.SolrConfig Using Lucene MatchVersion: 5.4.0
   [junit4]   2> 427158 INFO  (coreLoadExecutor-1028-thread-1) [    ] o.a.s.c.Config Loaded SolrConfig: solrconfig-tlog.xml
   [junit4]   2> 427158 INFO  (coreLoadExecutor-1028-thread-1) [    ] o.a.s.s.IndexSchema Reading Solr Schema from /x1/jenkins/jenkins-slave/workspace/Lucene-Solr-NightlyTests-5.x/solr/core/src/test-files/solr/collection1/conf/schema15.xml
   [junit4]   2> 427166 INFO  (coreLoadExecutor-1028-thread-1) [    ] o.a.s.s.IndexSchema [collection1] Schema name=test
   [junit4]   2> 427429 INFO  (coreLoadExecutor-1028-thread-1) [    ] o.a.s.s.IndexSchema default search field in schema is text
   [junit4]   2> 427431 INFO  (coreLoadExecutor-1028-thread-1) [    ] o.a.s.s.IndexSchema unique key field: id
   [junit4]   2> 427432 INFO  (coreLoadExecutor-1028-thread-1) [    ] o.a.s.s.FileExchangeRateProvider Reloading exchange rates from file currency.xml
   [junit4]   2> 427434 INFO  (coreLoadExecutor-1028-thread-1) [    ] o.a.s.s.FileExchangeRateProvider Reloading exchange rates from file currency.xml
   [junit4]   2> 427444 INFO  (coreLoadExecutor-1028-thread-1) [    ] o.a.s.c.ConfigSetProperties Did not find ConfigSet properties, assuming default properties: Can't find resource 'configsetprops.json' in classpath or '/x1/jenkins/jenkins-slave/workspace/Lucene-Solr-NightlyTests-5.x/solr/core/src/test-files/solr/collection1/conf'
   [junit4]   2> 427444 INFO  (coreLoadExecutor-1028-thread-1) [    ] o.a.s.c.CoreContainer Creating SolrCore 'collection1' using configuration from instancedir /x1/jenkins/jenkins-slave/workspace/Lucene-Solr-NightlyTests-5.x/solr/core/src/test-files/solr/collection1/
   [junit4]   2> 427444 INFO  (coreLoadExecutor-1028-thread-1) [    x:collection1] o.a.s.c.SolrCore org.apache.solr.core.MockDirectoryFactory
   [junit4]   2> 427445 INFO  (coreLoadExecutor-1028-thread-1) [    x:collection1] o.a.s.c.SolrCore [[collection1] ] Opening new SolrCore at [/x1/jenkins/jenkins-slave/workspace/Lucene-Solr-NightlyTests-5.x/solr/core/src/test-files/solr/collection1/], dataDir=[null]
   [junit4]   2> 427445 INFO  (coreLoadExecutor-1028-thread-1) [    x:collection1] o.a.s.c.JmxMonitoredMap JMX monitoring is enabled. Adding Solr mbeans to JMX Server: com.sun.jmx.mbeanserver.JmxMBeanServer@3b59543d
   [junit4]   2> 427445 INFO  (coreLoadExecutor-1028-thread-1) [    x:collection1] o.a.s.c.CachingDirectoryFactory return new directory for /x1/jenkins/jenkins-slave/workspace/Lucene-Solr-NightlyTests-5.x/solr/build/solr-core/test/J1/temp/solr.search.TestReloadDeadlock_456BEE68EFC74744-001/init-core-data-001
   [junit4]   2> 427445 INFO  (coreLoadExecutor-1028-thread-1) [    x:collection1] o.a.s.c.SolrCore New index directory detected: old=null new=/x1/jenkins/jenkins-slave/workspace/Lucene-Solr-NightlyTests-5.x/solr/build/solr-core/test/J1/temp/solr.search.TestReloadDeadlock_456BEE68EFC74744-001/init-core-data-001/index/
   [junit4]   2> 427445 WARN  (coreLoadExecutor-1028-thread-1) [    x:collection1] o.a.s.c.SolrCore [collection1] Solr index directory '/x1/jenkins/jenkins-slave/workspace/Lucene-Solr-NightlyTests-5.x/solr/build/solr-core/test/J1/temp/solr.search.TestReloadDeadlock_456BEE68EFC74744-001/init-core-data-001/index' doesn't exist. Creating new index...
   [junit4]   2> 427446 INFO  (coreLoadExecutor-1028-thread-1) [    x:collection1] o.a.s.c.CachingDirectoryFactory return new directory for /x1/jenkins/jenkins-slave/workspace/Lucene-Solr-NightlyTests-5.x/solr/build/solr-core/test/J1/temp/solr.search.TestReloadDeadlock_456BEE68EFC74744-001/init-core-data-001/index
   [junit4]   2> 427446 INFO  (coreLoadExecutor-1028-thread-1) [    x:collection1] o.a.s.u.RandomMergePolicy RandomMergePolicy wrapping class org.apache.lucene.index.LogDocMergePolicy: [LogDocMergePolicy: minMergeSize=1000, mergeFactor=7, maxMergeSize=9223372036854775807, maxMergeSizeForForcedMerge=9223372036854775807, calibrateSizeByDeletes=true, maxMergeDocs=2147483647, maxCFSSegmentSizeMB=8.796093022207999E12, noCFSRatio=1.0]
   [junit4]   2> 427447 INFO  (coreLoadExecutor-1028-thread-1) [    x:collection1] o.a.s.c.SolrCore SolrDeletionPolicy.onCommit: commits: num=1
   [junit4]   2> 	commit{dir=MockDirectoryWrapper(RAMDirectory@4846b836 lockFactory=org.apache.lucene.store.SingleInstanceLockFactory@1ae8064c),segFN=segments_1,generation=1}
   [junit4]   2> 427447 INFO  (coreLoadExecutor-1028-thread-1) [    x:collection1] o.a.s.c.SolrCore newest commit generation = 1
   [junit4]   2> 427451 INFO  (OldIndexDirectoryCleanupThreadForCore-collection1) [    x:collection1] o.a.s.c.SolrCore Looking for old index directories to cleanup for core collection1 in /x1/jenkins/jenkins-slave/workspace/Lucene-Solr-NightlyTests-5.x/solr/build/solr-core/test/J1/temp/solr.search.TestReloadDeadlock_456BEE68EFC74744-001/init-core-data-001/
   [junit4]   2> 427451 INFO  (coreLoadExecutor-1028-thread-1) [    x:collection1] o.a.s.u.p.UpdateRequestProcessorChain creating updateRequestProcessorChain "nodistrib"
   [junit4]   2> 427452 INFO  (coreLoadExecutor-1028-thread-1) [    x:collection1] o.a.s.u.p.UpdateRequestProcessorChain creating updateRequestProcessorChain "dedupe"
   [junit4]   2> 427452 INFO  (coreLoadExecutor-1028-thread-1) [    x:collection1] o.a.s.u.p.UpdateRequestProcessorChain inserting DistributedUpdateProcessorFactory into updateRequestProcessorChain "dedupe"
   [junit4]   2> 427452 INFO  (coreLoadExecutor-1028-thread-1) [    x:collection1] o.a.s.u.p.UpdateRequestProcessorChain creating updateRequestProcessorChain "stored_sig"
   [junit4]   2> 427452 INFO  (coreLoadExecutor-1028-thread-1) [    x:collection1] o.a.s.u.p.UpdateRequestProcessorChain inserting DistributedUpdateProcessorFactory into updateRequestProcessorChain "stored_sig"
   [junit4]   2> 427452 INFO  (coreLoadExecutor-1028-thread-1) [    x:collection1] o.a.s.u.p.UpdateRequestProcessorChain creating updateRequestProcessorChain "distrib-dup-test-chain-explicit"
   [junit4]   2> 427453 INFO  (coreLoadExecutor-1028-thread-1) [    x:collection1] o.a.s.u.p.UpdateRequestProcessorChain creating updateRequestProcessorChain "distrib-dup-test-chain-implicit"
   [junit4]   2> 427453 INFO  (coreLoadExecutor-1028-thread-1) [    x:collection1] o.a.s.u.p.UpdateRequestProcessorChain inserting DistributedUpdateProcessorFactory into updateRequestProcessorChain "distrib-dup-test-chain-implicit"
   [junit4]   2> 427453 INFO  (coreLoadExecutor-1028-thread-1) [    x:collection1] o.a.s.c.SolrCore no updateRequestProcessorChain defined as default, creating implicit default
   [junit4]   2> 427456 INFO  (coreLoadExecutor-1028-thread-1) [    x:collection1] o.a.s.h.l.XMLLoader xsltCacheLifetimeSeconds=60
   [junit4]   2> 427458 INFO  (coreLoadExecutor-1028-thread-1) [    x:collection1] o.a.s.h.l.XMLLoader xsltCacheLifetimeSeconds=60
   [junit4]   2> 427459 INFO  (coreLoadExecutor-1028-thread-1) [    x:collection1] o.a.s.h.l.XMLLoader xsltCacheLifetimeSeconds=60
   [junit4]   2> 427460 INFO  (coreLoadExecutor-1028-thread-1) [    x:collection1] o.a.s.h.l.XMLLoader xsltCacheLifetimeSeconds=60
   [junit4]   2> 427465 INFO  (coreLoadExecutor-1028-thread-1) [    x:collection1] o.a.s.c.RequestHandlers Registered paths: /admin/threads,/admin/segments,/admin/properties,/schema,/admin/logging,/update/csv,/admin/mbeans,/update,standard,/update/json,/replication,/admin/plugins,/config,/admin/system,/admin/file,/admin/ping,/get,/update/json/docs,/admin/luke
   [junit4]   2> 427466 INFO  (coreLoadExecutor-1028-thread-1) [    x:collection1] o.a.s.c.SolrCore Using default statsCache cache: org.apache.solr.search.stats.LocalStatsCache
   [junit4]   2> 427466 INFO  (coreLoadExecutor-1028-thread-1) [    x:collection1] o.a.s.u.UpdateHandler Using UpdateLog implementation: org.apache.solr.update.UpdateLog
   [junit4]   2> 427466 INFO  (coreLoadExecutor-1028-thread-1) [    x:collection1] o.a.s.u.UpdateLog Initializing UpdateLog: dataDir= defaultSyncLevel=FLUSH numRecordsToKeep=100 maxNumLogsToKeep=10 numVersionBuckets=65536
   [junit4]   2> 427467 INFO  (coreLoadExecutor-1028-thread-1) [    x:collection1] o.a.s.c.SolrCore Hard AutoCommit: disabled
   [junit4]   2> 427467 INFO  (coreLoadExecutor-1028-thread-1) [    x:collection1] o.a.s.c.SolrCore Soft AutoCommit: disabled
   [junit4]   2> 427468 INFO  (coreLoadExecutor-1028-thread-1) [    x:collection1] o.a.s.u.RandomMergePolicy RandomMergePolicy wrapping class org.apache.lucene.index.LogByteSizeMergePolicy: [LogByteSizeMergePolicy: minMergeSize=1677721, mergeFactor=5, maxMergeSize=2147483648, maxMergeSizeForForcedMerge=9223372036854775807, calibrateSizeByDeletes=false, maxMergeDocs=2147483647, maxCFSSegmentSizeMB=8.796093022207999E12, noCFSRatio=1.0]
   [junit4]   2> 427468 INFO  (coreLoadExecutor-1028-thread-1) [    x:collection1] o.a.s.c.SolrCore SolrDeletionPolicy.onInit: commits: num=1
   [junit4]   2> 	commit{dir=MockDirectoryWrapper(RAMDirectory@4846b836 lockFactory=org.apache.lucene.store.SingleInstanceLockFactory@1ae8064c),segFN=segments_1,generation=1}
   [junit4]   2> 427468 INFO  (coreLoadExecutor-1028-thread-1) [    x:collection1] o.a.s.c.SolrCore newest commit generation = 1
   [junit4]   2> 427468 INFO  (coreLoadExecutor-1028-thread-1) [    x:collection1] o.a.s.s.SolrIndexSearcher Opening Searcher@5de22625[collection1] main
   [junit4]   2> 427469 WARN  (coreLoadExecutor-1028-thread-1) [    x:collection1] o.a.s.r.ManagedResourceStorage Cannot write to config directory /x1/jenkins/jenkins-slave/workspace/Lucene-Solr-NightlyTests-5.x/solr/core/src/test-files/solr/collection1/conf; switching to use InMemory storage instead.
   [junit4]   2> 427469 INFO  (coreLoadExecutor-1028-thread-1) [    x:collection1] o.a.s.r.RestManager Initializing RestManager with initArgs: {}
   [junit4]   2> 427469 INFO  (coreLoadExecutor-1028-thread-1) [    x:collection1] o.a.s.r.ManagedResourceStorage Reading _rest_managed.json using InMemoryStorage
   [junit4]   2> 427469 INFO  (coreLoadExecutor-1028-thread-1) [    x:collection1] o.a.s.r.RestManager Initializing 0 registered ManagedResources
   [junit4]   2> 427469 INFO  (coreLoadExecutor-1028-thread-1) [    x:collection1] o.a.s.h.ReplicationHandler Commits will be reserved for  10000
   [junit4]   2> 427470 INFO  (searcherExecutor-1029-thread-1-processing-x:collection1) [    x:collection1] o.a.s.c.SolrCore [collection1] Registered new searcher Searcher@5de22625[collection1] main{ExitableDirectoryReader(UninvertingDirectoryReader())}
   [junit4]   2> 427470 INFO  (coreLoadExecutor-1028-thread-1) [    x:collection1] o.a.s.u.UpdateLog Looking up max value of version field to seed version buckets
   [junit4]   2> 427470 INFO  (coreLoadExecutor-1028-thread-1) [    x:collection1] o.a.s.u.VersionInfo Refreshing highest value of _version_ for 65536 version buckets from index
   [junit4]   2> 427470 INFO  (coreLoadExecutor-1028-thread-1) [    x:collection1] o.a.s.u.VersionInfo No terms found for _version_, cannot seed version bucket highest value from index
   [junit4]   2> 427470 INFO  (coreLoadExecutor-1028-thread-1) [    x:collection1] o.a.s.u.UpdateLog Could not find max version in index or recent updates, using new clock 1509776355497082880
   [junit4]   2> 427472 INFO  (coreLoadExecutor-1028-thread-1) [    x:collection1] o.a.s.u.UpdateLog Took 2.0ms to seed version buckets with highest version 1509776355497082880
   [junit4]   2> 427473 INFO  (coreLoadExecutor-1028-thread-1) [    x:collection1] o.a.s.c.CoreContainer registering core: collection1
   [junit4]   2> 427474 INFO  (SUITE-TestReloadDeadlock-seed#[456BEE68EFC74744]-worker) [    ] o.a.s.SolrTestCaseJ4 ####initCore end
   [junit4]   2> 427478 INFO  (TEST-TestReloadDeadlock.testReloadDeadlock-seed#[456BEE68EFC74744]) [    ] o.a.s.SolrTestCaseJ4 ###Starting testReloadDeadlock
   [junit4]   2> 427479 INFO  (TEST-TestReloadDeadlock.testReloadDeadlock-seed#[456BEE68EFC74744]) [    ] o.a.s.c.SolrCore [collection1] REMOVING ALL DOCUMENTS FROM INDEX
   [junit4]   2> 427480 INFO  (TEST-TestReloadDeadlock.testReloadDeadlock-seed#[456BEE68EFC74744]) [    ] o.a.s.s.SolrIndexSearcher Opening Searcher@7223cf2[collection1] realtime
   [junit4]   2> 427480 INFO  (TEST-TestReloadDeadlock.testReloadDeadlock-seed#[456BEE68EFC74744]) [    ] o.a.s.u.p.LogUpdateProcessor [collection1] webapp=null path=null params={_version_=-9223372036854775807&update.distrib=FROMLEADER&versions=true&wt=json&indent=true} {deleteByQuery=*:* (-9223372036854775807)} 0 1
   [junit4]   2> 427481 INFO  (TEST-TestReloadDeadlock.testReloadDeadlock-seed#[456BEE68EFC74744]) [    ] o.a.s.u.UpdateHandler start commit{,optimize=false,openSearcher=true,waitSearcher=true,expungeDeletes=false,softCommit=false,prepareCommit=false}
   [junit4]   2> 427481 INFO  (TEST-TestReloadDeadlock.testReloadDeadlock-seed#[456BEE68EFC74744]) [    ] o.a.s.c.SolrCore SolrDeletionPolicy.onCommit: commits: num=2
   [junit4]   2> 	commit{dir=MockDirectoryWrapper(RAMDirectory@4846b836 lockFactory=org.apache.lucene.store.SingleInstanceLockFactory@1ae8064c),segFN=segments_1,generation=1}
   [junit4]   2> 	commit{dir=MockDirectoryWrapper(RAMDirectory@4846b836 lockFactory=org.apache.lucene.store.SingleInstanceLockFactory@1ae8064c),segFN=segments_2,generation=2}
   [junit4]   2> 427481 INFO  (TEST-TestReloadDeadlock.testReloadDeadlock-seed#[456BEE68EFC74744]) [    ] o.a.s.c.SolrCore newest commit generation = 2
   [junit4]   2> 427482 INFO  (TEST-TestReloadDeadlock.testReloadDeadlock-seed#[456BEE68EFC74744]) [    ] o.a.s.s.SolrIndexSearcher Opening Searcher@f12e69a[collection1] main
   [junit4]   2> 427482 INFO  (TEST-TestReloadDeadlock.testReloadDeadlock-seed#[456BEE68EFC74744]) [    ] o.a.s.u.UpdateHandler end_commit_flush
   [junit4]   2> 427483 INFO  (searcherExecutor-1029-thread-1) [    ] o.a.s.c.SolrCore [collection1] Registered new searcher Searcher@f12e69a[collection1] main{ExitableDirectoryReader(UninvertingDirectoryReader())}
   [junit4]   2> 427483 INFO  (TEST-TestReloadDeadlock.testReloadDeadlock-seed#[456BEE68EFC74744]) [    ] o.a.s.u.p.LogUpdateProcessor [collection1] webapp=null path=null params={} {commit=} 0 3
   [junit4]   2> 427488 INFO  (WRITER0) [    ] o.a.s.u.UpdateHandler start commit{,optimize=false,openSearcher=true,waitSearcher=true,expungeDeletes=false,softCommit=false,prepareCommit=false}
   [junit4]   2> 427490 INFO  (WRITER0) [    ] o.a.s.u.UpdateHandler No uncommitted changes. Skipping IW.commit.
   [junit4]   2> 427490 INFO  (WRITER0) [    ] o.a.s.c.SolrCore SolrIndexSearcher has not changed - not re-opening: org.apache.solr.search.SolrIndexSearcher
   [junit4]   2> 427490 INFO  (WRITER0) [    ] o.a.s.u.UpdateHandler end_commit_flush
   [junit4]   2> 427491 INFO  (WRITER0) [    ] o.a.s.u.p.LogUpdateProcessor [collection1] webapp=null path=null params={} {commit=} 0 2
   [junit4]   2> 427495 INFO  (WRITER1) [    ] o.a.s.u.p.LogUpdateProcessor [collection1] webapp=null path=null params={_version_=-1&update.distrib=FROMLEADER&versions=true&wt=json&indent=true} {deleteByQuery=id:11 (-1)} 0 4
   [junit4]   2> 427495 INFO  (WRITER2) [    ] o.a.s.u.p.LogUpdateProcessor [collection1] webapp=null path=null params={_version_=-2&update.distrib=FROMLEADER&versions=true&wt=json&indent=true} {deleteByQuery=id:1 (-2)} 0 4
   [junit4]   2> 427496 INFO  (WRITER3) [    ] o.a.s.u.p.LogUpdateProcessor [collection1] webapp=null path=null params={_version_=-3&update.distrib=FROMLEADER&versions=true&wt=json&indent=true} {deleteByQuery=id:0 (-3)} 0 4
   [junit4]   2> 427499 INFO  (WRITER4) [    ] o.a.s.u.p.LogUpdateProcessor [collection1] webapp=null path=null params={update.distrib=FROMLEADER&versions=true&wt=json&indent=true} {add=[12 (4)]} 0 7
   [junit4]   2> 427505 INFO  (WRITER5) [    ] o.a.s.s.SolrIndexSearcher Opening Searcher@1b394bed[collection1] realtime
   [junit4]   2> 427505 INFO  (WRITER5) [    ] o.a.s.u.p.LogUpdateProcessor [collection1] webapp=null path=null params={_version_=-5&update.distrib=FROMLEADER&versions=true&wt=json&indent=true} {deleteByQuery=id:12 (-5)} 0 12
   [junit4]   2> 427506 INFO  (WRITER1) [    ] o.a.s.u.p.LogUpdateProcessor [collection1] webapp=null path=null params={_version_=-7&update.distrib=FROMLEADER&versions=true&wt=json&indent=true} {deleteByQuery=id:11 (-7)} 0 10
   [junit4]   2> 427507 INFO  (WRITER9) [    ] o.a.s.u.UpdateHandler Reordered DBQs detected.  Update=add{_version_=6,id=8} DBQs=[DBQ{version=7,q=id:11}]
   [junit4]   2> 427508 INFO  (WRITER4) [    ] o.a.s.u.UpdateHandler start commit{,optimize=false,openSearcher=true,waitSearcher=true,expungeDeletes=false,softCommit=false,prepareCommit=false}
   [junit4]   2> 427568 INFO  (WRITER9) [    ] o.a.s.s.SolrIndexSearcher Opening Searcher@455b9690[collection1] realtime
   [junit4]   2> 427569 INFO  (WRITER9) [    ] o.a.s.u.p.LogUpdateProcessor [collection1] webapp=null path=null params={update.distrib=FROMLEADER&versions=true&wt=json&indent=true} {add=[8 (6)]} 0 73
   [junit4]   2> 427569 INFO  (WRITER8) [    ] o.a.s.u.p.LogUpdateProcessor [collection1] webapp=null path=null params={update.distrib=FROMLEADER&versions=true&wt=json&indent=true} {add=[13 (8)]} 0 72
   [junit4]   2> 427569 INFO  (WRITER3) [    ] o.a.s.u.p.LogUpdateProcessor [collection1] webapp=null path=null params={update.distrib=FROMLEADER&versions=true&wt=json&indent=true} {add=[10 (12)]} 0 72
   [junit4]   2> 427572 INFO  (WRITER7) [    ] o.a.s.u.p.LogUpdateProcessor [collection1] webapp=null path=null params={update.distrib=FROMLEADER&versions=true&wt=json&indent=true} {add=[11 (10)]} 0 74
   [junit4]   2> 427572 INFO  (WRITER2) [    ] o.a.s.u.p.LogUpdateProcessor [collection1] webapp=null path=null params={update.distrib=FROMLEADER&versions=true&wt=json&indent=true} {add=[1 (11)]} 0 75
   [junit4]   2> 427573 INFO  (WRITER10) [    ] o.a.s.u.p.LogUpdateProcessor [collection1] webapp=null path=null params={update.distrib=FROMLEADER&versions=true&wt=json&indent=true} {add=[7 (9)]} 0 76
   [junit4]   2> 427573 INFO  (WRITER0) [    ] o.a.s.u.p.LogUpdateProcessor [collection1] webapp=null path=null params={update.distrib=FROMLEADER&versions=true&wt=json&indent=true} {add=[10 (14)]} 0 73
   [junit4]   2> 427576 INFO  (WRITER4) [    ] o.a.s.c.SolrCore SolrDeletionPolicy.onCommit: commits: num=2
   [junit4]   2> 	commit{dir=MockDirectoryWrapper(RAMDirectory@4846b836 lockFactory=org.apache.lucene.store.SingleInstanceLockFactory@1ae8064c),segFN=segments_2,generation=2}
   [junit4]   2> 	commit{dir=MockDirectoryWrapper(RAMDirectory@4846b836 lockFactory=org.apache.lucene.store.SingleInstanceLockFactory@1ae8064c),segFN=segments_3,generation=3}
   [junit4]   2> 427576 INFO  (WRITER4) [    ] o.a.s.c.SolrCore newest commit generation = 3
   [junit4]   2> 427583 INFO  (TEST-TestReloadDeadlock.testReloadDeadlock-seed#[456BEE68EFC74744]) [    ] o.a.s.c.SolrResourceLoader new SolrResourceLoader for directory: '/x1/jenkins/jenkins-slave/workspace/Lucene-Solr-NightlyTests-5.x/solr/core/src/test-files/solr/collection1/'
   [junit4]   2> 427584 INFO  (TEST-TestReloadDeadlock.testReloadDeadlock-seed#[456BEE68EFC74744]) [    ] o.a.s.c.SolrResourceLoader Adding 'file:/x1/jenkins/jenkins-slave/workspace/Lucene-Solr-NightlyTests-5.x/solr/core/src/test-files/solr/collection1/lib/.svn/' to classloader
   [junit4]   2> 427584 INFO  (TEST-TestReloadDeadlock.testReloadDeadlock-seed#[456BEE68EFC74744]) [    ] o.a.s.c.SolrResourceLoader Adding 'file:/x1/jenkins/jenkins-slave/workspace/Lucene-Solr-NightlyTests-5.x/solr/core/src/test-files/solr/collection1/lib/classes/' to classloader
   [junit4]   2> 427584 INFO  (TEST-TestReloadDeadlock.testReloadDeadlock-seed#[456BEE68EFC74744]) [    ] o.a.s.c.SolrResourceLoader Adding 'file:/x1/jenkins/jenkins-slave/workspace/Lucene-Solr-NightlyTests-5.x/solr/core/src/test-files/solr/collection1/lib/README' to classloader
   [junit4]   2> 427612 INFO  (TEST-TestReloadDeadlock.testReloadDeadlock-seed#[456BEE68EFC74744]) [    ] o.a.s.c.SolrConfig current version of requestparams : -1
   [junit4]   2> 427613 INFO  (WRITER4) [    ] o.a.s.s.SolrIndexSearcher Opening Searcher@54dccd3f[collection1] main
   [junit4]   2> 427613 INFO  (WRITER4) [    ] o.a.s.u.UpdateHandler end_commit_flush
   [junit4]   2> 427613 INFO  (searcherExecutor-1029-thread-1) [    ] o.a.s.c.SolrCore [collection1] Registered new searcher Searcher@54dccd3f[collection1] main{ExitableDirectoryReader(UninvertingDirectoryReader(Uninverting(_1(5.4.0):c1) Uninverting(_2(5.4.0):c1) Uninverting(_5(5.4.0):c1) Uninverting(_4(5.4.0):c1) Uninverting(_6(5.4.0):c1) Uninverting(_7(5.4.0):c1)))}
   [junit4]   2> 427614 INFO  (WRITER4) [    ] o.a.s.u.p.LogUpdateProcessor [collection1] webapp=null path=null params={} {commit=} 0 114
   [junit4]   2> 427624 INFO  (WRITER11) [    ] o.a.s.s.SolrIndexSearcher Opening Searcher@25987211[collection1] realtime
   [junit4]   2> 427624 INFO  (WRITER6) [    ] o.a.s.u.UpdateHandler Reordered DBQs detected.  Update=add{_version_=13,id=5} DBQs=[DBQ{version=15,q=id:10}]
   [junit4]   2> 427624 INFO  (WRITER11) [    ] o.a.s.u.p.LogUpdateProcessor [collection1] webapp=null path=null params={_version_=-15&update.distrib=FROMLEADER&versions=true&wt=json&indent=true} {deleteByQuery=id:10 (-15)} 0 124
   [junit4]   2> 427635 INFO  (TEST-TestReloadDeadlock.testReloadDeadlock-seed#[456BEE68EFC74744]) [    ] o.a.s.c.SolrConfig Using Lucene MatchVersion: 5.4.0
   [junit4]   2> 427637 INFO  (WRITER6) [    ] o.a.s.s.SolrIndexSearcher Opening Searcher@7915d36a[collection1] realtime
   [junit4]   2> 427638 INFO  (WRITER5) [    ] o.a.s.u.p.LogUpdateProcessor [collection1] webapp=null path=null params={update.distrib=FROMLEADER&versions=true&wt=json&indent=true} {add=[10 (16)]} 0 132
   [junit4]   2> 427639 INFO  (WRITER6) [    ] o.a.s.u.p.LogUpdateProcessor [collection1] webapp=null path=null params={update.distrib=FROMLEADER&versions=true&wt=json&indent=true} {add=[5 (13)]} 0 137
   [junit4]   2> 427640 INFO  (WRITER1) [    ] o.a.s.u.p.LogUpdateProcessor [collection1] webapp=null path=null params={update.distrib=FROMLEADER&versions=true&wt=json&indent=true} {add=[11 (17)]} 0 134
   [junit4]   2> 427641 INFO  (WRITER6) [    ] o.a.s.u.p.LogUpdateProcessor [collection1] webapp=null path=null params={update.distrib=FROMLEADER&versions=true&wt=json&indent=true} {add=[15 (28)]} 0 0
   [junit4]   2> 427641 INFO  (WRITER9) [    ] o.a.s.u.p.LogUpdateProcessor [collection1] webapp=null path=null params={update.distrib=FROMLEADER&versions=true&wt=json&indent=true} {add=[11 (18)]} 0 71
   [junit4]   2> 427640 INFO  (WRITER2) [    ] o.a.s.u.p.LogUpdateProcessor [collection1] webapp=null path=null params={update.distrib=FROMLEADER&versions=true&wt=json&indent=true} {add=[9 (22)]} 0 67
   [junit4]   2> 427639 INFO  (WRITER11) [    ] o.a.s.u.p.LogUpdateProcessor [collection1] webapp=null path=null params={update.distrib=FROMLEADER&versions=true&wt=json&indent=true} {add=[12 (26)]} 0 14
   [junit4]   2> 427639 INFO  (WRITER7) [    ] o.a.s.u.p.LogUpdateProcessor [collection1] webapp=null path=null params={update.distrib=FROMLEADER&versions=true&wt=json&indent=true} {add=[14 (21)]} 0 67
   [junit4]   2> 427642 INFO  (WRITER3) [    ] o.a.s.u.p.LogUpdateProcessor [collection1] webapp=null path=null params={update.distrib=FROMLEADER&versions=true&wt=json&indent=true} {add=[1 (20)]} 0 72
   [junit4]   2> 427643 INFO  (WRITER10) [    ] o.a.s.u.p.LogUpdateProcessor [collection1] webapp=null path=null params={update.distrib=FROMLEADER&versions=true&wt=json&indent=true} {add=[5 (23)]} 0 70
   [junit4]   2> 427644 INFO  (WRITER4) [    ] o.a.s.u.p.LogUpdateProcessor [collection1] webapp=null path=null params={update.distrib=FROMLEADER&versions=true&wt=json&indent=true} {add=[10 (25)]} 0 24
   [junit4]   2> 427644 INFO  (WRITER0) [    ] o.a.s.u.p.LogUpdateProcessor [collection1] webapp=null path=null params={update.distrib=FROMLEADER&versions=true&wt=json&indent=true} {add=[10 (24)]} 0 70
   [junit4]   2> 427644 INFO  (WRITER8) [    ] o.a.s.u.p.LogUpdateProcessor [collection1] webapp=null path=null params={update.distrib=FROMLEADER&versions=true&wt=json&indent=true} {add=[13 (19)]} 0 74
   [junit4]   2> 427644 INFO  (WRITER5) [    ] o.a.s.u.p.LogUpdateProcessor [collection1] webapp=null path=null params={update.distrib=FROMLEADER&versions=true&wt=json&indent=true} {add=[10 (27)]} 0 5
   [junit4]   2> 427665 INFO  (TEST-TestReloadDeadlock.testReloadDeadlock-seed#[456BEE68EFC74744]) [    ] o.a.s.c.Config Loaded SolrConfig: solrconfig-tlog.xml
   [junit4]   2> 427665 INFO  (TEST-TestReloadDeadlock.testReloadDeadlock-seed#[456BEE68EFC74744]) [    ] o.a.s.s.IndexSchema Reading Solr Schema from /x1/jenkins/jenkins-slave/workspace/Lucene-Solr-NightlyTests-5.x/solr/core/src/test-files/solr/collection1/conf/schema15.xml
   [junit4]   2> 427671 INFO  (TEST-TestReloadDeadlock.testReloadDeadlock-seed#[456BEE68EFC74744]) [    ] o.a.s.s.IndexSchema [collection1] Schema name=test
   [junit4]   2> 427680 INFO  (WRITER1) [    ] o.a.s.s.SolrIndexSearcher Opening Searcher@6a07daa4[collection1] realtime
   [junit4]   2> 427680 INFO  (WRITER1) [    ] o.a.s.u.p.LogUpdateProcessor [collection1] webapp=null path=null params={_version_=-29&update.distrib=FROMLEADER&versions=true&wt=json&indent=true} {deleteByQuery=id:14 (-29)} 0 39
   [junit4]   2> 427681 INFO  (WRITER3) [    ] o.a.s.u.UpdateHandler start commit{,optimize=false,openSearcher=true,waitSearcher=true,expungeDeletes=false,softCommit=false,prepareCommit=false}
   [junit4]   2> 427683 INFO  (WRITER11) [    ] o.a.s.u.p.LogUpdateProcessor [collection1] webapp=null path=null params={update.distrib=FROMLEADER&versions=true&wt=json&indent=true} {add=[4 (33)]} 0 40
   [junit4]   2> 427684 INFO  (WRITER2) [    ] o.a.s.u.p.LogUpdateProcessor [collection1] webapp=null path=null params={update.distrib=FROMLEADER&versions=true&wt=json&indent=true} {add=[11 (32)]} 0 42
   [junit4]   2> 427685 INFO  (WRITER9) [    ] o.a.s.u.p.LogUpdateProcessor [collection1] webapp=null path=null params={update.distrib=FROMLEADER&versions=true&wt=json&indent=true} {add=[11 (31)]} 0 43
   [junit4]   2> 427685 INFO  (WRITER4) [    ] o.a.s.u.p.LogUpdateProcessor [collection1] webapp=null path=null params={update.distrib=FROMLEADER&versions=true&wt=json&indent=true} {add=[13 (36)]} 0 40
   [junit4]   2> 427686 INFO  (WRITER7) [    ] o.a.s.u.p.LogUpdateProcessor [collection1] webapp=null path=null params={update.distrib=FROMLEADER&versions=true&wt=json&indent=true} {add=[12 (34)]} 0 43
   [junit4]   2> 427686 INFO  (WRITER5) [    ] o.a.s.u.p.LogUpdateProcessor [collection1] webapp=null path=null params={update.distrib=FROMLEADER&versions=true&wt=json&indent=true} {add=[2 (39)]} 0 41
   [junit4]   2> 427688 INFO  (WRITER6) [    ] o.a.s.u.p.LogUpdateProcessor [collection1] webapp=null path=null params={update.distrib=FROMLEADER&versions=true&wt=json&indent=true} {add=[15 (30)]} 0 47
   [junit4]   2> 427696 INFO  (WRITER3) [    ] o.a.s.c.SolrCore SolrDeletionPolicy.onCommit: commits: num=2
   [junit4]   2> 	commit{dir=MockDirectoryWrapper(RAMDirectory@4846b836 lockFactory=org.apache.lucene.store.SingleInstanceLockFactory@1ae8064c),segFN=segments_3,generation=3}
   [junit4]   2> 	commit{dir=MockDirectoryWrapper(RAMDirectory@4846b836 lockFactory=org.apache.lucene.store.SingleInstanceLockFactory@1ae8064c),segFN=segments_4,generation=4}
   [junit4]   2> 427696 INFO  (WRITER3) [    ] o.a.s.c.SolrCore newest commit generation = 4
   [junit4]   2> 427756 INFO  (WRITER3) [    ] o.a.s.s.SolrIndexSearcher Opening Searcher@16b61dca[collection1] main
   [junit4]   2> 427757 INFO  (WRITER3) [    ] o.a.s.u.UpdateHandler end_commit_flush
   [junit4]   2> 427758 INFO  (searcherExecutor-1029-thread-1) [    ] o.a.s.c.SolrCore [collection1] Registered new searcher Searcher@16b61dca[collection1] main{ExitableDirectoryReader(UninvertingDirectoryReader(Uninverting(_q(5.4.0):c11/3) Uninverting(_n(5.4.0):c1) Uninverting(_p(5.4.0):c2) Uninverting(_o(5.4.0):c1)))}
   [junit4]   2> 427758 INFO  (WRITER3) [    ] o.a.s.u.p.LogUpdateProcessor [collection1] webapp=null path=null params={} {commit=} 0 115
   [junit4]   2> 427759 INFO  (WRITER8) [    ] o.a.s.u.p.LogUpdateProcessor [collection1] webapp=null path=null params={_version_=-38&update.distrib=FROMLEADER&versions=true&wt=json&indent=true} {deleteByQuery=id:14 (-38)} 0 115
   [junit4]   2> 427761 INFO  (WRITER10) [    ] o.a.s.u.p.LogUpdateProcessor [collection1] webapp=null path=null params={_version_=-35&update.distrib=FROMLEADER&versions=true&wt=json&indent=true} {deleteByQuery=id:13 (-35)} 0 116
   [junit4]   2> 427771 INFO  (WRITER0) [    ] o.a.s.s.SolrIndexSearcher Opening Searcher@5f51f251[collection1] realtime
   [junit4]   2> 427771 INFO  (WRITER0) [    ] o.a.s.u.p.LogUpdateProcessor [collection1] webapp=null path=null params={_version_=-37&update.distrib=FROMLEADER&versions=true&wt=json&indent=true} {deleteByQuery=id:9 (-37)} 0 126
   [junit4]   2> 427772 INFO  (WRITER1) [    ] o.a.s.u.p.LogUpdateProcessor [collection1] webapp=null path=null params={update.distrib=FROMLEADER&versions=true&wt=json&indent=true} {add=[2 (40)]} 0 91
   [junit4]   2> 427825 INFO  (WRITER11) [    ] o.a.s.s.SolrIndexSearcher Opening Searcher@16940093[collection1] realtime
   [junit4]   2> 427826 INFO  (WRITER11) [    ] o.a.s.u.p.LogUpdateProcessor [collection1] webapp=null path=null params={_version_=-41&update.distrib=FROMLEADER&versions=true&wt=json&indent=true} {deleteByQuery=id:10 (-41)} 0 142
   [junit4]   2> 427827 INFO  (WRITER2) [    ] o.a.s.u.p.LogUpdateProcessor [collection1] webapp=null path=null params={update.distrib=FROMLEADER&versions=true&wt=json&indent=true} {add=[13 (42)]} 0 142
   [junit4]   2> 427830 INFO  (WRITER4) [    ] o.a.s.s.SolrIndexSearcher Opening Searcher@179a97e5[collection1] realtime
   [junit4]   2> 427830 INFO  (WRITER4) [    ] o.a.s.u.p.LogUpdateProcessor [collection1] webapp=null path=null params={_version_=-44&update.distrib=FROMLEADER&versions=true&wt=json&indent=true} {deleteByQuery=id:3 (-44)} 0 145
   [junit4]   2> 427831 INFO  (WRITER9) [    ] o.a.s.u.p.LogUpdateProcessor [collection1] webapp=null path=null params={_version_=-43&update.distrib=FROMLEADER&versions=true&wt=json&indent=true} {deleteByQuery=id:0 (-43)} 0 145
   [junit4]   2> 427832 INFO  (WRITER7) [    ] o.a.s.u.p.LogUpdateProcessor [collection1] webapp=null path=null params={update.distrib=FROMLEADER&versions=true&wt=json&indent=true} {add=[8 (45)]} 0 145
   [junit4]   2> 427835 INFO  (WRITER5) [    ] o.a.s.s.SolrIndexSearcher Opening Searcher@257688d[collection1] realtime
   [junit4]   2> 427837 INFO  (WRITER8) [    ] o.a.s.u.p.LogUpdateProcessor [collection1] webapp=null path=null params={update.distrib=FROMLEADER&versions=true&wt=json&indent=true} {add=[14 (48)]} 0 76
   [junit4]   2> 427837 INFO  (WRITER6) [    ] o.a.s.u.p.LogUpdateProcessor [collection1] webapp=null path=null params={update.distrib=FROMLEADER&versions=true&wt=json&indent=true} {add=[1 (47)]} 0 148
   [junit4]   2> 427837 INFO  (WRITER10) [    ] o.a.s.u.p.LogUpdateProcessor [collection1] webapp=null path=null params={update.distrib=FROMLEADER&versions=true&wt=json&indent=true} {add=[14 (49)]} 0 68
   [junit4]   2> 427838 INFO  (WRITER5) [    ] o.a.s.u.p.LogUpdateProcessor [collection1] webapp=null path=null params={_version_=-46&update.distrib=FROMLEADER&versions=true&wt=json&indent=true} {deleteByQuery=id:13 (-46)} 0 149
   [junit4]   2> 427890 INFO  (TEST-TestReloadDeadlock.testReloadDeadlock-seed#[456BEE68EFC74744]) [    ] o.a.s.s.IndexSchema default search field in schema is text
   [junit4]   2> 427891 INFO  (TEST-TestReloadDeadlock.testReloadDeadlock-seed#[456BEE68EFC74744]) [    ] o.a.s.s.IndexSchema unique key field: id
   [junit4]   2> 427893 INFO  (TEST-TestReloadDeadlock.testReloadDeadlock-seed#[456BEE68EFC74744]) [    ] o.a.s.s.FileExchangeRateProvider Reloading exchange rates from file currency.xml
   [junit4]   2> 427895 INFO  (TEST-TestReloadDeadlock.testReloadDeadlock-seed#[456BEE68EFC74744]) [    ] o.a.s.s.FileExchangeRateProvider Reloading exchange rates from file currency.xml
   [junit4]   2> 427898 INFO  (WRITER0) [    ] o.a.s.s.SolrIndexSearcher Opening Searcher@670b0372[collection1] realtime
   [junit4]   2> 427899 INFO  (WRITER0) [    ] o.a.s.u.p.LogUpdateProcessor [collection1] webapp=null path=null params={_version_=-50&update.distrib=FROMLEADER&versions=true&wt=json&indent=true} {deleteByQuery=id:9 (-50)} 0 127
   [junit4]   2> 427899 INFO  (WRITER1) [    ] o.a.s.u.p.LogUpdateProcessor [collection1] webapp=null path=null params={update.distrib=FROMLEADER&versions=true&wt=json&indent=true} {add=[2 (51)]} 0 127
   [junit4]   2> 427900 INFO  (WRITER3) [    ] o.a.s.u.p.LogUpdateProcessor [collection1] webapp=null path=null params={update.distrib=FROMLEADER&versions=true&wt=json&indent=true} {add=[6 (52)]} 0 126
   [junit4]   2> 427905 INFO  (WRITER11) [    ] o.a.s.s.SolrIndexSearcher Opening Searcher@1be14805[collection1] realtime
   [junit4]   2> 427906 INFO  (WRITER2) [    ] o.a.s.u.p.LogUpdateProcessor [collection1] webapp=null path=null params={update.distrib=FROMLEADER&versions=true&wt=json&indent=true} {add=[10 (54)]} 0 78
   [junit4]   2> 427906 INFO  (WRITER4) [    ] o.a.s.u.UpdateHandler start commit{,optimize=false,openSearcher=true,waitSearcher=true,expungeDeletes=false,softCommit=false,prepareCommit=false}
   [junit4]   2> 427907 INFO  (WRITER11) [    ] o.a.s.u.p.LogUpdateProcessor [collection1] webapp=null path=null params={_version_=-53&update.distrib=FROMLEADER&versions=true&wt=json&indent=true} {deleteByQuery=id:13 (-53)} 0 80
   [junit4]   2> 427907 INFO  (WRITER9) [    ] o.a.s.u.p.LogUpdateProcessor [collection1] webapp=null path=null params={update.distrib=FROMLEADER&versions=true&wt=json&indent=true} {add=[3 (55)]} 0 75
   [junit4]   2> 427910 INFO  (WRITER4) [    ] o.a.s.c.SolrCore SolrDeletionPolicy.onCommit: commits: num=2
   [junit4]   2> 	commit{dir=MockDirectoryWrapper(RAMDirectory@4846b836 lockFactory=org.apache.lucene.store.SingleInstanceLockFactory@1ae8064c),segFN=segments_4,generation=4}
   [junit4]   2> 	commit{dir=MockDirectoryWrapper(RAMDirectory@4846b836 lockFactory=org.apache.lucene.store.SingleInstanceLockFactory@1ae8064c),segFN=segments_5,generation=5}
   [junit4]   2> 427910 INFO  (WRITER4) [    ] o.a.s.c.SolrCore newest commit generation = 5
   [junit4]   2> 427910 INFO  (TEST-TestReloadDeadlock.testReloadDeadlock-seed#[456BEE68EFC74744]) [    ] o.a.s.c.ConfigSetProperties Did not find ConfigSet properties, assuming default properties: Can't find resource 'configsetprops.json' in classpath or '/x1/jenkins/jenkins-slave/workspace/Lucene-Solr-NightlyTests-5.x/solr/core/src/test-files/solr/collection1/conf'
   [junit4]   2> 427910 INFO  (TEST-TestReloadDeadlock.testReloadDeadlock-seed#[456BEE68EFC74744]) [    ] o.a.s.c.CoreContainer Reloading SolrCore 'collection1' using configuration from instancedir /x1/jenkins/jenkins-slave/workspace/Lucene-Solr-NightlyTests-5.x/solr/core/src/test-files/solr/collection1/
   [junit4]   2> 427910 INFO  (WRITER4) [    ] o.a.s.s.SolrIndexSearcher Opening Searcher@1d613de7[collection1] main
   [junit4]   2> 427911 INFO  (TEST-TestReloadDeadlock.testReloadDeadlock-seed#[456BEE68EFC74744]) [    x:collection1] o.a.s.c.SolrCore [[collection1] ] Opening new SolrCore at [/x1/jenkins/jenkins-slave/workspace/Lucene-Solr-NightlyTests-5.x/solr/core/src/test-files/solr/collection1/], dataDir=[/x1/jenkins/jenkins-slave/workspace/Lucene-Solr-NightlyTests-5.x/solr/build/solr-core/test/J1/temp/solr.search.TestReloadDeadlock_456BEE68EFC74744-001/init-core-data-001/]
   [junit4]   2> 427911 INFO  (WRITER4) [    ] o.a.s.u.UpdateHandler end_commit_flush
   [junit4]   2> 427911 INFO  (TEST-TestReloadDeadlock.testReloadDeadlock-seed#[456BEE68EFC74744]) [    x:collection1] o.a.s.c.JmxMonitoredMap JMX monitoring is enabled. Adding Solr mbeans to JMX Server: com.sun.jmx.mbeanserver.JmxMBeanServer@3b59543d
   [junit4]   2> 427911 INFO  (searcherExecutor-1029-thread-1) [    ] o.a.s.c.SolrCore [collection1] Registered new searcher Searcher@1d613de7[collection1] main{ExitableDirectoryReader(UninvertingDirectoryReader(Uninverting(_w(5.4.0):c10/1:delGen=1) Uninverting(_x(5.4.0):c1) Uninverting(_y(5.4.0):c1) Uninverting(_z(5.4.0):c2)))}
   [junit4]   2> 427912 INFO  (TEST-TestReloadDeadlock.testReloadDeadlock-seed#[456BEE68EFC74744]) [    x:collection1] o.a.s.c.SolrCore New index directory detected: old=null new=/x1/jenkins/jenkins-slave/workspace/Lucene-Solr-NightlyTests-5.x/solr/build/solr-core/test/J1/temp/solr.search.TestReloadDeadlock_456BEE68EFC74744-001/init-core-data-001/index/
   [junit4]   2> 427912 INFO  (WRITER4) [    ] o.a.s.u.p.LogUpdateProcessor [collection1] webapp=null path=null params={} {commit=} 0 81
   [junit4]   2> 427914 INFO  (WRITER7) [    ] o.a.s.s.SolrIndexSearcher Opening Searcher@7b0df949[collection1] realtime
   [junit4]   2> 427914 INFO  (WRITER7) [    ] o.a.s.u.p.LogUpdateProcessor [collection1] webapp=null path=null params={_version_=-56&update.distrib=FROMLEADER&versions=true&wt=json&indent=true} {deleteByQuery=id:4 (-56)} 0 82
   [junit4]   2> 427915 INFO  (OldIndexDirectoryCleanupThreadForCore-collection1) [    x:collection1] o.a.s.c.SolrCore Looking for old index directories to cleanup for core collection1 in /x1/jenkins/jenkins-slave/workspace/Lucene-Solr-NightlyTests-5.x/solr/build/solr-core/test/J1/temp/solr.search.TestReloadDeadlock_456BEE68EFC74744-001/init-core-data-001/
   [junit4]   2> 427915 INFO  (WRITER8) [    ] o.a.s.u.p.LogUpdateProcessor [collection1] webapp=null path=null params={update.distrib=FROMLEADER&versions=true&wt=json&indent=true} {add=[14 (57)]} 0 78
   [junit4]   2> 427915 INFO  (WRITER6) [    ] o.a.s.u.p.LogUpdateProcessor [collection1] webapp=null path=null params={update.distrib=FROMLEADER&versions=true&wt=json&indent=true} {add=[8 (58)]} 0 78
   [junit4]   2> 427916 INFO  (WRITER10) [    ] o.a.s.u.p.LogUpdateProcessor [collection1] webapp=null path=null params={update.distrib=FROMLEADER&versions=true&wt=json&indent=true} {add=[14 (59)]} 0 78
   [junit4]   2> 427917 INFO  (TEST-TestReloadDeadlock.testReloadDeadlock-seed#[456BEE68EFC74744]) [    x:collection1] o.a.s.u.p.UpdateRequestProcessorChain creating updateRequestProcessorChain "nodistrib"
   [junit4]   2> 427918 INFO  (TEST-TestReloadDeadlock.testReloadDeadlock-seed#[456BEE68EFC74744]) [    x:collection1] o.a.s.u.p.UpdateRequestProcessorChain creating updateRequestProcessorChain "dedupe"
   [junit4]   2> 427918 INFO  (TEST-TestReloadDeadlock.testReloadDeadlock-seed#[456BEE68EFC74744]) [    x:collection1] o.a.s.u.p.UpdateRequestProcessorChain inserting DistributedUpdateProcessorFactory into updateRequestProcessorChain "dedupe"
   [junit4]   2> 427918 INFO  (TEST-TestReloadDeadlock.testReloadDeadlock-seed#[456BEE68EFC74744]) [    x:collection1] o.a.s.u.p.UpdateRequestProcessorChain creating updateRequestProcessorChain "stored_sig"
   [junit4]   2> 427918 INFO  (TEST-TestReloadDeadlock.testReloadDeadlock-seed#[456BEE68EFC74744]) [    x:collection1] o.a.s.u.p.UpdateRequestProcessorChain inserting DistributedUpdateProcessorFactory into updateRequestProcessorChain "stored_sig"
   [junit4]   2> 427918 INFO  (TEST-TestReloadDeadlock.testReloadDeadlock-seed#[456BEE68EFC74744]) [    x:collection1] o.a.s.u.p.UpdateRequestProcessorChain creating updateRequestProcessorChain "distrib-dup-test-chain-explicit"
   [junit4]   2> 427919 INFO  (TEST-TestReloadDeadlock.testReloadDeadlock-seed#[456BEE68EFC74744]) [    x:collection1] o.a.s.u.p.UpdateRequestProcessorChain creating updateRequestProcessorChain "distrib-dup-test-chain-implicit"
   [junit4]   2> 427919 INFO  (TEST-TestReloadDeadlock.testReloadDeadlock-seed#[456BEE68EFC74744]) [    x:collection1] o.a.s.u.p.UpdateRequestProcessorChain inserting DistributedUpdateProcessorFactory into updateRequestProcessorChain "distrib-dup-test-chain-implicit"
   [junit4]   2> 427920 INFO  (TEST-TestReloadDeadlock.testReloadDeadlock-seed#[456BEE68EFC74744]) [    x:collection1] o.a.s.c.SolrCore no updateRequestProcessorChain defined as default, creating implicit default
   [junit4]   2> 427926 INFO  (WRITER5) [    ] o.a.s.s.SolrIndexSearcher Opening Searcher@4d373a3e[collection1] realtime
   [junit4]   2> 427926 INFO  (WRITER5) [    ] o.a.s.u.p.LogUpdateProcessor [collection1] webapp=null path=null params={_version_=-60&update.distrib=FROMLEADER&versions=true&wt=json&indent=true} {deleteByQuery=id:14 (-60)} 0 87
   [junit4]   2> 427927 INFO  (WRITER0) [    ] o.a.s.s.SolrIndexSearcher Opening Searcher@30fc1774[collection1] realtime
   [junit4]   2> 427927 INFO  (TEST-TestReloadDeadlock.testReloadDeadlock-seed#[456BEE68EFC74744]) [    x:collection1] o.a.s.h.l.XMLLoader xsltCacheLifetimeSeconds=60
   [junit4]   2> 427927 INFO  (WRITER0) [    ] o.a.s.u.p.LogUpdateProcessor [collection1] webapp=null path=null params={_version_=-61&update.distrib=FROMLEADER&versions=true&wt=json&indent=true} {deleteByQuery=id:9 (-61)} 0 27
   [junit4]   2> 427928 INFO  (WRITER1) [    ] o.a.s.u.p.LogUpdateProcessor [collection1] webapp=null path=null params={update.distrib=FROMLEADER&versions=true&wt=json&indent=true} {add=[2 (62)]} 0 28
   [junit4]   2> 427928 INFO  (WRITER3) [    ] o.a.s.u.p.LogUpdateProcessor [collection1] webapp=null path=null params={update.distrib=FROMLEADER&versions=true&wt=json&indent=true} {add=[7 (63)]} 0 28
   [junit4]   2> 427928 INFO  (WRITER11) [    ] o.a.s.u.p.LogUpdateProcessor [collection1] webapp=null path=null params={update.distrib=FROMLEADER&versions=true&wt=json&indent=true} {add=[2 (65)]} 0 21
   [junit4]   2> 427928 INFO  (WRITER9) [    ] o.a.s.u.p.LogUpdateProcessor [collection1] webapp=null path=null params={update.distrib=FROMLEADER&versions=true&wt=json&indent=true} {add=[3 (66)]} 0 20
   [junit4]   2> 427928 INFO  (WRITER7) [    ] o.a.s.u.p.LogUpdateProcessor [collection1] webapp=null path=null params={update.distrib=FROMLEADER&versions=true&wt=json&indent=true} {add=[0 (68)]} 0 14
   [junit4]   2> 427928 INFO  (WRITER2) [    ] o.a.s.u.p.LogUpdateProcessor [collection1] webapp=null path=null params={update.distrib=FROMLEADER&versions=true&wt=json&indent=true} {add=[2 (64)]} 0 21
   [junit4]   2> 427929 INFO  (WRITER6) [    ] o.a.s.u.p.LogUpdateProcessor [collection1] webapp=null path=null params={update.distrib=FROMLEADER&versions=true&wt=json&indent=true} {add=[5 (70)]} 0 13
   [junit4]   2> 427929 INFO  (WRITER4) [    ] o.a.s.u.p.LogUpdateProcessor [collection1] webapp=null path=null params={update.distrib=FROMLEADER&versions=true&wt=json&indent=true} {add=[8 (67)]} 0 16
   [junit4]   2> 427931 INFO  (TEST-TestReloadDeadlock.testReloadDeadlock-seed#[456BEE68EFC74744]) [    x:collection1] o.a.s.h.l.XMLLoader xsltCacheLifetimeSeconds=60
   [junit4]   2> 427932 INFO  (TEST-TestReloadDeadlock.testReloadDeadlock-seed#[456BEE68EFC74744]) [    x:collection1] o.a.s.h.l.XMLLoader xsltCacheLifetimeSeconds=60
   [junit4]   2> 427934 INFO  (WRITER8) [    ] o.a.s.s.SolrIndexSearcher Opening Searcher@670bfbfa[collection1] realtime
   [junit4]   2> 427934 INFO  (TEST-TestReloadDeadlock.testReloadDeadlock-seed#[456BEE68EFC74744]) [    x:collection1] o.a.s.h.l.XMLLoader xsltCacheLifetimeSeconds=60
   [junit4]   2> 427934 INFO  (WRITER8) [    ] o.a.s.u.p.LogUpdateProcessor [collection1] webapp=null path=null params={_version_=-69&update.distrib=FROMLEADER&versions=true&wt=json&indent=true} {deleteByQuery=id:14 (-69)} 0 18
   [junit4]   2> 427934 INFO  (WRITER10) [    ] o.a.s.u.p.LogUpdateProcessor [collection1] webapp=null path=null params={update.distrib=FROMLEADER&versions=true&wt=json&indent=true} {add=[10 (71)]} 0 18
   [junit4]   2> 427935 INFO  (WRITER5) [    ] o.a.s.u.p.LogUpdateProcessor [collection1] webapp=null path=null params={update.distrib=FROMLEADER&versions=true&wt=json&indent=true} {add=[14 (72)]} 0 8
   [junit4]   2> 427942 INFO  (WRITER0) [    ] o.a.s.s.SolrIndexSearcher Opening Searcher@5a4246be[collection1] realtime
   [junit4]   2> 427943 INFO  (WRITER0) [    ] o.a.s.u.p.LogUpdateProcessor [collection1] webapp=null path=null params={_version_=-73&update.distrib=FROMLEADER&versions=true&wt=json&indent=true} {deleteByQuery=id:1 (-73)} 0 15
   [junit4]   2> 427943 INFO  (WRITER1) [    ] o.a.s.u.p.LogUpdateProcessor [collection1] webapp=null path=null params={update.distrib=FROMLEADER&versions=true&wt=json&indent=true} {add=[2 (74)]} 0 15
   [junit4]   2> 427944 INFO  (TEST-TestReloadDeadlock.testReloadDeadlock-seed#[456BEE68EFC74744]) [    x:collection1] o.a.s.c.RequestHandlers Registered paths: /admin/threads,/admin/segments,/admin/properties,/schema,/admin/logging,/update/csv,/admin/mbeans,/update,standard,/update/json,/replication,/admin/plugins,/config,/admin/system,/admin/file,/admin/ping,/get,/update/json/docs,/admin/luke
   [junit4]   2> 427945 INFO  (TEST-TestReloadDeadlock.testReloadDeadlock-seed#[456BEE68EFC74744]) [    x:collection1] o.a.s.c.SolrCore Using default statsCache cache: org.apache.solr.search.stats.LocalStatsCache
   [junit4]   2> 427946 INFO  (TEST-TestReloadDeadlock.testReloadDeadlock-seed#[456BEE68EFC74744]) [    x:collection1] o.a.s.c.SolrCore Hard AutoCommit: disabled
   [junit4]   2> 427946 INFO  (TEST-TestReloadDeadlock.testReloadDeadlock-seed#[456BEE68EFC74744]) [    x:collection1] o.a.s.c.SolrCore Soft AutoCommit: disabled
   [junit4]   2> 428054 INFO  (TEST-TestReloadDeadlock.testReloadDeadlock-seed#[456BEE68EFC74744]) [    x:collection1] o.a.s.s.SolrIndexSearcher Opening Searcher@65467412[collection1] main
   [junit4]   2> 428054 WARN  (TEST-TestReloadDeadlock.testReloadDeadlock-seed#[456BEE68EFC74744]) [    x:collection1] o.a.s.r.ManagedResourceStorage Cannot write to config directory /x1/jenkins/jenkins-slave/workspace/Lucene-Solr-NightlyTests-5.x/solr/core/src/test-files/solr/collection1/conf; switching to use InMemory storage instead.
   [junit4]   2> 428055 INFO  (TEST-TestReloadDeadlock.testReloadDeadlock-seed#[456BEE68EFC74744]) [    x:collection1] o.a.s.r.RestManager Initializing RestManager with initArgs: {}
   [junit4]   2> 428055 INFO  (TEST-TestReloadDeadlock.testReloadDeadlock-seed#[456BEE68EFC74744]) [    x:collection1] o.a.s.r.ManagedResourceStorage Reading _rest_managed.json using InMemoryStorage
   [junit4]   2> 428055 INFO  (TEST-TestReloadDeadlock.testReloadDeadlock-seed#[456BEE68EFC74744]) [    x:collection1] o.a.s.r.RestManager Initializing 0 registered ManagedResources
   [junit4]   2> 428056 INFO  (TEST-TestReloadDeadlock.testReloadDeadlock-seed#[456BEE68EFC74744]) [    x:collection1] o.a.s.h.ReplicationHandler Commits will be reserved for  10000
   [junit4]   2> 428056 INFO  (searcherExecutor-1034-thread-1-processing-x:collection1) [    x:collection1] o.a.s.c.SolrCore [collection1] Registered new searcher Searcher@65467412[collection1] main{ExitableDirectoryReader(UninvertingDirectoryReader(Uninverting(_12(5.4.0):c11/7) Uninverting(_14(5.4.0):c6/1) Uninverting(_16(5.4.0):c1) Uninverting(_15(5.4.0):c1) Uninverting(_17(5.4.0):c1)))}
   [junit4]   2> 428057 INFO  (TEST-TestReloadDeadlock.testReloadDeadlock-seed#[456BEE68EFC74744]) [    x:collection1] o.a.s.u.UpdateLog Looking up max value of version field to seed version buckets
   [junit4]   2> 428059 INFO  (WRITER3) [    ] o.a.s.s.SolrIndexSearcher Opening Searcher@17894e52[collection1] realtime
   [junit4]   2> 428059 INFO  (WRITER3) [    ] o.a.s.u.p.LogUpdateProcessor [collection1] webapp=null path=null params={_version_=-75&update.distrib=FROMLEADER&versions=true&wt=json&indent=true} {deleteByQuery=id:7 (-75)} 0 131
   [junit4]   2> 428060 INFO  (WRITER11) [    ] o.a.s.u.p.LogUpdateProcessor [collection1] webapp=null path=null params={update.distrib=FROMLEADER&versions=true&wt=json&indent=true} {add=[4 (76)]} 0 131
   [junit4]   2> 428060 INFO  (WRITER9) [    ] o.a.s.u.p.LogUpdateProcessor [collection1] webapp=null path=null params={update.distrib=FROMLEADER&versions=true&wt=json&indent=true} {add=[5 (77)]} 0 131
   [junit4]   2> 428061 INFO  (WRITER2) [    ] o.a.s.u.p.LogUpdateProcessor [collection1] webapp=null path=null params={update.distrib=FROMLEADER&versions=true&wt=json&indent=true} {add=[5 (79)]} 0 131
   [junit4]   2> 428064 INFO  (WRITER6) [    ] o.a.s.u.p.LogUpdateProcessor [collection1] webapp=null path=null params={update.distrib=FROMLEADER&versions=true&wt=json&indent=true} {add=[13 (80)]} 0 134
   [junit4]   2> 428072 INFO  (WRITER4) [    ] o.a.s.s.SolrIndexSearcher Opening Searcher@3485ad67[collection1] realtime
   [junit4]   2> 428073 INFO  (WRITER7) [    ] o.a.s.u.p.LogUpdateProcessor [collection1] webapp=null path=null params={_version_=-78&update.distrib=FROMLEADER&versions=true&wt=json&indent=true} {deleteByQuery=id:5 (-78)} 0 143
   [junit4]   2> 428074 INFO  (WRITER8) [    ] o.a.s.s.SolrIndexSearcher Opening Searcher@4f90e7a4[collection1] realtime
   [junit4]   2> 428075 INFO  (WRITER8) [    ] o.a.s.u.p.LogUpdateProcessor [collection1] webapp=null path=null params={_version_=-82&update.distrib=FROMLEADER&versions=true&wt=json&indent=true} {deleteByQuery=id:14 (-82)} 0 140
   [junit4]   2> 428077 INFO  (WRITER5) [    ] o.a.s.s.SolrIndexSearcher Opening Searcher@197cd39e[collection1] realtime
   [junit4]   2> 428077 INFO  (WRITER5) [    ] o.a.s.u.p.LogUpdateProcessor [collection1] webapp=null path=null params={_version_=-84&update.distrib=FROMLEADER&versions=true&wt=json&indent=true} {deleteByQuery=id:0 (-84)} 0 142
   [junit4]   2> 428077 INFO  (WRITER10) [    ] o.a.s.u.UpdateHandler Reordered DBQs detected.  Update=add{_version_=83,id=1} DBQs=[DBQ{version=84,q=id:0}]
   [junit4]   2> 428100 INFO  (WRITER10) [    ] o.a.s.s.SolrIndexSearcher Opening Searcher@6f7e807e[collection1] realtime
   [junit4]   2> 428100 INFO  (WRITER4) [    ] o.a.s.u.p.LogUpdateProcessor [collection1] webapp=null path=null params={_version_=-81&update.distrib=FROMLEADER&versions=true&wt=json&indent=true} {deleteByQuery=id:8 (-81)} 0 171
   [junit4]   2> 428101 INFO  (WRITER1) [    ] o.a.s.u.p.LogUpdateProcessor [collection1] webapp=null path=null params={update.distrib=FROMLEADER&versions=true&wt=json&indent=true} {add=[12 (86)]} 0 157
   [junit4]   2> 428101 INFO  (WRITER10) [    ] o.a.s.u.p.LogUpdateProcessor [collection1] webapp=null path=null params={update.distrib=FROMLEADER&versions=true&wt=json&indent=true} {add=[1 (83)]} 0 166
   [junit4]   2> 428102 INFO  (TEST-TestReloadDeadlock.testReloadDeadlock-seed#[456BEE68EFC74744]) [    x:collection1] o.a.s.u.VersionInfo Refreshing highest value of _version_ for 65536 version buckets from index
   [junit4]   2> 428102 INFO  (WRITER0) [    ] o.a.s.u.p.LogUpdateProcessor [collection1] webapp=null path=null params={update.distrib=FROMLEADER&versions=true&wt=json&indent=true} {add=[1 (85)]} 0 158
   [junit4]   2> 428109 INFO  (TEST-TestReloadDeadlock.testReloadDeadlock-seed#[456BEE68EFC74744]) [    x:collection1] o.a.s.u.VersionInfo Found MAX value 74 from Terms for _version_ in index
   [junit4]   2> 428111 INFO  (TEST-TestReloadDeadlock.testReloadDeadlock-seed#[456BEE68EFC74744]) [    x:collection1] o.a.s.u.UpdateLog Took 8.0ms to seed version buckets with highest version 86
   [junit4]   2> 428111 INFO  (TEST-TestReloadDeadlock.testReloadDeadlock-seed#[456BEE68EFC74744]) [    x:collection1] o.a.s.u.DefaultSolrCoreState Creating new IndexWriter...
   [junit4]   2> 428111 INFO  (TEST-TestReloadDeadlock.testReloadDeadlock-seed#[456BEE68EFC74744]) [    x:collection1] o.a.s.u.DefaultSolrCoreState Waiting until IndexWriter is unused... core=collection1
   [junit4]   2> 428111 INFO  (TEST-TestReloadDeadlock.testReloadDeadlock-seed#[456BEE68EFC74744]) [    x:collection1] o.a.s.u.DefaultSolrCoreState Closing old IndexWriter... core=collection1
   [junit4]   2> 428165 INFO  (TEST-TestReloadDeadlock.testReloadDeadlock-seed#[456BEE68EFC74744]) [    x:collection1] o.a.s.c.SolrCore SolrDeletionPolicy.onCommit: commits: num=2
   [junit4]   2> 	commit{dir=MockDirectoryWrapper(RAMDirectory@4846b836 lockFactory=org.apache.lucene.store.SingleInstanceLockFactory@1ae8064c),segFN=segments_5,generation=5}
   [junit4]   2> 	commit{dir=MockDirectoryWrapper(RAMDirectory@4846b836 lockFactory=org.apache.lucene.store.SingleInstanceLockFactory@1ae8064c),segFN=segments_6,generation=6}
   [junit4]   2> 428165 INFO  (TEST-TestReloadDeadlock.testReloadDeadlock-seed#[456BEE68EFC74744]) [    x:collection1] o.a.s.c.SolrCore newest commit generation = 6
   [junit4]   2> 428166 INFO  (TEST-TestReloadDeadlock.testReloadDeadlock-seed#[456BEE68EFC74744]) [    x:collection1] o.a.s.u.RandomMergePolicy RandomMergePolicy wrapping class org.apache.lucene.index.TieredMergePolicy: [TieredMergePolicy: maxMergeAtOnce=33, maxMergeAtOnceExplicit=25, maxMergedSegmentMB=88.4013671875, floorSegmentMB=0.3203125, forceMergeDeletesPctAllowed=21.942637308492678, segmentsPerTier=23.0, maxCFSSegmentSizeMB=8.796093022207999E12, noCFSRatio=0.2452028314340395
   [junit4]   2> 428169 INFO  (TEST-TestReloadDeadlock.testReloadDeadlock-seed#[456BEE68EFC74744]) [    x:collection1] o.a.s.c.SolrCore SolrDeletionPolicy.onInit: commits: num=1
   [junit4]   2> 	commit{dir=MockDirectoryWrapper(RAMDirectory@4846b836 lockFactory=org.apache.lucene.store.SingleInstanceLockFactory@1ae8064c),segFN=segments_6,generation=6}
   [junit4]   2> 428169 INFO  (TEST-TestReloadDeadlock.testReloadDeadlock-seed#[456BEE68EFC74744]) [    x:collection1] o.a.s.c.SolrCore newest commit generation = 6
   [junit4]   2> 428170 INFO  (TEST-TestReloadDeadlock.testReloadDeadlock-seed#[456BEE68EFC74744]) [    x:collection1] o.a.s.u.DefaultSolrCoreState New IndexWriter is ready to be used.
   [junit4]   2> 428171 INFO  (WRITER3) [    ] o.a.s.u.p.LogUpdateProcessor [collection1] webapp=null path=null params={update.distrib=FROMLEADER&versions=true&wt=json&indent=true} {add=[2 (87)]} 0 111
   [junit4]   2> 428180 INFO  (TEST-TestReloadDeadlock.testReloadDeadlock-seed#[456BEE68EFC74744]) [    x:collection1] o.a.s.s.SolrIndexSearcher Opening Searcher@602b1d79[collection1] main
   [junit4]   2> 428181 INFO  (searcherExecutor-1034-thread-1-processing-x:collection1) [    x:collection1] o.a.s.c.SolrCore [collection1] Registered new searcher Searcher@602b1d79[collection1] main{ExitableDirectoryReader(UninvertingDirectoryReader(Uninverting(_1e(5.4.0):c10/2:delGen=1) Uninverting(_1c(5.4.0):c1) Uninverting(_1f(5.4.0):c1) Uninverting(_1g(5.4.0):c1)))}
   [junit4]   2> 428181 INFO  (TEST-TestReloadDeadlock.testReloadDeadlock-seed#[456BEE68EFC74744]) [    x:collection1] o.a.s.c.CoreContainer replacing core: collection1
   [junit4]   2> 428182 INFO  (TEST-TestReloadDeadlock.testReloadDeadlock-seed#[456BEE68EFC74744]) [    x:collection1] o.a.s.c.SolrCore [collection1]  CLOSING SolrCore org.apache.solr.core.SolrCore@77796fa7
   [junit4]   2> 428184 INFO  (WRITER11) [    ] o.a.s.s.SolrIndexSearcher Opening Searcher@55d462b2[collection1] realtime
   [junit4]   2> 428188 INFO  (WRITER11) [    ] o.a.s.u.p.LogUpdateProcessor [collection1] webapp=null path=null params={_version_=-88&update.distrib=FROMLEADER&versions=true&wt=json&indent=true} {deleteByQuery=id:2 (-88)} 0 127
   [junit4]   2> 428188 INFO  (WRITER6) [    ] o.a.s.u.p.LogUpdateProcessor [collection1] webapp=null path=null params={update.distrib=FROMLEADER&versions=true&wt=json&indent=true} {add=[1 (91)]} 0 123
   [junit4]   2> 428189 INFO  (WRITER2) [    ] o.a.s.u.p.LogUpdateProcessor [collection1] webapp=null path=null params={update.distrib=FROMLEADER&versions=true&wt=json&indent=true} {add=[13 (90)]} 0 128
   [junit4]   2> 428190 INFO  (WRITER9) [    ] o.a.s.u.p.LogUpdateProcessor [collection1] webapp=null path=null params={update.distrib=FROMLEADER&versions=true&wt=json&indent=true} {add=[5 (89)]} 0 129
   [junit4]   2> 428211 INFO  (WRITER7) [    ] o.a.s.s.SolrIndexSearcher Opening Searcher@373d019e[collection1] realtime
   [junit4]   2> 428216 INFO  (TEST-TestReloadDeadlock.testReloadDeadlock-seed#[456BEE68EFC74744]) [    x:collection1] o.a.s.u.UpdateHandler closing DirectUpdateHandler2{commits=5,autocommits=0,soft autocommits=0,optimizes=0,rollbacks=0,expungeDeletes=0,docsPending=22,adds=22,deletesById=0,deletesByQuery=11,errors=1,cumulative_adds=60,cumulative_deletesById=0,cumulative_deletesByQuery=28,cumulative_errors=1,transaction_logs_total_size=1536,transaction_logs_total_number=3}
   [junit4]   2> 428216 INFO  (TEST-TestReloadDeadlock.testReloadDeadlock-seed#[456BEE68EFC74744]) [    x:collection1] o.a.s.c.SolrCore [collection1] Closing main searcher on request.
   [junit4]   2> 428222 INFO  (WRITER7) [    ] o.a.s.u.p.LogUpdateProcessor [collection1] webapp=null path=null params={_version_=-92&update.distrib=FROMLEADER&versions=true&wt=json&indent=true} {deleteByQuery=id:7 (-92)} 0 148
   [junit4]   2> 428224 INFO  (WRITER8) [    ] o.a.s.u.p.LogUpdateProcessor [collection1] webapp=null path=null params={update.distrib=FROMLEADER&versions=true&wt=json&indent=true} {add=[12 (93)]} 0 149
   [junit4]   2> 428225 INFO  (WRITER1) [    ] o.a.s.u.p.LogUpdateProcessor [collection1] webapp=null path=null params={update.distrib=FROMLEADER&versions=true&wt=json&indent=true} {add=[12 (96)]} 0 123
   [junit4]   2> 428225 INFO  (WRITER4) [    ] o.a.s.u.p.LogUpdateProcessor [collection1] webapp=null path=null params={update.distrib=FROMLEADER&versions=true&wt=json&indent=true} {add=[12 (95)]} 0 124
   [junit4]   2> 428225 INFO  (WRITER5) [    ] o.a.s.u.p.LogUpdateProcessor [collection1] webapp=null path=null params={update.distrib=FROMLEADER&versions=true&wt=json&indent=true} {add=[13 (94)]} 0 147
   [junit4]   2> 428226 INFO  (WRITER10) [    ] o.a.s.u.p.LogUpdateProcessor [collection1] webapp=null path=null params={update.distrib=FROMLEADER&versions=true&wt=json&indent=true} {add=[2 (97)]} 0 122
   [junit4]   2> 428235 INFO  (WRITER0) [    ] o.a.s.s.SolrIndexSearcher Opening Searcher@2bc18cd5[collection1] realtime
   [junit4]   2> 428236 INFO  (WRITER0) [    ] o.a.s.u.p.LogUpdateProcessor [collection1] webapp=null path=null params={_version_=-98&update.distrib=FROMLEADER&versions=true&wt=json&indent=true} {deleteByQuery=id:2 (-98)} 0 131
   [junit4]   2> 428236 INFO  (WRITER3) [    ] o.a.s.u.p.LogUpdateProcessor [collection1] webapp=null path=null params={update.distrib=FROMLEADER&versions=true&wt=json&indent=true} {add=[2 (99)]} 0 65
   [junit4]   2> 428236 INFO  (WRITER11) [    ] o.a.s.u.p.LogUpdateProcessor [collection1] webapp=null path=null params={update.distrib=FROMLEADER&versions=true&wt=json&indent=true} {add=[13 (100)]} 0 48
   [junit4]   2> 428293 INFO  (WRITER6) [    ] o.a.s.s.SolrIndexSearcher Opening Searcher@2f9075f6[collection1] realtime
   [junit4]   2> 428293 INFO  (WRITER2) [    ] o.a.s.u.UpdateHandler start commit{,optimize=false,openSearcher=true,waitSearcher=true,expungeDeletes=false,softCommit=false,prepareCommit=false}
   [junit4]   2> 428293 INFO  (WRITER6) [    ] o.a.s.u.p.LogUpdateProcessor [collection1] webapp=null path=null params={_version_=-101&update.distrib=FROMLEADER&versions=true&wt=json&indent=true} {deleteByQuery=id:4 (-101)} 0 104
   [junit4]   2> 428294 INFO  (WRITER2) [    ] o.a.s.c.SolrCore SolrDeletionPolicy.onCommit: commits: num=2
   [junit4]   2> 	commit{dir=MockDirectoryWrapper(RAMDirectory@4846b836 lockFactory=org.apache.lucene.store.SingleInstanceLockFactory@1ae8064c),segFN=segments_6,generation=6}
   [junit4]   2> 	commit{dir=MockDirectoryWrapper(RAMDirectory@4846b836 lockFactory=org.apache.lucene.store.SingleInstanceLockFactory@1ae8064c),segFN=segments_7,generation=7}
   [junit4]   2> 428295 INFO  (WRITER2) [    ] o.a.s.c.SolrCore newest commit generation = 7
   [junit4]   2> 428295 INFO  (WRITER2) [    ] o.a.s.s.SolrIndexSearcher Opening Searcher@3c762578[collection1] main
   [junit4]   2> 428295 INFO  (WRITER2) [    ] o.a.s.u.UpdateHandler end_commit_flush
   [junit4]   2> 428296 INFO  (searcherExecutor-1034-thread-1) [    ] o.a.s.c.SolrCore [collection1] Registered new searcher Searcher@3c762578[collection1] main{ExitableDirectoryReader(UninvertingDirectoryReader(Uninverting(_1e(5.4.0):c10/5:delGen=2) Uninverting(_1h(5.4.0):c1) Uninverting(_1j(5.4.0):c1) Uninverting(_1l(5.4.0):c2/1:delGen=1) Uninverting(_1n(5.4.0):c1) Uninverting(_1o(5.4.0):c1)))}
   [junit4]   2> 428297 INFO  (WRITER2) [    ] o.a.s.u.p.LogUpdateProcessor [collection1] webapp=null path=null params={} {commit=} 0 107
   [junit4]   2> 428301 INFO  (WRITER9) [    ] o.a.s.u.p.LogUpdateProcessor [collection1] webapp=null path=null params={_version_=-102&update.distrib=FROMLEADER&versions=true&wt=json&indent=true} {deleteByQuery=id:4 (-102)} 0 110
   [junit4]   2> 428302 INFO  (WRITER7) [    ] o.a.s.u.p.LogUpdateProcessor [collection1] webapp=null path=null params={_version_=-103&update.distrib=FROMLEADER&versions=true&wt=json&indent=true} {deleteByQuery=id:7 (-103)} 0 78
   [junit4]   2> 428304 INFO  (WRITER8) [    ] o.a.s.s.SolrIndexSearcher Opening Searcher@1b23dbc3[collection1] realtime
   [junit4]   2> 428305 INFO  (WRITER8) [    ] o.a.s.u.p.LogUpdateProcessor [collection1] webapp=null path=null params={_version_=-104&update.distrib=FROMLEADER&versions=true&wt=json&indent=true} {deleteByQuery=id:13 (-104)} 0 79
   [junit4]   2> 428306 INFO  (WRITER5) [    ] o.a.s.u.p.LogUpdateProcessor [collection1] webapp=null path=null params={update.distrib=FROMLEADER&versions=true&wt=json&indent=true} {add=[13 (107)]} 0 80
   [junit4]   2> 428306 INFO  (WRITER11) [    ] o.a.s.u.p.LogUpdateProcessor [collection1] webapp=null path=null params={update.distrib=FROMLEADER&versions=true&wt=json&indent=true} {add=[13 (111)]} 0 69
   [junit4]   2> 428307 INFO  (WRITER10) [    ] o.a.s.u.p.LogUpdateProcessor [collection1] webapp=null path=null params={update.distrib=FROMLEADER&versions=true&wt=json&indent=true} {add=[13 (108)]} 0 80
   [junit4]   2> 428307 INFO  (WRITER1) [    ] o.a.s.u.p.LogUpdateProcessor [collection1] webapp=null path=null params={update.distrib=FROMLEADER&versions=true&wt=json&indent=true} {add=[12 (105)]} 0 82
   [junit4]   2> 428307 INFO  (WRITER3) [    ] o.a.s.u.p.LogUpdateProcessor [collection1] webapp=null path=null params={update.distrib=FROMLEADER&versions=true&wt=json&indent=true} {add=[5 (110)]} 0 70
   [junit4]   2> 428307 INFO  (WRITER0) [    ] o.a.s.u.p.LogUpdateProcessor [collection1] webapp=null path=null params={update.distrib=FROMLEADER&versions=true&wt=json&indent=true} {add=[9 (109)]} 0 70
   [junit4]   2> 428307 INFO  (WRITER4) [    ] o.a.s.u.p.LogUpdateProcessor [collection1] webapp=null path=null params={update.distrib=FROMLEADER&versions=true&wt=json&indent=true} {add=[12 (106)]} 0 82
   [junit4]   2> 428326 INFO  (WRITER6) [    ] o.a.s.s.SolrIndexSearcher Opening Searcher@3a9298f4[collection1] realtime
   [junit4]   2> 428327 INFO  (WRITER7) [    ] o.a.s.u.p.LogUpdateProcessor [collection1] webapp=null path=null params={update.distrib=FROMLEADER&versions=true&wt=json&indent=true} {add=[7 (114)]} 0 25
   [junit4]   2> 428331 INFO  (WRITER9) [    ] o.a.s.s.SolrIndexSearcher Opening Searcher@3549f0ba[collection1] realtime
   [junit4]   2> 428332 INFO  (WRITER2) [    ] o.a.s.u.p.LogUpdateProcessor [collection1] webapp=null path=null params={update.distrib=FROMLEADER&versions=true&wt=json&indent=true} {add=[15 (115)]} 0 27
   [junit4]   2> 428336 INFO  (WRITER8) [    ] o.a.s.s.SolrIndexSearcher Opening Searcher@40c425dc[collection1] realtime
   [junit4]   2> 428336 INFO  (WRITER8) [    ] o.a.s.u.p.LogUpdateProcessor [collection1] webapp=null path=null params={_version_=-116&update.distrib=FROMLEADER&versions=true&wt=json&indent=true} {deleteByQuery=id:13 (-116)} 0 31
   [junit4]   2> 428337 INFO  (WRITER5) [    ] o.a.s.u.p.LogUpdateProcessor [collection1] webapp=null path=null params={_version_=-117&update.distrib=FROMLEADER&versions=true&wt=json&indent=true} {deleteByQuery=id:13 (-117)} 0 31
   [junit4]   2> 428338 INFO  (WRITER6) [    ] o.a.s.u.p.LogUpdateProcessor [collection1] webapp=null path=null params={_version_=-112&update.distrib=FROMLEADER&versions=true&wt=json&indent=true} {deleteByQuery=id:15 (-112)} 0 43
   [junit4]   2> 428337 INFO  (WRITER9) [    ] o.a.s.u.p.LogUpdateProcessor [collection1] webapp=null path=null params={_version_=-113&update.distrib=FROMLEADER&versions=true&wt=json&indent=true} {deleteByQuery=id:12 (-113)} 0 34
   [junit4]   2> 428338 INFO  (WRITER11) [    ] o.a.s.u.p.LogUpdateProcessor [collection1] webapp=null path=null params={update.distrib=FROMLEADER&versions=true&wt=json&indent=true} {add=[13 (118)]} 0 31
   [junit4]   2> 428338 INFO  (WRITER10) [    ] o.a.s.u.p.LogUpdateProcessor [collection1] webapp=null path=null params={update.distrib=FROMLEADER&versions=true&wt=json&indent=true} {add=[13 (119)]} 0 31
   [junit4]   2> 428342 INFO  (WRITER1) [    ] o.a.s.s.SolrIndexSearcher Opening Searcher@721fbd9f[collection1] realtime
   [junit4]   2> 428342 INFO  (WRITER1) [    ] o.a.s.u.p.LogUpdateProcessor [collection1] webapp=null path=null params={_version_=-120&update.distrib=FROMLEADER&versions=true&wt=json&indent=true} {deleteByQuery=id:12 (-120)} 0 34
   [junit4]   2> 428343 INFO  (WRITER3) [    ] o.a.s.u.p.LogUpdateProcessor [collection1] webapp=null path=null params={update.distrib=FROMLEADER&versions=true&wt=json&indent=true} {add=[12 (121)]} 0 35
   [junit4]   2> 428343 INFO  (WRITER2) [    ] o.a.s.u.p.LogUpdateProcessor [collection1] webapp=null path=null params={update.distrib=FROMLEADER&versions=true&wt=json&indent=true} {add=[15 (124)]} 0 10
   [junit4]   2> 428343 INFO  (WRITER5) [    ] o.a.s.u.p.LogUpdateProcessor [collection1] webapp=null path=null params={update.distrib=FROMLEADER&versions=true&wt=json&indent=true} {add=[13 (126)]} 0 5
   [junit4]   2> 428342 INFO  (WRITER0) [    ] o.a.s.u.UpdateHandler start commit{,optimize=false,openSearcher=true,waitSearcher=true,expungeDeletes=false,softCommit=false,prepareCommit=false}
   [junit4]   2> 428343 INFO  (WRITER8) [    ] o.a.s.u.p.LogUpdateProcessor [collection1] webapp=null path=null params={update.distrib=FROMLEADER&versions=true&wt=json&indent=true} {add=[13 (125)]} 0 6
   [junit4]   2> 428348 INFO  (WRITER4) [    ] o.a.s.u.p.LogUpdateProcessor [collection1] webapp=null path=null params={update.distrib=FROMLEADER&versions=true&wt=json&indent=true} {add=[12 (122)]} 0 40
   [junit4]   2> 428349 INFO  (WRITER7) [    ] o.a.s.u.p.LogUpdateProcessor [collection1] webapp=null path=null params={update.distrib=FROMLEADER&versions=true&wt=json&indent=true} {add=[7 (123)]} 0 22
   [junit4]   2> 428356 INFO  (WRITER0) [    ] o.a.s.c.SolrCore SolrDeletionPolicy.onCommit: commits: num=2
   [junit4]   2> 	commit{dir=MockDirectoryWrapper(RAMDirectory@4846b836 lockFactory=org.apache.lucene.store.SingleInstanceLockFactory@1ae8064c),segFN=segments_7,generation=7}
   [junit4]   2> 	commit{dir=MockDirectoryWrapper(RAMDirectory@4846b836 lockFactory=org.apache.lucene.store.SingleInstanceLockFactory@1ae8064c),segFN=segments_8,generation=8}
   [junit4]   2> 428356 INFO  (WRITER0) [    ] o.a.s.c.SolrCore newest commit generation = 8
   [junit4]   2> 428367 INFO  (TEST-TestReloadDeadlock.testReloadDeadlock-seed#[456BEE68EFC74744]) [    x:collection1] o.a.s.c.SolrResourceLoader new SolrResourceLoader for directory: '/x1/jenkins/jenkins-slave/workspace/Lucene-Solr-NightlyTests-5.x/solr/core/src/test-files/solr/collection1/'
   [junit4]   2> 428368 INFO  (TEST-TestReloadDeadlock.testReloadDeadlock-seed#[456BEE68EFC74744]) [    x:collection1] o.a.s.c.SolrResourceLoader Adding 'file:/x1/jenkins/jenkins-slave/workspace/Lucene-Solr-NightlyTests-5.x/solr/core/src/test-files/solr/collection1/lib/.svn/' to classloader
   [junit4]   2> 428368 INFO  (TEST-TestReloadDeadlock.testReloadDeadlock-seed#[456BEE68EFC74744]) [    x:collection1] o.a.s.c.SolrResourceLoader Adding 'file:/x1/jenkins/jenkins-slave/workspace/Lucene-Solr-NightlyTests-5.x/solr/core/src/test-files/solr/collection1/lib/classes/' to classloader
   [junit4]   2> 428368 INFO  (TEST-TestReloadDeadlock.testReloadDeadlock-seed#[456BEE68EFC74744]) [    x:collection1] o.a.s.c.SolrResourceLoader Adding 'file:/x1/jenkins/jenkins-slave/workspace/Lucene-Solr-NightlyTests-5.x/solr/core/src/test-files/solr/collection1/lib/README' to classloader
   [junit4]   2> 428409 INFO  (TEST-TestReloadDeadlock.testReloadDeadlock-seed#[456BEE68EFC74744]) [    x:collection1] o.a.s.c.SolrConfig current version of requestparams : -1
   [junit4]   2> 428413 INFO  (WRITER0) [    ] o.a.s.s.SolrIndexSearcher Opening Searcher@66ba3637[collection1] main
   [junit4]   2> 428414 INFO  (WRITER0) [    ] o.a.s.u.UpdateHandler end_commit_flush
   [junit4]   2> 428414 INFO  (searcherExecutor-1034-thread-1) [    ] o.a.s.c.SolrCore [collection1] Registered new searcher Searcher@66ba3637[collection1] main{ExitableDirectoryReader(UninvertingDirectoryReader(Uninverting(_1e(5.4.0):c10/6:delGen=3) Uninverting(_1h(5.4.0):c1) Uninverting(_1n(5.4.0):c1) Uninverting(_1r(5.4.0):c1) Uninverting(_1s(5.4.0):c2/1:delGen=1) Uninverting(_1w(5.4.0):c4/2:delGen=1) Uninverting(_1x(5.4.0):c1) Uninverting(_1y(5.4.0):c1)))}
   [junit4]   2> 428415 INFO  (WRITER0) [    ] o.a.s.u.p.LogUpdateProcessor [collection1] webapp=null path=null params={} {commit=} 0 107
   [junit4]   2> 428417 INFO  (WRITER9) [    ] o.a.s.s.SolrIndexSearcher Opening Searcher@37356f4e[collection1] realtime
   [junit4]   2> 428417 INFO  (WRITER9

[...truncated too long message...]

eMetrics.java:145)
   [junit4]   2> 	at org.apache.hadoop.hdfs.server.namenode.NameNode.stop(NameNode.java:822)
   [junit4]   2> 	at org.apache.hadoop.hdfs.MiniDFSCluster.shutdown(MiniDFSCluster.java:1720)
   [junit4]   2> 	at org.apache.hadoop.hdfs.MiniDFSCluster.shutdown(MiniDFSCluster.java:1699)
   [junit4]   2> 	at org.apache.solr.cloud.hdfs.HdfsTestUtil.teardownClass(HdfsTestUtil.java:197)
   [junit4]   2> 	at org.apache.solr.cloud.hdfs.HdfsCollectionsAPIDistributedZkTest.teardownClass(HdfsCollectionsAPIDistributedZkTest.java:50)
   [junit4]   2> 	at sun.reflect.NativeMethodAccessorImpl.invoke0(Native Method)
   [junit4]   2> 	at sun.reflect.NativeMethodAccessorImpl.invoke(NativeMethodAccessorImpl.java:57)
   [junit4]   2> 	at sun.reflect.DelegatingMethodAccessorImpl.invoke(DelegatingMethodAccessorImpl.java:43)
   [junit4]   2> 	at java.lang.reflect.Method.invoke(Method.java:606)
   [junit4]   2> 	at com.carrotsearch.randomizedtesting.RandomizedRunner.invoke(RandomizedRunner.java:1627)
   [junit4]   2> 	at com.carrotsearch.randomizedtesting.RandomizedRunner$5.evaluate(RandomizedRunner.java:799)
   [junit4]   2> 	at com.carrotsearch.randomizedtesting.rules.StatementAdapter.evaluate(StatementAdapter.java:36)
   [junit4]   2> 	at com.carrotsearch.randomizedtesting.rules.SystemPropertiesRestoreRule$1.evaluate(SystemPropertiesRestoreRule.java:57)
   [junit4]   2> 	at org.apache.lucene.util.AbstractBeforeAfterRule$1.evaluate(AbstractBeforeAfterRule.java:46)
   [junit4]   2> 	at com.carrotsearch.randomizedtesting.rules.StatementAdapter.evaluate(StatementAdapter.java:36)
   [junit4]   2> 	at org.apache.lucene.util.TestRuleStoreClassName$1.evaluate(TestRuleStoreClassName.java:42)
   [junit4]   2> 	at com.carrotsearch.randomizedtesting.rules.NoShadowingOrOverridesOnMethodsRule$1.evaluate(NoShadowingOrOverridesOnMethodsRule.java:39)
   [junit4]   2> 	at com.carrotsearch.randomizedtesting.rules.NoShadowingOrOverridesOnMethodsRule$1.evaluate(NoShadowingOrOverridesOnMethodsRule.java:39)
   [junit4]   2> 	at com.carrotsearch.randomizedtesting.rules.StatementAdapter.evaluate(StatementAdapter.java:36)
   [junit4]   2> 	at com.carrotsearch.randomizedtesting.rules.StatementAdapter.evaluate(StatementAdapter.java:36)
   [junit4]   2> 	at com.carrotsearch.randomizedtesting.rules.StatementAdapter.evaluate(StatementAdapter.java:36)
   [junit4]   2> 	at org.apache.lucene.util.TestRuleAssertionsRequired$1.evaluate(TestRuleAssertionsRequired.java:54)
   [junit4]   2> 	at org.apache.lucene.util.TestRuleMarkFailure$1.evaluate(TestRuleMarkFailure.java:48)
   [junit4]   2> 	at org.apache.lucene.util.TestRuleIgnoreAfterMaxFailures$1.evaluate(TestRuleIgnoreAfterMaxFailures.java:65)
   [junit4]   2> 	at org.apache.lucene.util.TestRuleIgnoreTestSuites$1.evaluate(TestRuleIgnoreTestSuites.java:55)
   [junit4]   2> 	at com.carrotsearch.randomizedtesting.rules.StatementAdapter.evaluate(StatementAdapter.java:36)
   [junit4]   2> 	at com.carrotsearch.randomizedtesting.ThreadLeakControl$StatementRunner.run(ThreadLeakControl.java:365)
   [junit4]   2> 	at java.lang.Thread.run(Thread.java:745)
   [junit4]   2> Caused by: java.lang.NullPointerException
   [junit4]   2> 	at org.apache.hadoop.hdfs.server.blockmanagement.BlocksMap.size(BlocksMap.java:198)
   [junit4]   2> 	at org.apache.hadoop.hdfs.server.blockmanagement.BlockManager.getTotalBlocks(BlockManager.java:3291)
   [junit4]   2> 	at org.apache.hadoop.hdfs.server.namenode.FSNamesystem.getBlocksTotal(FSNamesystem.java:6223)
   [junit4]   2> 	... 53 more
   [junit4]   2> 3486400 INFO  (SUITE-HdfsCollectionsAPIDistributedZkTest-seed#[456BEE68EFC74744]-worker) [n:127.0.0.1:60081_frj c:addReplicaColl s:shard1 r:core_node7 x:propertyDotName] o.a.s.SolrTestCaseJ4 ###deleteCore
   [junit4]   2> Aug 17, 2015 2:59:53 PM com.carrotsearch.randomizedtesting.ThreadLeakControl checkThreadLeaks
   [junit4]   2> WARNING: Will linger awaiting termination of 2 leaked thread(s).
   [junit4]   2> NOTE: test params are: codec=Asserting(Lucene53): {intDefault=PostingsFormat(name=Memory doPackFST= true), range_facet_l_dv=PostingsFormat(name=Direct), multiDefault=Lucene50(blocksize=128), range_facet_l=PostingsFormat(name=Memory doPackFST= true), _version_=PostingsFormat(name=Memory doPackFST= true), range_facet_i_dv=PostingsFormat(name=Memory doPackFST= true), text=Lucene50(blocksize=128), other_tl1=PostingsFormat(name=Memory doPackFST= true), a_t=PostingsFormat(name=Memory doPackFST= true), id=PostingsFormat(name=Direct), a_i1=PostingsFormat(name=Memory doPackFST= true), timestamp=PostingsFormat(name=Memory doPackFST= true)}, docValues:{range_facet_l_dv=DocValuesFormat(name=Direct), range_facet_i_dv=DocValuesFormat(name=Memory), timestamp=DocValuesFormat(name=Memory)}, sim=RandomSimilarityProvider(queryNorm=false,coord=no): {}, locale=ar_EG, timezone=America/Juneau
   [junit4]   2> NOTE: Linux 3.13.0-52-generic amd64/Oracle Corporation 1.7.0_72 (64-bit)/cpus=4,threads=2,free=266614040,total=525860864
   [junit4]   2> NOTE: All tests run in this JVM: [DeleteReplicaTest, TestFastOutputStream, MoreLikeThisHandlerTest, TestGroupingSearch, TestReload, HdfsSyncSliceTest, OverseerCollectionProcessorTest, TestSolrCloudWithKerberosAlt, SampleTest, SpatialHeatmapFacetsTest, TestQueryTypes, HardAutoCommitTest, BinaryUpdateRequestHandlerTest, PolyFieldTest, DocExpirationUpdateProcessorFactoryTest, TestQueryUtils, SpatialRPTFieldTypeTest, TestReloadAndDeleteDocs, SynonymTokenizerTest, MultiThreadedOCPTest, TestSchemaManager, TestSmileRequest, ZkStateWriterTest, ChangedSchemaMergeTest, TestExtendedDismaxParser, CircularListTest, TestSurroundQueryParser, StressHdfsTest, TestBlendedInfixSuggestions, LoggingHandlerTest, TestDynamicFieldResource, BadIndexSchemaTest, TestStressReorder, HdfsLockFactoryTest, CoreAdminRequestStatusTest, TestBM25SimilarityFactory, CustomCollectionTest, SOLR749Test, TestJettySolrRunner, TestFieldTypeCollectionResource, TestXIncludeConfig, OverseerTest, TestPerFieldSimilarity, DOMUtilTest, NotRequiredUniqueKeyTest, StatsComponentTest, DirectSolrSpellCheckerTest, AnalysisErrorHandlingTest, TestRequestStatusCollectionAPI, AsyncCallRequestStatusResponseTest, TestDistribIDF, TestRestoreCore, ConcurrentDeleteAndCreateCollectionTest, OutputWriterTest, TestShardHandlerFactory, FileBasedSpellCheckerTest, CoreMergeIndexesAdminHandlerTest, RankQueryTest, TestSimpleTrackingShardHandler, SmileWriterTest, CollectionReloadTest, TestCollationField, TestDefaultSimilarityFactory, TestDocBasedVersionConstraints, DistribCursorPagingTest, TestCSVResponseWriter, DistributedQueryComponentCustomSortTest, HdfsUnloadDistributedZkTest, QueryParsingTest, RegexBoostProcessorTest, SolrIndexSplitterTest, TestDocSet, TestHdfsUpdateLog, TestCloudInspectUtil, LeaderElectionTest, TestFieldTypeResource, TestCryptoKeys, BasicDistributedZk2Test, TestSolrQueryParserResource, XmlUpdateRequestHandlerTest, SimpleCollectionCreateDeleteTest, TestSchemaSimilarityResource, SolrInfoMBeanTest, PreAnalyzedUpdateProcessorTest, SyncSliceTest, OpenCloseCoreStressTest, ClusterStateUpdateTest, TestRandomFaceting, TestZkChroot, TestRandomDVFaceting, ZkCLITest, ShardRoutingCustomTest, AutoCommitTest, TestDistributedGrouping, TestRecovery, DistributedSpellCheckComponentTest, TestRealTimeGet, TestRangeQuery, TestCoreContainer, TestSolr4Spatial, PeerSyncTest, TestSort, SoftAutoCommitTest, TestTrie, TestCSVLoader, TestUpdate, FieldMutatingUpdateProcessorTest, DirectUpdateHandlerOptimizeTest, SortByFunctionTest, XsltUpdateRequestHandlerTest, TestWriterPerf, TestSolrQueryParser, SolrPluginUtilsTest, ReturnFieldsTest, MBeansHandlerTest, CSVRequestHandlerTest, HighlighterConfigTest, TestQuerySenderNoQuery, BadComponentTest, MultiTermTest, TestBinaryField, NumericFieldsTest, TestFuzzyAnalyzedSuggestions, TestPostingsSolrHighlighter, EchoParamsTest, TestLMDirichletSimilarityFactory, TestIBSimilarityFactory, ResourceLoaderTest, URLClassifyProcessorTest, PreAnalyzedFieldTest, ClusterStateTest, SliceStateTest, FileUtilsTest, CursorPagingTest, CleanupOldIndexTest, ConnectionManagerTest, DeleteInactiveReplicaTest, HttpPartitionTest, SharedFSAutoReplicaFailoverUtilsTest, SolrCloudExampleTest, TestAuthenticationFramework, TestDistribDocBasedVersion, TestDownShardTolerantSearch, TestLeaderElectionZkExpiry, TestMiniSolrCloudClusterSSL, TestRandomRequestDistribution, TestReplicaProperties, TriLevelCompositeIdRoutingTest, HdfsCollectionsAPIDistributedZkTest]
   [junit4] Completed [450/533] on J2 in 361.04s, 1 test, 1 error <<< FAILURES!

[...truncated 267 lines...]
BUILD FAILED
/x1/jenkins/jenkins-slave/workspace/Lucene-Solr-NightlyTests-5.x/build.xml:792: The following error occurred while executing this line:
/x1/jenkins/jenkins-slave/workspace/Lucene-Solr-NightlyTests-5.x/build.xml:729: The following error occurred while executing this line:
/x1/jenkins/jenkins-slave/workspace/Lucene-Solr-NightlyTests-5.x/build.xml:59: The following error occurred while executing this line:
/x1/jenkins/jenkins-slave/workspace/Lucene-Solr-NightlyTests-5.x/solr/build.xml:233: The following error occurred while executing this line:
/x1/jenkins/jenkins-slave/workspace/Lucene-Solr-NightlyTests-5.x/solr/common-build.xml:524: The following error occurred while executing this line:
/x1/jenkins/jenkins-slave/workspace/Lucene-Solr-NightlyTests-5.x/lucene/common-build.xml:1449: The following error occurred while executing this line:
/x1/jenkins/jenkins-slave/workspace/Lucene-Solr-NightlyTests-5.x/lucene/common-build.xml:1003: There were test failures: 533 suites, 2114 tests, 3 errors, 1 failure, 26 ignored (14 assumptions)

Total time: 196 minutes 18 seconds
Build step 'Invoke Ant' marked build as failure
Archiving artifacts
Sending artifact delta relative to Lucene-Solr-NightlyTests-5.x #911
Archived 4 artifacts
Archive block size is 32768
Received 0 blocks and 985507060 bytes
Compression is 0.0%
Took 2 min 53 sec
Recording test results
Email was triggered for: Failure
Sending email for trigger: Failure



Mime
View raw message