lucene-dev mailing list archives

Site index · List index
Message view « Date » · « Thread »
Top « Date » · « Thread »
From Policeman Jenkins Server <jenk...@thetaphi.de>
Subject [JENKINS-EA] Lucene-Solr-trunk-Linux (32bit/jdk1.8.0_60-ea-b25) - Build # 13921 - Failure!
Date Wed, 19 Aug 2015 17:41:14 GMT
Build: http://jenkins.thetaphi.de/job/Lucene-Solr-trunk-Linux/13921/
Java: 32bit/jdk1.8.0_60-ea-b25 -client -XX:+UseConcMarkSweepGC

1 tests failed.
FAILED:  org.apache.solr.client.solrj.impl.CloudSolrClientTest.test

Error Message:
Error from server at http://127.0.0.1:46227/gx/checkStateVerCol: no servers hosting shard: shard2

Stack Trace:
org.apache.solr.client.solrj.impl.HttpSolrClient$RemoteSolrException: Error from server at http://127.0.0.1:46227/gx/checkStateVerCol: no servers hosting shard: shard2
	at __randomizedtesting.SeedInfo.seed([D1A4036987FD3D7A:59F03CB329015082]:0)
	at org.apache.solr.client.solrj.impl.HttpSolrClient.executeMethod(HttpSolrClient.java:560)
	at org.apache.solr.client.solrj.impl.HttpSolrClient.request(HttpSolrClient.java:234)
	at org.apache.solr.client.solrj.impl.HttpSolrClient.request(HttpSolrClient.java:226)
	at org.apache.solr.client.solrj.SolrRequest.process(SolrRequest.java:135)
	at org.apache.solr.client.solrj.SolrClient.query(SolrClient.java:943)
	at org.apache.solr.client.solrj.SolrClient.query(SolrClient.java:958)
	at org.apache.solr.client.solrj.impl.CloudSolrClientTest.stateVersionParamTest(CloudSolrClientTest.java:542)
	at org.apache.solr.client.solrj.impl.CloudSolrClientTest.test(CloudSolrClientTest.java:115)
	at sun.reflect.NativeMethodAccessorImpl.invoke0(Native Method)
	at sun.reflect.NativeMethodAccessorImpl.invoke(NativeMethodAccessorImpl.java:62)
	at sun.reflect.DelegatingMethodAccessorImpl.invoke(DelegatingMethodAccessorImpl.java:43)
	at java.lang.reflect.Method.invoke(Method.java:497)
	at com.carrotsearch.randomizedtesting.RandomizedRunner.invoke(RandomizedRunner.java:1627)
	at com.carrotsearch.randomizedtesting.RandomizedRunner$6.evaluate(RandomizedRunner.java:836)
	at com.carrotsearch.randomizedtesting.RandomizedRunner$7.evaluate(RandomizedRunner.java:872)
	at com.carrotsearch.randomizedtesting.RandomizedRunner$8.evaluate(RandomizedRunner.java:886)
	at org.junit.rules.ExpectedException$ExpectedExceptionStatement.evaluate(ExpectedException.java:110)
	at org.apache.solr.BaseDistributedSearchTestCase$ShardsRepeatRule$ShardsFixedStatement.callStatement(BaseDistributedSearchTestCase.java:963)
	at org.apache.solr.BaseDistributedSearchTestCase$ShardsRepeatRule$ShardsStatement.evaluate(BaseDistributedSearchTestCase.java:938)
	at com.carrotsearch.randomizedtesting.rules.SystemPropertiesRestoreRule$1.evaluate(SystemPropertiesRestoreRule.java:57)
	at org.apache.lucene.util.TestRuleSetupTeardownChained$1.evaluate(TestRuleSetupTeardownChained.java:50)
	at org.apache.lucene.util.AbstractBeforeAfterRule$1.evaluate(AbstractBeforeAfterRule.java:46)
	at org.apache.lucene.util.TestRuleThreadAndTestName$1.evaluate(TestRuleThreadAndTestName.java:49)
	at org.apache.lucene.util.TestRuleIgnoreAfterMaxFailures$1.evaluate(TestRuleIgnoreAfterMaxFailures.java:65)
	at org.apache.lucene.util.TestRuleMarkFailure$1.evaluate(TestRuleMarkFailure.java:48)
	at com.carrotsearch.randomizedtesting.rules.StatementAdapter.evaluate(StatementAdapter.java:36)
	at com.carrotsearch.randomizedtesting.ThreadLeakControl$StatementRunner.run(ThreadLeakControl.java:365)
	at com.carrotsearch.randomizedtesting.ThreadLeakControl.forkTimeoutingTask(ThreadLeakControl.java:798)
	at com.carrotsearch.randomizedtesting.ThreadLeakControl$3.evaluate(ThreadLeakControl.java:458)
	at com.carrotsearch.randomizedtesting.RandomizedRunner.runSingleTest(RandomizedRunner.java:845)
	at com.carrotsearch.randomizedtesting.RandomizedRunner$3.evaluate(RandomizedRunner.java:747)
	at com.carrotsearch.randomizedtesting.RandomizedRunner$4.evaluate(RandomizedRunner.java:781)
	at com.carrotsearch.randomizedtesting.RandomizedRunner$5.evaluate(RandomizedRunner.java:792)
	at com.carrotsearch.randomizedtesting.rules.StatementAdapter.evaluate(StatementAdapter.java:36)
	at com.carrotsearch.randomizedtesting.rules.SystemPropertiesRestoreRule$1.evaluate(SystemPropertiesRestoreRule.java:57)
	at org.apache.lucene.util.AbstractBeforeAfterRule$1.evaluate(AbstractBeforeAfterRule.java:46)
	at com.carrotsearch.randomizedtesting.rules.StatementAdapter.evaluate(StatementAdapter.java:36)
	at org.apache.lucene.util.TestRuleStoreClassName$1.evaluate(TestRuleStoreClassName.java:42)
	at com.carrotsearch.randomizedtesting.rules.NoShadowingOrOverridesOnMethodsRule$1.evaluate(NoShadowingOrOverridesOnMethodsRule.java:39)
	at com.carrotsearch.randomizedtesting.rules.NoShadowingOrOverridesOnMethodsRule$1.evaluate(NoShadowingOrOverridesOnMethodsRule.java:39)
	at com.carrotsearch.randomizedtesting.rules.StatementAdapter.evaluate(StatementAdapter.java:36)
	at com.carrotsearch.randomizedtesting.rules.StatementAdapter.evaluate(StatementAdapter.java:36)
	at com.carrotsearch.randomizedtesting.rules.StatementAdapter.evaluate(StatementAdapter.java:36)
	at org.apache.lucene.util.TestRuleAssertionsRequired$1.evaluate(TestRuleAssertionsRequired.java:54)
	at org.apache.lucene.util.TestRuleMarkFailure$1.evaluate(TestRuleMarkFailure.java:48)
	at org.apache.lucene.util.TestRuleIgnoreAfterMaxFailures$1.evaluate(TestRuleIgnoreAfterMaxFailures.java:65)
	at org.apache.lucene.util.TestRuleIgnoreTestSuites$1.evaluate(TestRuleIgnoreTestSuites.java:55)
	at com.carrotsearch.randomizedtesting.rules.StatementAdapter.evaluate(StatementAdapter.java:36)
	at com.carrotsearch.randomizedtesting.ThreadLeakControl$StatementRunner.run(ThreadLeakControl.java:365)
	at java.lang.Thread.run(Thread.java:745)




Build Log:
[...truncated 11466 lines...]
   [junit4] Suite: org.apache.solr.client.solrj.impl.CloudSolrClientTest
   [junit4]   2> Creating dataDir: /home/jenkins/workspace/Lucene-Solr-trunk-Linux/solr/build/solr-solrj/test/J1/temp/solr.client.solrj.impl.CloudSolrClientTest_D1A4036987FD3D7A-001/init-core-data-001
   [junit4]   2> 46425 INFO  (SUITE-CloudSolrClientTest-seed#[D1A4036987FD3D7A]-worker) [    ] o.a.s.SolrTestCaseJ4 Randomized ssl (false) and clientAuth (false)
   [junit4]   2> 46425 INFO  (SUITE-CloudSolrClientTest-seed#[D1A4036987FD3D7A]-worker) [    ] o.a.s.BaseDistributedSearchTestCase Setting hostContext system property: /gx/
   [junit4]   2> 46427 WARN  (SUITE-CloudSolrClientTest-seed#[D1A4036987FD3D7A]-worker) [    ] o.a.s.c.AbstractZkTestCase TEST_HOME() does not exist - solrj test?
   [junit4]   2> 46433 INFO  (TEST-CloudSolrClientTest.test-seed#[D1A4036987FD3D7A]) [    ] o.a.s.c.ZkTestServer STARTING ZK TEST SERVER
   [junit4]   2> 46434 INFO  (Thread-94) [    ] o.a.s.c.ZkTestServer client port:0.0.0.0/0.0.0.0:0
   [junit4]   2> 46434 INFO  (Thread-94) [    ] o.a.s.c.ZkTestServer Starting server
   [junit4]   2> 46534 INFO  (TEST-CloudSolrClientTest.test-seed#[D1A4036987FD3D7A]) [    ] o.a.s.c.ZkTestServer start zk server on port:41425
   [junit4]   2> 46534 INFO  (TEST-CloudSolrClientTest.test-seed#[D1A4036987FD3D7A]) [    ] o.a.s.c.c.SolrZkClient Using default ZkCredentialsProvider
   [junit4]   2> 46535 INFO  (TEST-CloudSolrClientTest.test-seed#[D1A4036987FD3D7A]) [    ] o.a.s.c.c.ConnectionManager Waiting for client to connect to ZooKeeper
   [junit4]   2> 46537 INFO  (zkCallback-33-thread-1) [    ] o.a.s.c.c.ConnectionManager Watcher org.apache.solr.common.cloud.ConnectionManager@474901 name:ZooKeeperConnection Watcher:127.0.0.1:41425 got event WatchedEvent state:SyncConnected type:None path:null path:null type:None
   [junit4]   2> 46538 INFO  (TEST-CloudSolrClientTest.test-seed#[D1A4036987FD3D7A]) [    ] o.a.s.c.c.ConnectionManager Client is connected to ZooKeeper
   [junit4]   2> 46538 INFO  (TEST-CloudSolrClientTest.test-seed#[D1A4036987FD3D7A]) [    ] o.a.s.c.c.SolrZkClient Using default ZkACLProvider
   [junit4]   2> 46538 INFO  (TEST-CloudSolrClientTest.test-seed#[D1A4036987FD3D7A]) [    ] o.a.s.c.c.SolrZkClient makePath: /solr
   [junit4]   2> 46540 INFO  (TEST-CloudSolrClientTest.test-seed#[D1A4036987FD3D7A]) [    ] o.a.s.c.c.SolrZkClient Using default ZkCredentialsProvider
   [junit4]   2> 46541 INFO  (TEST-CloudSolrClientTest.test-seed#[D1A4036987FD3D7A]) [    ] o.a.s.c.c.ConnectionManager Waiting for client to connect to ZooKeeper
   [junit4]   2> 46542 INFO  (zkCallback-34-thread-1) [    ] o.a.s.c.c.ConnectionManager Watcher org.apache.solr.common.cloud.ConnectionManager@bef6c name:ZooKeeperConnection Watcher:127.0.0.1:41425/solr got event WatchedEvent state:SyncConnected type:None path:null path:null type:None
   [junit4]   2> 46542 INFO  (TEST-CloudSolrClientTest.test-seed#[D1A4036987FD3D7A]) [    ] o.a.s.c.c.ConnectionManager Client is connected to ZooKeeper
   [junit4]   2> 46543 INFO  (TEST-CloudSolrClientTest.test-seed#[D1A4036987FD3D7A]) [    ] o.a.s.c.c.SolrZkClient Using default ZkACLProvider
   [junit4]   2> 46543 INFO  (TEST-CloudSolrClientTest.test-seed#[D1A4036987FD3D7A]) [    ] o.a.s.c.c.SolrZkClient makePath: /collections/collection1
   [junit4]   2> 46545 INFO  (TEST-CloudSolrClientTest.test-seed#[D1A4036987FD3D7A]) [    ] o.a.s.c.c.SolrZkClient makePath: /collections/collection1/shards
   [junit4]   2> 46547 INFO  (TEST-CloudSolrClientTest.test-seed#[D1A4036987FD3D7A]) [    ] o.a.s.c.c.SolrZkClient makePath: /collections/control_collection
   [junit4]   2> 46548 INFO  (TEST-CloudSolrClientTest.test-seed#[D1A4036987FD3D7A]) [    ] o.a.s.c.c.SolrZkClient makePath: /collections/control_collection/shards
   [junit4]   2> 46550 INFO  (TEST-CloudSolrClientTest.test-seed#[D1A4036987FD3D7A]) [    ] o.a.s.c.AbstractZkTestCase put /home/jenkins/workspace/Lucene-Solr-trunk-Linux/solr/solrj/src/test-files/solrj/solr/collection1/conf/solrconfig.xml to /configs/conf1/solrconfig.xml
   [junit4]   2> 46551 INFO  (TEST-CloudSolrClientTest.test-seed#[D1A4036987FD3D7A]) [    ] o.a.s.c.c.SolrZkClient makePath: /configs/conf1/solrconfig.xml
   [junit4]   2> 46553 INFO  (TEST-CloudSolrClientTest.test-seed#[D1A4036987FD3D7A]) [    ] o.a.s.c.AbstractZkTestCase put /home/jenkins/workspace/Lucene-Solr-trunk-Linux/solr/solrj/src/test-files/solrj/solr/collection1/conf/schema.xml to /configs/conf1/schema.xml
   [junit4]   2> 46554 INFO  (TEST-CloudSolrClientTest.test-seed#[D1A4036987FD3D7A]) [    ] o.a.s.c.c.SolrZkClient makePath: /configs/conf1/schema.xml
   [junit4]   2> 46555 INFO  (TEST-CloudSolrClientTest.test-seed#[D1A4036987FD3D7A]) [    ] o.a.s.c.AbstractZkTestCase skipping /home/jenkins/workspace/Lucene-Solr-trunk-Linux/solr/solrj/src/test-files/solrj/solr/collection1/conf/solrconfig.snippet.randomindexconfig.xml because it doesn't exist
   [junit4]   2> 46556 INFO  (TEST-CloudSolrClientTest.test-seed#[D1A4036987FD3D7A]) [    ] o.a.s.c.AbstractZkTestCase skipping /home/jenkins/workspace/Lucene-Solr-trunk-Linux/solr/solrj/src/test-files/solrj/solr/collection1/conf/stopwords.txt because it doesn't exist
   [junit4]   2> 46556 INFO  (TEST-CloudSolrClientTest.test-seed#[D1A4036987FD3D7A]) [    ] o.a.s.c.AbstractZkTestCase skipping /home/jenkins/workspace/Lucene-Solr-trunk-Linux/solr/solrj/src/test-files/solrj/solr/collection1/conf/protwords.txt because it doesn't exist
   [junit4]   2> 46556 INFO  (TEST-CloudSolrClientTest.test-seed#[D1A4036987FD3D7A]) [    ] o.a.s.c.AbstractZkTestCase skipping /home/jenkins/workspace/Lucene-Solr-trunk-Linux/solr/solrj/src/test-files/solrj/solr/collection1/conf/currency.xml because it doesn't exist
   [junit4]   2> 46556 INFO  (TEST-CloudSolrClientTest.test-seed#[D1A4036987FD3D7A]) [    ] o.a.s.c.AbstractZkTestCase skipping /home/jenkins/workspace/Lucene-Solr-trunk-Linux/solr/solrj/src/test-files/solrj/solr/collection1/conf/enumsConfig.xml because it doesn't exist
   [junit4]   2> 46556 INFO  (TEST-CloudSolrClientTest.test-seed#[D1A4036987FD3D7A]) [    ] o.a.s.c.AbstractZkTestCase skipping /home/jenkins/workspace/Lucene-Solr-trunk-Linux/solr/solrj/src/test-files/solrj/solr/collection1/conf/open-exchange-rates.json because it doesn't exist
   [junit4]   2> 46557 INFO  (TEST-CloudSolrClientTest.test-seed#[D1A4036987FD3D7A]) [    ] o.a.s.c.AbstractZkTestCase skipping /home/jenkins/workspace/Lucene-Solr-trunk-Linux/solr/solrj/src/test-files/solrj/solr/collection1/conf/mapping-ISOLatin1Accent.txt because it doesn't exist
   [junit4]   2> 46557 INFO  (TEST-CloudSolrClientTest.test-seed#[D1A4036987FD3D7A]) [    ] o.a.s.c.AbstractZkTestCase skipping /home/jenkins/workspace/Lucene-Solr-trunk-Linux/solr/solrj/src/test-files/solrj/solr/collection1/conf/old_synonyms.txt because it doesn't exist
   [junit4]   2> 46557 INFO  (TEST-CloudSolrClientTest.test-seed#[D1A4036987FD3D7A]) [    ] o.a.s.c.AbstractZkTestCase skipping /home/jenkins/workspace/Lucene-Solr-trunk-Linux/solr/solrj/src/test-files/solrj/solr/collection1/conf/synonyms.txt because it doesn't exist
   [junit4]   2> 46571 INFO  (TEST-CloudSolrClientTest.test-seed#[D1A4036987FD3D7A]) [    ] o.a.s.SolrTestCaseJ4 Writing core.properties file to /home/jenkins/workspace/Lucene-Solr-trunk-Linux/solr/build/solr-solrj/test/J1/temp/solr.client.solrj.impl.CloudSolrClientTest_D1A4036987FD3D7A-001/control-001/cores/collection1
   [junit4]   2> 46573 INFO  (TEST-CloudSolrClientTest.test-seed#[D1A4036987FD3D7A]) [    ] o.e.j.s.Server jetty-9.2.13.v20150730
   [junit4]   2> 46574 INFO  (TEST-CloudSolrClientTest.test-seed#[D1A4036987FD3D7A]) [    ] o.e.j.s.h.ContextHandler Started o.e.j.s.ServletContextHandler@70ac41{/gx,null,AVAILABLE}
   [junit4]   2> 46577 INFO  (TEST-CloudSolrClientTest.test-seed#[D1A4036987FD3D7A]) [    ] o.e.j.s.ServerConnector Started ServerConnector@8173f{HTTP/1.1}{127.0.0.1:53130}
   [junit4]   2> 46577 INFO  (TEST-CloudSolrClientTest.test-seed#[D1A4036987FD3D7A]) [    ] o.e.j.s.Server Started @48048ms
   [junit4]   2> 46577 INFO  (TEST-CloudSolrClientTest.test-seed#[D1A4036987FD3D7A]) [    ] o.a.s.c.s.e.JettySolrRunner Jetty properties: {solr.data.dir=/home/jenkins/workspace/Lucene-Solr-trunk-Linux/solr/build/solr-solrj/test/J1/temp/solr.client.solrj.impl.CloudSolrClientTest_D1A4036987FD3D7A-001/tempDir-001/control/data, hostContext=/gx, hostPort=53130, coreRootDirectory=/home/jenkins/workspace/Lucene-Solr-trunk-Linux/solr/build/solr-solrj/test/J1/../../../../../../../../../home/jenkins/workspace/Lucene-Solr-trunk-Linux/solr/build/solr-solrj/test/J1/temp/solr.client.solrj.impl.CloudSolrClientTest_D1A4036987FD3D7A-001/control-001/cores}
   [junit4]   2> 46578 INFO  (TEST-CloudSolrClientTest.test-seed#[D1A4036987FD3D7A]) [    ] o.a.s.s.SolrDispatchFilter SolrDispatchFilter.init(): sun.misc.Launcher$AppClassLoader@19e0bfd
   [junit4]   2> 46578 INFO  (TEST-CloudSolrClientTest.test-seed#[D1A4036987FD3D7A]) [    ] o.a.s.c.SolrResourceLoader new SolrResourceLoader for directory: '/home/jenkins/workspace/Lucene-Solr-trunk-Linux/solr/build/solr-solrj/test/J1/../../../../../../../../../home/jenkins/workspace/Lucene-Solr-trunk-Linux/solr/build/solr-solrj/test/J1/temp/solr.client.solrj.impl.CloudSolrClientTest_D1A4036987FD3D7A-001/control-001/'
   [junit4]   2> 46602 INFO  (TEST-CloudSolrClientTest.test-seed#[D1A4036987FD3D7A]) [    ] o.a.s.c.c.SolrZkClient Using default ZkCredentialsProvider
   [junit4]   2> 46603 INFO  (TEST-CloudSolrClientTest.test-seed#[D1A4036987FD3D7A]) [    ] o.a.s.c.c.ConnectionManager Waiting for client to connect to ZooKeeper
   [junit4]   2> 46605 INFO  (zkCallback-35-thread-1) [    ] o.a.s.c.c.ConnectionManager Watcher org.apache.solr.common.cloud.ConnectionManager@b6580b name:ZooKeeperConnection Watcher:127.0.0.1:41425/solr got event WatchedEvent state:SyncConnected type:None path:null path:null type:None
   [junit4]   2> 46605 INFO  (TEST-CloudSolrClientTest.test-seed#[D1A4036987FD3D7A]) [    ] o.a.s.c.c.ConnectionManager Client is connected to ZooKeeper
   [junit4]   2> 46605 INFO  (TEST-CloudSolrClientTest.test-seed#[D1A4036987FD3D7A]) [    ] o.a.s.c.c.SolrZkClient Using default ZkACLProvider
   [junit4]   2> 46607 INFO  (TEST-CloudSolrClientTest.test-seed#[D1A4036987FD3D7A]) [    ] o.a.s.s.SolrDispatchFilter Loading solr.xml from SolrHome (not found in ZooKeeper)
   [junit4]   2> 46607 INFO  (TEST-CloudSolrClientTest.test-seed#[D1A4036987FD3D7A]) [    ] o.a.s.c.SolrXmlConfig Loading container configuration from /home/jenkins/workspace/Lucene-Solr-trunk-Linux/solr/build/solr-solrj/test/J1/../../../../../../../../../home/jenkins/workspace/Lucene-Solr-trunk-Linux/solr/build/solr-solrj/test/J1/temp/solr.client.solrj.impl.CloudSolrClientTest_D1A4036987FD3D7A-001/control-001/solr.xml
   [junit4]   2> 46653 INFO  (TEST-CloudSolrClientTest.test-seed#[D1A4036987FD3D7A]) [    ] o.a.s.c.CoresLocator Config-defined core root directory: /home/jenkins/workspace/Lucene-Solr-trunk-Linux/solr/build/solr-solrj/test/J1/../../../../../../../../../home/jenkins/workspace/Lucene-Solr-trunk-Linux/solr/build/solr-solrj/test/J1/temp/solr.client.solrj.impl.CloudSolrClientTest_D1A4036987FD3D7A-001/control-001/cores
   [junit4]   2> 46653 INFO  (TEST-CloudSolrClientTest.test-seed#[D1A4036987FD3D7A]) [    ] o.a.s.c.CoreContainer New CoreContainer 13024668
   [junit4]   2> 46654 INFO  (TEST-CloudSolrClientTest.test-seed#[D1A4036987FD3D7A]) [    ] o.a.s.c.CoreContainer Loading cores into CoreContainer [instanceDir=/home/jenkins/workspace/Lucene-Solr-trunk-Linux/solr/build/solr-solrj/test/J1/../../../../../../../../../home/jenkins/workspace/Lucene-Solr-trunk-Linux/solr/build/solr-solrj/test/J1/temp/solr.client.solrj.impl.CloudSolrClientTest_D1A4036987FD3D7A-001/control-001/]
   [junit4]   2> 46654 INFO  (TEST-CloudSolrClientTest.test-seed#[D1A4036987FD3D7A]) [    ] o.a.s.c.CoreContainer loading shared library: /home/jenkins/workspace/Lucene-Solr-trunk-Linux/solr/build/solr-solrj/test/J1/../../../../../../../../../home/jenkins/workspace/Lucene-Solr-trunk-Linux/solr/build/solr-solrj/test/J1/temp/solr.client.solrj.impl.CloudSolrClientTest_D1A4036987FD3D7A-001/control-001/lib
   [junit4]   2> 46654 WARN  (TEST-CloudSolrClientTest.test-seed#[D1A4036987FD3D7A]) [    ] o.a.s.c.SolrResourceLoader Can't find (or read) directory to add to classloader: lib (resolved as: /home/jenkins/workspace/Lucene-Solr-trunk-Linux/solr/build/solr-solrj/test/J1/../../../../../../../../../home/jenkins/workspace/Lucene-Solr-trunk-Linux/solr/build/solr-solrj/test/J1/temp/solr.client.solrj.impl.CloudSolrClientTest_D1A4036987FD3D7A-001/control-001/lib).
   [junit4]   2> 46662 INFO  (TEST-CloudSolrClientTest.test-seed#[D1A4036987FD3D7A]) [    ] o.a.s.h.c.HttpShardHandlerFactory created with socketTimeout : 90000,urlScheme : ,connTimeout : 15000,maxConnectionsPerHost : 20,maxConnections : 10000,corePoolSize : 0,maximumPoolSize : 2147483647,maxThreadIdleTime : 5,sizeOfQueue : -1,fairnessPolicy : false,useRetries : false,
   [junit4]   2> 46663 INFO  (TEST-CloudSolrClientTest.test-seed#[D1A4036987FD3D7A]) [    ] o.a.s.u.UpdateShardHandler Creating UpdateShardHandler HTTP client with params: socketTimeout=340000&connTimeout=45000&retry=true
   [junit4]   2> 46663 INFO  (TEST-CloudSolrClientTest.test-seed#[D1A4036987FD3D7A]) [    ] o.a.s.l.LogWatcher SLF4J impl is org.slf4j.impl.Log4jLoggerFactory
   [junit4]   2> 46663 INFO  (TEST-CloudSolrClientTest.test-seed#[D1A4036987FD3D7A]) [    ] o.a.s.l.LogWatcher Registering Log Listener [Log4j (org.slf4j.impl.Log4jLoggerFactory)]
   [junit4]   2> 46664 INFO  (TEST-CloudSolrClientTest.test-seed#[D1A4036987FD3D7A]) [    ] o.a.s.c.ZkContainer Zookeeper client=127.0.0.1:41425/solr
   [junit4]   2> 46664 INFO  (TEST-CloudSolrClientTest.test-seed#[D1A4036987FD3D7A]) [    ] o.a.s.c.ZkController zkHost includes chroot
   [junit4]   2> 46664 INFO  (TEST-CloudSolrClientTest.test-seed#[D1A4036987FD3D7A]) [    ] o.a.s.c.c.SolrZkClient Using default ZkCredentialsProvider
   [junit4]   2> 46664 INFO  (TEST-CloudSolrClientTest.test-seed#[D1A4036987FD3D7A]) [    ] o.a.s.c.c.ConnectionManager Waiting for client to connect to ZooKeeper
   [junit4]   2> 46666 INFO  (zkCallback-37-thread-1) [    ] o.a.s.c.c.ConnectionManager Watcher org.apache.solr.common.cloud.ConnectionManager@13122f0 name:ZooKeeperConnection Watcher:127.0.0.1:41425 got event WatchedEvent state:SyncConnected type:None path:null path:null type:None
   [junit4]   2> 46667 INFO  (TEST-CloudSolrClientTest.test-seed#[D1A4036987FD3D7A]) [    ] o.a.s.c.c.ConnectionManager Client is connected to ZooKeeper
   [junit4]   2> 46667 INFO  (TEST-CloudSolrClientTest.test-seed#[D1A4036987FD3D7A]) [    ] o.a.s.c.c.SolrZkClient Using default ZkACLProvider
   [junit4]   2> 46669 INFO  (TEST-CloudSolrClientTest.test-seed#[D1A4036987FD3D7A]) [n:127.0.0.1:53130_gx    ] o.a.s.c.c.ConnectionManager Waiting for client to connect to ZooKeeper
   [junit4]   2> 46670 INFO  (zkCallback-38-thread-1-processing-n:127.0.0.1:53130_gx) [n:127.0.0.1:53130_gx    ] o.a.s.c.c.ConnectionManager Watcher org.apache.solr.common.cloud.ConnectionManager@1e3ed4d name:ZooKeeperConnection Watcher:127.0.0.1:41425/solr got event WatchedEvent state:SyncConnected type:None path:null path:null type:None
   [junit4]   2> 46670 INFO  (TEST-CloudSolrClientTest.test-seed#[D1A4036987FD3D7A]) [n:127.0.0.1:53130_gx    ] o.a.s.c.c.ConnectionManager Client is connected to ZooKeeper
   [junit4]   2> 46672 INFO  (TEST-CloudSolrClientTest.test-seed#[D1A4036987FD3D7A]) [n:127.0.0.1:53130_gx    ] o.a.s.c.c.SolrZkClient makePath: /overseer/queue
   [junit4]   2> 46675 INFO  (TEST-CloudSolrClientTest.test-seed#[D1A4036987FD3D7A]) [n:127.0.0.1:53130_gx    ] o.a.s.c.c.SolrZkClient makePath: /overseer/collection-queue-work
   [junit4]   2> 46678 INFO  (TEST-CloudSolrClientTest.test-seed#[D1A4036987FD3D7A]) [n:127.0.0.1:53130_gx    ] o.a.s.c.c.SolrZkClient makePath: /overseer/collection-map-running
   [junit4]   2> 46681 INFO  (TEST-CloudSolrClientTest.test-seed#[D1A4036987FD3D7A]) [n:127.0.0.1:53130_gx    ] o.a.s.c.c.SolrZkClient makePath: /overseer/collection-map-completed
   [junit4]   2> 46683 INFO  (TEST-CloudSolrClientTest.test-seed#[D1A4036987FD3D7A]) [n:127.0.0.1:53130_gx    ] o.a.s.c.c.SolrZkClient makePath: /overseer/collection-map-failure
   [junit4]   2> 46686 INFO  (TEST-CloudSolrClientTest.test-seed#[D1A4036987FD3D7A]) [n:127.0.0.1:53130_gx    ] o.a.s.c.c.SolrZkClient makePath: /live_nodes
   [junit4]   2> 46689 INFO  (TEST-CloudSolrClientTest.test-seed#[D1A4036987FD3D7A]) [n:127.0.0.1:53130_gx    ] o.a.s.c.c.SolrZkClient makePath: /aliases.json
   [junit4]   2> 46690 INFO  (TEST-CloudSolrClientTest.test-seed#[D1A4036987FD3D7A]) [n:127.0.0.1:53130_gx    ] o.a.s.c.c.SolrZkClient makePath: /clusterstate.json
   [junit4]   2> 46692 INFO  (TEST-CloudSolrClientTest.test-seed#[D1A4036987FD3D7A]) [n:127.0.0.1:53130_gx    ] o.a.s.c.c.SolrZkClient makePath: /security.json
   [junit4]   2> 46694 INFO  (TEST-CloudSolrClientTest.test-seed#[D1A4036987FD3D7A]) [n:127.0.0.1:53130_gx    ] o.a.s.c.ZkController Register node as live in ZooKeeper:/live_nodes/127.0.0.1:53130_gx
   [junit4]   2> 46694 INFO  (TEST-CloudSolrClientTest.test-seed#[D1A4036987FD3D7A]) [n:127.0.0.1:53130_gx    ] o.a.s.c.c.SolrZkClient makePath: /live_nodes/127.0.0.1:53130_gx
   [junit4]   2> 46697 INFO  (TEST-CloudSolrClientTest.test-seed#[D1A4036987FD3D7A]) [n:127.0.0.1:53130_gx    ] o.a.s.c.c.SolrZkClient makePath: /overseer_elect
   [junit4]   2> 46698 INFO  (TEST-CloudSolrClientTest.test-seed#[D1A4036987FD3D7A]) [n:127.0.0.1:53130_gx    ] o.a.s.c.c.SolrZkClient makePath: /overseer_elect/election
   [junit4]   2> 46700 INFO  (TEST-CloudSolrClientTest.test-seed#[D1A4036987FD3D7A]) [n:127.0.0.1:53130_gx    ] o.a.s.c.Overseer Overseer (id=null) closing
   [junit4]   2> 46701 INFO  (TEST-CloudSolrClientTest.test-seed#[D1A4036987FD3D7A]) [n:127.0.0.1:53130_gx    ] o.a.s.c.LeaderElector Joined leadership election with path: /overseer_elect/election/94372232315076612-127.0.0.1:53130_gx-n_0000000000
   [junit4]   2> 46702 INFO  (TEST-CloudSolrClientTest.test-seed#[D1A4036987FD3D7A]) [n:127.0.0.1:53130_gx    ] o.a.s.c.OverseerElectionContext I am going to be the leader 127.0.0.1:53130_gx
   [junit4]   2> 46702 INFO  (TEST-CloudSolrClientTest.test-seed#[D1A4036987FD3D7A]) [n:127.0.0.1:53130_gx    ] o.a.s.c.c.SolrZkClient makePath: /overseer_elect/leader
   [junit4]   2> 46703 INFO  (TEST-CloudSolrClientTest.test-seed#[D1A4036987FD3D7A]) [n:127.0.0.1:53130_gx    ] o.a.s.c.Overseer Overseer (id=94372232315076612-127.0.0.1:53130_gx-n_0000000000) starting
   [junit4]   2> 46705 INFO  (TEST-CloudSolrClientTest.test-seed#[D1A4036987FD3D7A]) [n:127.0.0.1:53130_gx    ] o.a.s.c.c.SolrZkClient makePath: /overseer/queue-work
   [junit4]   2> 46713 INFO  (TEST-CloudSolrClientTest.test-seed#[D1A4036987FD3D7A]) [n:127.0.0.1:53130_gx    ] o.a.s.c.OverseerAutoReplicaFailoverThread Starting OverseerAutoReplicaFailoverThread autoReplicaFailoverWorkLoopDelay=10000 autoReplicaFailoverWaitAfterExpiration=30000 autoReplicaFailoverBadNodeExpiration=60000
   [junit4]   2> 46714 INFO  (OverseerCollectionProcessor-94372232315076612-127.0.0.1:53130_gx-n_0000000000) [n:127.0.0.1:53130_gx    ] o.a.s.c.OverseerProcessor Process current queue of overseer operations
   [junit4]   2> 46714 INFO  (TEST-CloudSolrClientTest.test-seed#[D1A4036987FD3D7A]) [n:127.0.0.1:53130_gx    ] o.a.s.c.c.ZkStateReader Updating cluster state from ZooKeeper... 
   [junit4]   2> 46714 INFO  (OverseerStateUpdate-94372232315076612-127.0.0.1:53130_gx-n_0000000000) [n:127.0.0.1:53130_gx    ] o.a.s.c.Overseer Starting to work on the main queue
   [junit4]   2> 46777 INFO  (TEST-CloudSolrClientTest.test-seed#[D1A4036987FD3D7A]) [n:127.0.0.1:53130_gx    ] o.a.s.c.CoreContainer Security conf doesn't exist. Skipping setup for authorization module.
   [junit4]   2> 46778 INFO  (TEST-CloudSolrClientTest.test-seed#[D1A4036987FD3D7A]) [n:127.0.0.1:53130_gx    ] o.a.s.c.CoreContainer No authentication plugin used.
   [junit4]   2> 46779 INFO  (TEST-CloudSolrClientTest.test-seed#[D1A4036987FD3D7A]) [n:127.0.0.1:53130_gx    ] o.a.s.c.CoresLocator Looking for core definitions underneath /home/jenkins/workspace/Lucene-Solr-trunk-Linux/solr/build/solr-solrj/test/J1/../../../../../../../../../home/jenkins/workspace/Lucene-Solr-trunk-Linux/solr/build/solr-solrj/test/J1/temp/solr.client.solrj.impl.CloudSolrClientTest_D1A4036987FD3D7A-001/control-001/cores
   [junit4]   2> 46782 INFO  (TEST-CloudSolrClientTest.test-seed#[D1A4036987FD3D7A]) [n:127.0.0.1:53130_gx    ] o.a.s.c.SolrCore Created CoreDescriptor: {name=collection1, config=solrconfig.xml, transient=false, schema=schema.xml, loadOnStartup=true, configSetProperties=configsetprops.json, instanceDir=/home/jenkins/workspace/Lucene-Solr-trunk-Linux/solr/build/solr-solrj/test/J1/../../../../../../../../../home/jenkins/workspace/Lucene-Solr-trunk-Linux/solr/build/solr-solrj/test/J1/temp/solr.client.solrj.impl.CloudSolrClientTest_D1A4036987FD3D7A-001/control-001/cores/collection1, collection=control_collection, absoluteInstDir=/home/jenkins/workspace/Lucene-Solr-trunk-Linux/solr/build/solr-solrj/test/J1/../../../../../../../../../home/jenkins/workspace/Lucene-Solr-trunk-Linux/solr/build/solr-solrj/test/J1/temp/solr.client.solrj.impl.CloudSolrClientTest_D1A4036987FD3D7A-001/control-001/cores/collection1/, coreNodeName=, dataDir=data/, shard=}
   [junit4]   2> 46782 INFO  (TEST-CloudSolrClientTest.test-seed#[D1A4036987FD3D7A]) [n:127.0.0.1:53130_gx    ] o.a.s.c.CoresLocator Found core collection1 in /home/jenkins/workspace/Lucene-Solr-trunk-Linux/solr/build/solr-solrj/test/J1/../../../../../../../../../home/jenkins/workspace/Lucene-Solr-trunk-Linux/solr/build/solr-solrj/test/J1/temp/solr.client.solrj.impl.CloudSolrClientTest_D1A4036987FD3D7A-001/control-001/cores/collection1/
   [junit4]   2> 46782 INFO  (TEST-CloudSolrClientTest.test-seed#[D1A4036987FD3D7A]) [n:127.0.0.1:53130_gx    ] o.a.s.c.CoresLocator Found 1 core definitions
   [junit4]   2> 46784 INFO  (TEST-CloudSolrClientTest.test-seed#[D1A4036987FD3D7A]) [n:127.0.0.1:53130_gx    ] o.a.s.s.SolrDispatchFilter user.dir=/home/jenkins/workspace/Lucene-Solr-trunk-Linux/solr/build/solr-solrj/test/J1
   [junit4]   2> 46784 INFO  (coreLoadExecutor-128-thread-1-processing-n:127.0.0.1:53130_gx) [n:127.0.0.1:53130_gx c:control_collection   x:collection1] o.a.s.c.ZkController publishing state=down
   [junit4]   2> 46784 INFO  (TEST-CloudSolrClientTest.test-seed#[D1A4036987FD3D7A]) [n:127.0.0.1:53130_gx    ] o.a.s.s.SolrDispatchFilter SolrDispatchFilter.init() done
   [junit4]   2> 46785 INFO  (coreLoadExecutor-128-thread-1-processing-n:127.0.0.1:53130_gx) [n:127.0.0.1:53130_gx c:control_collection   x:collection1] o.a.s.c.ZkController numShards not found on descriptor - reading it from system property
   [junit4]   2> 46787 INFO  (zkCallback-38-thread-1-processing-n:127.0.0.1:53130_gx) [n:127.0.0.1:53130_gx    ] o.a.s.c.DistributedQueue NodeChildrenChanged fired on path /overseer/queue state SyncConnected
   [junit4]   2> 46787 INFO  (coreLoadExecutor-128-thread-1-processing-n:127.0.0.1:53130_gx) [n:127.0.0.1:53130_gx c:control_collection   x:collection1] o.a.s.c.ZkController look for our core node name
   [junit4]   2> 46789 INFO  (OverseerStateUpdate-94372232315076612-127.0.0.1:53130_gx-n_0000000000) [n:127.0.0.1:53130_gx    ] o.a.s.c.Overseer processMessage: queueSize: 1, message = {
   [junit4]   2>   "core":"collection1",
   [junit4]   2>   "roles":null,
   [junit4]   2>   "base_url":"http://127.0.0.1:53130/gx",
   [junit4]   2>   "node_name":"127.0.0.1:53130_gx",
   [junit4]   2>   "numShards":"1",
   [junit4]   2>   "state":"down",
   [junit4]   2>   "shard":null,
   [junit4]   2>   "collection":"control_collection",
   [junit4]   2>   "operation":"state"} current state version: 0
   [junit4]   2> 46798 INFO  (OverseerStateUpdate-94372232315076612-127.0.0.1:53130_gx-n_0000000000) [n:127.0.0.1:53130_gx    ] o.a.s.c.o.ReplicaMutator Update state numShards=1 message={
   [junit4]   2>   "core":"collection1",
   [junit4]   2>   "roles":null,
   [junit4]   2>   "base_url":"http://127.0.0.1:53130/gx",
   [junit4]   2>   "node_name":"127.0.0.1:53130_gx",
   [junit4]   2>   "numShards":"1",
   [junit4]   2>   "state":"down",
   [junit4]   2>   "shard":null,
   [junit4]   2>   "collection":"control_collection",
   [junit4]   2>   "operation":"state"}
   [junit4]   2> 46799 INFO  (OverseerStateUpdate-94372232315076612-127.0.0.1:53130_gx-n_0000000000) [n:127.0.0.1:53130_gx    ] o.a.s.c.o.ClusterStateMutator building a new cName: control_collection
   [junit4]   2> 46809 INFO  (OverseerStateUpdate-94372232315076612-127.0.0.1:53130_gx-n_0000000000) [n:127.0.0.1:53130_gx    ] o.a.s.c.o.ReplicaMutator Assigning new node to shard shard=shard1
   [junit4]   2> 46814 INFO  (zkCallback-38-thread-1-processing-n:127.0.0.1:53130_gx) [n:127.0.0.1:53130_gx    ] o.a.s.c.c.ZkStateReader A cluster state change: WatchedEvent state:SyncConnected type:NodeDataChanged path:/clusterstate.json, has occurred - updating... (live nodes size: 1)
   [junit4]   2> 47788 INFO  (coreLoadExecutor-128-thread-1-processing-n:127.0.0.1:53130_gx) [n:127.0.0.1:53130_gx c:control_collection   x:collection1] o.a.s.c.ZkController waiting to find shard id in clusterstate for collection1
   [junit4]   2> 47789 INFO  (coreLoadExecutor-128-thread-1-processing-n:127.0.0.1:53130_gx) [n:127.0.0.1:53130_gx c:control_collection   x:collection1] o.a.s.c.ZkController Check for collection zkNode:control_collection
   [junit4]   2> 47790 INFO  (coreLoadExecutor-128-thread-1-processing-n:127.0.0.1:53130_gx) [n:127.0.0.1:53130_gx c:control_collection   x:collection1] o.a.s.c.ZkController Collection zkNode exists
   [junit4]   2> 47790 INFO  (coreLoadExecutor-128-thread-1-processing-n:127.0.0.1:53130_gx) [n:127.0.0.1:53130_gx c:control_collection   x:collection1] o.a.s.c.c.ZkStateReader Load collection config from:/collections/control_collection
   [junit4]   2> 47791 INFO  (coreLoadExecutor-128-thread-1-processing-n:127.0.0.1:53130_gx) [n:127.0.0.1:53130_gx c:control_collection   x:collection1] o.a.s.c.c.ZkStateReader path=/collections/control_collection configName=conf1 specified config exists in ZooKeeper
   [junit4]   2> 47791 INFO  (coreLoadExecutor-128-thread-1-processing-n:127.0.0.1:53130_gx) [n:127.0.0.1:53130_gx c:control_collection   x:collection1] o.a.s.c.SolrResourceLoader new SolrResourceLoader for directory: '/home/jenkins/workspace/Lucene-Solr-trunk-Linux/solr/build/solr-solrj/test/J1/../../../../../../../../../home/jenkins/workspace/Lucene-Solr-trunk-Linux/solr/build/solr-solrj/test/J1/temp/solr.client.solrj.impl.CloudSolrClientTest_D1A4036987FD3D7A-001/control-001/cores/collection1/'
   [junit4]   2> 47823 INFO  (coreLoadExecutor-128-thread-1-processing-n:127.0.0.1:53130_gx) [n:127.0.0.1:53130_gx c:control_collection   x:collection1] o.a.s.c.Config loaded config solrconfig.xml with version 0 
   [junit4]   2> 47832 INFO  (coreLoadExecutor-128-thread-1-processing-n:127.0.0.1:53130_gx) [n:127.0.0.1:53130_gx c:control_collection   x:collection1] o.a.s.c.SolrConfig current version of requestparams : -1
   [junit4]   2> 47848 INFO  (coreLoadExecutor-128-thread-1-processing-n:127.0.0.1:53130_gx) [n:127.0.0.1:53130_gx c:control_collection   x:collection1] o.a.s.c.SolrConfig Using Lucene MatchVersion: 6.0.0
   [junit4]   2> 47873 INFO  (coreLoadExecutor-128-thread-1-processing-n:127.0.0.1:53130_gx) [n:127.0.0.1:53130_gx c:control_collection   x:collection1] o.a.s.c.Config Loaded SolrConfig: solrconfig.xml
   [junit4]   2> 47874 INFO  (coreLoadExecutor-128-thread-1-processing-n:127.0.0.1:53130_gx) [n:127.0.0.1:53130_gx c:control_collection   x:collection1] o.a.s.s.IndexSchema Reading Solr Schema from /configs/conf1/schema.xml
   [junit4]   2> 47928 INFO  (coreLoadExecutor-128-thread-1-processing-n:127.0.0.1:53130_gx) [n:127.0.0.1:53130_gx c:control_collection   x:collection1] o.a.s.s.IndexSchema [collection1] Schema name=test
   [junit4]   2> 48243 INFO  (coreLoadExecutor-128-thread-1-processing-n:127.0.0.1:53130_gx) [n:127.0.0.1:53130_gx c:control_collection   x:collection1] o.a.s.s.IndexSchema default search field in schema is text
   [junit4]   2> 48246 INFO  (coreLoadExecutor-128-thread-1-processing-n:127.0.0.1:53130_gx) [n:127.0.0.1:53130_gx c:control_collection   x:collection1] o.a.s.s.IndexSchema unique key field: id
   [junit4]   2> 48248 WARN  (coreLoadExecutor-128-thread-1-processing-n:127.0.0.1:53130_gx) [n:127.0.0.1:53130_gx c:control_collection   x:collection1] o.a.s.s.IndexSchema Field lowerfilt1and2 is not multivalued and destination for multiple copyFields (2)
   [junit4]   2> 48249 WARN  (coreLoadExecutor-128-thread-1-processing-n:127.0.0.1:53130_gx) [n:127.0.0.1:53130_gx c:control_collection   x:collection1] o.a.s.s.IndexSchema Field text is not multivalued and destination for multiple copyFields (3)
   [junit4]   2> 48261 INFO  (coreLoadExecutor-128-thread-1-processing-n:127.0.0.1:53130_gx) [n:127.0.0.1:53130_gx c:control_collection   x:collection1] o.a.s.c.ConfigSetProperties Did not find ConfigSet properties, assuming default properties: Can't find resource 'configsetprops.json' in classpath or '/configs/conf1', cwd=/home/jenkins/workspace/Lucene-Solr-trunk-Linux/solr/build/solr-solrj/test/J1
   [junit4]   2> 48262 INFO  (coreLoadExecutor-128-thread-1-processing-n:127.0.0.1:53130_gx) [n:127.0.0.1:53130_gx c:control_collection   x:collection1] o.a.s.c.CoreContainer Creating SolrCore 'collection1' using configuration from collection control_collection
   [junit4]   2> 48262 INFO  (coreLoadExecutor-128-thread-1-processing-n:127.0.0.1:53130_gx) [n:127.0.0.1:53130_gx c:control_collection s:shard1 r:core_node1 x:collection1] o.a.s.c.SolrCore org.apache.solr.core.MockDirectoryFactory
   [junit4]   2> 48263 INFO  (coreLoadExecutor-128-thread-1-processing-n:127.0.0.1:53130_gx) [n:127.0.0.1:53130_gx c:control_collection s:shard1 r:core_node1 x:collection1] o.a.s.c.SolrCore [[collection1] ] Opening new SolrCore at [/home/jenkins/workspace/Lucene-Solr-trunk-Linux/solr/build/solr-solrj/test/J1/../../../../../../../../../home/jenkins/workspace/Lucene-Solr-trunk-Linux/solr/build/solr-solrj/test/J1/temp/solr.client.solrj.impl.CloudSolrClientTest_D1A4036987FD3D7A-001/control-001/cores/collection1/], dataDir=[null]
   [junit4]   2> 48263 INFO  (coreLoadExecutor-128-thread-1-processing-n:127.0.0.1:53130_gx) [n:127.0.0.1:53130_gx c:control_collection s:shard1 r:core_node1 x:collection1] o.a.s.c.SolrCore JMX monitoring not detected for core: collection1
   [junit4]   2> 48264 INFO  (coreLoadExecutor-128-thread-1-processing-n:127.0.0.1:53130_gx) [n:127.0.0.1:53130_gx c:control_collection s:shard1 r:core_node1 x:collection1] o.a.s.c.CachingDirectoryFactory return new directory for /home/jenkins/workspace/Lucene-Solr-trunk-Linux/solr/build/solr-solrj/test/J1/../../../../../../../../../home/jenkins/workspace/Lucene-Solr-trunk-Linux/solr/build/solr-solrj/test/J1/temp/solr.client.solrj.impl.CloudSolrClientTest_D1A4036987FD3D7A-001/control-001/cores/collection1/data
   [junit4]   2> 48264 INFO  (coreLoadExecutor-128-thread-1-processing-n:127.0.0.1:53130_gx) [n:127.0.0.1:53130_gx c:control_collection s:shard1 r:core_node1 x:collection1] o.a.s.c.SolrCore New index directory detected: old=null new=/home/jenkins/workspace/Lucene-Solr-trunk-Linux/solr/build/solr-solrj/test/J1/../../../../../../../../../home/jenkins/workspace/Lucene-Solr-trunk-Linux/solr/build/solr-solrj/test/J1/temp/solr.client.solrj.impl.CloudSolrClientTest_D1A4036987FD3D7A-001/control-001/cores/collection1/data/index/
   [junit4]   2> 48265 WARN  (coreLoadExecutor-128-thread-1-processing-n:127.0.0.1:53130_gx) [n:127.0.0.1:53130_gx c:control_collection s:shard1 r:core_node1 x:collection1] o.a.s.c.SolrCore [collection1] Solr index directory '/home/jenkins/workspace/Lucene-Solr-trunk-Linux/solr/build/solr-solrj/test/J1/../../../../../../../../../home/jenkins/workspace/Lucene-Solr-trunk-Linux/solr/build/solr-solrj/test/J1/temp/solr.client.solrj.impl.CloudSolrClientTest_D1A4036987FD3D7A-001/control-001/cores/collection1/data/index' doesn't exist. Creating new index...
   [junit4]   2> 48265 INFO  (coreLoadExecutor-128-thread-1-processing-n:127.0.0.1:53130_gx) [n:127.0.0.1:53130_gx c:control_collection s:shard1 r:core_node1 x:collection1] o.a.s.c.CachingDirectoryFactory return new directory for /home/jenkins/workspace/Lucene-Solr-trunk-Linux/solr/build/solr-solrj/test/J1/../../../../../../../../../home/jenkins/workspace/Lucene-Solr-trunk-Linux/solr/build/solr-solrj/test/J1/temp/solr.client.solrj.impl.CloudSolrClientTest_D1A4036987FD3D7A-001/control-001/cores/collection1/data/index
   [junit4]   2> 48266 INFO  (coreLoadExecutor-128-thread-1-processing-n:127.0.0.1:53130_gx) [n:127.0.0.1:53130_gx c:control_collection s:shard1 r:core_node1 x:collection1] o.a.s.c.SolrCore SolrDeletionPolicy.onCommit: commits: num=1
   [junit4]   2> 	commit{dir=MockDirectoryWrapper(RAMDirectory@1571498 lockFactory=org.apache.lucene.store.SingleInstanceLockFactory@3fc03f),segFN=segments_1,generation=1}
   [junit4]   2> 48266 INFO  (coreLoadExecutor-128-thread-1-processing-n:127.0.0.1:53130_gx) [n:127.0.0.1:53130_gx c:control_collection s:shard1 r:core_node1 x:collection1] o.a.s.c.SolrCore newest commit generation = 1
   [junit4]   2> 48267 INFO  (OldIndexDirectoryCleanupThreadForCore-collection1) [n:127.0.0.1:53130_gx c:control_collection s:shard1 r:core_node1 x:collection1] o.a.s.c.SolrCore Looking for old index directories to cleanup for core collection1 in /home/jenkins/workspace/Lucene-Solr-trunk-Linux/solr/build/solr-solrj/test/J1/../../../../../../../../../home/jenkins/workspace/Lucene-Solr-trunk-Linux/solr/build/solr-solrj/test/J1/temp/solr.client.solrj.impl.CloudSolrClientTest_D1A4036987FD3D7A-001/control-001/cores/collection1/data/
   [junit4]   2> 48267 WARN  (OldIndexDirectoryCleanupThreadForCore-collection1) [n:127.0.0.1:53130_gx c:control_collection s:shard1 r:core_node1 x:collection1] o.a.s.c.DirectoryFactory /home/jenkins/workspace/Lucene-Solr-trunk-Linux/solr/build/solr-solrj/test/J1/../../../../../../../../../home/jenkins/workspace/Lucene-Solr-trunk-Linux/solr/build/solr-solrj/test/J1/temp/solr.client.solrj.impl.CloudSolrClientTest_D1A4036987FD3D7A-001/control-001/cores/collection1/data/ does not point to a valid data directory; skipping clean-up of old index directories.
   [junit4]   2> 48271 INFO  (coreLoadExecutor-128-thread-1-processing-n:127.0.0.1:53130_gx) [n:127.0.0.1:53130_gx c:control_collection s:shard1 r:core_node1 x:collection1] o.a.s.c.SolrCore no updateRequestProcessorChain defined as default, creating implicit default
   [junit4]   2> 48273 INFO  (coreLoadExecutor-128-thread-1-processing-n:127.0.0.1:53130_gx) [n:127.0.0.1:53130_gx c:control_collection s:shard1 r:core_node1 x:collection1] o.a.s.h.l.XMLLoader xsltCacheLifetimeSeconds=60
   [junit4]   2> 48274 INFO  (coreLoadExecutor-128-thread-1-processing-n:127.0.0.1:53130_gx) [n:127.0.0.1:53130_gx c:control_collection s:shard1 r:core_node1 x:collection1] o.a.s.h.l.XMLLoader xsltCacheLifetimeSeconds=60
   [junit4]   2> 48275 INFO  (coreLoadExecutor-128-thread-1-processing-n:127.0.0.1:53130_gx) [n:127.0.0.1:53130_gx c:control_collection s:shard1 r:core_node1 x:collection1] o.a.s.h.l.XMLLoader xsltCacheLifetimeSeconds=60
   [junit4]   2> 48276 INFO  (coreLoadExecutor-128-thread-1-processing-n:127.0.0.1:53130_gx) [n:127.0.0.1:53130_gx c:control_collection s:shard1 r:core_node1 x:collection1] o.a.s.h.l.XMLLoader xsltCacheLifetimeSeconds=60
   [junit4]   2> 48280 INFO  (coreLoadExecutor-128-thread-1-processing-n:127.0.0.1:53130_gx) [n:127.0.0.1:53130_gx c:control_collection s:shard1 r:core_node1 x:collection1] o.a.s.c.RequestHandlers Registered paths: /admin/mbeans,standard,,/update/csv,/update/json/docs,/admin/luke,/admin/segments,/get,/admin/system,/replication,/admin/properties,/config,/schema,/admin/plugins,/admin/logging,/update/json,/admin/threads,/admin/ping,/update,/admin/file
   [junit4]   2> 48281 WARN  (coreLoadExecutor-128-thread-1-processing-n:127.0.0.1:53130_gx) [n:127.0.0.1:53130_gx c:control_collection s:shard1 r:core_node1 x:collection1] o.a.s.c.RequestHandlers no default request handler is registered (either '/select' or 'standard')
   [junit4]   2> 48284 INFO  (coreLoadExecutor-128-thread-1-processing-n:127.0.0.1:53130_gx) [n:127.0.0.1:53130_gx c:control_collection s:shard1 r:core_node1 x:collection1] o.a.s.c.SolrCore Using default statsCache cache: org.apache.solr.search.stats.LocalStatsCache
   [junit4]   2> 48285 INFO  (coreLoadExecutor-128-thread-1-processing-n:127.0.0.1:53130_gx) [n:127.0.0.1:53130_gx c:control_collection s:shard1 r:core_node1 x:collection1] o.a.s.u.UpdateHandler Using UpdateLog implementation: org.apache.solr.update.UpdateLog
   [junit4]   2> 48285 INFO  (coreLoadExecutor-128-thread-1-processing-n:127.0.0.1:53130_gx) [n:127.0.0.1:53130_gx c:control_collection s:shard1 r:core_node1 x:collection1] o.a.s.u.UpdateLog Initializing UpdateLog: dataDir= defaultSyncLevel=FLUSH numRecordsToKeep=100 maxNumLogsToKeep=10 numVersionBuckets=65536
   [junit4]   2> 48287 INFO  (coreLoadExecutor-128-thread-1-processing-n:127.0.0.1:53130_gx) [n:127.0.0.1:53130_gx c:control_collection s:shard1 r:core_node1 x:collection1] o.a.s.c.SolrCore Hard AutoCommit: disabled
   [junit4]   2> 48287 INFO  (coreLoadExecutor-128-thread-1-processing-n:127.0.0.1:53130_gx) [n:127.0.0.1:53130_gx c:control_collection s:shard1 r:core_node1 x:collection1] o.a.s.c.SolrCore Soft AutoCommit: disabled
   [junit4]   2> 48288 INFO  (coreLoadExecutor-128-thread-1-processing-n:127.0.0.1:53130_gx) [n:127.0.0.1:53130_gx c:control_collection s:shard1 r:core_node1 x:collection1] o.a.s.c.SolrCore SolrDeletionPolicy.onInit: commits: num=1
   [junit4]   2> 	commit{dir=MockDirectoryWrapper(RAMDirectory@1571498 lockFactory=org.apache.lucene.store.SingleInstanceLockFactory@3fc03f),segFN=segments_1,generation=1}
   [junit4]   2> 48288 INFO  (coreLoadExecutor-128-thread-1-processing-n:127.0.0.1:53130_gx) [n:127.0.0.1:53130_gx c:control_collection s:shard1 r:core_node1 x:collection1] o.a.s.c.SolrCore newest commit generation = 1
   [junit4]   2> 48288 INFO  (coreLoadExecutor-128-thread-1-processing-n:127.0.0.1:53130_gx) [n:127.0.0.1:53130_gx c:control_collection s:shard1 r:core_node1 x:collection1] o.a.s.s.SolrIndexSearcher Opening Searcher@1b1b7ec[collection1] main
   [junit4]   2> 48289 INFO  (coreLoadExecutor-128-thread-1-processing-n:127.0.0.1:53130_gx) [n:127.0.0.1:53130_gx c:control_collection s:shard1 r:core_node1 x:collection1] o.a.s.c.c.ZkStateReader Load collection config from:/collections/control_collection
   [junit4]   2> 48290 INFO  (coreLoadExecutor-128-thread-1-processing-n:127.0.0.1:53130_gx) [n:127.0.0.1:53130_gx c:control_collection s:shard1 r:core_node1 x:collection1] o.a.s.c.c.ZkStateReader path=/collections/control_collection configName=conf1 specified config exists in ZooKeeper
   [junit4]   2> 48290 INFO  (coreLoadExecutor-128-thread-1-processing-n:127.0.0.1:53130_gx) [n:127.0.0.1:53130_gx c:control_collection s:shard1 r:core_node1 x:collection1] o.a.s.r.ManagedResourceStorage Setting up ZooKeeper-based storage for the RestManager with znodeBase: /configs/conf1
   [junit4]   2> 48292 INFO  (coreLoadExecutor-128-thread-1-processing-n:127.0.0.1:53130_gx) [n:127.0.0.1:53130_gx c:control_collection s:shard1 r:core_node1 x:collection1] o.a.s.r.ManagedResourceStorage Configured ZooKeeperStorageIO with znodeBase: /configs/conf1
   [junit4]   2> 48292 INFO  (coreLoadExecutor-128-thread-1-processing-n:127.0.0.1:53130_gx) [n:127.0.0.1:53130_gx c:control_collection s:shard1 r:core_node1 x:collection1] o.a.s.r.RestManager Initializing RestManager with initArgs: {}
   [junit4]   2> 48293 INFO  (coreLoadExecutor-128-thread-1-processing-n:127.0.0.1:53130_gx) [n:127.0.0.1:53130_gx c:control_collection s:shard1 r:core_node1 x:collection1] o.a.s.r.ManagedResourceStorage Reading _rest_managed.json using ZooKeeperStorageIO:path=/configs/conf1
   [junit4]   2> 48293 INFO  (coreLoadExecutor-128-thread-1-processing-n:127.0.0.1:53130_gx) [n:127.0.0.1:53130_gx c:control_collection s:shard1 r:core_node1 x:collection1] o.a.s.r.ManagedResourceStorage No data found for znode /configs/conf1/_rest_managed.json
   [junit4]   2> 48293 INFO  (coreLoadExecutor-128-thread-1-processing-n:127.0.0.1:53130_gx) [n:127.0.0.1:53130_gx c:control_collection s:shard1 r:core_node1 x:collection1] o.a.s.r.ManagedResourceStorage Loaded null at path _rest_managed.json using ZooKeeperStorageIO:path=/configs/conf1
   [junit4]   2> 48294 INFO  (coreLoadExecutor-128-thread-1-processing-n:127.0.0.1:53130_gx) [n:127.0.0.1:53130_gx c:control_collection s:shard1 r:core_node1 x:collection1] o.a.s.r.RestManager Initializing 0 registered ManagedResources
   [junit4]   2> 48294 INFO  (coreLoadExecutor-128-thread-1-processing-n:127.0.0.1:53130_gx) [n:127.0.0.1:53130_gx c:control_collection s:shard1 r:core_node1 x:collection1] o.a.s.h.ReplicationHandler Commits will be reserved for  10000
   [junit4]   2> 48294 INFO  (searcherExecutor-129-thread-1-processing-n:127.0.0.1:53130_gx x:collection1 s:shard1 c:control_collection r:core_node1) [n:127.0.0.1:53130_gx c:control_collection s:shard1 r:core_node1 x:collection1] o.a.s.c.SolrCore [collection1] Registered new searcher Searcher@1b1b7ec[collection1] main{ExitableDirectoryReader(UninvertingDirectoryReader())}
   [junit4]   2> 48294 INFO  (coreLoadExecutor-128-thread-1-processing-n:127.0.0.1:53130_gx) [n:127.0.0.1:53130_gx c:control_collection s:shard1 r:core_node1 x:collection1] o.a.s.u.UpdateLog Looking up max value of version field to seed version buckets
   [junit4]   2> 48295 INFO  (coreLoadExecutor-128-thread-1-processing-n:127.0.0.1:53130_gx) [n:127.0.0.1:53130_gx c:control_collection s:shard1 r:core_node1 x:collection1] o.a.s.u.VersionInfo Refreshing highest value of _version_ for 65536 version buckets from index
   [junit4]   2> 48295 INFO  (coreLoadExecutor-128-thread-1-processing-n:127.0.0.1:53130_gx) [n:127.0.0.1:53130_gx c:control_collection s:shard1 r:core_node1 x:collection1] o.a.s.u.VersionInfo No terms found for _version_, cannot seed version bucket highest value from index
   [junit4]   2> 48295 INFO  (coreLoadExecutor-128-thread-1-processing-n:127.0.0.1:53130_gx) [n:127.0.0.1:53130_gx c:control_collection s:shard1 r:core_node1 x:collection1] o.a.s.u.UpdateLog Could not find max version in index or recent updates, using new clock 1509955718991577088
   [junit4]   2> 48298 INFO  (coreLoadExecutor-128-thread-1-processing-n:127.0.0.1:53130_gx) [n:127.0.0.1:53130_gx c:control_collection s:shard1 r:core_node1 x:collection1] o.a.s.u.UpdateLog Took 3.0ms to seed version buckets with highest version 1509955718991577088
   [junit4]   2> 48299 INFO  (coreLoadExecutor-128-thread-1-processing-n:127.0.0.1:53130_gx) [n:127.0.0.1:53130_gx c:control_collection s:shard1 r:core_node1 x:collection1] o.a.s.c.ZkController watch zkdir /configs/conf1
   [junit4]   2> 48300 INFO  (coreLoadExecutor-128-thread-1-processing-n:127.0.0.1:53130_gx) [n:127.0.0.1:53130_gx c:control_collection s:shard1 r:core_node1 x:collection1] o.a.s.c.CoreContainer registering core: collection1
   [junit4]   2> 48301 INFO  (coreZkRegister-122-thread-1-processing-n:127.0.0.1:53130_gx x:collection1 s:shard1 c:control_collection r:core_node1) [n:127.0.0.1:53130_gx c:control_collection s:shard1 r:core_node1 x:collection1] o.a.s.c.ZkController Register replica - core:collection1 address:http://127.0.0.1:53130/gx collection:control_collection shard:shard1
   [junit4]   2> 48308 INFO  (coreZkRegister-122-thread-1-processing-n:127.0.0.1:53130_gx x:collection1 s:shard1 c:control_collection r:core_node1) [n:127.0.0.1:53130_gx c:control_collection s:shard1 r:core_node1 x:collection1] o.a.s.c.c.SolrZkClient makePath: /collections/control_collection/leader_elect/shard1/election
   [junit4]   2> 48313 INFO  (coreZkRegister-122-thread-1-processing-n:127.0.0.1:53130_gx x:collection1 s:shard1 c:control_collection r:core_node1) [n:127.0.0.1:53130_gx c:control_collection s:shard1 r:core_node1 x:collection1] o.a.s.c.LeaderElector Joined leadership election with path: /collections/control_collection/leader_elect/shard1/election/94372232315076612-core_node1-n_0000000000
   [junit4]   2> 48314 INFO  (coreZkRegister-122-thread-1-processing-n:127.0.0.1:53130_gx x:collection1 s:shard1 c:control_collection r:core_node1) [n:127.0.0.1:53130_gx c:control_collection s:shard1 r:core_node1 x:collection1] o.a.s.c.ShardLeaderElectionContext Running the leader process for shard shard1
   [junit4]   2> 48317 INFO  (zkCallback-38-thread-1-processing-n:127.0.0.1:53130_gx) [n:127.0.0.1:53130_gx    ] o.a.s.c.DistributedQueue NodeChildrenChanged fired on path /overseer/queue state SyncConnected
   [junit4]   2> 48317 INFO  (coreZkRegister-122-thread-1-processing-n:127.0.0.1:53130_gx x:collection1 s:shard1 c:control_collection r:core_node1) [n:127.0.0.1:53130_gx c:control_collection s:shard1 r:core_node1 x:collection1] o.a.s.c.ShardLeaderElectionContext Enough replicas found to continue.
   [junit4]   2> 48317 INFO  (coreZkRegister-122-thread-1-processing-n:127.0.0.1:53130_gx x:collection1 s:shard1 c:control_collection r:core_node1) [n:127.0.0.1:53130_gx c:control_collection s:shard1 r:core_node1 x:collection1] o.a.s.c.ShardLeaderElectionContext I may be the new leader - try and sync
   [junit4]   2> 48318 INFO  (OverseerStateUpdate-94372232315076612-127.0.0.1:53130_gx-n_0000000000) [n:127.0.0.1:53130_gx    ] o.a.s.c.Overseer processMessage: queueSize: 1, message = {
   [junit4]   2>   "operation":"leader",
   [junit4]   2>   "shard":"shard1",
   [junit4]   2>   "collection":"control_collection"} current state version: 1
   [junit4]   2> 48318 INFO  (coreZkRegister-122-thread-1-processing-n:127.0.0.1:53130_gx x:collection1 s:shard1 c:control_collection r:core_node1) [n:127.0.0.1:53130_gx c:control_collection s:shard1 r:core_node1 x:collection1] o.a.s.c.SyncStrategy Sync replicas to http://127.0.0.1:53130/gx/collection1/
   [junit4]   2> 48319 INFO  (coreZkRegister-122-thread-1-processing-n:127.0.0.1:53130_gx x:collection1 s:shard1 c:control_collection r:core_node1) [n:127.0.0.1:53130_gx c:control_collection s:shard1 r:core_node1 x:collection1] o.a.s.c.SyncStrategy Sync Success - now sync replicas to me
   [junit4]   2> 48319 INFO  (coreZkRegister-122-thread-1-processing-n:127.0.0.1:53130_gx x:collection1 s:shard1 c:control_collection r:core_node1) [n:127.0.0.1:53130_gx c:control_collection s:shard1 r:core_node1 x:collection1] o.a.s.c.SyncStrategy http://127.0.0.1:53130/gx/collection1/ has no replicas
   [junit4]   2> 48319 INFO  (coreZkRegister-122-thread-1-processing-n:127.0.0.1:53130_gx x:collection1 s:shard1 c:control_collection r:core_node1) [n:127.0.0.1:53130_gx c:control_collection s:shard1 r:core_node1 x:collection1] o.a.s.c.ShardLeaderElectionContext I am the new leader: http://127.0.0.1:53130/gx/collection1/ shard1
   [junit4]   2> 48321 INFO  (coreZkRegister-122-thread-1-processing-n:127.0.0.1:53130_gx x:collection1 s:shard1 c:control_collection r:core_node1) [n:127.0.0.1:53130_gx c:control_collection s:shard1 r:core_node1 x:collection1] o.a.s.c.c.SolrZkClient makePath: /collections/control_collection/leaders/shard1
   [junit4]   2> 48331 INFO  (zkCallback-38-thread-1-processing-n:127.0.0.1:53130_gx) [n:127.0.0.1:53130_gx    ] o.a.s.c.c.ZkStateReader A cluster state change: WatchedEvent state:SyncConnected type:NodeDataChanged path:/clusterstate.json, has occurred - updating... (live nodes size: 1)
   [junit4]   2> 48340 INFO  (OverseerStateUpdate-94372232315076612-127.0.0.1:53130_gx-n_0000000000) [n:127.0.0.1:53130_gx    ] o.a.s.c.Overseer processMessage: queueSize: 1, message = {
   [junit4]   2>   "operation":"leader",
   [junit4]   2>   "shard":"shard1",
   [junit4]   2>   "collection":"control_collection",
   [junit4]   2>   "base_url":"http://127.0.0.1:53130/gx",
   [junit4]   2>   "core":"collection1",
   [junit4]   2>   "state":"active"} current state version: 2
   [junit4]   2> 48343 INFO  (zkCallback-38-thread-1-processing-n:127.0.0.1:53130_gx) [n:127.0.0.1:53130_gx    ] o.a.s.c.DistributedQueue NodeChildrenChanged fired on path /overseer/queue state SyncConnected
   [junit4]   2> 48343 INFO  (zkCallback-38-thread-1-processing-n:127.0.0.1:53130_gx) [n:127.0.0.1:53130_gx    ] o.a.s.c.c.ZkStateReader A cluster state change: WatchedEvent state:SyncConnected type:NodeDataChanged path:/clusterstate.json, has occurred - updating... (live nodes size: 1)
   [junit4]   2> 48391 INFO  (coreZkRegister-122-thread-1-processing-n:127.0.0.1:53130_gx x:collection1 s:shard1 c:control_collection r:core_node1) [n:127.0.0.1:53130_gx c:control_collection s:shard1 r:core_node1 x:collection1] o.a.s.c.ZkController We are http://127.0.0.1:53130/gx/collection1/ and leader is http://127.0.0.1:53130/gx/collection1/
   [junit4]   2> 48391 INFO  (coreZkRegister-122-thread-1-processing-n:127.0.0.1:53130_gx x:collection1 s:shard1 c:control_collection r:core_node1) [n:127.0.0.1:53130_gx c:control_collection s:shard1 r:core_node1 x:collection1] o.a.s.c.ZkController No LogReplay needed for core=collection1 baseURL=http://127.0.0.1:53130/gx
   [junit4]   2> 48391 INFO  (coreZkRegister-122-thread-1-processing-n:127.0.0.1:53130_gx x:collection1 s:shard1 c:control_collection r:core_node1) [n:127.0.0.1:53130_gx c:control_collection s:shard1 r:core_node1 x:collection1] o.a.s.c.ZkController I am the leader, no recovery necessary
   [junit4]   2> 48391 INFO  (coreZkRegister-122-thread-1-processing-n:127.0.0.1:53130_gx x:collection1 s:shard1 c:control_collection r:core_node1) [n:127.0.0.1:53130_gx c:control_collection s:shard1 r:core_node1 x:collection1] o.a.s.c.ZkController publishing state=active
   [junit4]   2> 48391 INFO  (coreZkRegister-122-thread-1-processing-n:127.0.0.1:53130_gx x:collection1 s:shard1 c:control_collection r:core_node1) [n:127.0.0.1:53130_gx c:control_collection s:shard1 r:core_node1 x:collection1] o.a.s.c.ZkController numShards not found on descriptor - reading it from system property
   [junit4]   2> 48393 INFO  (zkCallback-38-thread-1-processing-n:127.0.0.1:53130_gx) [n:127.0.0.1:53130_gx    ] o.a.s.c.DistributedQueue NodeChildrenChanged fired on path /overseer/queue state SyncConnected
   [junit4]   2> 48394 INFO  (OverseerStateUpdate-94372232315076612-127.0.0.1:53130_gx-n_0000000000) [n:127.0.0.1:53130_gx    ] o.a.s.c.Overseer processMessage: queueSize: 1, message = {
   [junit4]   2>   "core":"collection1",
   [junit4]   2>   "core_node_name":"core_node1",
   [junit4]   2>   "roles":null,
   [junit4]   2>   "base_url":"http://127.0.0.1:53130/gx",
   [junit4]   2>   "node_name":"127.0.0.1:53130_gx",
   [junit4]   2>   "numShards":"1",
   [junit4]   2>   "state":"active",
   [junit4]   2>   "shard":"shard1",
   [junit4]   2>   "collection":"control_collection",
   [junit4]   2>   "operation":"state"} current state version: 3
   [junit4]   2> 48395 INFO  (OverseerStateUpdate-94372232315076612-127.0.0.1:53130_gx-n_0000000000) [n:127.0.0.1:53130_gx    ] o.a.s.c.o.ReplicaMutator Update state numShards=1 message={
   [junit4]   2>   "core":"collection1",
   [junit4]   2>   "core_node_name":"core_node1",
   [junit4]   2>   "roles":null,
   [junit4]   2>   "base_url":"http://127.0.0.1:53130/gx",
   [junit4]   2>   "node_name":"127.0.0.1:53130_gx",
   [junit4]   2>   "numShards":"1",
   [junit4]   2>   "state":"active",
   [junit4]   2>   "shard":"shard1",
   [junit4]   2>   "collection":"control_collection",
   [junit4]   2>   "operation":"state"}
   [junit4]   2> 48498 INFO  (zkCallback-38-thread-1-processing-n:127.0.0.1:53130_gx) [n:127.0.0.1:53130_gx    ] o.a.s.c.c.ZkStateReader A cluster state change: WatchedEvent state:SyncConnected type:NodeDataChanged path:/clusterstate.json, has occurred - updating... (live nodes size: 1)
   [junit4]   2> 48787 INFO  (TEST-CloudSolrClientTest.test-seed#[D1A4036987FD3D7A]) [    ] o.a.s.c.c.SolrZkClient Using default ZkCredentialsProvider
   [junit4]   2> 48790 INFO  (TEST-CloudSolrClientTest.test-seed#[D1A4036987FD3D7A]) [    ] o.a.s.c.c.ConnectionManager Waiting for client to connect to ZooKeeper
   [junit4]   2> 48794 INFO  (zkCallback-40-thread-1) [    ] o.a.s.c.c.ConnectionManager Watcher org.apache.solr.common.cloud.ConnectionManager@1081aec name:ZooKeeperConnection Watcher:127.0.0.1:41425/solr got event WatchedEvent state:SyncConnected type:None path:null path:null type:None
   [junit4]   2> 48794 INFO  (TEST-CloudSolrClientTest.test-seed#[D1A4036987FD3D7A]) [    ] o.a.s.c.c.ConnectionManager Client is connected to ZooKeeper
   [junit4]   2> 48795 INFO  (TEST-CloudSolrClientTest.test-seed#[D1A4036987FD3D7A]) [    ] o.a.s.c.c.SolrZkClient Using default ZkACLProvider
   [junit4]   2> 48795 INFO  (TEST-CloudSolrClientTest.test-seed#[D1A4036987FD3D7A]) [    ] o.a.s.c.c.ZkStateReader Updating cluster state from ZooKeeper... 
   [junit4]   2> 48801 INFO  (TEST-CloudSolrClientTest.test-seed#[D1A4036987FD3D7A]) [    ] o.a.s.c.ChaosMonkey monkey: init - expire sessions:false cause connection loss:false
   [junit4]   2> 48801 INFO  (TEST-CloudSolrClientTest.test-seed#[D1A4036987FD3D7A]) [    ] o.a.s.c.AbstractFullDistribZkTestBase Creating collection1 with stateFormat=2
   [junit4]   2> 48801 INFO  (TEST-CloudSolrClientTest.test-seed#[D1A4036987FD3D7A]) [    ] o.a.s.c.c.SolrZkClient Using default ZkCredentialsProvider
   [junit4]   2> 48802 INFO  (TEST-CloudSolrClientTest.test-seed#[D1A4036987FD3D7A]) [    ] o.a.s.c.c.ConnectionManager Waiting for client to connect to ZooKeeper
   [junit4]   2> 48803 INFO  (zkCallback-41-thread-1) [    ] o.a.s.c.c.ConnectionManager Watcher org.apache.solr.common.cloud.ConnectionManager@1197f5a name:ZooKeeperConnection Watcher:127.0.0.1:41425/solr got event WatchedEvent state:SyncConnected type:None path:null path:null type:None
   [junit4]   2> 48803 INFO  (TEST-CloudSolrClientTest.test-seed#[D1A4036987FD3D7A]) [    ] o.a.s.c.c.ConnectionManager Client is connected to ZooKeeper
   [junit4]   2> 48804 INFO  (TEST-CloudSolrClientTest.test-seed#[D1A4036987FD3D7A]) [    ] o.a.s.c.c.SolrZkClient Using default ZkACLProvider
   [junit4]   2> 48807 INFO  (zkCallback-38-thread-1-processing-n:127.0.0.1:53130_gx) [n:127.0.0.1:53130_gx    ] o.a.s.c.DistributedQueue NodeChildrenChanged fired on path /overseer/queue state SyncConnected
   [junit4]   2> 48810 INFO  (OverseerStateUpdate-94372232315076612-127.0.0.1:53130_gx-n_0000000000) [n:127.0.0.1:53130_gx    ] o.a.s.c.Overseer processMessage: queueSize: 1, message = {
   [junit4]   2>   "operation":"create",
   [junit4]   2>   "name":"collection1",
   [junit4]   2>   "numShards":"2",
   [junit4]   2>   "stateFormat":"2"} current state version: 4
   [junit4]   2> 48810 INFO  (OverseerStateUpdate-94372232315076612-127.0.0.1:53130_gx-n_0000000000) [n:127.0.0.1:53130_gx    ] o.a.s.c.o.ClusterStateMutator building a new cName: collection1
   [junit4]   2> 48826 INFO  (TEST-CloudSolrClientTest.test-seed#[D1A4036987FD3D7A]) [    ] o.a.s.SolrTestCaseJ4 Writing core.properties file to /home/jenkins/workspace/Lucene-Solr-trunk-Linux/solr/build/solr-solrj/test/J1/temp/solr.client.solrj.impl.CloudSolrClientTest_D1A4036987FD3D7A-001/shard-1-001/cores/collection1
   [junit4]   2> 48827 INFO  (TEST-CloudSolrClientTest.test-seed#[D1A4036987FD3D7A]) [    ] o.a.s.c.AbstractFullDistribZkTestBase create jetty 1 in directory /home/jenkins/workspace/Lucene-Solr-trunk-Linux/solr/build/solr-solrj/test/J1/temp/solr.client.solrj.impl.CloudSolrClientTest_D1A4036987FD3D7A-001/shard-1-001
   [junit4]   2> 48827 INFO  (TEST-CloudSolrClientTest.test-seed#[D1A4036987FD3D7A]) [    ] o.e.j.s.Server jetty-9.2.13.v20150730
   [junit4]   2> 48829 INFO  (TEST-CloudSolrClientTest.test-seed#[D1A4036987FD3D7A]) [    ] o.e.j.s.h.ContextHandler Started o.e.j.s.ServletContextHandler@161a3ad{/gx,null,AVAILABLE}
   [junit4]   2> 48830 INFO  (TEST-CloudSolrClientTest.test-seed#[D1A4036987FD3D7A]) [    ] o.e.j.s.ServerConnector Started ServerConnector@137383d{HTTP/1.1}{127.0.0.1:52664}
   [junit4]   2> 48830 INFO  (TEST-CloudSolrClientTest.test-seed#[D1A4036987FD3D7A]) [    ] o.e.j.s.Server Started @50301ms
   [junit4]   2> 48830 INFO  (TEST-CloudSolrClientTest.test-seed#[D1A4036987FD3D7A]) [    ] o.a.s.c.s.e.JettySolrRunner Jetty properties: {solr.data.dir=/home/jenkins/workspace/Lucene-Solr-trunk-Linux/solr/build/solr-solrj/test/J1/temp/solr.client.solrj.impl.CloudSolrClientTest_D1A4036987FD3D7A-001/tempDir-001/jetty1, solrconfig=solrconfig.xml, hostContext=/gx, hostPort=52664, coreRootDirectory=/home/jenkins/workspace/Lucene-Solr-trunk-Linux/solr/build/solr-solrj/test/J1/temp/solr.client.solrj.impl.CloudSolrClientTest_D1A4036987FD3D7A-001/shard-1-001/cores}
   [junit4]   2> 48831 INFO  (TEST-CloudSolrClientTest.test-seed#[D1A4036987FD3D7A]) [    ] o.a.s.s.SolrDispatchFilter SolrDispatchFilter.init(): sun.misc.Launcher$AppClassLoader@19e0bfd
   [junit4]   2> 48831 INFO  (TEST-CloudSolrClientTest.test-seed#[D1A4036987FD3D7A]) [    ] o.a.s.c.SolrResourceLoader new SolrResourceLoader for directory: '/home/jenkins/workspace/Lucene-Solr-trunk-Linux/solr/build/solr-solrj/test/J1/temp/solr.client.solrj.impl.CloudSolrClientTest_D1A4036987FD3D7A-001/shard-1-001/'
   [junit4]   2> 48879 INFO  (TEST-CloudSolrClientTest.test-seed#[D1A4036987FD3D7A]) [    ] o.a.s.c.c.SolrZkClient Using default ZkCredentialsProvider
   [junit4]   2> 48879 INFO  (TEST-CloudSolrClientTest.test-seed#[D1A4036987FD3D7A]) [    ] o.a.s.c.c.ConnectionManager Waiting for client to connect to ZooKeeper
   [junit4]   2> 48882 INFO  (zkCallback-42-thread-1) [    ] o.a.s.c.c.ConnectionManager Watcher org.apache.solr.common.cloud.ConnectionManager@1a79315 name:ZooKeeperConnection Watcher:127.0.0.1:41425/solr got event WatchedEvent state:SyncConnected type:None path:null path:null type:None
   [junit4]   2> 48882 INFO  (TEST-CloudSolrClientTest.test-seed#[D1A4036987FD3D7A]) [    ] o.a.s.c.c.ConnectionManager Client is connected to ZooKeeper
   [junit4]   2> 48882 INFO  (TEST-CloudSolrClientTest.test-seed#[D1A4036987FD3D7A]) [    ] o.a.s.c.c.SolrZkClient Using default ZkACLProvider
   [junit4]   2> 48886 INFO  (TEST-CloudSolrClientTest.test-seed#[D1A4036987FD3D7A]) [    ] o.a.s.s.SolrDispatchFilter Loading solr.xml from SolrHome (not found in ZooKeeper)
   [junit4]   2> 48887 INFO  (TEST-CloudSolrClientTest.test-seed#[D1A4036987FD3D7A]) [    ] o.a.s.c.SolrXmlConfig Loading container configuration from /home/jenkins/workspace/Lucene-Solr-trunk-Linux/solr/build/solr-solrj/test/J1/temp/solr.client.solrj.impl.CloudSolrClientTest_D1A4036987FD3D7A-001/shard-1-001/solr.xml
   [junit4]   2> 48923 INFO  (OverseerStateUpdate-94372232315076612-127.0.0.1:53130_gx-n_0000000000) [n:127.0.0.1:53130_gx    ] o.a.s.c.o.ZkStateWriter going to create_collection /collections/collection1/state.json
   [junit4]   2> 48924 INFO  (zkCallback-38-thread-1-processing-n:127.0.0.1:53130_gx) [n:127.0.0.1:53130_gx    ] o.a.s.c.c.ZkStateReader A cluster state change: WatchedEvent state:SyncConnected type:NodeDataChanged path:/clusterstate.json, has occurred - updating... (live nodes size: 1)
   [junit4]   2> 48925 INFO  (zkCallback-40-thread-1) [    ] o.a.s.c.c.ZkStateReader A cluster state change: WatchedEvent state:SyncConnected type:NodeDataChanged path:/clusterstate.json, has occurred - updating... (live nodes size: 1)
   [junit4]   2> 48948 INFO  (TEST-CloudSolrClientTest.test-seed#[D1A4036987FD3D7A]) [    ] o.a.s.c.CoresLocator Config-defined core root directory: /home/jenkins/workspace/Lucene-Solr-trunk-Linux/solr/build/solr-solrj/test/J1/temp/solr.client.solrj.impl.CloudSolrClientTest_D1A4036987FD3D7A-001/shard-1-001/cores
   [junit4]   2> 48948 INFO  (TEST-CloudSolrClientTest.test-seed#[D1A4036987FD3D7A]) [    ] o.a.s.c.CoreContainer New CoreContainer 13240508
   [junit4]   2> 48949 INFO  (TEST-CloudSolrClientTest.test-seed#[D1A4036987FD3D7A]) [    ] o.a.s.c.CoreContainer Loading cores into CoreContainer [instanceDir=/home/jenkins/workspace/Lucene-Solr-trunk-Linux/solr/build/solr-solrj/test/J1/temp/solr.client.solrj.impl.CloudSolrClientTest_D1A4036987FD3D7A-001/shard-1-001/]
   [junit4]   2> 48949 INFO  (TEST-CloudSolrClientTest.test-seed#[D1A4036987FD3D7A]) [    ] o.a.s.c.CoreContainer loading shared library: /home/jenkins/workspace/Lucene-Solr-trunk-Linux/solr/build/solr-solrj/test/J1/temp/solr.client.solrj.impl.CloudSolrClientTest_D1A4036987FD3D7A-001/shard-1-001/lib
   [junit4]   2> 48949 WARN  (TEST-CloudSolrClientTest.test-seed#[D1A4036987FD3D7A]) [    ] o.a.s.c.SolrResourceLoader Can't find (or read) directory to add to classloader: lib (resolved as: /home/jenkins/workspace/Lucene-Solr-trunk-Linux/solr/build/solr-solrj/test/J1/temp/solr.client.solrj.impl.CloudSolrClientTest_D1A4036987FD3D7A-001/shard-1-001/lib).
   [junit4]   2> 48958 INFO  (TEST-CloudSolrClientTest.test-seed#[D1A4036987FD3D7A]) [    ] o.a.s.h.c.HttpShardHandlerFactory created with socketTimeout : 90000,urlScheme : ,connTimeout : 15000,maxConnectionsPerHost : 20,maxConnections : 10000,corePoolSize : 0,maximumPoolSize : 2147483647,maxThreadIdleTime : 5,sizeOfQueue : -1,fairnessPolicy : false,useRetries : false,
   [junit4]   2> 48960 INFO  (TEST-CloudSolrClientTest.test-seed#[D1A4036987FD3D7A]) [    ] o.a.s.u.UpdateShardHandler Creating UpdateShardHandler HTTP client with params: socketTimeout=340000&connTimeout=45000&retry=true
   [junit4]   2> 48960 INFO  (TEST-CloudSolrClientTest.test-seed#[D1A4036987FD3D7A]) [    ] o.a.s.l.LogWatcher SLF4J impl is org.slf4j.impl.Log4jLoggerFactory
   [junit4]   2> 48961 INFO  (TEST-CloudSolrClientTest.test-seed#[D1A4036987FD3D7A]) [    ] o.a.s.l.LogWatcher Registering Log Listener [Log4j (org.slf4j.impl.Log4jLoggerFactory)]
   [junit4]   2> 48961 INFO  (TEST-CloudSolrClientTest.test-seed#[D1A4036987FD3D7A]) [    ] o.a.s.c.ZkContainer Zookeeper client=127.0.0.1:41425/solr
   [junit4]   2> 48961 INFO  (TEST-CloudSolrClientTest.test-seed#[D1A4036987FD3D7A]) [    ] o.a.s.c.ZkController zkHost includes chroot
   [junit4]   2> 48961 INFO  (TEST-CloudSolrClientTest.test-seed#[D1A4036987FD3D7A]) [    ] o.a.s.c.c.SolrZkClient Using default ZkCredentialsProvider
   [junit4]   2> 48962 INFO  (TEST-CloudSolrClientTest.test-seed#[D1A4036987FD3D7A]) [    ] o.a.s.c.c.ConnectionManager Waiting for client to connect to ZooKeeper
   [junit4]   2> 48972 INFO  (zkCallback-44-thread-1) [    ] o.a.s.c.c.ConnectionManager Watcher org.apache.solr.common.cloud.ConnectionManager@cf1abd name:ZooKeeperConnection Watcher:127.0.0.1:41425 got event WatchedEvent state:SyncConnected type:None path:null path:null type:None
   [junit4]   2> 48972 INFO  (TEST-CloudSolrClientTest.test-seed#[D1A4036987FD3D7A]) [    ] o.a.s.c.c.ConnectionManager Client is connected to ZooKeeper
   [junit4]   2> 48972 INFO  (TEST-CloudSolrClientTest.test-seed#[D1A4036987FD3D7A]) [    ] o.a.s.c.c.SolrZkClient Using default ZkACLProvider
   [junit4]   2> 48974 INFO  (TEST-CloudSolrClientTest.test-seed#[D1A4036987FD3D7A]) [n:127.0.0.1:52664_gx    ] o.a.s.c.c.ConnectionManager Waiting for client to connect to ZooKeeper
   [junit4]   2> 48976 INFO  (zkCallback-45-thread-1-processing-n:127.0.0.1:52664_gx) [n:127.0.0.1:52664_gx    ] o.a.s.c.c.ConnectionManager Watcher org.apache.solr.common.cloud.ConnectionManager@a63ddd name:ZooKeeperConnection Watcher:127.0.0.1:41425/solr got event WatchedEvent state:SyncConnected type:None path:null path:null type:None
   [junit4]   2> 48977 INFO  (TEST-CloudSolrClientTest.test-seed#[D1A4036987FD3D7A]) [n:127.0.0.1:52664_gx    ] o.a.s.c.c.ConnectionManager Client is connected to ZooKeeper
   [junit4]   2> 48984 INFO  (TEST-CloudSolrClientTest.test-seed#[D1A4036987FD3D7A]) [n:127.0.0.1:52664_gx    ] o.a.s.c.c.ZkStateReader Updating cluster state from ZooKeeper... 
   [junit4]   2> 49989 INFO  (TEST-CloudSolrClientTest.test-seed#[D1A4036987FD3D7A]) [n:127.0.0.1:52664_gx    ] o.a.s.c.ZkController Register node as live in ZooKeeper:/live_nodes/127.0.0.1:52664_gx
   [junit4]   2> 49989 INFO  (TEST-CloudSolrClientTest.test-seed#[D1A4036987FD3D7A]) [n:127.0.0.1:52664_gx    ] o.a.s.c.c.SolrZkClient makePath: /live_nodes/127.0.0.1:52664_gx
   [junit4]   2> 49992 INFO  (zkCallback-45-thread-1-processing-n:127.0.0.1:52664_gx) [n:127.0.0.1:52664_gx    ] o.a.s.c.c.ZkStateReader A live node change: WatchedEvent state:SyncConnected type:NodeChildrenChanged path:/live_nodes, has occurred - updating... (live nodes size: 1)
   [junit4]   2> 49992 INFO  (zkCallback-40-thread-1) [    ] o.a.s.c.c.ZkStateReader A live node change: WatchedEvent state:SyncConnected type:NodeChildrenChanged path:/live_nodes, has occurred - updating... (live nodes size: 1)
   [junit4]   2> 49992 INFO  (zkCallback-38-thread-1-processing-n:127.0.0.1:53130_gx) [n:127.0.0.1:53130_gx    ] o.a.s.c.c.ZkStateReader A live node change: WatchedEvent state:SyncConnected type:NodeChildrenChanged path:/live_nodes, has occurred - updating... (live nodes size: 1)
   [junit4]   2> 49995 INFO  (TEST-CloudSolrClientTest.test-seed#[D1A4036987FD3D7A]) [n:127.0.0.1:52664_gx    ] o.a.s.c.Overseer Overseer (id=null) closing
   [junit4]   2> 49996 INFO  (TEST-CloudSolrClientTest.test-seed#[D1A4036987FD3D7A]) [n:127.0.0.1:52664_gx    ] o.a.s.c.LeaderElector Joined leadership election with path: /overseer_elect/election/94372232315076617-127.0.0.1:52664_gx-n_0000000001
   [junit4]   2> 49998 INFO  (TEST-CloudSolrClientTest.test-seed#[D1A4036987FD3D7A]) [n:127.0.0.1:52664_gx    ] o.a.s.c.LeaderElector Watching path /overseer_elect/election/94372232315076612-127.0.0.1:53130_gx-n_0000000000 to know if I could be the leader
   [junit4]   2> 50034 INFO  (TEST-CloudSolrClientTest.test-seed#[D1A4036987FD3D7A]) [n:127.0.0.1:52664_gx    ] o.a.s.c.CoreContainer Security conf doesn't exist. Skipping setup for authorization module.
   [junit4]   2> 50034 INFO  (TEST-CloudSolrClientTest.test-seed#[D1A4036987FD3D7A]) [n:127.0.0.1:52664_gx    ] o.a.s.c.CoreContainer No authentication plugin used.
   [junit4]   2> 50035 INFO  (TEST-CloudSolrClientTest.test-seed#[D1A4036987FD3D7A]) [n:127.0.0.1:52664_gx    ] o.a.s.c.CoresLocator Looking for core definitions underneath /home/jenkins/workspace/Lucene-Solr-trunk-Linux/solr/build/solr-solrj/test/J1/temp/solr.client.solrj.impl.CloudSolrClientTest_D1A4036987FD3D7A-001/shard-1-001/cores
   [junit4]   2> 50036 INFO  (TEST-CloudSolrClientTest.test-seed#[D1A4036987FD3D7A]) [n:127.0.0.1:52664_gx    ] o.a.s.c.SolrCore Created CoreDescriptor: {name=collection1, config=solrconfig.xml, transient=false, schema=schema.xml, loadOnStartup=true, configSetProperties=configsetprops.json, instanceDir=/home/jenkins/workspace/Lucene-Solr-trunk-Linux/solr/build/solr-solrj/test/J1/temp/solr.client.solrj.impl.CloudSolrClientTest_D1A4036987FD3D7A-001/shard-1-001/cores/collection1, collection=collection1, absoluteInstDir=/home/jenkins/workspace/Lucene-Solr-trunk-Linux/solr/build/solr-solrj/test/J1/temp/solr.client.solrj.impl.CloudSolrClientTest_D1A4036987FD3D7A-001/shard-1-001/cores/collection1/, coreNodeName=, dataDir=data/, shard=}
   [junit4]   2> 50037 INFO  (TEST-CloudSolrClientTest.test-seed#[D1A4036987FD3D7A]) [n:127.0.0.1:52664_gx    ] o.a.s.c.CoresLocator Found core collection1 in /home/jenkins/workspace/Lucene-Solr-trunk-Linux/solr/build/solr-solrj/test/J1/temp/solr.client.solrj.impl.CloudSolrClientTest_D1A4036987FD3D7A-001/shard-1-001/cores/collection1/
   [junit4]   2> 50037 INFO  (TEST-CloudSolrClientTest.test-seed#[D1A4036987FD3D7A]) [n:127.0.0.1:52664_gx    ] o.a.s.c.CoresLocator Found 1 core definitions
   [junit4]   2> 50038 INFO  (TEST-CloudSolrClientTest.test-seed#[D1A4036987FD3D7A]) [n:127.0.0.1:52664_gx    ] o.a.s.s.SolrDispatchFilter user.dir=/home/jenkins/workspace/Lucene-Solr-trunk-Linux/solr/build/solr-solrj/test/J1
   [junit4]   2> 50038 INFO  (TEST-CloudSolrClientTest.test-seed#[D1A4036987FD3D7A]) [n:127.0.0.1:52664_gx    ] o.a.s.s.SolrDispatchFilter SolrDispatchFilter.init() done
   [junit4]   2> 50039 INFO  (coreLoadExecutor-139-thread-1-processing-n:127.0.0.1:52664_gx) [n:127.0.0.1:52664_gx c:collection1   x:collection1] o.a.s.c.ZkController publishing state=down
   [junit4]   2> 50039 INFO  (coreLoadExecutor-139-thread-1-processing-n:127.0.0.1:52664_gx) [n:127.0.0.1:52664_gx c:collection1   x:collection1] o.a.s.c.ZkController numShards not found on descriptor - reading it from system property
   [junit4]   2> 50040 INFO  (zkCallback-38-thread-1-processing-n:127.0.0.1:53130_gx) [n:127.0.0.1:53130_gx    ] o.a.s.c.DistributedQueue NodeChildrenChanged fired on path /overseer/queue state SyncConnected
   [junit4]   2> 50041 INFO  (coreLoadExecutor-139-thread-1-processing-n:127.0.0.1:52664_gx) [n:127.0.0.1:52664_gx c:collection1   x:collection1] o.a.s.c.ZkController Registering watch for collection collection1
   [junit4]   2> 50041 INFO  (coreLoadExecutor-139-thread-1-processing-n:127.0.0.1:52664_gx) [n:127.0.0.1:52664_gx c:collection1   x:collection1] o.a.s.c.c.ZkStateReader addZkWatch collection1
   [junit4]   2> 50041 INFO  (OverseerStateUpdate-94372232315076612-127.0.0.1:53130_gx-n_0000000000) [n:127.0.0.1:53130_gx    ] o.a.s.c.Overseer processMessage: queueSize: 1, message = {
   [junit4]   2>   "core":"collection1",
   [junit4]   2>   "roles":null,
   [junit4]   2>   "base_url":"http://127.0.0.1:52664/gx",
   [junit4]   2>   "node_name":"127.0.0.1:52664_gx",
   [junit4]   2>   "numShards":"2",
   [junit4]   2>   "state":"down",
   [junit4]   2>   "shard":null,
   [junit4]   2>   "collection":"collection1",
   [junit4]   2>   "operation":"state"} current state version: 5
   [junit4]   2> 50042 INFO  (OverseerStateUpdate-94372232315076612-127.0.0.1:53130_gx-n_0000000000) [n:127.0.0.1:53130_gx    ] o.a.s.c.o.ReplicaMutator Update state numShards=2 message={
   [junit4]   2>   "core":"collection1",
   [junit4]   2>   "roles":null,
   [junit4]   2>   "base_url":"http://127.0.0.1:52664/gx",
   [junit4]   2>   "node_name":"127.0.0.1:52664_gx",
   [junit4]   2>   "numShards":"2",
   [junit4]   2>   "state":"down",
   [junit4]   2>   "shard":null,
   [junit4]   2>   "collection":"collection1",
   [junit4]   2>   "operation":"state"}
   [junit4]   2> 50042 INFO  (OverseerStateUpdate-94372232315076612-127.0.0.1:53130_gx-n_0000000000) [n:127.0.0.1:53130_gx    ] o.a.s.c.o.ReplicaMutator Collection already exists with numShards=2
   [junit4]   2> 50042 INFO  (OverseerStateUpdate-94372232315076612-127.0.0.1:53130_gx-n_0000000000) [n:127.0.0.1:53130_gx    ] o.a.s.c.o.ReplicaMutator Assigning new node to shard shard=shard2
   [junit4]   2> 50043 INFO  (coreLoadExecutor-139-thread-1-processing-n:127.0.0.1:52664_gx) [n:127.0.0.1:52664_gx c:collection1   x:collection1] o.a.s.c.c.ZkStateReader Add data for collection1 ver 0 
   [junit4]   2> 50043 INFO  (coreLoadExecutor-139-thread-1-processing-n:127.0.0.1:52664_gx) [n:127.0.0.1:52664_gx c:collection1   x:collection1] o.a.s.c.ZkController look for our core node name
   [junit4]   2> 50145 INFO  (OverseerStateUpdate-94372232315076612-127.0.0.1:53130_gx-n_0000000000) [n:127.0.0.1:53130_gx    ] o.a.s.c.o.ZkStateWriter going to update_collection /collections/collection1/state.json version: 0
   [junit4]   2> 50146 INFO  (zkCallback-45-thread-1-processing-n:127.0.0.1:52664_gx) [n:127.0.0.1:52664_gx    ] o.a.s.c.c.ZkStateReader A cluster state change: WatchedEvent state:SyncConnected type:NodeDataChanged path:/collections/collection1/state.json for collection collection1 has occurred - updating... (live nodes size: 2)
   [junit4]   2> 50146 INFO  (zkCallback-45-thread-1-processing-n:127.0.0.1:52664_gx) [n:127.0.0.1:52664_gx    ] o.a.s.c.c.ZkStateReader Updating data for collection1 from 0 to 1 
   [junit4]   2> 51043 INFO  (coreLoadExecutor-139-thread-1-processing-n:127.0.0.1:52664_gx) [n:127.0.0.1:52664_gx c:collection1   x:collection1] o.a.s.c.ZkController waiting to find shard id in clusterstate for collection1
   [junit4]   2> 51044 INFO  (coreLoadExecutor-139-thread-1-processing-n:127.0.0.1:52664_gx) [n:127.0.0.1:52664_gx c:collection1   x:collection1] o.a.s.c.ZkController Check for collection zkNode:collection1
   [junit4]   2> 51044 INFO  (coreLoadExecutor-139-thread-1-processing-n:127.0.0.1:52664_gx) [n:127.0.0.1:52664_gx c:collection1   x:collection1] o.a.s.c.ZkController Collection zkNode exists
   [junit4]   2> 51044 INFO  (coreLoadExecutor-139-thread-1-processing-n:127.0.0.1:52664_gx) [n:127.0.0.1:52664_gx c:collection1   x:collection1] o.a.s.c.c.ZkStateReader Load collection config from:/collections/collection1
   [junit4]   2> 51045 INFO  (coreLoadExecutor-139-thread-1-processing-n:127.0.0.1:52664_gx) [n:127.0.0.1:52664_gx c:collection1   x:collection1] o.a.s.c.c.ZkStateReader path=/collections/collection1 configName=conf1 specified config exists in ZooKeeper
   [junit4]   2> 51045 INFO  (coreLoadExecutor-139-thread-1-processing-n:127.0.0.1:52664_gx) [n:127.0.0.1:52664_gx c:collection1   x:collection1] o.a.s.c.SolrResourceLoader new SolrResourceLoader for directory: '/home/jenkins/workspace/Lucene-Solr-trunk-Linux/solr/build/solr-solrj/test/J1/temp/solr.client.solrj.impl.CloudSolrClientTest_D1A4036987FD3D7A-001/shard-1-001/cores/collection1/'
   [junit4]   2> 51069 INFO  (coreLoadExecutor-139-thread-1-processing-n:127.0.0.1:52664_gx) [n:127.0.0.1:52664_gx c:collection1   x:collection1] o.a.s.c.Config loaded config solrconfig.xml with version 0 
   [junit4]   2> 51074 INFO  (coreLoadExecutor-139-thread-1-processing-n:127.0.0.1:52664_gx) [n:127.0.0.1:52664_gx c:collection1   x:collection1] o.a.s.c.SolrConfig current version of requestparams : -1
   [junit4]   2> 51096 INFO  (coreLoadExecutor-139-thread-1-processing-n:127.0.0.1:52664_gx) [n:127.0.0.1:52664_gx c:collection1   x:collection1] o.a.s.c.SolrConfig Using Lucene MatchVersion: 6.0.0
   [junit4]   2> 51113 INFO  (coreLoadExecutor-139-thread-1-processing-n:127.0.0.1:52664_gx) [n:127.0.0.1:52664_gx c:collection1   x:collection1] o.a.s.c.Config Loaded SolrConfig: solrconfig.xml
   [junit4]   2> 51114 INFO  (coreLoadExecutor-139-thread-1-processing-n:127.0.0.1:52664_gx) [n:127.0.0.1:52664_gx c:collection1   x:collection1] o.a.s.s.IndexSchema Reading Solr Schema from /configs/conf1/schema.xml
   [junit4]   2> 51125 INFO  (coreLoadExecutor-139-thread-1-processing-n:127.0.0.1:52664_gx) [n:127.0.0.1:52664_gx c:collection1   x:collection1] o.a.s.s.IndexSchema [collection1] Schema name=test
   [junit4]   2> 51290 INFO  (coreLoadExecutor-139-thread-1-processing-n:127.0.0.1:52664_gx) [n:127.0.0.1:52664_gx c:collection1   x:collection1] o.a.s.s.IndexSchema default search field in schema is text
   [junit4]   2> 51295 INFO  (coreLoadExecutor-139-thread-1-processing-n:127.0.0.1:52664_gx) [n:127.0.0.1:52664_gx c:collection1   x:collection1] o.a.s.s.IndexSchema unique key field: id
   [junit4]   2> 51297 WARN  (coreLoadExecutor-139-thread-1-processing-n:127.0.0.1:52664_gx) [n:127.0.0.1:52664_gx c:collection1   x:collection1] o.a.s.s.IndexSchema Field lowerfilt1and2 is not multivalued and destination for multiple copyFields (2)
   [junit4]   2> 51298 WARN  (coreLoadExecutor-139-thread-1-processing-n:127.0.0.1:52664_gx) [n:127.0.0.1:52664_gx c:collection1   x:collection1] o.a.s.s.IndexSchema Field text is not multivalued and destination for multiple copyFields (3)
   [junit4]   2> 51301 INFO  (coreLoadExecutor-139-thread-1-processing-n:127.0.0.1:52664_gx) [n:127.0.0.1:52664_gx c:collection1   x:collection1] o.a.s.c.ConfigSetProperties Did not find ConfigSet properties, assuming default properties: Can't find resource 'configsetprops.json' in classpath or '/configs/conf1', cwd=/home/jenkins/workspace/Lucene-Solr-trunk-Linux/solr/build/solr-solrj/test/J1
   [junit4]   2> 51302 INFO  (coreLoadExecutor-139-thread-1-processing-n:127.0.0.1:52664_gx) [n:127.0.0.1:52664_gx c:collection1   x:collection1] o.a.s.c.CoreContainer Creating SolrCore 'collection1' using configuration from collection collection1
   [junit4]   2> 51302 INFO  (coreLoadExecutor-139-thread-1-processing-n:127.0.0.1:52664_gx) [n:127.0.0.1:52664_gx c:collection1 s:shard2 r:core_node1 x:collection1] o.a.s.c.SolrCore org.apache.solr.core.MockDirectoryFactory
   [junit4]   2> 51303 INFO  (coreLoadExecutor-139-thread-1-processing-n:127.0.0.1:52664_gx) [n:127.0.0.1:52664_gx c:collection1 s:shard2 r:core_node1 x:collection1] o.a.s.c.SolrCore [[collection1] ] Opening new SolrCore at [/home/jenkins/workspace/Lucene-Solr-trunk-Linux/solr/build/solr-solrj/test/J1/temp/solr.client.solrj.impl.CloudSolrClientTest_D1A4036987FD3D7A-001/shard-1-001/cores/collection1/], dataDir=[null]
   [junit4]   2> 51303 INFO  (coreLoadExecutor-139-thread-1-processing-n:127.0.0.1:52664_gx) [n:127.0.0.1:52664_gx c:collection1 s:shard2 r:core_node1 x:collection1] o.a.s.c.SolrCore JMX monitoring not detected for core: collection1
   [junit4]   2> 51304 INFO  (coreLoadExecutor-139-thread-1-processing-n:127.0.0.1:52664_gx) [n:127.0.0.1:52664_gx c:collection1 s:shard2 r:core_node1 x:collection1] o.a.s.c.CachingDirectoryFactory return new directory for /home/jenkins/workspace/Lucene-Solr-trunk-Linux/solr/build/solr-solrj/test/J1/temp/solr.client.solrj.impl.CloudSolrClientTest_D1A4036987FD3D7A-001/shard-1-001/cores/collection1/data
   [junit4]   2> 51305 INFO  (coreLoadExecutor-139-thread-1-processing-n:127.0.0.1:52664_gx) [n:127.0.0.1:52664_gx c:collection1 s:shard2 r:core_node1 x:collection1] o.a.s.c.SolrCore New index directory detected: old=null new=/home/jenkins/workspace/Lucene-Solr-trunk-Linux/solr/build/solr-solrj/test/J1/temp/solr.client.solrj.impl.CloudSolrClientTest_D1A4036987FD3D7A-001/shard-1-001/cores/collection1/data/index/
   [junit4]   2> 51305 WARN  (coreLoadExecutor-139-thread-1-processing-n:127.0.0.1:52664_gx) [n:127.0.0.1:52664_gx c:collection1 s:shard2 r:core_node1 x:collection1] o.a.s.c.SolrCore [collection1] Solr index directory '/home/jenkins/workspace/Lucene-Solr-trunk-Linux/solr/build/solr-solrj/test/J1/temp/solr.client.solrj.impl.CloudSolrClientTest_D1A4036987FD3D7A-001/shard-1-001/cores/collection1/data/index' doesn't exist. Creating new index...
   [junit4]   2> 51306 INFO  (coreLoadExecutor-139-thread-1-processing-n:127.0.0.1:52664_gx) [n:127.0.0.1:52664_gx c:collection1 s:shard2 r:core_node1 x:collection1] o.a.s.c.CachingDirectoryFactory return new directory for /home/jenkins/workspace/Lucene-Solr-trunk-Linux/solr/build/solr-solrj/test/J1/temp/solr.client.solrj.impl.CloudSolrClientTest_D1A4036987FD3D7A-001/shard-1-001/cores/collection1/data/index
   [junit4]   2> 51307 INFO  (coreLoadExecutor-139-thread-1-processing-n:127.0.0.1:52664_gx) [n:127.0.0.1:52664_gx c:collection1 s:shard2 r:core_node1 x:collection1] o.a.s.c.SolrCore SolrDeletionPolicy.onCommit: commits: num=1
   [junit4]   2> 	commit{dir=MockDirectoryWrapper(RAMDirectory@16212c7 lockFactory=org.apache.lucene.store.SingleInstanceLockFactory@74b61a),segFN=segments_1,generation=1}
   [junit4]   2> 51307 INFO  (coreLoadExecutor-139-thread-1-processing-n:127.0.0.1:52664_gx) [n:127.0.0.1:52664_gx c:collection1 s:shard2 r:core_node1 x:collection1] o.a.s.c.SolrCore newest commit generation = 1
   [junit4]   2> 51308 INFO  (OldIndexDirectoryCleanupThreadForCore-collection1) [n:127.0.0.1:52664_gx c:collection1 s:shard2 r:core_node1 x:collection1] o.a.s.c.SolrCore Looking for old index directories to cleanup for core collection1 in /home/jenkins/workspace/Lucene-Solr-trunk-Linux/solr/build/solr-solrj/test/J1/temp/solr.client.solrj.impl.CloudSolrClientTest_D1A4036987FD3D7A-001/shard-1-001/cores/collection1/data/
   [junit4]   2> 51309 WARN  (OldIndexDirectoryCleanupThreadForCore-collection1) [n:127.0.0.1:52664_gx c:collection1 s:shard2 r:core_node1 x:collection1] o.a.s.c.DirectoryFactory /home/jenkins/workspace/Lucene-Solr-trunk-Linux/solr/build/solr-solrj/test/J1/temp/solr.client.solrj.impl.CloudSolrClientTest_D1A4036987FD3D7A-001/shard-1-001/cores/collection1/data/ does not point to a valid data directory; skipping clean-up of old index directories.
   [junit4]   2> 51310 INFO  (coreLoadExecutor-139-thread-1-processing-n:127.0.0.1:52664_gx) [n:127.0.0.1:52664_gx c:collection1 s:shard2 r:core_node1 x:collection1] o.a.s.c.SolrCore no updateRequestProcessorChain defined as default, creating implicit default
   [junit4]   2> 51312 INFO  (coreLoadExecutor-139-thread-1-processing-n:127.0.0.1:52664_gx) [n:127.0.0.1:52664_gx c:collection1 s:shard2 r:core_node1 x:collection1] o.a.s.h.l.XMLLoader xsltCacheLifetimeSeconds=60
   [junit4]   2> 51313 INFO  (coreLoadExecutor-139-thread-1-processing-n:127.0.0.1:52664_gx) [n:127.0.0.1:52664_gx c:collection1 s:shard2 r:core_node1 x:collection1] o.a.s.h.l.XMLLoader xsltCacheLifetimeSeconds=60
   [junit4]   2> 51314 INFO  (coreLoadExecutor-139-thread-1-processing-n:127.0.0.1:52664_gx) [n:127.0.0.1:52664_gx c:collection1 s:shard2 r:core_node1 x:collection1] o.a.s.h.l.XMLLoader xsltCacheLifetimeSeconds=60
   [junit4]   2> 51315 INFO  (coreLoadExecutor-139-thread-1-processing-n:127.0.0.1:52664_gx) [n:127.0.0.1:52664_gx c:collection1 s:shard2 r:core_node1 x:collection1] o.a.s.h.l.XMLLoader xsltCacheLifetimeSeconds=60
   [junit4]   2> 51322 INFO  (coreLoadExecutor-139-thread-1-processing-n:127.0.0.1:52664_gx) [n:127.0.0.1:52664_gx c:collection1 s:shard2 r:core_node1 x:collection1] o.a.s.c.RequestHandlers Registered paths: /admin/mbeans,standard,,/update/csv,/update/json/docs,/admin/luke,/admin/segments,/get,/admin/system,/replication,/admin/properties,/config,/schema,/admin/plugins,/admin/logging,/update/json,/admin/threads,/admin/ping,/update,/admin/file
   [junit4]   2> 51322 WARN  (coreLoadExecutor-139-thread-1-processing-n:127.0.0.1:52664_gx) [n:127.0.0.1:52664_gx c:collection1 s:shard2 r:core_node1 x:collection1] o.a.s.c.RequestHandlers no default request handler is registered (either '/select' or 'standard')
   [junit4]   2> 51323 INFO  (coreLoadExecutor-139-thread-1-processing-n:127.0.0.1:52664_gx) [n:127.0.0.1:52664_gx c:collection1 s:shard2 r:core_node1 x:collection1] o.a.s.c.SolrCore Using default statsCache cache: org.apache.solr.search.stats.LocalStatsCache
   [junit4]   2> 51324 INFO  (coreLoadExecutor-139-thread-1-processing-n:127.0.0.1:52664_gx) [n:127.0.0.1:52664_gx c:collection1 s:shard2 r:core_node1 x:collection1] o.a.s.u.UpdateHandler Using UpdateLog implementation: org.apache.solr.update.UpdateLog
   [junit4]   2> 51324 INFO  (coreLoadExecutor-139-thread-1-processing-n:127.0.0.1:52664_gx) [n:127.0.0.1:52664_gx c:collection1 s:shard2 r:core_node1 x:collection1] o.a.s.u.UpdateLog Initializing UpdateLog: dataDir= defaultSyncLevel=FLUSH numRecordsToKeep=100 maxNumLogsToKeep=10 numVersionBuckets=65536
   [junit4]   2> 51325 INFO  (coreLoadExecutor-139-thread-1-processing-n:127.0.0.1:52664_gx) [n:127.0.0.1:52664_gx c:collection1 s:shard2 r:core_node1 x:collection1] o.a.s.c.SolrCore Hard AutoCommit: disabled
   [junit4]   2> 51326 INFO  (coreLoadExecutor-139-thread-1-processing-n:127.0.0.1:52664_gx) [n:127.0.0.1:52664_gx c:collection1 s:shard2 r:core_node1 x:collection1] o.a.s.c.SolrCore Soft AutoCommit: disabled
   [junit4]   2> 51326 INFO  (coreLoadExecutor-139-thread-1-processing-n:127.0.0.1:52664_gx) [n:127.0.0.1:52664_gx c:collection1 s:shard2 r:core_node1 x:collection1] o.a.s.c.SolrCore SolrDeletionPolicy.onInit: commits: num=1
   [junit4]   2> 	commit{dir=MockDirectoryWrapper(RAMDirectory@16212c7 lockFactory=org.apache.lucene.store.SingleInstanceLockFactory@74b61a),segFN=segments_1,generation=1}
   [junit4]   2> 51327 INFO  (coreLoadExecutor-139-thread-1-processing-n:127.0.0.1:52664_gx) [n:127.0.0.1:52664_gx c:collection1 s:shard2 r:core_node1 x:collection1] o.a.s.c.SolrCore newest commit generation = 1
   [junit4]   2> 51327 INFO  (coreLoadExecutor-139-thread-1-processing-n:127.0.0.1:52664_gx) [n:127.0.0.1:52664_gx c:collection1 s:shard2 r:core_node1 x:collection1] o.a.s.s.SolrIndexSearcher Opening Searcher@5c1b2d[collection1] main
   [junit4]   2> 51328 INFO  (coreLoadExecutor-139-thread-1-processing-n:127.0.0.1:52664_gx) [n:127.0.0.1:52664_gx c:collection1 s:shard2 r:core_node1 x:collection1] o.a.s.c.c.ZkStateReader Load collection config from:/collections/collection1
   [junit4]   2> 51329 INFO  (coreLoadExecutor-139-thread-1-processing-n:127.0.0.1:52664_gx) [n:127.0.0.1:52664_gx c:collection1 s:shard2 r:core_node1 x:collection1] o.a.s.c.c.ZkStateReader path=/collections/collection1 configName=conf1 specified config exists in ZooKeeper
   [junit4]   2> 51329 INFO  (coreLoadExecutor-139-thread-1-processing-n:127

[...truncated too long message...]

D1A4036987FD3D7A-001/shard-3-003/cores/collection1/data;done=false>>]
   [junit4]   2> 131864 INFO  (zkCallback-113-thread-2-processing-n:127.0.0.1:42152_gx) [n:127.0.0.1:42152_gx c:collection1 s:shard2 r:core_node3 x:collection1] o.a.s.c.CachingDirectoryFactory Closing directory: /home/jenkins/workspace/Lucene-Solr-trunk-Linux/solr/build/solr-solrj/test/J1/../../../../../../../../../home/jenkins/workspace/Lucene-Solr-trunk-Linux/solr/build/solr-solrj/test/J1/temp/solr.client.solrj.impl.CloudSolrClientTest_D1A4036987FD3D7A-001/shard-3-003/cores/collection1/data
   [junit4]   2> 131864 INFO  (zkCallback-113-thread-2-processing-n:127.0.0.1:42152_gx) [n:127.0.0.1:42152_gx c:collection1 s:shard2 r:core_node3 x:collection1] o.a.s.c.CachingDirectoryFactory looking to close /home/jenkins/workspace/Lucene-Solr-trunk-Linux/solr/build/solr-solrj/test/J1/../../../../../../../../../home/jenkins/workspace/Lucene-Solr-trunk-Linux/solr/build/solr-solrj/test/J1/temp/solr.client.solrj.impl.CloudSolrClientTest_D1A4036987FD3D7A-001/shard-3-003/cores/collection1/data/index [CachedDir<<refCount=0;path=/home/jenkins/workspace/Lucene-Solr-trunk-Linux/solr/build/solr-solrj/test/J1/../../../../../../../../../home/jenkins/workspace/Lucene-Solr-trunk-Linux/solr/build/solr-solrj/test/J1/temp/solr.client.solrj.impl.CloudSolrClientTest_D1A4036987FD3D7A-001/shard-3-003/cores/collection1/data/index;done=false>>]
   [junit4]   2> 131864 INFO  (zkCallback-113-thread-2-processing-n:127.0.0.1:42152_gx) [n:127.0.0.1:42152_gx c:collection1 s:shard2 r:core_node3 x:collection1] o.a.s.c.CachingDirectoryFactory Closing directory: /home/jenkins/workspace/Lucene-Solr-trunk-Linux/solr/build/solr-solrj/test/J1/../../../../../../../../../home/jenkins/workspace/Lucene-Solr-trunk-Linux/solr/build/solr-solrj/test/J1/temp/solr.client.solrj.impl.CloudSolrClientTest_D1A4036987FD3D7A-001/shard-3-003/cores/collection1/data/index
   [junit4]   2> 131864 WARN  (zkCallback-113-thread-2-processing-n:127.0.0.1:42152_gx) [n:127.0.0.1:42152_gx c:collection1 s:shard2 r:core_node3 x:collection1] o.a.s.c.LeaderElector 
   [junit4]   2> org.apache.solr.common.SolrException: org.apache.zookeeper.KeeperException$SessionExpiredException: KeeperErrorCode = Session expired for /overseer/queue
   [junit4]   2> 	at org.apache.solr.cloud.DistributedQueue.<init>(DistributedQueue.java:71)
   [junit4]   2> 	at org.apache.solr.cloud.Overseer.getInQueue(Overseer.java:897)
   [junit4]   2> 	at org.apache.solr.cloud.Overseer.getInQueue(Overseer.java:892)
   [junit4]   2> 	at org.apache.solr.cloud.ShardLeaderElectionContext.runLeaderProcess(ElectionContext.java:221)
   [junit4]   2> 	at org.apache.solr.cloud.LeaderElector.runIamLeaderProcess(LeaderElector.java:199)
   [junit4]   2> 	at org.apache.solr.cloud.LeaderElector.checkIfIamLeader(LeaderElector.java:159)
   [junit4]   2> 	at org.apache.solr.cloud.LeaderElector.joinElection(LeaderElector.java:348)
   [junit4]   2> 	at org.apache.solr.cloud.LeaderElector.joinElection(LeaderElector.java:257)
   [junit4]   2> 	at org.apache.solr.cloud.ShardLeaderElectionContext.rejoinLeaderElection(ElectionContext.java:481)
   [junit4]   2> 	at org.apache.solr.cloud.ShardLeaderElectionContext.runLeaderProcess(ElectionContext.java:238)
   [junit4]   2> 	at org.apache.solr.cloud.LeaderElector.runIamLeaderProcess(LeaderElector.java:199)
   [junit4]   2> 	at org.apache.solr.cloud.LeaderElector.checkIfIamLeader(LeaderElector.java:159)
   [junit4]   2> 	at org.apache.solr.cloud.LeaderElector.access$200(LeaderElector.java:56)
   [junit4]   2> 	at org.apache.solr.cloud.LeaderElector$ElectionWatcher.process(LeaderElector.java:390)
   [junit4]   2> 	at org.apache.solr.common.cloud.SolrZkClient$3$1.run(SolrZkClient.java:269)
   [junit4]   2> 	at java.util.concurrent.Executors$RunnableAdapter.call(Executors.java:511)
   [junit4]   2> 	at java.util.concurrent.FutureTask.run(FutureTask.java:266)
   [junit4]   2> 	at org.apache.solr.common.util.ExecutorUtil$MDCAwareThreadPoolExecutor$1.run(ExecutorUtil.java:210)
   [junit4]   2> 	at java.util.concurrent.ThreadPoolExecutor.runWorker(ThreadPoolExecutor.java:1142)
   [junit4]   2> 	at java.util.concurrent.ThreadPoolExecutor$Worker.run(ThreadPoolExecutor.java:617)
   [junit4]   2> 	at java.lang.Thread.run(Thread.java:745)
   [junit4]   2> Caused by: org.apache.zookeeper.KeeperException$SessionExpiredException: KeeperErrorCode = Session expired for /overseer/queue
   [junit4]   2> 	at org.apache.zookeeper.KeeperException.create(KeeperException.java:127)
   [junit4]   2> 	at org.apache.zookeeper.KeeperException.create(KeeperException.java:51)
   [junit4]   2> 	at org.apache.zookeeper.ZooKeeper.exists(ZooKeeper.java:1045)
   [junit4]   2> 	at org.apache.solr.common.cloud.SolrZkClient$5.execute(SolrZkClient.java:319)
   [junit4]   2> 	at org.apache.solr.common.cloud.SolrZkClient$5.execute(SolrZkClient.java:316)
   [junit4]   2> 	at org.apache.solr.common.cloud.ZkCmdExecutor.retryOperation(ZkCmdExecutor.java:61)
   [junit4]   2> 	at org.apache.solr.common.cloud.SolrZkClient.exists(SolrZkClient.java:316)
   [junit4]   2> 	at org.apache.solr.common.cloud.ZkCmdExecutor.ensureExists(ZkCmdExecutor.java:90)
   [junit4]   2> 	at org.apache.solr.common.cloud.ZkCmdExecutor.ensureExists(ZkCmdExecutor.java:84)
   [junit4]   2> 	at org.apache.solr.cloud.DistributedQueue.<init>(DistributedQueue.java:69)
   [junit4]   2> 	... 20 more
   [junit4]   2> 131866 INFO  (TEST-CloudSolrClientTest.testWrongZkChrootTest-seed#[D1A4036987FD3D7A]) [    ] o.e.j.s.ServerConnector Stopped ServerConnector@18661ae{HTTP/1.1}{127.0.0.1:0}
   [junit4]   2> 131866 INFO  (TEST-CloudSolrClientTest.testWrongZkChrootTest-seed#[D1A4036987FD3D7A]) [    ] o.e.j.s.h.ContextHandler Stopped o.e.j.s.ServletContextHandler@7a6975{/gx,null,UNAVAILABLE}
   [junit4]   2> 131870 INFO  (TEST-CloudSolrClientTest.testWrongZkChrootTest-seed#[D1A4036987FD3D7A]) [n:127.0.0.1:42152_gx c:collection1 s:shard2 r:core_node3 x:collection1] o.a.s.c.ChaosMonkey monkey: stop shard! 49151
   [junit4]   2> 131871 INFO  (TEST-CloudSolrClientTest.testWrongZkChrootTest-seed#[D1A4036987FD3D7A]) [n:127.0.0.1:42152_gx c:collection1 s:shard2 r:core_node3 x:collection1] o.a.s.c.ZkTestServer connecting to 127.0.0.1:47586 47586
   [junit4]   2> 131946 INFO  (Thread-249) [n:127.0.0.1:56021_gx c:collection1 s:shard2 r:core_node3 x:collection1] o.a.s.c.ZkTestServer connecting to 127.0.0.1:47586 47586
   [junit4]   2> 131946 WARN  (Thread-249) [n:127.0.0.1:56021_gx c:collection1 s:shard2 r:core_node3 x:collection1] o.a.s.c.ZkTestServer Watch limit violations: 
   [junit4]   2> Maximum concurrent create/delete watches above limit:
   [junit4]   2> 
   [junit4]   2> 	5	/solr/aliases.json
   [junit4]   2> 	4	/solr/security.json
   [junit4]   2> 	4	/solr/configs/conf1
   [junit4]   2> 
   [junit4]   2> Maximum concurrent data watches above limit:
   [junit4]   2> 
   [junit4]   2> 	5	/solr/clusterstate.json
   [junit4]   2> 
   [junit4]   2> Maximum concurrent children watches above limit:
   [junit4]   2> 
   [junit4]   2> 	5	/solr/live_nodes
   [junit4]   2> 	3	/solr/overseer/collection-queue-work
   [junit4]   2> 	2	/solr/overseer/queue
   [junit4]   2> 
   [junit4]   2> 131948 INFO  (SUITE-CloudSolrClientTest-seed#[D1A4036987FD3D7A]-worker) [n:127.0.0.1:42152_gx c:collection1 s:shard2 r:core_node3 x:collection1] o.a.s.SolrTestCaseJ4 ###deleteCore
   [junit4]   2> NOTE: leaving temporary files on disk at: /home/jenkins/workspace/Lucene-Solr-trunk-Linux/solr/build/solr-solrj/test/J1/temp/solr.client.solrj.impl.CloudSolrClientTest_D1A4036987FD3D7A-001
   [junit4]   2> Aug 19, 2015 5:41:11 PM com.carrotsearch.randomizedtesting.ThreadLeakControl checkThreadLeaks
   [junit4]   2> WARNING: Will linger awaiting termination of 2 leaked thread(s).
   [junit4]   2> NOTE: test params are: codec=Asserting(Lucene53): {_version_=PostingsFormat(name=LuceneVarGapDocFreqInterval), multiDefault=FSTOrd50, a_t=FSTOrd50, intDefault=PostingsFormat(name=LuceneVarGapDocFreqInterval), id=PostingsFormat(name=MockRandom), text=BlockTreeOrds(blocksize=128), range_facet_l=FSTOrd50, timestamp=FSTOrd50}, docValues:{}, sim=RandomSimilarityProvider(queryNorm=true,coord=yes): {}, locale=vi_VN, timezone=Asia/Jerusalem
   [junit4]   2> NOTE: Linux 3.19.0-25-generic i386/Oracle Corporation 1.8.0_60-ea (32-bit)/cpus=12,threads=1,free=17766256,total=99282944
   [junit4]   2> NOTE: All tests run in this JVM: [MergeIndexesEmbeddedTest, SolrExampleEmbeddedTest, TestSolrProperties, SolrDocumentTest, QueryResponseTest, BasicHttpSolrClientTest, TestCloudSolrClientConnections, DocumentAnalysisResponseTest, CommonAdminParamsTest, SolrExampleStreamingBinaryTest, CloudSolrClientMultiConstructorTest, CloudSolrClientTest]
   [junit4] Completed [66/66] on J1 in 85.84s, 3 tests, 1 error <<< FAILURES!

[...truncated 11 lines...]
BUILD FAILED
/home/jenkins/workspace/Lucene-Solr-trunk-Linux/build.xml:775: The following error occurred while executing this line:
/home/jenkins/workspace/Lucene-Solr-trunk-Linux/build.xml:719: The following error occurred while executing this line:
/home/jenkins/workspace/Lucene-Solr-trunk-Linux/build.xml:59: The following error occurred while executing this line:
/home/jenkins/workspace/Lucene-Solr-trunk-Linux/solr/build.xml:246: The following error occurred while executing this line:
/home/jenkins/workspace/Lucene-Solr-trunk-Linux/solr/common-build.xml:514: The following error occurred while executing this line:
/home/jenkins/workspace/Lucene-Solr-trunk-Linux/lucene/common-build.xml:1431: The following error occurred while executing this line:
/home/jenkins/workspace/Lucene-Solr-trunk-Linux/lucene/common-build.xml:986: There were test failures: 66 suites, 463 tests, 1 error

Total time: 58 minutes 1 second
Build step 'Invoke Ant' marked build as failure
Archiving artifacts
[WARNINGS] Skipping publisher since build result is FAILURE
Recording test results
Email was triggered for: Failure - Any
Sending email for trigger: Failure - Any



Mime
View raw message