lucene-dev mailing list archives

Site index · List index
Message view « Date » · « Thread »
Top « Date » · « Thread »
From Policeman Jenkins Server <jenk...@thetaphi.de>
Subject [JENKINS-EA] Lucene-Solr-trunk-Linux (32bit/jdk1.9.0-ea-b60) - Build # 13713 - Failure!
Date Mon, 03 Aug 2015 09:56:13 GMT
Build: http://jenkins.thetaphi.de/job/Lucene-Solr-trunk-Linux/13713/
Java: 32bit/jdk1.9.0-ea-b60 -server -XX:+UseG1GC -Djava.locale.providers=JRE,SPI

1 tests failed.
FAILED:  org.apache.solr.cloud.CdcrReplicationDistributedZkTest.doTests

Error Message:
Timeout waiting for CDCR replication to complete @source_collection:shard1

Stack Trace:
java.lang.RuntimeException: Timeout waiting for CDCR replication to complete @source_collection:shard1
	at __randomizedtesting.SeedInfo.seed([21435AB8DC35042:A74408782CD7849]:0)
	at org.apache.solr.cloud.BaseCdcrDistributedZkTest.waitForReplicationToComplete(BaseCdcrDistributedZkTest.java:732)
	at org.apache.solr.cloud.CdcrReplicationDistributedZkTest.doTestUpdateLogSynchronisation(CdcrReplicationDistributedZkTest.java:361)
	at org.apache.solr.cloud.CdcrReplicationDistributedZkTest.doTests(CdcrReplicationDistributedZkTest.java:50)
	at sun.reflect.NativeMethodAccessorImpl.invoke0(Native Method)
	at sun.reflect.NativeMethodAccessorImpl.invoke(NativeMethodAccessorImpl.java:62)
	at sun.reflect.DelegatingMethodAccessorImpl.invoke(DelegatingMethodAccessorImpl.java:43)
	at java.lang.reflect.Method.invoke(Method.java:502)
	at com.carrotsearch.randomizedtesting.RandomizedRunner.invoke(RandomizedRunner.java:1627)
	at com.carrotsearch.randomizedtesting.RandomizedRunner$6.evaluate(RandomizedRunner.java:836)
	at com.carrotsearch.randomizedtesting.RandomizedRunner$7.evaluate(RandomizedRunner.java:872)
	at com.carrotsearch.randomizedtesting.RandomizedRunner$8.evaluate(RandomizedRunner.java:886)
	at org.apache.solr.BaseDistributedSearchTestCase$ShardsRepeatRule$ShardsFixedStatement.callStatement(BaseDistributedSearchTestCase.java:966)
	at org.apache.solr.BaseDistributedSearchTestCase$ShardsRepeatRule$ShardsStatement.evaluate(BaseDistributedSearchTestCase.java:941)
	at com.carrotsearch.randomizedtesting.rules.SystemPropertiesRestoreRule$1.evaluate(SystemPropertiesRestoreRule.java:57)
	at org.apache.lucene.util.TestRuleSetupTeardownChained$1.evaluate(TestRuleSetupTeardownChained.java:50)
	at org.apache.lucene.util.AbstractBeforeAfterRule$1.evaluate(AbstractBeforeAfterRule.java:46)
	at org.apache.lucene.util.TestRuleThreadAndTestName$1.evaluate(TestRuleThreadAndTestName.java:49)
	at org.apache.lucene.util.TestRuleIgnoreAfterMaxFailures$1.evaluate(TestRuleIgnoreAfterMaxFailures.java:65)
	at org.apache.lucene.util.TestRuleMarkFailure$1.evaluate(TestRuleMarkFailure.java:48)
	at com.carrotsearch.randomizedtesting.rules.StatementAdapter.evaluate(StatementAdapter.java:36)
	at com.carrotsearch.randomizedtesting.ThreadLeakControl$StatementRunner.run(ThreadLeakControl.java:365)
	at com.carrotsearch.randomizedtesting.ThreadLeakControl.forkTimeoutingTask(ThreadLeakControl.java:798)
	at com.carrotsearch.randomizedtesting.ThreadLeakControl$3.evaluate(ThreadLeakControl.java:458)
	at com.carrotsearch.randomizedtesting.RandomizedRunner.runSingleTest(RandomizedRunner.java:845)
	at com.carrotsearch.randomizedtesting.RandomizedRunner$3.evaluate(RandomizedRunner.java:747)
	at com.carrotsearch.randomizedtesting.RandomizedRunner$4.evaluate(RandomizedRunner.java:781)
	at com.carrotsearch.randomizedtesting.RandomizedRunner$5.evaluate(RandomizedRunner.java:792)
	at com.carrotsearch.randomizedtesting.rules.StatementAdapter.evaluate(StatementAdapter.java:36)
	at com.carrotsearch.randomizedtesting.rules.SystemPropertiesRestoreRule$1.evaluate(SystemPropertiesRestoreRule.java:57)
	at org.apache.lucene.util.AbstractBeforeAfterRule$1.evaluate(AbstractBeforeAfterRule.java:46)
	at com.carrotsearch.randomizedtesting.rules.StatementAdapter.evaluate(StatementAdapter.java:36)
	at org.apache.lucene.util.TestRuleStoreClassName$1.evaluate(TestRuleStoreClassName.java:42)
	at com.carrotsearch.randomizedtesting.rules.NoShadowingOrOverridesOnMethodsRule$1.evaluate(NoShadowingOrOverridesOnMethodsRule.java:39)
	at com.carrotsearch.randomizedtesting.rules.NoShadowingOrOverridesOnMethodsRule$1.evaluate(NoShadowingOrOverridesOnMethodsRule.java:39)
	at com.carrotsearch.randomizedtesting.rules.StatementAdapter.evaluate(StatementAdapter.java:36)
	at com.carrotsearch.randomizedtesting.rules.StatementAdapter.evaluate(StatementAdapter.java:36)
	at com.carrotsearch.randomizedtesting.rules.StatementAdapter.evaluate(StatementAdapter.java:36)
	at org.apache.lucene.util.TestRuleAssertionsRequired$1.evaluate(TestRuleAssertionsRequired.java:54)
	at org.apache.lucene.util.TestRuleMarkFailure$1.evaluate(TestRuleMarkFailure.java:48)
	at org.apache.lucene.util.TestRuleIgnoreAfterMaxFailures$1.evaluate(TestRuleIgnoreAfterMaxFailures.java:65)
	at org.apache.lucene.util.TestRuleIgnoreTestSuites$1.evaluate(TestRuleIgnoreTestSuites.java:55)
	at com.carrotsearch.randomizedtesting.rules.StatementAdapter.evaluate(StatementAdapter.java:36)
	at com.carrotsearch.randomizedtesting.ThreadLeakControl$StatementRunner.run(ThreadLeakControl.java:365)
	at java.lang.Thread.run(Thread.java:745)




Build Log:
[...truncated 10171 lines...]
   [junit4] Suite: org.apache.solr.cloud.CdcrReplicationDistributedZkTest
   [junit4]   2> Creating dataDir: /home/jenkins/workspace/Lucene-Solr-trunk-Linux/solr/build/solr-core/test/J0/temp/solr.cloud.CdcrReplicationDistributedZkTest_21435AB8DC35042-001/init-core-data-001
   [junit4]   2> 250445 INFO  (SUITE-CdcrReplicationDistributedZkTest-seed#[21435AB8DC35042]-worker) [    ] o.a.s.SolrTestCaseJ4 Randomized ssl (true) and clientAuth (false)
   [junit4]   2> 250445 INFO  (SUITE-CdcrReplicationDistributedZkTest-seed#[21435AB8DC35042]-worker) [    ] o.a.s.BaseDistributedSearchTestCase Setting hostContext system property: /
   [junit4]   2> 250447 INFO  (TEST-CdcrReplicationDistributedZkTest.doTests-seed#[21435AB8DC35042]) [    ] o.a.s.c.ZkTestServer STARTING ZK TEST SERVER
   [junit4]   2> 250447 INFO  (Thread-1198) [    ] o.a.s.c.ZkTestServer client port:0.0.0.0/0.0.0.0:0
   [junit4]   2> 250447 INFO  (Thread-1198) [    ] o.a.s.c.ZkTestServer Starting server
   [junit4]   2> 250547 INFO  (TEST-CdcrReplicationDistributedZkTest.doTests-seed#[21435AB8DC35042]) [    ] o.a.s.c.ZkTestServer start zk server on port:46780
   [junit4]   2> 250547 INFO  (TEST-CdcrReplicationDistributedZkTest.doTests-seed#[21435AB8DC35042]) [    ] o.a.s.c.c.SolrZkClient Using default ZkCredentialsProvider
   [junit4]   2> 250548 INFO  (TEST-CdcrReplicationDistributedZkTest.doTests-seed#[21435AB8DC35042]) [    ] o.a.s.c.c.ConnectionManager Waiting for client to connect to ZooKeeper
   [junit4]   2> 250550 INFO  (zkCallback-181-thread-1) [    ] o.a.s.c.c.ConnectionManager Watcher org.apache.solr.common.cloud.ConnectionManager@1f26856 name:ZooKeeperConnection Watcher:127.0.0.1:46780 got event WatchedEvent state:SyncConnected type:None path:null path:null type:None
   [junit4]   2> 250551 INFO  (TEST-CdcrReplicationDistributedZkTest.doTests-seed#[21435AB8DC35042]) [    ] o.a.s.c.c.ConnectionManager Client is connected to ZooKeeper
   [junit4]   2> 250551 INFO  (TEST-CdcrReplicationDistributedZkTest.doTests-seed#[21435AB8DC35042]) [    ] o.a.s.c.c.SolrZkClient Using default ZkACLProvider
   [junit4]   2> 250551 INFO  (TEST-CdcrReplicationDistributedZkTest.doTests-seed#[21435AB8DC35042]) [    ] o.a.s.c.c.SolrZkClient makePath: /solr
   [junit4]   2> 250567 INFO  (TEST-CdcrReplicationDistributedZkTest.doTests-seed#[21435AB8DC35042]) [    ] o.a.s.c.c.SolrZkClient Using default ZkCredentialsProvider
   [junit4]   2> 250567 INFO  (TEST-CdcrReplicationDistributedZkTest.doTests-seed#[21435AB8DC35042]) [    ] o.a.s.c.c.ConnectionManager Waiting for client to connect to ZooKeeper
   [junit4]   2> 250569 INFO  (zkCallback-182-thread-1) [    ] o.a.s.c.c.ConnectionManager Watcher org.apache.solr.common.cloud.ConnectionManager@15fb1b name:ZooKeeperConnection Watcher:127.0.0.1:46780/solr got event WatchedEvent state:SyncConnected type:None path:null path:null type:None
   [junit4]   2> 250569 INFO  (TEST-CdcrReplicationDistributedZkTest.doTests-seed#[21435AB8DC35042]) [    ] o.a.s.c.c.ConnectionManager Client is connected to ZooKeeper
   [junit4]   2> 250569 INFO  (TEST-CdcrReplicationDistributedZkTest.doTests-seed#[21435AB8DC35042]) [    ] o.a.s.c.c.SolrZkClient Using default ZkACLProvider
   [junit4]   2> 250569 INFO  (TEST-CdcrReplicationDistributedZkTest.doTests-seed#[21435AB8DC35042]) [    ] o.a.s.c.c.SolrZkClient makePath: /collections/collection1
   [junit4]   2> 250570 INFO  (TEST-CdcrReplicationDistributedZkTest.doTests-seed#[21435AB8DC35042]) [    ] o.a.s.c.c.SolrZkClient makePath: /collections/collection1/shards
   [junit4]   2> 250571 INFO  (TEST-CdcrReplicationDistributedZkTest.doTests-seed#[21435AB8DC35042]) [    ] o.a.s.c.c.SolrZkClient makePath: /collections/control_collection
   [junit4]   2> 250572 INFO  (TEST-CdcrReplicationDistributedZkTest.doTests-seed#[21435AB8DC35042]) [    ] o.a.s.c.c.SolrZkClient makePath: /collections/control_collection/shards
   [junit4]   2> 250573 INFO  (TEST-CdcrReplicationDistributedZkTest.doTests-seed#[21435AB8DC35042]) [    ] o.a.s.c.AbstractZkTestCase put /home/jenkins/workspace/Lucene-Solr-trunk-Linux/solr/core/src/test-files/solr/collection1/conf/solrconfig-cdcr.xml to /configs/conf1/solrconfig.xml
   [junit4]   2> 250573 INFO  (TEST-CdcrReplicationDistributedZkTest.doTests-seed#[21435AB8DC35042]) [    ] o.a.s.c.c.SolrZkClient makePath: /configs/conf1/solrconfig.xml
   [junit4]   2> 250574 INFO  (TEST-CdcrReplicationDistributedZkTest.doTests-seed#[21435AB8DC35042]) [    ] o.a.s.c.AbstractZkTestCase put /home/jenkins/workspace/Lucene-Solr-trunk-Linux/solr/core/src/test-files/solr/collection1/conf/schema15.xml to /configs/conf1/schema.xml
   [junit4]   2> 250574 INFO  (TEST-CdcrReplicationDistributedZkTest.doTests-seed#[21435AB8DC35042]) [    ] o.a.s.c.c.SolrZkClient makePath: /configs/conf1/schema.xml
   [junit4]   2> 250575 INFO  (TEST-CdcrReplicationDistributedZkTest.doTests-seed#[21435AB8DC35042]) [    ] o.a.s.c.AbstractZkTestCase put /home/jenkins/workspace/Lucene-Solr-trunk-Linux/solr/core/src/test-files/solr/collection1/conf/solrconfig.snippet.randomindexconfig.xml to /configs/conf1/solrconfig.snippet.randomindexconfig.xml
   [junit4]   2> 250576 INFO  (TEST-CdcrReplicationDistributedZkTest.doTests-seed#[21435AB8DC35042]) [    ] o.a.s.c.c.SolrZkClient makePath: /configs/conf1/solrconfig.snippet.randomindexconfig.xml
   [junit4]   2> 250576 INFO  (TEST-CdcrReplicationDistributedZkTest.doTests-seed#[21435AB8DC35042]) [    ] o.a.s.c.AbstractZkTestCase put /home/jenkins/workspace/Lucene-Solr-trunk-Linux/solr/core/src/test-files/solr/collection1/conf/stopwords.txt to /configs/conf1/stopwords.txt
   [junit4]   2> 250576 INFO  (TEST-CdcrReplicationDistributedZkTest.doTests-seed#[21435AB8DC35042]) [    ] o.a.s.c.c.SolrZkClient makePath: /configs/conf1/stopwords.txt
   [junit4]   2> 250577 INFO  (TEST-CdcrReplicationDistributedZkTest.doTests-seed#[21435AB8DC35042]) [    ] o.a.s.c.AbstractZkTestCase put /home/jenkins/workspace/Lucene-Solr-trunk-Linux/solr/core/src/test-files/solr/collection1/conf/protwords.txt to /configs/conf1/protwords.txt
   [junit4]   2> 250578 INFO  (TEST-CdcrReplicationDistributedZkTest.doTests-seed#[21435AB8DC35042]) [    ] o.a.s.c.c.SolrZkClient makePath: /configs/conf1/protwords.txt
   [junit4]   2> 250578 INFO  (TEST-CdcrReplicationDistributedZkTest.doTests-seed#[21435AB8DC35042]) [    ] o.a.s.c.AbstractZkTestCase put /home/jenkins/workspace/Lucene-Solr-trunk-Linux/solr/core/src/test-files/solr/collection1/conf/currency.xml to /configs/conf1/currency.xml
   [junit4]   2> 250578 INFO  (TEST-CdcrReplicationDistributedZkTest.doTests-seed#[21435AB8DC35042]) [    ] o.a.s.c.c.SolrZkClient makePath: /configs/conf1/currency.xml
   [junit4]   2> 250579 INFO  (TEST-CdcrReplicationDistributedZkTest.doTests-seed#[21435AB8DC35042]) [    ] o.a.s.c.AbstractZkTestCase put /home/jenkins/workspace/Lucene-Solr-trunk-Linux/solr/core/src/test-files/solr/collection1/conf/enumsConfig.xml to /configs/conf1/enumsConfig.xml
   [junit4]   2> 250579 INFO  (TEST-CdcrReplicationDistributedZkTest.doTests-seed#[21435AB8DC35042]) [    ] o.a.s.c.c.SolrZkClient makePath: /configs/conf1/enumsConfig.xml
   [junit4]   2> 250580 INFO  (TEST-CdcrReplicationDistributedZkTest.doTests-seed#[21435AB8DC35042]) [    ] o.a.s.c.AbstractZkTestCase put /home/jenkins/workspace/Lucene-Solr-trunk-Linux/solr/core/src/test-files/solr/collection1/conf/open-exchange-rates.json to /configs/conf1/open-exchange-rates.json
   [junit4]   2> 250580 INFO  (TEST-CdcrReplicationDistributedZkTest.doTests-seed#[21435AB8DC35042]) [    ] o.a.s.c.c.SolrZkClient makePath: /configs/conf1/open-exchange-rates.json
   [junit4]   2> 250581 INFO  (TEST-CdcrReplicationDistributedZkTest.doTests-seed#[21435AB8DC35042]) [    ] o.a.s.c.AbstractZkTestCase put /home/jenkins/workspace/Lucene-Solr-trunk-Linux/solr/core/src/test-files/solr/collection1/conf/mapping-ISOLatin1Accent.txt to /configs/conf1/mapping-ISOLatin1Accent.txt
   [junit4]   2> 250581 INFO  (TEST-CdcrReplicationDistributedZkTest.doTests-seed#[21435AB8DC35042]) [    ] o.a.s.c.c.SolrZkClient makePath: /configs/conf1/mapping-ISOLatin1Accent.txt
   [junit4]   2> 250582 INFO  (TEST-CdcrReplicationDistributedZkTest.doTests-seed#[21435AB8DC35042]) [    ] o.a.s.c.AbstractZkTestCase put /home/jenkins/workspace/Lucene-Solr-trunk-Linux/solr/core/src/test-files/solr/collection1/conf/old_synonyms.txt to /configs/conf1/old_synonyms.txt
   [junit4]   2> 250582 INFO  (TEST-CdcrReplicationDistributedZkTest.doTests-seed#[21435AB8DC35042]) [    ] o.a.s.c.c.SolrZkClient makePath: /configs/conf1/old_synonyms.txt
   [junit4]   2> 250583 INFO  (TEST-CdcrReplicationDistributedZkTest.doTests-seed#[21435AB8DC35042]) [    ] o.a.s.c.AbstractZkTestCase put /home/jenkins/workspace/Lucene-Solr-trunk-Linux/solr/core/src/test-files/solr/collection1/conf/synonyms.txt to /configs/conf1/synonyms.txt
   [junit4]   2> 250583 INFO  (TEST-CdcrReplicationDistributedZkTest.doTests-seed#[21435AB8DC35042]) [    ] o.a.s.c.c.SolrZkClient makePath: /configs/conf1/synonyms.txt
   [junit4]   2> 250584 INFO  (TEST-CdcrReplicationDistributedZkTest.doTests-seed#[21435AB8DC35042]) [    ] o.a.s.c.c.SolrZkClient Using default ZkCredentialsProvider
   [junit4]   2> 250585 INFO  (TEST-CdcrReplicationDistributedZkTest.doTests-seed#[21435AB8DC35042]) [    ] o.a.s.c.c.ConnectionManager Waiting for client to connect to ZooKeeper
   [junit4]   2> 250586 INFO  (zkCallback-183-thread-1) [    ] o.a.s.c.c.ConnectionManager Watcher org.apache.solr.common.cloud.ConnectionManager@17416c name:ZooKeeperConnection Watcher:127.0.0.1:46780/solr got event WatchedEvent state:SyncConnected type:None path:null path:null type:None
   [junit4]   2> 250586 INFO  (TEST-CdcrReplicationDistributedZkTest.doTests-seed#[21435AB8DC35042]) [    ] o.a.s.c.c.ConnectionManager Client is connected to ZooKeeper
   [junit4]   2> 250586 INFO  (TEST-CdcrReplicationDistributedZkTest.doTests-seed#[21435AB8DC35042]) [    ] o.a.s.c.c.SolrZkClient Using default ZkACLProvider
   [junit4]   2> 250587 INFO  (TEST-CdcrReplicationDistributedZkTest.doTests-seed#[21435AB8DC35042]) [    ] o.a.s.SolrTestCaseJ4 ###Starting doTests
   [junit4]   2> 250669 INFO  (TEST-CdcrReplicationDistributedZkTest.doTests-seed#[21435AB8DC35042]) [    ] o.a.s.SolrTestCaseJ4 Writing core.properties file to /home/jenkins/workspace/Lucene-Solr-trunk-Linux/solr/build/solr-core/test/J0/temp/solr.cloud.CdcrReplicationDistributedZkTest_21435AB8DC35042-001/jetty-001/cores/collection1
   [junit4]   2> 250671 INFO  (TEST-CdcrReplicationDistributedZkTest.doTests-seed#[21435AB8DC35042]) [    ] o.e.j.s.Server jetty-9.2.11.v20150529
   [junit4]   2> 250673 INFO  (TEST-CdcrReplicationDistributedZkTest.doTests-seed#[21435AB8DC35042]) [    ] o.e.j.s.h.ContextHandler Started o.e.j.s.ServletContextHandler@12f299{/,null,AVAILABLE}
   [junit4]   2> 250681 INFO  (TEST-CdcrReplicationDistributedZkTest.doTests-seed#[21435AB8DC35042]) [    ] o.e.j.s.ServerConnector Started ServerConnector@b5f21{SSL-http/1.1}{127.0.0.1:40112}
   [junit4]   2> 250682 INFO  (TEST-CdcrReplicationDistributedZkTest.doTests-seed#[21435AB8DC35042]) [    ] o.e.j.s.Server Started @252573ms
   [junit4]   2> 250682 INFO  (TEST-CdcrReplicationDistributedZkTest.doTests-seed#[21435AB8DC35042]) [    ] o.a.s.c.s.e.JettySolrRunner Jetty properties: {shards=shard1, hostContext=/, hostPort=40112, coreRootDirectory=/home/jenkins/workspace/Lucene-Solr-trunk-Linux/solr/build/solr-core/test/J0/temp/solr.cloud.CdcrReplicationDistributedZkTest_21435AB8DC35042-001/jetty-001/cores}
   [junit4]   2> 250683 INFO  (TEST-CdcrReplicationDistributedZkTest.doTests-seed#[21435AB8DC35042]) [    ] o.a.s.s.SolrDispatchFilter SolrDispatchFilter.init(): sun.misc.Launcher$AppClassLoader@1fe3ee3
   [junit4]   2> 250684 INFO  (TEST-CdcrReplicationDistributedZkTest.doTests-seed#[21435AB8DC35042]) [    ] o.a.s.c.SolrResourceLoader new SolrResourceLoader for directory: '/home/jenkins/workspace/Lucene-Solr-trunk-Linux/solr/build/solr-core/test/J0/temp/solr.cloud.CdcrReplicationDistributedZkTest_21435AB8DC35042-001/jetty-001/'
   [junit4]   2> 250694 INFO  (TEST-CdcrReplicationDistributedZkTest.doTests-seed#[21435AB8DC35042]) [    ] o.a.s.c.c.SolrZkClient Using default ZkCredentialsProvider
   [junit4]   2> 250694 INFO  (TEST-CdcrReplicationDistributedZkTest.doTests-seed#[21435AB8DC35042]) [    ] o.a.s.c.c.ConnectionManager Waiting for client to connect to ZooKeeper
   [junit4]   2> 250701 INFO  (zkCallback-184-thread-1) [    ] o.a.s.c.c.ConnectionManager Watcher org.apache.solr.common.cloud.ConnectionManager@1d8f30f name:ZooKeeperConnection Watcher:127.0.0.1:46780/solr got event WatchedEvent state:SyncConnected type:None path:null path:null type:None
   [junit4]   2> 250701 INFO  (TEST-CdcrReplicationDistributedZkTest.doTests-seed#[21435AB8DC35042]) [    ] o.a.s.c.c.ConnectionManager Client is connected to ZooKeeper
   [junit4]   2> 250701 INFO  (TEST-CdcrReplicationDistributedZkTest.doTests-seed#[21435AB8DC35042]) [    ] o.a.s.c.c.SolrZkClient Using default ZkACLProvider
   [junit4]   2> 250704 INFO  (TEST-CdcrReplicationDistributedZkTest.doTests-seed#[21435AB8DC35042]) [    ] o.a.s.s.SolrDispatchFilter Loading solr.xml from SolrHome (not found in ZooKeeper)
   [junit4]   2> 250704 INFO  (TEST-CdcrReplicationDistributedZkTest.doTests-seed#[21435AB8DC35042]) [    ] o.a.s.c.SolrXmlConfig Loading container configuration from /home/jenkins/workspace/Lucene-Solr-trunk-Linux/solr/build/solr-core/test/J0/temp/solr.cloud.CdcrReplicationDistributedZkTest_21435AB8DC35042-001/jetty-001/solr.xml
   [junit4]   2> 250707 INFO  (TEST-CdcrReplicationDistributedZkTest.doTests-seed#[21435AB8DC35042]) [    ] o.a.s.c.CoresLocator Config-defined core root directory: /home/jenkins/workspace/Lucene-Solr-trunk-Linux/solr/build/solr-core/test/J0/temp/solr.cloud.CdcrReplicationDistributedZkTest_21435AB8DC35042-001/jetty-001/cores
   [junit4]   2> 250708 INFO  (TEST-CdcrReplicationDistributedZkTest.doTests-seed#[21435AB8DC35042]) [    ] o.a.s.c.CoreContainer New CoreContainer 28863218
   [junit4]   2> 250708 INFO  (TEST-CdcrReplicationDistributedZkTest.doTests-seed#[21435AB8DC35042]) [    ] o.a.s.c.CoreContainer Loading cores into CoreContainer [instanceDir=/home/jenkins/workspace/Lucene-Solr-trunk-Linux/solr/build/solr-core/test/J0/temp/solr.cloud.CdcrReplicationDistributedZkTest_21435AB8DC35042-001/jetty-001/]
   [junit4]   2> 250708 INFO  (TEST-CdcrReplicationDistributedZkTest.doTests-seed#[21435AB8DC35042]) [    ] o.a.s.c.CoreContainer loading shared library: /home/jenkins/workspace/Lucene-Solr-trunk-Linux/solr/build/solr-core/test/J0/temp/solr.cloud.CdcrReplicationDistributedZkTest_21435AB8DC35042-001/jetty-001/lib
   [junit4]   2> 250708 WARN  (TEST-CdcrReplicationDistributedZkTest.doTests-seed#[21435AB8DC35042]) [    ] o.a.s.c.SolrResourceLoader Can't find (or read) directory to add to classloader: lib (resolved as: /home/jenkins/workspace/Lucene-Solr-trunk-Linux/solr/build/solr-core/test/J0/temp/solr.cloud.CdcrReplicationDistributedZkTest_21435AB8DC35042-001/jetty-001/lib).
   [junit4]   2> 250715 INFO  (TEST-CdcrReplicationDistributedZkTest.doTests-seed#[21435AB8DC35042]) [    ] o.a.s.h.c.HttpShardHandlerFactory created with socketTimeout : 90000,urlScheme : ,connTimeout : 15000,maxConnectionsPerHost : 20,maxConnections : 10000,corePoolSize : 0,maximumPoolSize : 2147483647,maxThreadIdleTime : 5,sizeOfQueue : -1,fairnessPolicy : false,useRetries : false,
   [junit4]   2> 250718 INFO  (TEST-CdcrReplicationDistributedZkTest.doTests-seed#[21435AB8DC35042]) [    ] o.a.s.u.UpdateShardHandler Creating UpdateShardHandler HTTP client with params: socketTimeout=340000&connTimeout=45000&retry=true
   [junit4]   2> 250720 INFO  (TEST-CdcrReplicationDistributedZkTest.doTests-seed#[21435AB8DC35042]) [    ] o.a.s.l.LogWatcher SLF4J impl is org.slf4j.impl.Log4jLoggerFactory
   [junit4]   2> 250720 INFO  (TEST-CdcrReplicationDistributedZkTest.doTests-seed#[21435AB8DC35042]) [    ] o.a.s.l.LogWatcher Registering Log Listener [Log4j (org.slf4j.impl.Log4jLoggerFactory)]
   [junit4]   2> 250720 INFO  (TEST-CdcrReplicationDistributedZkTest.doTests-seed#[21435AB8DC35042]) [    ] o.a.s.c.ZkContainer Zookeeper client=127.0.0.1:46780/solr
   [junit4]   2> 250721 INFO  (TEST-CdcrReplicationDistributedZkTest.doTests-seed#[21435AB8DC35042]) [    ] o.a.s.c.ZkController zkHost includes chroot
   [junit4]   2> 250721 INFO  (TEST-CdcrReplicationDistributedZkTest.doTests-seed#[21435AB8DC35042]) [    ] o.a.s.c.c.SolrZkClient Using default ZkCredentialsProvider
   [junit4]   2> 250722 INFO  (TEST-CdcrReplicationDistributedZkTest.doTests-seed#[21435AB8DC35042]) [    ] o.a.s.c.c.ConnectionManager Waiting for client to connect to ZooKeeper
   [junit4]   2> 250723 INFO  (zkCallback-186-thread-1) [    ] o.a.s.c.c.ConnectionManager Watcher org.apache.solr.common.cloud.ConnectionManager@a37f3b name:ZooKeeperConnection Watcher:127.0.0.1:46780 got event WatchedEvent state:SyncConnected type:None path:null path:null type:None
   [junit4]   2> 250723 INFO  (TEST-CdcrReplicationDistributedZkTest.doTests-seed#[21435AB8DC35042]) [    ] o.a.s.c.c.ConnectionManager Client is connected to ZooKeeper
   [junit4]   2> 250724 INFO  (TEST-CdcrReplicationDistributedZkTest.doTests-seed#[21435AB8DC35042]) [    ] o.a.s.c.c.SolrZkClient Using default ZkACLProvider
   [junit4]   2> 250725 INFO  (TEST-CdcrReplicationDistributedZkTest.doTests-seed#[21435AB8DC35042]) [n:127.0.0.1:40112_    ] o.a.s.c.c.ConnectionManager Waiting for client to connect to ZooKeeper
   [junit4]   2> 250727 INFO  (zkCallback-187-thread-1-processing-n:127.0.0.1:40112_) [n:127.0.0.1:40112_    ] o.a.s.c.c.ConnectionManager Watcher org.apache.solr.common.cloud.ConnectionManager@176555b name:ZooKeeperConnection Watcher:127.0.0.1:46780/solr got event WatchedEvent state:SyncConnected type:None path:null path:null type:None
   [junit4]   2> 250727 INFO  (TEST-CdcrReplicationDistributedZkTest.doTests-seed#[21435AB8DC35042]) [n:127.0.0.1:40112_    ] o.a.s.c.c.ConnectionManager Client is connected to ZooKeeper
   [junit4]   2> 250728 INFO  (TEST-CdcrReplicationDistributedZkTest.doTests-seed#[21435AB8DC35042]) [n:127.0.0.1:40112_    ] o.a.s.c.c.SolrZkClient makePath: /overseer/queue
   [junit4]   2> 250729 INFO  (TEST-CdcrReplicationDistributedZkTest.doTests-seed#[21435AB8DC35042]) [n:127.0.0.1:40112_    ] o.a.s.c.c.SolrZkClient makePath: /overseer/collection-queue-work
   [junit4]   2> 250730 INFO  (TEST-CdcrReplicationDistributedZkTest.doTests-seed#[21435AB8DC35042]) [n:127.0.0.1:40112_    ] o.a.s.c.c.SolrZkClient makePath: /overseer/collection-map-running
   [junit4]   2> 250731 INFO  (TEST-CdcrReplicationDistributedZkTest.doTests-seed#[21435AB8DC35042]) [n:127.0.0.1:40112_    ] o.a.s.c.c.SolrZkClient makePath: /overseer/collection-map-completed
   [junit4]   2> 250731 INFO  (TEST-CdcrReplicationDistributedZkTest.doTests-seed#[21435AB8DC35042]) [n:127.0.0.1:40112_    ] o.a.s.c.c.SolrZkClient makePath: /overseer/collection-map-failure
   [junit4]   2> 250732 INFO  (TEST-CdcrReplicationDistributedZkTest.doTests-seed#[21435AB8DC35042]) [n:127.0.0.1:40112_    ] o.a.s.c.c.SolrZkClient makePath: /live_nodes
   [junit4]   2> 250733 INFO  (TEST-CdcrReplicationDistributedZkTest.doTests-seed#[21435AB8DC35042]) [n:127.0.0.1:40112_    ] o.a.s.c.c.SolrZkClient makePath: /aliases.json
   [junit4]   2> 250733 INFO  (TEST-CdcrReplicationDistributedZkTest.doTests-seed#[21435AB8DC35042]) [n:127.0.0.1:40112_    ] o.a.s.c.c.SolrZkClient makePath: /clusterstate.json
   [junit4]   2> 250734 INFO  (TEST-CdcrReplicationDistributedZkTest.doTests-seed#[21435AB8DC35042]) [n:127.0.0.1:40112_    ] o.a.s.c.ZkController Register node as live in ZooKeeper:/live_nodes/127.0.0.1:40112_
   [junit4]   2> 250734 INFO  (TEST-CdcrReplicationDistributedZkTest.doTests-seed#[21435AB8DC35042]) [n:127.0.0.1:40112_    ] o.a.s.c.c.SolrZkClient makePath: /live_nodes/127.0.0.1:40112_
   [junit4]   2> 250735 INFO  (TEST-CdcrReplicationDistributedZkTest.doTests-seed#[21435AB8DC35042]) [n:127.0.0.1:40112_    ] o.a.s.c.c.SolrZkClient makePath: /overseer_elect
   [junit4]   2> 250735 INFO  (TEST-CdcrReplicationDistributedZkTest.doTests-seed#[21435AB8DC35042]) [n:127.0.0.1:40112_    ] o.a.s.c.c.SolrZkClient makePath: /overseer_elect/election
   [junit4]   2> 250736 INFO  (TEST-CdcrReplicationDistributedZkTest.doTests-seed#[21435AB8DC35042]) [n:127.0.0.1:40112_    ] o.a.s.c.Overseer Overseer (id=null) closing
   [junit4]   2> 250736 INFO  (TEST-CdcrReplicationDistributedZkTest.doTests-seed#[21435AB8DC35042]) [n:127.0.0.1:40112_    ] o.a.s.c.LeaderElector Joined leadership election with path: /overseer_elect/election/94279716383293445-127.0.0.1:40112_-n_0000000000
   [junit4]   2> 250736 INFO  (TEST-CdcrReplicationDistributedZkTest.doTests-seed#[21435AB8DC35042]) [n:127.0.0.1:40112_    ] o.a.s.c.OverseerElectionContext I am going to be the leader 127.0.0.1:40112_
   [junit4]   2> 250737 INFO  (TEST-CdcrReplicationDistributedZkTest.doTests-seed#[21435AB8DC35042]) [n:127.0.0.1:40112_    ] o.a.s.c.c.SolrZkClient makePath: /overseer_elect/leader
   [junit4]   2> 250737 INFO  (TEST-CdcrReplicationDistributedZkTest.doTests-seed#[21435AB8DC35042]) [n:127.0.0.1:40112_    ] o.a.s.c.Overseer Overseer (id=94279716383293445-127.0.0.1:40112_-n_0000000000) starting
   [junit4]   2> 250738 INFO  (TEST-CdcrReplicationDistributedZkTest.doTests-seed#[21435AB8DC35042]) [n:127.0.0.1:40112_    ] o.a.s.c.c.SolrZkClient makePath: /overseer/queue-work
   [junit4]   2> 250740 INFO  (TEST-CdcrReplicationDistributedZkTest.doTests-seed#[21435AB8DC35042]) [n:127.0.0.1:40112_    ] o.a.s.c.OverseerAutoReplicaFailoverThread Starting OverseerAutoReplicaFailoverThread autoReplicaFailoverWorkLoopDelay=10000 autoReplicaFailoverWaitAfterExpiration=30000 autoReplicaFailoverBadNodeExpiration=60000
   [junit4]   2> 250741 INFO  (TEST-CdcrReplicationDistributedZkTest.doTests-seed#[21435AB8DC35042]) [n:127.0.0.1:40112_    ] o.a.s.c.c.ZkStateReader Updating cluster state from ZooKeeper... 
   [junit4]   2> 250741 INFO  (OverseerCollectionProcessor-94279716383293445-127.0.0.1:40112_-n_0000000000) [n:127.0.0.1:40112_    ] o.a.s.c.OverseerCollectionProcessor Process current queue of collection creations
   [junit4]   2> 250741 INFO  (OverseerStateUpdate-94279716383293445-127.0.0.1:40112_-n_0000000000) [n:127.0.0.1:40112_    ] o.a.s.c.Overseer Starting to work on the main queue
   [junit4]   2> 250742 INFO  (TEST-CdcrReplicationDistributedZkTest.doTests-seed#[21435AB8DC35042]) [n:127.0.0.1:40112_    ] o.a.s.c.CoreContainer No authentication plugin used.
   [junit4]   2> 250743 INFO  (TEST-CdcrReplicationDistributedZkTest.doTests-seed#[21435AB8DC35042]) [n:127.0.0.1:40112_    ] o.a.s.c.CoreContainer Security conf doesn't exist. Skipping setup for authorization module.
   [junit4]   2> 250743 INFO  (TEST-CdcrReplicationDistributedZkTest.doTests-seed#[21435AB8DC35042]) [n:127.0.0.1:40112_    ] o.a.s.c.CoresLocator Looking for core definitions underneath /home/jenkins/workspace/Lucene-Solr-trunk-Linux/solr/build/solr-core/test/J0/temp/solr.cloud.CdcrReplicationDistributedZkTest_21435AB8DC35042-001/jetty-001/cores
   [junit4]   2> 250744 INFO  (TEST-CdcrReplicationDistributedZkTest.doTests-seed#[21435AB8DC35042]) [n:127.0.0.1:40112_    ] o.a.s.c.SolrCore Created CoreDescriptor: {name=collection1, config=solrconfig.xml, transient=false, schema=schema.xml, loadOnStartup=true, configSetProperties=configsetprops.json, instanceDir=/home/jenkins/workspace/Lucene-Solr-trunk-Linux/solr/build/solr-core/test/J0/temp/solr.cloud.CdcrReplicationDistributedZkTest_21435AB8DC35042-001/jetty-001/cores/collection1, collection=tmp_collection, absoluteInstDir=/home/jenkins/workspace/Lucene-Solr-trunk-Linux/solr/build/solr-core/test/J0/temp/solr.cloud.CdcrReplicationDistributedZkTest_21435AB8DC35042-001/jetty-001/cores/collection1/, coreNodeName=, dataDir=data/, shard=}
   [junit4]   2> 250744 INFO  (TEST-CdcrReplicationDistributedZkTest.doTests-seed#[21435AB8DC35042]) [n:127.0.0.1:40112_    ] o.a.s.c.CoresLocator Found core collection1 in /home/jenkins/workspace/Lucene-Solr-trunk-Linux/solr/build/solr-core/test/J0/temp/solr.cloud.CdcrReplicationDistributedZkTest_21435AB8DC35042-001/jetty-001/cores/collection1/
   [junit4]   2> 250744 INFO  (TEST-CdcrReplicationDistributedZkTest.doTests-seed#[21435AB8DC35042]) [n:127.0.0.1:40112_    ] o.a.s.c.CoresLocator Found 1 core definitions
   [junit4]   2> 250744 INFO  (TEST-CdcrReplicationDistributedZkTest.doTests-seed#[21435AB8DC35042]) [n:127.0.0.1:40112_    ] o.a.s.s.SolrDispatchFilter user.dir=/home/jenkins/workspace/Lucene-Solr-trunk-Linux/solr/build/solr-core/test/J0
   [junit4]   2> 250745 INFO  (TEST-CdcrReplicationDistributedZkTest.doTests-seed#[21435AB8DC35042]) [n:127.0.0.1:40112_    ] o.a.s.s.SolrDispatchFilter SolrDispatchFilter.init() done
   [junit4]   2> 250744 INFO  (coreLoadExecutor-1123-thread-1-processing-n:127.0.0.1:40112_) [n:127.0.0.1:40112_ c:tmp_collection   x:collection1] o.a.s.c.ZkController publishing state=down
   [junit4]   2> 250745 INFO  (coreLoadExecutor-1123-thread-1-processing-n:127.0.0.1:40112_) [n:127.0.0.1:40112_ c:tmp_collection   x:collection1] o.a.s.c.ZkController numShards not found on descriptor - reading it from system property
   [junit4]   2> 250745 INFO  (coreLoadExecutor-1123-thread-1-processing-n:127.0.0.1:40112_) [n:127.0.0.1:40112_ c:tmp_collection   x:collection1] o.a.s.c.ZkController look for our core node name
   [junit4]   2> 250745 INFO  (zkCallback-187-thread-1-processing-n:127.0.0.1:40112_) [n:127.0.0.1:40112_    ] o.a.s.c.DistributedQueue NodeChildrenChanged fired on path /overseer/queue state SyncConnected
   [junit4]   2> 250746 INFO  (OverseerStateUpdate-94279716383293445-127.0.0.1:40112_-n_0000000000) [n:127.0.0.1:40112_    ] o.a.s.c.Overseer processMessage: queueSize: 1, message = {
   [junit4]   2>   "core":"collection1",
   [junit4]   2>   "roles":null,
   [junit4]   2>   "base_url":"https://127.0.0.1:40112",
   [junit4]   2>   "node_name":"127.0.0.1:40112_",
   [junit4]   2>   "numShards":"2",
   [junit4]   2>   "state":"down",
   [junit4]   2>   "shard":null,
   [junit4]   2>   "collection":"tmp_collection",
   [junit4]   2>   "operation":"state"} current state version: 0
   [junit4]   2> 250746 INFO  (OverseerStateUpdate-94279716383293445-127.0.0.1:40112_-n_0000000000) [n:127.0.0.1:40112_    ] o.a.s.c.o.ReplicaMutator Update state numShards=2 message={
   [junit4]   2>   "core":"collection1",
   [junit4]   2>   "roles":null,
   [junit4]   2>   "base_url":"https://127.0.0.1:40112",
   [junit4]   2>   "node_name":"127.0.0.1:40112_",
   [junit4]   2>   "numShards":"2",
   [junit4]   2>   "state":"down",
   [junit4]   2>   "shard":null,
   [junit4]   2>   "collection":"tmp_collection",
   [junit4]   2>   "operation":"state"}
   [junit4]   2> 250746 INFO  (OverseerStateUpdate-94279716383293445-127.0.0.1:40112_-n_0000000000) [n:127.0.0.1:40112_    ] o.a.s.c.o.ClusterStateMutator building a new cName: tmp_collection
   [junit4]   2> 250746 INFO  (OverseerStateUpdate-94279716383293445-127.0.0.1:40112_-n_0000000000) [n:127.0.0.1:40112_    ] o.a.s.c.o.ReplicaMutator Assigning new node to shard shard=shard2
   [junit4]   2> 250747 INFO  (zkCallback-187-thread-1-processing-n:127.0.0.1:40112_) [n:127.0.0.1:40112_    ] o.a.s.c.c.ZkStateReader A cluster state change: WatchedEvent state:SyncConnected type:NodeDataChanged path:/clusterstate.json, has occurred - updating... (live nodes size: 1)
   [junit4]   2> 250748 INFO  (zkCallback-187-thread-1-processing-n:127.0.0.1:40112_) [n:127.0.0.1:40112_    ] o.a.s.c.c.ZkStateReader Updated cluster state version to 1
   [junit4]   2> 251745 INFO  (coreLoadExecutor-1123-thread-1-processing-n:127.0.0.1:40112_) [n:127.0.0.1:40112_ c:tmp_collection   x:collection1] o.a.s.c.ZkController waiting to find shard id in clusterstate for collection1
   [junit4]   2> 251746 INFO  (coreLoadExecutor-1123-thread-1-processing-n:127.0.0.1:40112_) [n:127.0.0.1:40112_ c:tmp_collection   x:collection1] o.a.s.c.ZkController Check for collection zkNode:tmp_collection
   [junit4]   2> 251746 INFO  (coreLoadExecutor-1123-thread-1-processing-n:127.0.0.1:40112_) [n:127.0.0.1:40112_ c:tmp_collection   x:collection1] o.a.s.c.ZkController Creating collection in ZooKeeper:tmp_collection
   [junit4]   2> 251746 INFO  (coreLoadExecutor-1123-thread-1-processing-n:127.0.0.1:40112_) [n:127.0.0.1:40112_ c:tmp_collection   x:collection1] o.a.s.c.ZkController Looking for collection configName
   [junit4]   2> 251746 INFO  (coreLoadExecutor-1123-thread-1-processing-n:127.0.0.1:40112_) [n:127.0.0.1:40112_ c:tmp_collection   x:collection1] o.a.s.c.ZkController Only one config set found in zk - using it:conf1
   [junit4]   2> 251747 INFO  (coreLoadExecutor-1123-thread-1-processing-n:127.0.0.1:40112_) [n:127.0.0.1:40112_ c:tmp_collection   x:collection1] o.a.s.c.c.SolrZkClient makePath: /collections/tmp_collection
   [junit4]   2> 251747 INFO  (coreLoadExecutor-1123-thread-1-processing-n:127.0.0.1:40112_) [n:127.0.0.1:40112_ c:tmp_collection   x:collection1] o.a.s.c.c.ZkStateReader Load collection config from:/collections/tmp_collection
   [junit4]   2> 251747 INFO  (coreLoadExecutor-1123-thread-1-processing-n:127.0.0.1:40112_) [n:127.0.0.1:40112_ c:tmp_collection   x:collection1] o.a.s.c.c.ZkStateReader path=/collections/tmp_collection configName=conf1 specified config exists in ZooKeeper
   [junit4]   2> 251747 INFO  (coreLoadExecutor-1123-thread-1-processing-n:127.0.0.1:40112_) [n:127.0.0.1:40112_ c:tmp_collection   x:collection1] o.a.s.c.SolrResourceLoader new SolrResourceLoader for directory: '/home/jenkins/workspace/Lucene-Solr-trunk-Linux/solr/build/solr-core/test/J0/temp/solr.cloud.CdcrReplicationDistributedZkTest_21435AB8DC35042-001/jetty-001/cores/collection1/'
   [junit4]   2> 251755 INFO  (coreLoadExecutor-1123-thread-1-processing-n:127.0.0.1:40112_) [n:127.0.0.1:40112_ c:tmp_collection   x:collection1] o.a.s.c.Config loaded config solrconfig.xml with version 0 
   [junit4]   2> 251757 INFO  (coreLoadExecutor-1123-thread-1-processing-n:127.0.0.1:40112_) [n:127.0.0.1:40112_ c:tmp_collection   x:collection1] o.a.s.c.SolrConfig current version of requestparams : -1
   [junit4]   2> 251759 INFO  (coreLoadExecutor-1123-thread-1-processing-n:127.0.0.1:40112_) [n:127.0.0.1:40112_ c:tmp_collection   x:collection1] o.a.s.c.SolrConfig Using Lucene MatchVersion: 6.0.0
   [junit4]   2> 251763 INFO  (coreLoadExecutor-1123-thread-1-processing-n:127.0.0.1:40112_) [n:127.0.0.1:40112_ c:tmp_collection   x:collection1] o.a.s.c.Config Loaded SolrConfig: solrconfig.xml
   [junit4]   2> 251763 INFO  (coreLoadExecutor-1123-thread-1-processing-n:127.0.0.1:40112_) [n:127.0.0.1:40112_ c:tmp_collection   x:collection1] o.a.s.s.IndexSchema Reading Solr Schema from /configs/conf1/schema.xml
   [junit4]   2> 251766 INFO  (coreLoadExecutor-1123-thread-1-processing-n:127.0.0.1:40112_) [n:127.0.0.1:40112_ c:tmp_collection   x:collection1] o.a.s.s.IndexSchema [collection1] Schema name=test
   [junit4]   2> 251824 INFO  (coreLoadExecutor-1123-thread-1-processing-n:127.0.0.1:40112_) [n:127.0.0.1:40112_ c:tmp_collection   x:collection1] o.a.s.s.IndexSchema default search field in schema is text
   [junit4]   2> 251826 INFO  (coreLoadExecutor-1123-thread-1-processing-n:127.0.0.1:40112_) [n:127.0.0.1:40112_ c:tmp_collection   x:collection1] o.a.s.s.IndexSchema unique key field: id
   [junit4]   2> 251827 INFO  (coreLoadExecutor-1123-thread-1-processing-n:127.0.0.1:40112_) [n:127.0.0.1:40112_ c:tmp_collection   x:collection1] o.a.s.s.FileExchangeRateProvider Reloading exchange rates from file currency.xml
   [junit4]   2> 251829 INFO  (coreLoadExecutor-1123-thread-1-processing-n:127.0.0.1:40112_) [n:127.0.0.1:40112_ c:tmp_collection   x:collection1] o.a.s.s.FileExchangeRateProvider Reloading exchange rates from file currency.xml
   [junit4]   2> 251841 INFO  (coreLoadExecutor-1123-thread-1-processing-n:127.0.0.1:40112_) [n:127.0.0.1:40112_ c:tmp_collection   x:collection1] o.a.s.c.ConfigSetProperties Did not find ConfigSet properties, assuming default properties: Can't find resource 'configsetprops.json' in classpath or '/configs/conf1', cwd=/home/jenkins/workspace/Lucene-Solr-trunk-Linux/solr/build/solr-core/test/J0
   [junit4]   2> 251841 INFO  (coreLoadExecutor-1123-thread-1-processing-n:127.0.0.1:40112_) [n:127.0.0.1:40112_ c:tmp_collection   x:collection1] o.a.s.c.CoreContainer Creating SolrCore 'collection1' using configuration from collection tmp_collection
   [junit4]   2> 251841 INFO  (coreLoadExecutor-1123-thread-1-processing-n:127.0.0.1:40112_) [n:127.0.0.1:40112_ c:tmp_collection s:shard2 r:core_node1 x:collection1] o.a.s.c.SolrCore org.apache.solr.core.MockDirectoryFactory
   [junit4]   2> 251841 INFO  (coreLoadExecutor-1123-thread-1-processing-n:127.0.0.1:40112_) [n:127.0.0.1:40112_ c:tmp_collection s:shard2 r:core_node1 x:collection1] o.a.s.c.SolrCore [[collection1] ] Opening new SolrCore at [/home/jenkins/workspace/Lucene-Solr-trunk-Linux/solr/build/solr-core/test/J0/temp/solr.cloud.CdcrReplicationDistributedZkTest_21435AB8DC35042-001/jetty-001/cores/collection1/], dataDir=[null]
   [junit4]   2> 251842 INFO  (coreLoadExecutor-1123-thread-1-processing-n:127.0.0.1:40112_) [n:127.0.0.1:40112_ c:tmp_collection s:shard2 r:core_node1 x:collection1] o.a.s.c.JmxMonitoredMap JMX monitoring is enabled. Adding Solr mbeans to JMX Server: com.sun.jmx.mbeanserver.JmxMBeanServer@119c291
   [junit4]   2> 251842 INFO  (coreLoadExecutor-1123-thread-1-processing-n:127.0.0.1:40112_) [n:127.0.0.1:40112_ c:tmp_collection s:shard2 r:core_node1 x:collection1] o.a.s.c.CachingDirectoryFactory return new directory for /home/jenkins/workspace/Lucene-Solr-trunk-Linux/solr/build/solr-core/test/J0/temp/solr.cloud.CdcrReplicationDistributedZkTest_21435AB8DC35042-001/jetty-001/cores/collection1/data
   [junit4]   2> 251843 INFO  (coreLoadExecutor-1123-thread-1-processing-n:127.0.0.1:40112_) [n:127.0.0.1:40112_ c:tmp_collection s:shard2 r:core_node1 x:collection1] o.a.s.c.SolrCore New index directory detected: old=null new=/home/jenkins/workspace/Lucene-Solr-trunk-Linux/solr/build/solr-core/test/J0/temp/solr.cloud.CdcrReplicationDistributedZkTest_21435AB8DC35042-001/jetty-001/cores/collection1/data/index/
   [junit4]   2> 251843 WARN  (coreLoadExecutor-1123-thread-1-processing-n:127.0.0.1:40112_) [n:127.0.0.1:40112_ c:tmp_collection s:shard2 r:core_node1 x:collection1] o.a.s.c.SolrCore [collection1] Solr index directory '/home/jenkins/workspace/Lucene-Solr-trunk-Linux/solr/build/solr-core/test/J0/temp/solr.cloud.CdcrReplicationDistributedZkTest_21435AB8DC35042-001/jetty-001/cores/collection1/data/index' doesn't exist. Creating new index...
   [junit4]   2> 251843 INFO  (coreLoadExecutor-1123-thread-1-processing-n:127.0.0.1:40112_) [n:127.0.0.1:40112_ c:tmp_collection s:shard2 r:core_node1 x:collection1] o.a.s.c.CachingDirectoryFactory return new directory for /home/jenkins/workspace/Lucene-Solr-trunk-Linux/solr/build/solr-core/test/J0/temp/solr.cloud.CdcrReplicationDistributedZkTest_21435AB8DC35042-001/jetty-001/cores/collection1/data/index
   [junit4]   2> 251843 INFO  (coreLoadExecutor-1123-thread-1-processing-n:127.0.0.1:40112_) [n:127.0.0.1:40112_ c:tmp_collection s:shard2 r:core_node1 x:collection1] o.a.s.u.RandomMergePolicy RandomMergePolicy wrapping class org.apache.lucene.index.TieredMergePolicy: [TieredMergePolicy: maxMergeAtOnce=26, maxMergeAtOnceExplicit=40, maxMergedSegmentMB=74.50390625, floorSegmentMB=0.26171875, forceMergeDeletesPctAllowed=22.450176009615337, segmentsPerTier=44.0, maxCFSSegmentSizeMB=8.796093022207999E12, noCFSRatio=1.0
   [junit4]   2> 251844 INFO  (coreLoadExecutor-1123-thread-1-processing-n:127.0.0.1:40112_) [n:127.0.0.1:40112_ c:tmp_collection s:shard2 r:core_node1 x:collection1] o.a.s.c.SolrCore SolrDeletionPolicy.onCommit: commits: num=1
   [junit4]   2> 	commit{dir=MockDirectoryWrapper(RAMDirectory@363807 lockFactory=org.apache.lucene.store.SingleInstanceLockFactory@1aafb08),segFN=segments_1,generation=1}
   [junit4]   2> 251844 INFO  (coreLoadExecutor-1123-thread-1-processing-n:127.0.0.1:40112_) [n:127.0.0.1:40112_ c:tmp_collection s:shard2 r:core_node1 x:collection1] o.a.s.c.SolrCore newest commit generation = 1
   [junit4]   2> 251844 INFO  (OldIndexDirectoryCleanupThreadForCore-collection1) [n:127.0.0.1:40112_ c:tmp_collection s:shard2 r:core_node1 x:collection1] o.a.s.c.SolrCore Looking for old index directories to cleanup for core collection1 in /home/jenkins/workspace/Lucene-Solr-trunk-Linux/solr/build/solr-core/test/J0/temp/solr.cloud.CdcrReplicationDistributedZkTest_21435AB8DC35042-001/jetty-001/cores/collection1/data/
   [junit4]   2> 251845 WARN  (OldIndexDirectoryCleanupThreadForCore-collection1) [n:127.0.0.1:40112_ c:tmp_collection s:shard2 r:core_node1 x:collection1] o.a.s.c.DirectoryFactory /home/jenkins/workspace/Lucene-Solr-trunk-Linux/solr/build/solr-core/test/J0/temp/solr.cloud.CdcrReplicationDistributedZkTest_21435AB8DC35042-001/jetty-001/cores/collection1/data/ does not point to a valid data directory; skipping clean-up of old index directories.
   [junit4]   2> 251847 INFO  (coreLoadExecutor-1123-thread-1-processing-n:127.0.0.1:40112_) [n:127.0.0.1:40112_ c:tmp_collection s:shard2 r:core_node1 x:collection1] o.a.s.u.p.UpdateRequestProcessorChain creating updateRequestProcessorChain "cdcr-processor-chain"
   [junit4]   2> 251860 INFO  (coreLoadExecutor-1123-thread-1-processing-n:127.0.0.1:40112_) [n:127.0.0.1:40112_ c:tmp_collection s:shard2 r:core_node1 x:collection1] o.a.s.c.SolrCore no updateRequestProcessorChain defined as default, creating implicit default
   [junit4]   2> 251864 INFO  (coreLoadExecutor-1123-thread-1-processing-n:127.0.0.1:40112_) [n:127.0.0.1:40112_ c:tmp_collection s:shard2 r:core_node1 x:collection1] o.a.s.h.l.XMLLoader xsltCacheLifetimeSeconds=60
   [junit4]   2> 251865 INFO  (coreLoadExecutor-1123-thread-1-processing-n:127.0.0.1:40112_) [n:127.0.0.1:40112_ c:tmp_collection s:shard2 r:core_node1 x:collection1] o.a.s.h.l.XMLLoader xsltCacheLifetimeSeconds=60
   [junit4]   2> 251865 INFO  (coreLoadExecutor-1123-thread-1-processing-n:127.0.0.1:40112_) [n:127.0.0.1:40112_ c:tmp_collection s:shard2 r:core_node1 x:collection1] o.a.s.h.l.XMLLoader xsltCacheLifetimeSeconds=60
   [junit4]   2> 251866 INFO  (coreLoadExecutor-1123-thread-1-processing-n:127.0.0.1:40112_) [n:127.0.0.1:40112_ c:tmp_collection s:shard2 r:core_node1 x:collection1] o.a.s.h.l.XMLLoader xsltCacheLifetimeSeconds=60
   [junit4]   2> 251873 INFO  (coreLoadExecutor-1123-thread-1-processing-n:127.0.0.1:40112_) [n:127.0.0.1:40112_ c:tmp_collection s:shard2 r:core_node1 x:collection1] o.a.s.c.RequestHandlers Registered paths: /admin/mbeans,standard,/update/csv,/update/json/docs,/admin/luke,/admin/segments,/get,/admin/system,/replication,/admin/properties,/config,/schema,/admin/plugins,/admin/logging,/update/json,/admin/threads,/admin/ping,/cdcr,/update,/admin/file
   [junit4]   2> 251873 INFO  (coreLoadExecutor-1123-thread-1-processing-n:127.0.0.1:40112_) [n:127.0.0.1:40112_ c:tmp_collection s:shard2 r:core_node1 x:collection1] o.a.s.c.SolrCore Using default statsCache cache: org.apache.solr.search.stats.LocalStatsCache
   [junit4]   2> 251883 INFO  (coreLoadExecutor-1123-thread-1-processing-n:127.0.0.1:40112_) [n:127.0.0.1:40112_ c:tmp_collection s:shard2 r:core_node1 x:collection1] o.a.s.u.UpdateHandler Using UpdateLog implementation: org.apache.solr.update.CdcrUpdateLog
   [junit4]   2> 251883 INFO  (coreLoadExecutor-1123-thread-1-processing-n:127.0.0.1:40112_) [n:127.0.0.1:40112_ c:tmp_collection s:shard2 r:core_node1 x:collection1] o.a.s.u.UpdateLog Initializing UpdateLog: dataDir= defaultSyncLevel=FLUSH numRecordsToKeep=100 maxNumLogsToKeep=10 numVersionBuckets=65536
   [junit4]   2> 251884 INFO  (coreLoadExecutor-1123-thread-1-processing-n:127.0.0.1:40112_) [n:127.0.0.1:40112_ c:tmp_collection s:shard2 r:core_node1 x:collection1] o.a.s.c.SolrCore Hard AutoCommit: disabled
   [junit4]   2> 251884 INFO  (coreLoadExecutor-1123-thread-1-processing-n:127.0.0.1:40112_) [n:127.0.0.1:40112_ c:tmp_collection s:shard2 r:core_node1 x:collection1] o.a.s.c.SolrCore Soft AutoCommit: disabled
   [junit4]   2> 251885 INFO  (coreLoadExecutor-1123-thread-1-processing-n:127.0.0.1:40112_) [n:127.0.0.1:40112_ c:tmp_collection s:shard2 r:core_node1 x:collection1] o.a.s.u.RandomMergePolicy RandomMergePolicy wrapping class org.apache.lucene.index.TieredMergePolicy: [TieredMergePolicy: maxMergeAtOnce=24, maxMergeAtOnceExplicit=10, maxMergedSegmentMB=11.73046875, floorSegmentMB=2.064453125, forceMergeDeletesPctAllowed=17.508825029336357, segmentsPerTier=17.0, maxCFSSegmentSizeMB=8.796093022207999E12, noCFSRatio=0.4738799137543743
   [junit4]   2> 251885 INFO  (coreLoadExecutor-1123-thread-1-processing-n:127.0.0.1:40112_) [n:127.0.0.1:40112_ c:tmp_collection s:shard2 r:core_node1 x:collection1] o.a.s.c.SolrCore SolrDeletionPolicy.onInit: commits: num=1
   [junit4]   2> 	commit{dir=MockDirectoryWrapper(RAMDirectory@363807 lockFactory=org.apache.lucene.store.SingleInstanceLockFactory@1aafb08),segFN=segments_1,generation=1}
   [junit4]   2> 251886 INFO  (coreLoadExecutor-1123-thread-1-processing-n:127.0.0.1:40112_) [n:127.0.0.1:40112_ c:tmp_collection s:shard2 r:core_node1 x:collection1] o.a.s.c.SolrCore newest commit generation = 1
   [junit4]   2> 251886 INFO  (coreLoadExecutor-1123-thread-1-processing-n:127.0.0.1:40112_) [n:127.0.0.1:40112_ c:tmp_collection s:shard2 r:core_node1 x:collection1] o.a.s.s.SolrIndexSearcher Opening Searcher@812975[collection1] main
   [junit4]   2> 251886 INFO  (coreLoadExecutor-1123-thread-1-processing-n:127.0.0.1:40112_) [n:127.0.0.1:40112_ c:tmp_collection s:shard2 r:core_node1 x:collection1] o.a.s.c.c.ZkStateReader Load collection config from:/collections/tmp_collection
   [junit4]   2> 251886 INFO  (coreLoadExecutor-1123-thread-1-processing-n:127.0.0.1:40112_) [n:127.0.0.1:40112_ c:tmp_collection s:shard2 r:core_node1 x:collection1] o.a.s.c.c.ZkStateReader path=/collections/tmp_collection configName=conf1 specified config exists in ZooKeeper
   [junit4]   2> 251887 INFO  (coreLoadExecutor-1123-thread-1-processing-n:127.0.0.1:40112_) [n:127.0.0.1:40112_ c:tmp_collection s:shard2 r:core_node1 x:collection1] o.a.s.r.ManagedResourceStorage Setting up ZooKeeper-based storage for the RestManager with znodeBase: /configs/conf1
   [junit4]   2> 251887 INFO  (coreLoadExecutor-1123-thread-1-processing-n:127.0.0.1:40112_) [n:127.0.0.1:40112_ c:tmp_collection s:shard2 r:core_node1 x:collection1] o.a.s.r.ManagedResourceStorage Configured ZooKeeperStorageIO with znodeBase: /configs/conf1
   [junit4]   2> 251887 INFO  (coreLoadExecutor-1123-thread-1-processing-n:127.0.0.1:40112_) [n:127.0.0.1:40112_ c:tmp_collection s:shard2 r:core_node1 x:collection1] o.a.s.r.RestManager Initializing RestManager with initArgs: {}
   [junit4]   2> 251887 INFO  (coreLoadExecutor-1123-thread-1-processing-n:127.0.0.1:40112_) [n:127.0.0.1:40112_ c:tmp_collection s:shard2 r:core_node1 x:collection1] o.a.s.r.ManagedResourceStorage Reading _rest_managed.json using ZooKeeperStorageIO:path=/configs/conf1
   [junit4]   2> 251888 INFO  (coreLoadExecutor-1123-thread-1-processing-n:127.0.0.1:40112_) [n:127.0.0.1:40112_ c:tmp_collection s:shard2 r:core_node1 x:collection1] o.a.s.r.ManagedResourceStorage No data found for znode /configs/conf1/_rest_managed.json
   [junit4]   2> 251888 INFO  (coreLoadExecutor-1123-thread-1-processing-n:127.0.0.1:40112_) [n:127.0.0.1:40112_ c:tmp_collection s:shard2 r:core_node1 x:collection1] o.a.s.r.ManagedResourceStorage Loaded null at path _rest_managed.json using ZooKeeperStorageIO:path=/configs/conf1
   [junit4]   2> 251888 INFO  (coreLoadExecutor-1123-thread-1-processing-n:127.0.0.1:40112_) [n:127.0.0.1:40112_ c:tmp_collection s:shard2 r:core_node1 x:collection1] o.a.s.r.RestManager Initializing 0 registered ManagedResources
   [junit4]   2> 251888 INFO  (coreLoadExecutor-1123-thread-1-processing-n:127.0.0.1:40112_) [n:127.0.0.1:40112_ c:tmp_collection s:shard2 r:core_node1 x:collection1] o.a.s.h.ReplicationHandler Commits will be reserved for  10000
   [junit4]   2> 251891 INFO  (coreLoadExecutor-1123-thread-1-processing-n:127.0.0.1:40112_) [n:127.0.0.1:40112_ c:tmp_collection s:shard2 r:core_node1 x:collection1] o.a.s.c.c.SolrZkClient makePath: /collections/tmp_collection/cdcr/state
   [junit4]   2> 251893 INFO  (coreLoadExecutor-1123-thread-1-processing-n:127.0.0.1:40112_) [n:127.0.0.1:40112_ c:tmp_collection s:shard2 r:core_node1 x:collection1] o.a.s.h.CdcrBufferStateManager Created znode /collections/tmp_collection/cdcr/state/buffer
   [junit4]   2> 251898 INFO  (coreLoadExecutor-1123-thread-1-processing-n:127.0.0.1:40112_) [n:127.0.0.1:40112_ c:tmp_collection s:shard2 r:core_node1 x:collection1] o.a.s.h.CdcrProcessStateManager Created znode /collections/tmp_collection/cdcr/state/process
   [junit4]   2> 251912 INFO  (searcherExecutor-1124-thread-1-processing-n:127.0.0.1:40112_ x:collection1 s:shard2 c:tmp_collection r:core_node1) [n:127.0.0.1:40112_ c:tmp_collection s:shard2 r:core_node1 x:collection1] o.a.s.c.SolrCore [collection1] Registered new searcher Searcher@812975[collection1] main{ExitableDirectoryReader(UninvertingDirectoryReader())}
   [junit4]   2> 251913 INFO  (coreLoadExecutor-1123-thread-1-processing-n:127.0.0.1:40112_) [n:127.0.0.1:40112_ c:tmp_collection s:shard2 r:core_node1 x:collection1] o.a.s.u.UpdateLog Looking up max value of version field to seed version buckets
   [junit4]   2> 251913 INFO  (coreLoadExecutor-1123-thread-1-processing-n:127.0.0.1:40112_) [n:127.0.0.1:40112_ c:tmp_collection s:shard2 r:core_node1 x:collection1] o.a.s.u.VersionInfo Refreshing highest value of _version_ for 65536 version buckets from index
   [junit4]   2> 251913 INFO  (coreLoadExecutor-1123-thread-1-processing-n:127.0.0.1:40112_) [n:127.0.0.1:40112_ c:tmp_collection s:shard2 r:core_node1 x:collection1] o.a.s.u.VersionInfo No terms found for _version_, cannot seed version bucket highest value from index
   [junit4]   2> 251913 INFO  (coreLoadExecutor-1123-thread-1-processing-n:127.0.0.1:40112_) [n:127.0.0.1:40112_ c:tmp_collection s:shard2 r:core_node1 x:collection1] o.a.s.u.UpdateLog Could not find max version in index or recent updates, using new clock 1508475463668858880
   [junit4]   2> 251915 INFO  (coreLoadExecutor-1123-thread-1-processing-n:127.0.0.1:40112_) [n:127.0.0.1:40112_ c:tmp_collection s:shard2 r:core_node1 x:collection1] o.a.s.u.UpdateLog Took 2 ms to seed version buckets with highest version 1508475463668858880
   [junit4]   2> 251915 INFO  (coreLoadExecutor-1123-thread-1-processing-n:127.0.0.1:40112_) [n:127.0.0.1:40112_ c:tmp_collection s:shard2 r:core_node1 x:collection1] o.a.s.c.ZkController watch zkdir /configs/conf1
   [junit4]   2> 251916 INFO  (coreLoadExecutor-1123-thread-1-processing-n:127.0.0.1:40112_) [n:127.0.0.1:40112_ c:tmp_collection s:shard2 r:core_node1 x:collection1] o.a.s.c.CoreContainer registering core: collection1
   [junit4]   2> 251916 INFO  (coreZkRegister-1117-thread-1-processing-n:127.0.0.1:40112_ x:collection1 s:shard2 c:tmp_collection r:core_node1) [n:127.0.0.1:40112_ c:tmp_collection s:shard2 r:core_node1 x:collection1] o.a.s.c.ZkController Register replica - core:collection1 address:https://127.0.0.1:40112 collection:tmp_collection shard:shard2
   [junit4]   2> 251916 INFO  (coreZkRegister-1117-thread-1-processing-n:127.0.0.1:40112_ x:collection1 s:shard2 c:tmp_collection r:core_node1) [n:127.0.0.1:40112_ c:tmp_collection s:shard2 r:core_node1 x:collection1] o.a.s.c.c.SolrZkClient makePath: /collections/tmp_collection/leader_elect/shard2/election
   [junit4]   2> 251918 INFO  (coreZkRegister-1117-thread-1-processing-n:127.0.0.1:40112_ x:collection1 s:shard2 c:tmp_collection r:core_node1) [n:127.0.0.1:40112_ c:tmp_collection s:shard2 r:core_node1 x:collection1] o.a.s.c.LeaderElector Joined leadership election with path: /collections/tmp_collection/leader_elect/shard2/election/94279716383293445-core_node1-n_0000000000
   [junit4]   2> 251918 INFO  (coreZkRegister-1117-thread-1-processing-n:127.0.0.1:40112_ x:collection1 s:shard2 c:tmp_collection r:core_node1) [n:127.0.0.1:40112_ c:tmp_collection s:shard2 r:core_node1 x:collection1] o.a.s.c.ShardLeaderElectionContext Running the leader process for shard shard2
   [junit4]   2> 251919 INFO  (zkCallback-187-thread-1-processing-n:127.0.0.1:40112_) [n:127.0.0.1:40112_    ] o.a.s.c.DistributedQueue NodeChildrenChanged fired on path /overseer/queue state SyncConnected
   [junit4]   2> 251919 INFO  (coreZkRegister-1117-thread-1-processing-n:127.0.0.1:40112_ x:collection1 s:shard2 c:tmp_collection r:core_node1) [n:127.0.0.1:40112_ c:tmp_collection s:shard2 r:core_node1 x:collection1] o.a.s.c.ShardLeaderElectionContext Enough replicas found to continue.
   [junit4]   2> 251919 INFO  (coreZkRegister-1117-thread-1-processing-n:127.0.0.1:40112_ x:collection1 s:shard2 c:tmp_collection r:core_node1) [n:127.0.0.1:40112_ c:tmp_collection s:shard2 r:core_node1 x:collection1] o.a.s.c.ShardLeaderElectionContext I may be the new leader - try and sync
   [junit4]   2> 251920 INFO  (coreZkRegister-1117-thread-1-processing-n:127.0.0.1:40112_ x:collection1 s:shard2 c:tmp_collection r:core_node1) [n:127.0.0.1:40112_ c:tmp_collection s:shard2 r:core_node1 x:collection1] o.a.s.c.SyncStrategy Sync replicas to https://127.0.0.1:40112/collection1/
   [junit4]   2> 251920 INFO  (OverseerStateUpdate-94279716383293445-127.0.0.1:40112_-n_0000000000) [n:127.0.0.1:40112_    ] o.a.s.c.Overseer processMessage: queueSize: 1, message = {
   [junit4]   2>   "operation":"leader",
   [junit4]   2>   "shard":"shard2",
   [junit4]   2>   "collection":"tmp_collection"} current state version: 1
   [junit4]   2> 251920 INFO  (coreZkRegister-1117-thread-1-processing-n:127.0.0.1:40112_ x:collection1 s:shard2 c:tmp_collection r:core_node1) [n:127.0.0.1:40112_ c:tmp_collection s:shard2 r:core_node1 x:collection1] o.a.s.c.SyncStrategy Sync Success - now sync replicas to me
   [junit4]   2> 251920 INFO  (coreZkRegister-1117-thread-1-processing-n:127.0.0.1:40112_ x:collection1 s:shard2 c:tmp_collection r:core_node1) [n:127.0.0.1:40112_ c:tmp_collection s:shard2 r:core_node1 x:collection1] o.a.s.c.SyncStrategy https://127.0.0.1:40112/collection1/ has no replicas
   [junit4]   2> 251920 INFO  (coreZkRegister-1117-thread-1-processing-n:127.0.0.1:40112_ x:collection1 s:shard2 c:tmp_collection r:core_node1) [n:127.0.0.1:40112_ c:tmp_collection s:shard2 r:core_node1 x:collection1] o.a.s.c.ShardLeaderElectionContext I am the new leader: https://127.0.0.1:40112/collection1/ shard2
   [junit4]   2> 251920 INFO  (coreZkRegister-1117-thread-1-processing-n:127.0.0.1:40112_ x:collection1 s:shard2 c:tmp_collection r:core_node1) [n:127.0.0.1:40112_ c:tmp_collection s:shard2 r:core_node1 x:collection1] o.a.s.c.c.SolrZkClient makePath: /collections/tmp_collection/leaders/shard2
   [junit4]   2> 251922 INFO  (zkCallback-187-thread-1-processing-n:127.0.0.1:40112_) [n:127.0.0.1:40112_    ] o.a.s.h.CdcrProcessStateManager Received new leader state @ tmp_collection:shard2
   [junit4]   2> 251924 INFO  (zkCallback-187-thread-2-processing-n:127.0.0.1:40112_) [n:127.0.0.1:40112_    ] o.a.s.c.DistributedQueue NodeChildrenChanged fired on path /overseer/queue state SyncConnected
   [junit4]   2> 251924 INFO  (OverseerStateUpdate-94279716383293445-127.0.0.1:40112_-n_0000000000) [n:127.0.0.1:40112_    ] o.a.s.c.Overseer processMessage: queueSize: 1, message = {
   [junit4]   2>   "operation":"leader",
   [junit4]   2>   "shard":"shard2",
   [junit4]   2>   "collection":"tmp_collection",
   [junit4]   2>   "base_url":"https://127.0.0.1:40112",
   [junit4]   2>   "core":"collection1",
   [junit4]   2>   "state":"active"} current state version: 1
   [junit4]   2> 252026 INFO  (zkCallback-187-thread-2-processing-n:127.0.0.1:40112_) [n:127.0.0.1:40112_    ] o.a.s.c.c.ZkStateReader A cluster state change: WatchedEvent state:SyncConnected type:NodeDataChanged path:/clusterstate.json, has occurred - updating... (live nodes size: 1)
   [junit4]   2> 252027 INFO  (zkCallback-187-thread-2-processing-n:127.0.0.1:40112_) [n:127.0.0.1:40112_    ] o.a.s.c.c.ZkStateReader Updated cluster state version to 2
   [junit4]   2> 252074 INFO  (coreZkRegister-1117-thread-1-processing-n:127.0.0.1:40112_ x:collection1 s:shard2 c:tmp_collection r:core_node1) [n:127.0.0.1:40112_ c:tmp_collection s:shard2 r:core_node1 x:collection1] o.a.s.c.ZkController We are https://127.0.0.1:40112/collection1/ and leader is https://127.0.0.1:40112/collection1/
   [junit4]   2> 252074 INFO  (coreZkRegister-1117-thread-1-processing-n:127.0.0.1:40112_ x:collection1 s:shard2 c:tmp_collection r:core_node1) [n:127.0.0.1:40112_ c:tmp_collection s:shard2 r:core_node1 x:collection1] o.a.s.c.ZkController No LogReplay needed for core=collection1 baseURL=https://127.0.0.1:40112
   [junit4]   2> 252074 INFO  (coreZkRegister-1117-thread-1-processing-n:127.0.0.1:40112_ x:collection1 s:shard2 c:tmp_collection r:core_node1) [n:127.0.0.1:40112_ c:tmp_collection s:shard2 r:core_node1 x:collection1] o.a.s.c.ZkController I am the leader, no recovery necessary
   [junit4]   2> 252075 INFO  (coreZkRegister-1117-thread-1-processing-n:127.0.0.1:40112_ x:collection1 s:shard2 c:tmp_collection r:core_node1) [n:127.0.0.1:40112_ c:tmp_collection s:shard2 r:core_node1 x:collection1] o.a.s.c.ZkController publishing state=active
   [junit4]   2> 252075 INFO  (coreZkRegister-1117-thread-1-processing-n:127.0.0.1:40112_ x:collection1 s:shard2 c:tmp_collection r:core_node1) [n:127.0.0.1:40112_ c:tmp_collection s:shard2 r:core_node1 x:collection1] o.a.s.c.ZkController numShards not found on descriptor - reading it from system property
   [junit4]   2> 252075 INFO  (zkCallback-187-thread-2-processing-n:127.0.0.1:40112_) [n:127.0.0.1:40112_    ] o.a.s.c.DistributedQueue NodeChildrenChanged fired on path /overseer/queue state SyncConnected
   [junit4]   2> 252076 INFO  (OverseerStateUpdate-94279716383293445-127.0.0.1:40112_-n_0000000000) [n:127.0.0.1:40112_    ] o.a.s.c.Overseer processMessage: queueSize: 1, message = {
   [junit4]   2>   "core":"collection1",
   [junit4]   2>   "core_node_name":"core_node1",
   [junit4]   2>   "roles":null,
   [junit4]   2>   "base_url":"https://127.0.0.1:40112",
   [junit4]   2>   "node_name":"127.0.0.1:40112_",
   [junit4]   2>   "numShards":"2",
   [junit4]   2>   "state":"active",
   [junit4]   2>   "shard":"shard2",
   [junit4]   2>   "collection":"tmp_collection",
   [junit4]   2>   "operation":"state"} current state version: 2
   [junit4]   2> 252076 INFO  (OverseerStateUpdate-94279716383293445-127.0.0.1:40112_-n_0000000000) [n:127.0.0.1:40112_    ] o.a.s.c.o.ReplicaMutator Update state numShards=2 message={
   [junit4]   2>   "core":"collection1",
   [junit4]   2>   "core_node_name":"core_node1",
   [junit4]   2>   "roles":null,
   [junit4]   2>   "base_url":"https://127.0.0.1:40112",
   [junit4]   2>   "node_name":"127.0.0.1:40112_",
   [junit4]   2>   "numShards":"2",
   [junit4]   2>   "state":"active",
   [junit4]   2>   "shard":"shard2",
   [junit4]   2>   "collection":"tmp_collection",
   [junit4]   2>   "operation":"state"}
   [junit4]   2> 252178 INFO  (zkCallback-187-thread-2-processing-n:127.0.0.1:40112_) [n:127.0.0.1:40112_    ] o.a.s.c.c.ZkStateReader A cluster state change: WatchedEvent state:SyncConnected type:NodeDataChanged path:/clusterstate.json, has occurred - updating... (live nodes size: 1)
   [junit4]   2> 252179 INFO  (zkCallback-187-thread-2-processing-n:127.0.0.1:40112_) [n:127.0.0.1:40112_    ] o.a.s.c.c.ZkStateReader Updated cluster state version to 3
   [junit4]   2> 252320 INFO  (TEST-CdcrReplicationDistributedZkTest.doTests-seed#[21435AB8DC35042]) [    ] o.a.s.SolrTestCaseJ4 Writing core.properties file to /home/jenkins/workspace/Lucene-Solr-trunk-Linux/solr/build/solr-core/test/J0/temp/solr.cloud.CdcrReplicationDistributedZkTest_21435AB8DC35042-001/jetty-002/cores/collection1
   [junit4]   2> 252322 INFO  (TEST-CdcrReplicationDistributedZkTest.doTests-seed#[21435AB8DC35042]) [    ] o.e.j.s.Server jetty-9.2.11.v20150529
   [junit4]   2> 252322 INFO  (TEST-CdcrReplicationDistributedZkTest.doTests-seed#[21435AB8DC35042]) [    ] o.e.j.s.h.ContextHandler Started o.e.j.s.ServletContextHandler@f6c2b4{/,null,AVAILABLE}
   [junit4]   2> 252326 INFO  (TEST-CdcrReplicationDistributedZkTest.doTests-seed#[21435AB8DC35042]) [    ] o.e.j.s.ServerConnector Started ServerConnector@158210{SSL-http/1.1}{127.0.0.1:58479}
   [junit4]   2> 252326 INFO  (TEST-CdcrReplicationDistributedZkTest.doTests-seed#[21435AB8DC35042]) [    ] o.e.j.s.Server Started @254217ms
   [junit4]   2> 252326 INFO  (TEST-CdcrReplicationDistributedZkTest.doTests-seed#[21435AB8DC35042]) [    ] o.a.s.c.s.e.JettySolrRunner Jetty properties: {shards=shard2, hostContext=/, hostPort=58479, coreRootDirectory=/home/jenkins/workspace/Lucene-Solr-trunk-Linux/solr/build/solr-core/test/J0/temp/solr.cloud.CdcrReplicationDistributedZkTest_21435AB8DC35042-001/jetty-002/cores}
   [junit4]   2> 252327 INFO  (TEST-CdcrReplicationDistributedZkTest.doTests-seed#[21435AB8DC35042]) [    ] o.a.s.s.SolrDispatchFilter SolrDispatchFilter.init(): sun.misc.Launcher$AppClassLoader@1fe3ee3
   [junit4]   2> 252327 INFO  (TEST-CdcrReplicationDistributedZkTest.doTests-seed#[21435AB8DC35042]) [    ] o.a.s.c.SolrResourceLoader new SolrResourceLoader for directory: '/home/jenkins/workspace/Lucene-Solr-trunk-Linux/solr/build/solr-core/test/J0/temp/solr.cloud.CdcrReplicationDistributedZkTest_21435AB8DC35042-001/jetty-002/'
   [junit4]   2> 252335 INFO  (TEST-CdcrReplicationDistributedZkTest.doTests-seed#[21435AB8DC35042]) [    ] o.a.s.c.c.SolrZkClient Using default ZkCredentialsProvider
   [junit4]   2> 252336 INFO  (TEST-CdcrReplicationDistributedZkTest.doTests-seed#[21435AB8DC35042]) [    ] o.a.s.c.c.ConnectionManager Waiting for client to connect to ZooKeeper
   [junit4]   2> 252338 INFO  (zkCallback-188-thread-1) [    ] o.a.s.c.c.ConnectionManager Watcher org.apache.solr.common.cloud.ConnectionManager@174cf76 name:ZooKeeperConnection Watcher:127.0.0.1:46780/solr got event WatchedEvent state:SyncConnected type:None path:null path:null type:None
   [junit4]   2> 252338 INFO  (TEST-CdcrReplicationDistributedZkTest.doTests-seed#[21435AB8DC35042]) [    ] o.a.s.c.c.ConnectionManager Client is connected to ZooKeeper
   [junit4]   2> 252338 INFO  (TEST-CdcrReplicationDistributedZkTest.doTests-seed#[21435AB8DC35042]) [    ] o.a.s.c.c.SolrZkClient Using default ZkACLProvider
   [junit4]   2> 252340 INFO  (TEST-CdcrReplicationDistributedZkTest.doTests-seed#[21435AB8DC35042]) [    ] o.a.s.s.SolrDispatchFilter Loading solr.xml from SolrHome (not found in ZooKeeper)
   [junit4]   2> 252340 INFO  (TEST-CdcrReplicationDistributedZkTest.doTests-seed#[21435AB8DC35042]) [    ] o.a.s.c.SolrXmlConfig Loading container configuration from /home/jenkins/workspace/Lucene-Solr-trunk-Linux/solr/build/solr-core/test/J0/temp/solr.cloud.CdcrReplicationDistributedZkTest_21435AB8DC35042-001/jetty-002/solr.xml
   [junit4]   2> 252343 INFO  (TEST-CdcrReplicationDistributedZkTest.doTests-seed#[21435AB8DC35042]) [    ] o.a.s.c.CoresLocator Config-defined core root directory: /home/jenkins/workspace/Lucene-Solr-trunk-Linux/solr/build/solr-core/test/J0/temp/solr.cloud.CdcrReplicationDistributedZkTest_21435AB8DC35042-001/jetty-002/cores
   [junit4]   2> 252343 INFO  (TEST-CdcrReplicationDistributedZkTest.doTests-seed#[21435AB8DC35042]) [    ] o.a.s.c.CoreContainer New CoreContainer 15256834
   [junit4]   2> 252343 INFO  (TEST-CdcrReplicationDistributedZkTest.doTests-seed#[21435AB8DC35042]) [    ] o.a.s.c.CoreContainer Loading cores into CoreContainer [instanceDir=/home/jenkins/workspace/Lucene-Solr-trunk-Linux/solr/build/solr-core/test/J0/temp/solr.cloud.CdcrReplicationDistributedZkTest_21435AB8DC35042-001/jetty-002/]
   [junit4]   2> 252343 INFO  (TEST-CdcrReplicationDistributedZkTest.doTests-seed#[21435AB8DC35042]) [    ] o.a.s.c.CoreContainer loading shared library: /home/jenkins/workspace/Lucene-Solr-trunk-Linux/solr/build/solr-core/test/J0/temp/solr.cloud.CdcrReplicationDistributedZkTest_21435AB8DC35042-001/jetty-002/lib
   [junit4]   2> 252344 WARN  (TEST-CdcrReplicationDistributedZkTest.doTests-seed#[21435AB8DC35042]) [    ] o.a.s.c.SolrResourceLoader Can't find (or read) directory to add to classloader: lib (resolved as: /home/jenkins/workspace/Lucene-Solr-trunk-Linux/solr/build/solr-core/test/J0/temp/solr.cloud.CdcrReplicationDistributedZkTest_21435AB8DC35042-001/jetty-002/lib).
   [junit4]   2> 252348 INFO  (TEST-CdcrReplicationDistributedZkTest.doTests-seed#[21435AB8DC35042]) [    ] o.a.s.h.c.HttpShardHandlerFactory created with socketTimeout : 90000,urlScheme : ,connTimeout : 15000,maxConnectionsPerHost : 20,maxConnections : 10000,corePoolSize : 0,maximumPoolSize : 2147483647,maxThreadIdleTime : 5,sizeOfQueue : -1,fairnessPolicy : false,useRetries : false,
   [junit4]   2> 252350 INFO  (TEST-CdcrReplicationDistributedZkTest.doTests-seed#[21435AB8DC35042]) [    ] o.a.s.u.UpdateShardHandler Creating UpdateShardHandler HTTP client with params: socketTimeout=340000&connTimeout=45000&retry=true
   [junit4]   2> 252351 INFO  (TEST-CdcrReplicationDistributedZkTest.doTests-seed#[21435AB8DC35042]) [    ] o.a.s.l.LogWatcher SLF4J impl is org.slf4j.impl.Log4jLoggerFactory
   [junit4]   2> 252351 INFO  (TEST-CdcrReplicationDistributedZkTest.doTests-seed#[21435AB8DC35042]) [    ] o.a.s.l.LogWatcher Registering Log Listener [Log4j (org.slf4j.impl.Log4jLoggerFactory)]
   [junit4]   2> 252351 INFO  (TEST-CdcrReplicationDistributedZkTest.doTests-seed#[21435AB8DC35042]) [    ] o.a.s.c.ZkContainer Zookeeper client=127.0.0.1:46780/solr
   [junit4]   2> 252351 INFO  (TEST-CdcrReplicationDistributedZkTest.doTests-seed#[21435AB8DC35042]) [    ] o.a.s.c.ZkController zkHost includes chroot
   [junit4]   2> 252352 INFO  (TEST-CdcrReplicationDistributedZkTest.doTests-seed#[21435AB8DC35042]) [    ] o.a.s.c.c.SolrZkClient Using default ZkCredentialsProvider
   [junit4]   2> 252352 INFO  (TEST-CdcrReplicationDistributedZkTest.doTests-seed#[21435AB8DC35042]) [    ] o.a.s.c.c.ConnectionManager Waiting for client to connect to ZooKeeper
   [junit4]   2> 252354 INFO  (zkCallback-190-thread-1) [    ] o.a.s.c.c.ConnectionManager Watcher org.apache.solr.common.cloud.ConnectionManager@cf16f2 name:ZooKeeperConnection Watcher:127.0.0.1:46780 got event WatchedEvent state:SyncConnected type:None path:null path:null type:None
   [junit4]   2> 252354 INFO  (TEST-CdcrReplicationDistributedZkTest.doTests-seed#[21435AB8DC35042]) [    ] o.a.s.c.c.ConnectionManager Client is connected to ZooKeeper
   [junit4]   2> 252354 INFO  (TEST-CdcrReplicationDistributedZkTest.doTests-seed#[21435AB8DC35042]) [    ] o.a.s.c.c.SolrZkClient Using default ZkACLProvider
   [junit4]   2> 252356 INFO  (TEST-CdcrReplicationDistributedZkTest.doTests-seed#[21435AB8DC35042]) [n:127.0.0.1:58479_    ] o.a.s.c.c.ConnectionManager Waiting for client to connect to ZooKeeper
   [junit4]   2> 252357 INFO  (zkCallback-191-thread-1-processing-n:127.0.0.1:58479_) [n:127.0.0.1:58479_    ] o.a.s.c.c.ConnectionManager Watcher org.apache.solr.common.cloud.ConnectionManager@84ebbe name:ZooKeeperConnection Watcher:127.0.0.1:46780/solr got event WatchedEvent state:SyncConnected type:None path:null path:null type:None
   [junit4]   2> 252357 INFO  (TEST-CdcrReplicationDistributedZkTest.doTests-seed#[21435AB8DC35042]) [n:127.0.0.1:58479_    ] o.a.s.c.c.ConnectionManager Client is connected to ZooKeeper
   [junit4]   2> 252359 INFO  (TEST-CdcrReplicationDistributedZkTest.doTests-seed#[21435AB8DC35042]) [n:127.0.0.1:58479_    ] o.a.s.c.c.ZkStateReader Updating cluster state from ZooKeeper... 
   [junit4]   2> 253361 INFO  (TEST-CdcrReplicationDistributedZkTest.doTests-seed#[21435AB8DC35042]) [n:127.0.0.1:58479_    ] o.a.s.c.ZkController Register node as live in ZooKeeper:/live_nodes/127.0.0.1:58479_
   [junit4]   2> 253361 INFO  (TEST-CdcrReplicationDistributedZkTest.doTests-seed#[21435AB8DC35042]) [n:127.0.0.1:58479_    ] o.a.s.c.c.SolrZkClient makePath: /live_nodes/127.0.0.1:58479_
   [junit4]   2> 253363 INFO  (TEST-CdcrReplicationDistributedZkTest.doTests-seed#[21435AB8DC35042]) [n:127.0.0.1:58479_    ] o.a.s.c.Overseer Overseer (id=null) closing
   [junit4]   2> 253363 INFO  (TEST-CdcrReplicationDistributedZkTest.doTests-seed#[21435AB8DC35042]) [n:127.0.0.1:58479_    ] o.a.s.c.LeaderElector Joined leadership election with path: /overseer_elect/election/94279716383293448-127.0.0.1:58479_-n_0000000001
   [junit4]   2> 253364 INFO  (TEST-CdcrReplicationDistributedZkTest.doTests-seed#[21435AB8DC35042]) [n:127.0.0.1:58479_    ] o.a.s.c.LeaderElector Watching path /overseer_elect/election/94279716383293445-127.0.0.1:40112_-n_0000000000 to know if I could be the leader
   [junit4]   2> 253364 INFO  (TEST-CdcrReplicationDistributedZkTest.doTests-seed#[21435AB8DC35042]) [n:127.0.0.1:58479_    ] o.a.s.c.CoreContainer No authentication plugin used.
   [junit4]   2> 253365 INFO  (TEST-CdcrReplicationDistributedZkTest.doTests-seed#[21435AB8DC35042]) [n:127.0.0.1:58479_    ] o.a.s.c.CoreContainer Security conf doesn't exist. Skipping setup for authorization module.
   [junit4]   2> 253365 INFO  (TEST-CdcrReplicationDistributedZkTest.doTests-seed#[21435AB8DC35042]) [n:127.0.0.1:58479_    ] o.a.s.c.CoresLocator Looking for core definitions underneath /home/jenkins/workspace/Lucene-Solr-trunk-Linux/solr/build/solr-core/test/J0/temp/solr.cloud.CdcrReplicationDistributedZkTest_21435AB8DC35042-001/jetty-002/cores
   [junit4]   2> 253366 INFO  (TEST-CdcrReplicationDistributedZkTest.doTests-seed#[21435AB8DC35042]) [n:127.0.0.1:58479_    ] o.a.s.c.SolrCore Created CoreDescriptor: {name=collection1, config=solrconfig.xml, transient=false, schema=schema.xml, loadOnStartup=true, configSetProperties=configsetprops.json, instanceDir=/home/jenkins/workspace/Lucene-Solr-trunk-Linux/solr/build/solr-core/test/J0/temp/solr.cloud.CdcrReplicationDistributedZkTest_21435AB8DC35042-001/jetty-002/cores/collection1, collection=tmp_collection, absoluteInstDir=/home/jenkins/workspace/Lucene-Solr-trunk-Linux/solr/build/solr-core/test/J0/temp/solr.cloud.CdcrReplicationDistributedZkTest_21435AB8DC35042-001/jetty-002/cores/collection1/, coreNodeName=, dataDir=data/, shard=}
   [junit4]   2> 253366 INFO  (TEST-CdcrReplicationDistributedZkTest.doTests-seed#[21435AB8DC35042]) [n:127.0.0.1:58479_    ] o.a.s.c.CoresLocator Found core collection1 in /home/jenkins/workspace/Lucene-Solr-trunk-Linux/solr/build/solr-core/test/J0/temp/solr.cloud.CdcrReplicationDistributedZkTest_21435AB8DC35042-001/jetty-002/cores/collection1/
   [junit4]   2> 253366 INFO  (TEST-CdcrReplicationDistributedZkTest.doTests-seed#[21435AB8DC35042]) [n:127.0.0.1:58479_    ] o.a.s.c.CoresLocator Found 1 core definitions
   [junit4]   2> 253367 INFO  (TEST-CdcrReplicationDistributedZkTest.doTests-seed#[21435AB8DC35042]) [n:127.0.0.1:58479_    ] o.a.s.s.SolrDispatchFilter user.dir=/home/jenkins/workspace/Lucene-Solr-trunk-Linux/solr/build/solr-core/test/J0
   [junit4]   2> 253367 INFO  (TEST-CdcrReplicationDistributedZkTest.doTests-seed#[21435AB8DC35042]) [n:127.0.0.1:58479_    ] o.a.s.s.SolrDispatchFilter SolrDispatchFilter.init() done
   [junit4]   2> 253367 INFO  (coreLoadExecutor-1135-thread-1-processing-n:127.0.0.1:58479_) [n:127.0.0.1:58479_ c:tmp_collection   x:collection1] o.a.s.c.ZkController publishing state=down
   [junit4]   2> 253367 INFO  (coreLoadExecutor-1135-thread-1-processing-n:127.0.0.1:58479_) [n:127.0.0.1:58479_ c:tmp_collection   x:collection1] o.a.s.c.ZkController numShards not found on descriptor - reading it from system property
   [junit4]   2> 253369 INFO  (zkCallback-187-thread-2-processing-n:127.0.0.1:40112_) [n:127.0.0.1:40112_    ] o.a.s.c.DistributedQueue NodeChildrenChanged fired on path /overseer/queue state SyncConnected
   [junit4]   2> 253369 INFO  (coreLoadExecutor-1135-thread-1-processing-n:127.0.0.1:58479_) [n:127.0.0.1:58479_ c:tmp_collection   x:collection1] o.a.s.c.ZkController look for our core node name
   [junit4]   2> 253370 INFO  (OverseerStateUpdate-94279716383293445-127.0.0.1:40112_-n_0000000000) [n:127.0.0.1:40112_    ] o.a.s.c.Overseer processMessage: queueSize: 1, message = {
   [junit4]   2>   "core":"collection1",
   [junit4]   2>   "roles":null,
   [junit4]   2>   "base_url":"https://127.0.0.1:58479",
   [junit4]   2>   "node_name":"127.0.0.1:58479_",
   [junit4]   2>   "numShards":"2",
   [junit4]   2>   "state":"down",
   [junit4]   2>   "shard":null,
   [junit4]   2>   "collection":"tmp_collection",
   [junit4]   2>   "operation":"state"} current state version: 3
   [junit4]   2> 253370 INFO  (OverseerStateUpdate-94279716383293445-127.0.0.1:40112_-n_0000000000) [n:127.0.0.1:40112_    ] o.a.s.c.o.ReplicaMutator Update state numShards=2 message={
   [junit4]   2>   "core":"collection1",
   [junit4]   2>   "roles":null,
   [junit4]   2>   "base_url":"https://127.0.0.1:58479",
   [junit4]   2>   "node_name":"127.0.0.1:58479_",
   [junit4]   2>   "numShards":"2",
   [junit4]   2>   "state":"down",
   [junit4]   2>   "shard":null,
   [junit4]   2>   "collection":"tmp_collection",
   [junit4]   2>   "operation":"state"}
   [junit4]   2> 253370 INFO  (OverseerStateUpdate-94279716383293445-127.0.0.1:40112_-n_0000000000) [n:127.0.0.1:40112_    ] o.a.s.c.o.ReplicaMutator Collection already exists with numShards=2
   [junit4]   2> 253370 INFO  (OverseerStateUpdate-94279716383293445-127.0.0.1:40112_-n_0000000000) [n:127.0.0.1:40112_    ] o.a.s.c.o.ReplicaMutator Assigning new node to shard shard=shard1
   [junit4]   2> 253472 INFO  (zkCallback-191-thread-1-processing-n:127.0.0.1:58479_) [n:127.0.0.1:58479_    ] o.a.s.c.c.ZkStateReader A cluster state change: WatchedEvent state:SyncConnected type:NodeDataChanged path:/clusterstate.json, has occurred - updating... (live nodes size: 2)
   [junit4]   2> 253472 INFO  (zkCallback-187-thread-2-processing-n:127.0.0.1:40112_) [n:127.0.0.1:40112_    ] o.a.s.c.c.ZkStateReader A cluster state change: WatchedEvent state:SyncConnected type:NodeDataChanged path:/clusterstate.json, has occurred - updating... (live nodes size: 2)
   [junit4]   2> 253472 INFO  (zkCallback-191-thread-1-processing-n:127.0.0.1:58479_) [n:127.0.0.1:58479_    ] o.a.s.c.c.ZkStateReader Updated cluster state version to 4
   [junit4]   2> 253472 INFO  (zkCallback-187-thread-2-processing-n:127.0.0.1:40112_) [n:127.0.0.1:40112_    ] o.a.s.c.c.ZkStateReader Updated cluster state version to 4
   [junit4]   2> 254370 INFO  (coreLoadExecutor-1135-thread-1-processing-n:127.0.0.1:58479_) [n:127.0.0.1:58479_ c:tmp_collection   x:collection1] o.a.s.c.ZkController waiting to find shard id in clusterstate for collection1
   [junit4]   2> 254370 INFO  (coreLoadExecutor-1135-thread-1-processing-n:127.0.0.1:58479_) [n:127.0.0.1:58479_ c:tmp_collection   x:collection1] o.a.s.c.ZkController Check for collection zkNode:tmp_collection
   [junit4]   2> 254370 INFO  (coreLoadExecutor-1135-thread-1-processing-n:127.0.0.1:58479_) [n:127.0.0.1:58479_ c:tmp_collection   x:collection1] o.a.s.c.ZkController Collection zkNode exists
   [junit4]   2> 254370 INFO  (coreLoadExecutor-1135-thread-1-processing-n:127.0.0.1:58479_) [n:127.0.0.1:58479_ c:tmp_collection   x:collection1] o.a.s.c.c.ZkStateReader Load collection config from:/collections/tmp_collection
   [junit4]   2> 254370 INFO  (coreLoadExecutor-1135-thread-1-processing-n:127.0.0.1:58479_) [n:127.0.0.1:58479_ c:tmp_collection   x:collection1] o.a.s.c.c.ZkStateReader path=/collections/tmp_collection configName=conf1 specified config exists in ZooKeeper
   [junit4]   2> 254371 INFO  (coreLoadExecutor-1135-thread-1-processing-n:127.0.0.1:58479_) [n:127.0.0.1:58479_ c:tmp_collection   x:collection1] o.a.s.c.SolrResourceLoader new SolrResourceLoader for directory: '/home/jenkins/workspace/Lucene-Solr-trunk-Linux/solr/build/solr-core/test/J0/temp/solr.cloud.CdcrReplicationDistributedZkTest_21435AB8DC35042-001/jetty-002/cores/collection1/'
   [junit4]   2> 254377 INFO  (coreLoadExecutor-1135-thread-1-processing-n:127.0.0.1:58479_) [n:127.0.0.1:58479_ c:tmp_collection   x:collection1] o.a.s.c.Config loaded config solrconfig.xml with version 0 
   [junit4]   2> 254381 INFO  (coreLoadExecutor-1135-thread-1-processing-n:127.0.0.1:58479_) [n:127.0.0.1:58479_ c:tmp_collection   x:collection1] o.a.s.c.SolrConfig current version of requestparams : -1
   [junit4]   2> 254389 INFO  (coreLoadExecutor-1135-thread-1-processing-n:127.0.0.1:58479_) [n:127.0.0.1:58479_ c:tmp_collection   x:collection1] o.a.s.c.SolrConfig Using Lucene MatchVersion: 6.0.0
   [junit4]   2> 254393 INFO  (coreLoadExecutor-1135-thread-1-processing-n:127.0.0.1:58479_) [n:127.0.0.1:58479_ c:tmp_collection   x:collection1] o.a.s.c.Config Loaded SolrConfig: solrconfig.xml
   [junit4]   2> 254394 INFO  (coreLoadExecutor-1135-thread-1-processing-n:127.0.0.1:58479_) [n:127.0.0.1:58479_ c:tmp_collection   x:collection1] o.a.s.s.IndexSchema Reading Solr Schema from /configs/conf1/schema.xml
   [junit4]   2> 254397 INFO  (coreLoadExecutor-1135-thread-1-processing-n:127.0.0.1:58479_) [n:127.0.0.1:58479_ c:tmp_collection   x:collection1] o.a.s.s.IndexSchema [collection1] Schema name=test
   [junit4]   2> 254440 INFO  (coreLoadExecutor-1135-thread-1-processing-n:127.0.0.1:58479_) [n:127.0.0.1:58479_ c:tmp_collection   x:collection1] o.a.s.s.IndexSchema default search field in schema is text
   [junit4]   2> 254441 INFO  (coreLoadExecutor-1135-thread-1-processing-n:127.0.0.1:58479_) [n:127.0.0.1:58479_ c:tmp_collection   x:collection1] o.a.s.s.IndexSchema unique key field: id
   [junit4]   2> 254441 INFO  (coreLoadExecutor-1135-thread-1-processing-n:127.0.0.1:58479_) [n:127.0.0.1:58479_ c:tmp_collection   x:collection1] o.a.s.s.FileExchangeRateProvider Reloading exchange rates from file currency.xml
   [junit4]   2> 254443 INFO  (coreLoadExecutor-1135-thread-1-processing-n:127.0.0.1:58479_) [n:127.0.0.1:58479_ c:tmp_collection   x:collection1] o.a.s.s.FileExchangeRateProvider Reloading exchange rates from file currency.xml
   [junit4]   2> 254449 INFO  (coreLoadExecutor-1135-thread-1-processing-n:127.0.0.1:58479_) [n:127.0.0.1:58479_ c:tmp_collection   x:collection1] o.a.s.c.ConfigSetProperties Did not find ConfigSet properties, assuming default properties: Can't find resource 'configsetprops.json' in classpath or '/configs/conf1', cwd=/home/jenkins/workspace/Lucene-Solr-trunk-Linux/solr/build/solr-core/test/J0
   [junit4]   2> 254449 INFO  (coreLoadExecutor-1135-thread-1-processing-n:127.0.0.1:58479_) [n:127.0.0.1:58479_ c:tmp_collection   x:collection1] o.a.s.c.CoreContainer Creating SolrCore 'collection1' using configuration from collection tmp_collection
   [junit4]   2> 254449 INFO  (coreLoadExecutor-1135-thread-1-processing-n:127.0.0.1:58479_) [n:127.0.0.1:58479_ c:tmp_collection s:shard1 r:core_node2 x:collection1] o.a.s.c.SolrCore org.apache.solr.core.MockDirectoryFactory
   [junit4]   2> 254449 INFO  (coreLoadExecutor-1135-thread-1-processing-n:127.0.0.1:58479_) [n:127.0.0.1:58479_ c:tmp_collection s:shard1 r:core_node2 x:collection1] o.a.s.c.SolrCore [[collection1] ] Opening new SolrCore at [/home/jenkins/workspace/Lucene-Solr-trunk-Linux/solr/build/solr-core/test/J0/temp/solr.cloud.CdcrReplicationDistributedZkTest_21435AB8DC35042-001/jetty-002/cores/collection1/], dataDir=[null]
   [junit4]   2> 254449 INFO  (coreLoadExecutor-1135-thread-1-processing-n:127.0.0.1:58479_) [n:127.0.0.1:58479_ c:tmp_collection s:shard1 r:core_node2 x:collection1] o.a.s.c.JmxMonitoredMap JMX monitoring is enabled. Adding Solr mbeans to JMX Server: com.sun.jmx.mbeanserver.JmxMBeanServer@119c291
   [junit4]   2> 254450 INFO  (coreLoadExecutor-1135-thread-1-processing-n:127.0.0.1:58479_) [n:127.0.0.1:58479_ c:tmp_collection s:shard1 r:core_node2 x:collection1] o.a.s.c.CachingDirectoryFactory return new directory for /home/jenkins/workspace/Lucene-Solr-trunk-Linux/solr/build/solr-core/test/J0/temp/solr.cloud.CdcrReplicationDistributedZkTest_21435AB8DC35042-001/jetty-002/cores/collection1/data
   [junit4]   2> 254450 INFO  (coreLoadExecutor-1135-thread-1-processing-n:127.0.0.1:58479_) [n:127.0.0.1:58479_ c:tmp_collection s:shard1 r:core_node2 x:collection1] o.a.s.c.SolrCore New index directory detected: old=null new=/home/jenkins/workspace/Lucene-Solr-trunk-Linux/solr/build/solr-core/test/J0/temp/solr.cloud.CdcrReplicationDistributedZkTest_21435AB8DC35042-001/jetty-002/cores/collection1/data/index/
   [junit4]   2> 254450 WARN  (coreLoadExecutor-1135-thread-1-processing-n:127.0.0.1:58479_) [n:127.0.0.1:58479_ c:tmp_collection s:shard1 r:core_node2 x:collection1] o.a.s.c.SolrCore [collection1] Solr index directory '/home/jenkins/workspace/Lucene-Solr-trunk-Linux/solr/build/solr-core/test/J0/temp/solr.cloud.CdcrReplicationDistributedZkTest_21435AB8DC35042-001/jetty-002/cores/collection1/data/index' doesn't exist. Creating new index...
   [junit4]   2> 254450 INFO  (coreLoadExecutor-1135-thread-1-processing-n:127.0.0.1:58479_) [n:127.0.0.1:58479_ c:tmp_collection s:shard1 r:core_node2 x:collection1] o.a.s.c.CachingDirectoryFactory return new directory for /home/jenkins/workspace/Lucene-Solr-trunk-Linux/solr/build/solr-core/test/J0/temp/solr.cloud.CdcrReplicationDistributedZkTest_21435AB8DC35042-001/jetty-002/cores/collection1/data/index
   [junit4]   2> 254450 INFO  (coreLoadExecutor-1135-thread-1-processing-n:127.0.0.1:58479_) [n:127.0.0.1:58479_ c:tmp_collection s:shard1 r:core_node2 x:collection1] o.a.s.u.RandomMergePolicy RandomMergePolicy wrapping class org.apache.lucene.index.TieredMergePolicy: [TieredMergePolicy: maxMergeAtOnce=26, maxMergeAtOnceExplicit=40, maxMergedSegmentMB=74.50390625, floorSegmentMB=0.26171875, forceMergeDeletesPctAllowed=22.450176009615337, segmentsPerTier=44.0, maxCFSSegmentSizeMB=8.796093022207999E12, noCFSRatio=1.0
   [junit4]   2> 254451 INFO  (coreLoadExecutor-1135-thread-1-processing-n:127.0.0.1:58479_) [n:127.0.0.1:58479_ c:tmp_collection s:shard1 r:core_node2 x:collection1] o.a.s.c.SolrCore SolrDeletionPolicy.onCommit: commits: num=1
   [junit4]   2> 	commit{dir=MockDirectoryWrapper(RAMDirectory@1787a52 lockFactory=org.apache.lucene.store.SingleInstanceLockFactory@168f2ed),segFN=segments_1,generation=1}
   [junit4]   2> 254451 INFO  (coreLoadExecutor-1135-thread-1-processing-n:127.0.0.1:58479_) [n:127.0.0.1:58479_ c:tmp_collection s:shard1 r:core_node2 x:collection1] o.a.s.c.SolrCore newest commit generation = 1
   [junit4]   2> 254451 INFO  (OldIndexDirectoryCleanupThreadForCore-collection1) [n:127.0.0.1:58479_ c:tmp_collection s:shard1 r:core_node2 x:collection1] o.a.s.c.SolrCore Looking for old index directories to cleanup for core collection1 in /home/jenkins/workspace/Lucene-Solr-trunk-Linux/solr/build/solr-core/test/J0/temp/solr.cloud.CdcrReplicationDistributedZkTest_21435AB8DC35042-001/jetty-002/cores/collection1/data/
   [junit4]   2> 254451 WARN  (OldIndexDirectoryCleanupThreadForCore-collection1) [n:127.0.0.1:58479_ c:tmp_collection s:shard1 r:core_node2 x:collection1] o.a.s.c.DirectoryFactory /home/jenkins/workspace/Lucene-Solr-trunk-Linux/solr/build/solr-core/test/J0/temp/solr.cloud.CdcrReplicationDistributedZkTest_21435AB8DC35042-001/jetty-002/cores/collection1/data/ does not point to a valid data directory; skipping clean-up of old index directories.
   [junit4]   2> 254454 INFO  (coreLoadExecutor-1135-thread-1-processing-n:127.0.0.1:58479_) [n:127.0.0.1:58479_ c:tmp_collection s:shard1 r:core_node2 x:collection1] o.a.s.u.p.UpdateRequestProcessorChain creating updateRequestProcessorChain "cdcr-processor-chain"
   [junit4]   2> 254454 INFO  (coreLoadExecutor-1135-thread-1-processing-n:127.0.0.1:58479_) [n:127.0.0.1:58479_ c:tmp_collection s:shard1 r:core_node2 x:collection1] o.a.s.c.SolrCore no updateRequestProcessorChain defined as default, creating implicit default
   [junit4]   2> 254455 INFO  (coreLoadExecutor-1135-thread-1-processing-n:127.0.0.1:58479_) [n:127.0.0.1:58479_ c:tmp_collection s:shard1 r:core_node2 x:collection1] o.a.s.h.l.XMLLoader xsltCacheLifetimeSeconds=60
   [junit4]   2> 254456 INFO  (coreLoadExecutor-1135-thread-1-processing-n:127.0.0.1:58479_) [n:127.0.0.1:58479_ c:tmp_collection s:shard1 r:core_node2 x:collection1] o.a.s.h.l.XMLLoader xsltCacheLifetimeSeconds=60
   [junit4]   2> 254457 INFO  (coreLoadExecutor-1135-thread-1-processing-n:127.0.0.1:58479_) [n:127.0.0.1:58479_ c:tmp_collection s:shard1 r:core_node2 x:collection1] o.a.s.h.l.XMLLoader xsltCacheLifetimeSeconds=60
   [junit4]   2> 254458 INFO  (coreLoadExecutor-1135-thread-1-processing-n:127.0.0.1:58479_) [n:127.0.0.1:58479_ c:tmp_collection s:shard1 r:core_node2 x:collection1] o.a.s.h.l.XMLLoader xsltCacheLifetimeSeconds=60
   [junit4]   2> 254460 INFO  (coreLoadExecutor-1135-thread-1-processing-n:127.0.0.1:58479_) [n:127.0.0.1:58479_ c:tmp_collection s:shard1 r:core_node2 x:collection1] o.a.s.c.RequestHandlers Registered paths: /admin/mbeans,standard,/update/csv,/update/json/docs,/admin/luke,/admin/segments,/get,/admin/system,/replication,/admin/properties,/config,/schema,/admin/plugins,/admin/logging,/update/json,/admin/threads,/admin/ping,/cdcr,/update,/admin/file
   [junit4]   2> 254461 INFO  (coreLoadExecutor-1135-thread-1-processing-n:127.0.0.1:58479_) [n:127.0.0.1:58479_ c:tmp_collection s:shard1 r:core_node2 x:collection1] o.a.s.c.SolrCore Using default statsCache cache: org.apache.solr.search.stats.LocalStatsCache
   [junit4]   2> 254461 INFO  (coreLoadExecutor-1135-thread-1-processing-n:127.0.0.1:58479_) [n:127.0.0.1:58479_ c:tmp_collection s:shard1 r:core_node2 x:collection1] o.a.s.u.UpdateHandler Using UpdateLog implementation: org.apache.solr.update.CdcrUpdateLog
   [junit4]   2> 254461 INFO  (coreLoadExecutor-1135-thread-1-processing-n:127.0.0.1:58479_) [n:127.0.0.1:58479_ c:tmp_collection s:shard1 r:core_node2 x:collection1] o.a.s.u.UpdateLog Initializing UpdateLog: dataDir= defaultSyncLevel=FLUSH numRecordsToKeep=100 maxNumLogsToKeep=10 numVersionBuckets=65536
   [junit4]   2> 254462 INFO  (coreLoadExecutor-1135-thread-1-processing-n:127.0.0.1:58479_) [n:127.0.0.1:58479_ c:tmp_collection s:shard1 r:core_node2 x:collection1] o.a.s.c.SolrCore Hard AutoCommit: disabled
   [junit4]   2> 254462 INFO  (coreLoadExecutor-1135-thread-1-processing-n:127.0.0.1:58479_) [n:127.0.0.1:58479_ c:tmp_collection s:shard1 r:core_node2 x:collection1] o.a.s.c.SolrCore Soft AutoCommit: disabled
   [junit4]   2> 254463 INFO  (coreLoadExecutor-1135-thread-1-processing-n:127.0.0.1:58479_) [n:127.0.0.1:58479_ c:tmp_collection s:shard1 r:core_node2 x:collection1] o.a.s.u.RandomMergePolicy RandomMergePolicy wrapping class org.apache.lucene.index.TieredMergePolicy: [TieredMergePolicy: maxMergeAtOnce=24, maxMergeAtOnceExplicit=10, maxMergedSegmentMB=11.73046875, floorSegmentMB=2.064453125, forceMergeDeletesPctAllowed=17.508825029336357, segmentsPerTier=17.0, maxCFSSegmentSizeMB=8.796093022207999E12, noCFSRatio=0.4738799137543743
   [junit4]   2> 254463 INFO  (coreLoadExecutor-1135-thread-1-processing-n:127.0.0.1:58479_) [n:127.0.0.1:58479_ c:tmp_collection s:shard1 r:core_node2 x:collection1] o.a.s.c.SolrCore SolrDeletionPolicy.onInit: commits: num=1
   [junit4]   2> 	commit{dir=MockDirectoryWrapper(RAMDirectory@1787a52 lockFactory=org.apache.lucene.store.SingleInstanceLockFactory@168f2ed),segFN=segments_1,generation=1}
   [junit4]   2> 254463 INFO  (coreLoadExecutor-1135-thread-1-processing-n:127.0.0.1:58479_) [n:127.0.0.1:58479_ c:tmp_collection s:shard1 r:core_node2 x:collection1] o.a.s.c.SolrCore newest commit generation = 1
   [junit4]   2> 254463 INFO  (coreLoadExecutor-1135-thread-1-processing-n:127.0.0.1:58479_) [n:127.0.0.1:58479_ c:tmp_collection s:shard1 r:core_node2 x:collection1] o.a.s.s.SolrIndexSearcher Opening Searcher@6b37e0[collection1] main
   [junit4]   2> 254464 INFO  (coreLoadExecutor-1135-thread-1-processing-n:127.0.0.1:58479_) [n:127.0.0.1:58479_ c:tmp_collection s:shard1 r:core_node2 x:collection1] o.a.s.c.c.ZkStateReader Load collection config from:/collections/tmp_collection
   [junit4]   2> 254464 INFO  (coreLoadExecutor-1135-thread-1-processing-n:127.0.0.1:58479_) [n:127.0.0.1:58479_ c:tmp_collection s:shard1 r:core_node2 x:collection1] o.a.s.c.c.ZkStateReader path=/collections/tmp_collection configName=conf1 specified config exists in ZooKeeper
   [junit4]   2> 254464 INFO  (coreLoadExecutor-1135-thread-1-processing-n:127.0.0.1:58479_) [n:127.0.0.1:58479_ c:tmp_collection s:shard1 r:core_node2 x:collection1] o.a.s.r.ManagedResourceStorage Setting up ZooKeeper-based storage for the RestManager with znodeBase: /configs/conf1
   [junit4]   2> 254464 INFO  (coreLoadExecutor-1135-thread-1-processing-n:127.0.0.1:58479_) [n:127.0.0.1:58479_ c:tmp_collection s:shard1 r:core_node2 x:collection1] o.a.s.r.ManagedResourceStorage Configured ZooKeeperStorageIO with znodeBase: /configs/conf1
   [junit4]   2> 254464 INFO  (coreLoadExecut

[...truncated too long message...]

toryFactory Closing directory: /home/jenkins/workspace/Lucene-Solr-trunk-Linux/solr/build/solr-core/test/J0/temp/solr.cloud.CdcrReplicationDistributedZkTest_21435AB8DC35042-001/jetty-008/cores/target_collection_shard1_replica1/data/index
   [junit4]   2> 622158 INFO  (TEST-CdcrReplicationDistributedZkTest.doTests-seed#[21435AB8DC35042]) [n:127.0.0.1:59032_ c:target_collection s:shard1 r:core_node2 x:target_collection_shard1_replica1] o.a.s.c.CachingDirectoryFactory looking to close /home/jenkins/workspace/Lucene-Solr-trunk-Linux/solr/build/solr-core/test/J0/temp/solr.cloud.CdcrReplicationDistributedZkTest_21435AB8DC35042-001/jetty-008/cores/target_collection_shard1_replica1/data [CachedDir<<refCount=0;path=/home/jenkins/workspace/Lucene-Solr-trunk-Linux/solr/build/solr-core/test/J0/temp/solr.cloud.CdcrReplicationDistributedZkTest_21435AB8DC35042-001/jetty-008/cores/target_collection_shard1_replica1/data;done=false>>]
   [junit4]   2> 622159 INFO  (TEST-CdcrReplicationDistributedZkTest.doTests-seed#[21435AB8DC35042]) [n:127.0.0.1:59032_ c:target_collection s:shard1 r:core_node2 x:target_collection_shard1_replica1] o.a.s.c.CachingDirectoryFactory Closing directory: /home/jenkins/workspace/Lucene-Solr-trunk-Linux/solr/build/solr-core/test/J0/temp/solr.cloud.CdcrReplicationDistributedZkTest_21435AB8DC35042-001/jetty-008/cores/target_collection_shard1_replica1/data
   [junit4]   2> 622159 INFO  (TEST-CdcrReplicationDistributedZkTest.doTests-seed#[21435AB8DC35042]) [n:127.0.0.1:59032_ c:target_collection s:shard1 r:core_node2 x:target_collection_shard1_replica1] o.a.s.c.Overseer Overseer (id=94279716383293622-127.0.0.1:59032_-n_0000000013) closing
   [junit4]   2> 622159 INFO  (OverseerStateUpdate-94279716383293622-127.0.0.1:59032_-n_0000000013) [n:127.0.0.1:59032_    ] o.a.s.c.Overseer Overseer Loop exiting : 127.0.0.1:59032_
   [junit4]   2> 622161 WARN  (zkCallback-571-thread-1-processing-n:127.0.0.1:59032_) [n:127.0.0.1:59032_    ] o.a.s.c.c.ZkStateReader ZooKeeper watch triggered, but Solr cannot talk to ZK
   [junit4]   2> 622161 INFO  (TEST-CdcrReplicationDistributedZkTest.doTests-seed#[21435AB8DC35042]) [    ] o.e.j.s.ServerConnector Stopped ServerConnector@9d6b64{SSL-http/1.1}{127.0.0.1:59032}
   [junit4]   2> 622162 INFO  (TEST-CdcrReplicationDistributedZkTest.doTests-seed#[21435AB8DC35042]) [    ] o.e.j.s.h.ContextHandler Stopped o.e.j.s.ServletContextHandler@2c193b{/,null,UNAVAILABLE}
   [junit4]   2> 622162 INFO  (TEST-CdcrReplicationDistributedZkTest.doTests-seed#[21435AB8DC35042]) [n:127.0.0.1:59032_ c:target_collection s:shard1 r:core_node2 x:target_collection_shard1_replica1] o.a.s.SolrTestCaseJ4 ###Ending doTests
   [junit4]   2> 622163 INFO  (TEST-CdcrReplicationDistributedZkTest.doTests-seed#[21435AB8DC35042]) [n:127.0.0.1:59032_ c:target_collection s:shard1 r:core_node2 x:target_collection_shard1_replica1] o.a.s.c.ZkTestServer connecting to 127.0.0.1:46780 46780
   [junit4]   2> 622286 INFO  (Thread-1198) [    ] o.a.s.c.ZkTestServer connecting to 127.0.0.1:46780 46780
   [junit4]   2> 622287 WARN  (Thread-1198) [    ] o.a.s.c.ZkTestServer Watch limit violations: 
   [junit4]   2> Maximum concurrent create/delete watches above limit:
   [junit4]   2> 
   [junit4]   2> 	224	/solr/aliases.json
   [junit4]   2> 	224	/solr/clusterstate.json
   [junit4]   2> 	78	/solr/configs/conf1
   [junit4]   2> 	33	/solr/collections/source_collection/state.json
   [junit4]   2> 	32	/solr/collections/target_collection/state.json
   [junit4]   2> 	4	/solr/collections/target_collection/leaders/shard1
   [junit4]   2> 	2	/solr/collections/source_collection/leaders/shard1
   [junit4]   2> 	2	/solr/collections/source_collection/leaders/shard2
   [junit4]   2> 	2	/solr/collections/tmp_collection/leaders/shard1
   [junit4]   2> 	2	/solr/collections/tmp_collection/leaders/shard2
   [junit4]   2> 	2	/solr/collections/target_collection/leaders/shard2
   [junit4]   2> 
   [junit4]   2> Maximum concurrent data watches above limit:
   [junit4]   2> 
   [junit4]   2> 	44	/solr/collections/source_collection/cdcr/state/process
   [junit4]   2> 	38	/solr/collections/source_collection/cdcr/state/buffer
   [junit4]   2> 	35	/solr/collections/target_collection/cdcr/state/buffer
   [junit4]   2> 	35	/solr/collections/target_collection/cdcr/state/process
   [junit4]   2> 	8	/solr/collections/tmp_collection/cdcr/state/buffer
   [junit4]   2> 	8	/solr/collections/tmp_collection/cdcr/state/process
   [junit4]   2> 	4	/solr/overseer_elect/election/94279716383293466-127.0.0.1:48159_-n_0000000005
   [junit4]   2> 	4	/solr/overseer_elect/election/94279716383293509-127.0.0.1:34160_-n_0000000009
   [junit4]   2> 	3	/solr/collections/target_collection/leader_elect/shard2/election/94279716383293466-core_node2-n_0000000000
   [junit4]   2> 	3	/solr/overseer_elect/election/94279716383293451-127.0.0.1:34921_-n_0000000002
   [junit4]   2> 	2	/solr/overseer_elect/election/94279716383293445-127.0.0.1:40112_-n_0000000000
   [junit4]   2> 	2	/solr/collections/source_collection/leader_elect/shard2/election/94279716383293454-core_node4-n_0000000000
   [junit4]   2> 	2	/solr/collections/source_collection/leader_elect/shard1/election/94279716383293451-core_node1-n_0000000000
   [junit4]   2> 	2	/solr/overseer_elect/election/94279716383293622-127.0.0.1:59032_-n_0000000013
   [junit4]   2> 
   [junit4]   2> Maximum concurrent children watches above limit:
   [junit4]   2> 
   [junit4]   2> 	216	/solr/live_nodes
   [junit4]   2> 	5	/solr/overseer/queue
   [junit4]   2> 	5	/solr/overseer/collection-queue-work
   [junit4]   2> 
   [junit4]   2> NOTE: reproduce with: ant test  -Dtestcase=CdcrReplicationDistributedZkTest -Dtests.method=doTests -Dtests.seed=21435AB8DC35042 -Dtests.multiplier=3 -Dtests.slow=true -Dtests.locale=sr -Dtests.timezone=Pacific/Kosrae -Dtests.asserts=true -Dtests.file.encoding=ISO-8859-1
   [junit4] ERROR    372s J0 | CdcrReplicationDistributedZkTest.doTests <<<
   [junit4]    > Throwable #1: java.lang.RuntimeException: Timeout waiting for CDCR replication to complete @source_collection:shard1
   [junit4]    > 	at __randomizedtesting.SeedInfo.seed([21435AB8DC35042:A74408782CD7849]:0)
   [junit4]    > 	at org.apache.solr.cloud.BaseCdcrDistributedZkTest.waitForReplicationToComplete(BaseCdcrDistributedZkTest.java:732)
   [junit4]    > 	at org.apache.solr.cloud.CdcrReplicationDistributedZkTest.doTestUpdateLogSynchronisation(CdcrReplicationDistributedZkTest.java:361)
   [junit4]    > 	at org.apache.solr.cloud.CdcrReplicationDistributedZkTest.doTests(CdcrReplicationDistributedZkTest.java:50)
   [junit4]    > 	at org.apache.solr.BaseDistributedSearchTestCase$ShardsRepeatRule$ShardsFixedStatement.callStatement(BaseDistributedSearchTestCase.java:966)
   [junit4]    > 	at org.apache.solr.BaseDistributedSearchTestCase$ShardsRepeatRule$ShardsStatement.evaluate(BaseDistributedSearchTestCase.java:941)
   [junit4]    > 	at java.lang.Thread.run(Thread.java:745)
   [junit4]   2> 622291 INFO  (SUITE-CdcrReplicationDistributedZkTest-seed#[21435AB8DC35042]-worker) [n:127.0.0.1:59032_ c:target_collection s:shard1 r:core_node2 x:target_collection_shard1_replica1] o.a.s.SolrTestCaseJ4 ###deleteCore
   [junit4]   2> NOTE: leaving temporary files on disk at: /home/jenkins/workspace/Lucene-Solr-trunk-Linux/solr/build/solr-core/test/J0/temp/solr.cloud.CdcrReplicationDistributedZkTest_21435AB8DC35042-001
   [junit4]   2> NOTE: test params are: codec=Asserting(Lucene53): {_version_=PostingsFormat(name=MockRandom), id=FSTOrd50}, docValues:{}, sim=DefaultSimilarity, locale=sr, timezone=Pacific/Kosrae
   [junit4]   2> NOTE: Linux 3.16.0-44-generic i386/Oracle Corporation 1.9.0-ea (32-bit)/cpus=12,threads=1,free=45998976,total=279969792
   [junit4]   2> NOTE: All tests run in this JVM: [HdfsCollectionsAPIDistributedZkTest, TestSolrQueryParserDefaultOperatorResource, ClusterStateTest, TestDownShardTolerantSearch, CollectionStateFormat2Test, UpdateRequestProcessorFactoryTest, SpatialHeatmapFacetsTest, CSVRequestHandlerTest, RequestLoggingTest, SchemaVersionSpecificBehaviorTest, TestSchemaManager, TestDistributedSearch, TestJmxMonitoredMap, ExternalFileFieldSortTest, TestManagedResourceStorage, TestCodecSupport, TestSolrDeletionPolicy1, TestMaxScoreQueryParser, DebugComponentTest, TestRestoreCore, CleanupOldIndexTest, TestRTimer, ParsingFieldUpdateProcessorsTest, TestCSVLoader, RuleEngineTest, SolrIndexConfigTest, DistributedDebugComponentTest, ActionThrottleTest, TestLRUStatsCache, HdfsBasicDistributedZkTest, AddBlockUpdateTest, MultiTermTest, StressHdfsTest, TestSmileRequest, TestRemoteStreaming, TestUpdate, TestConfigSetImmutable, TestCopyFieldCollectionResource, TestStressLucene, TestQuerySenderListener, JavabinLoaderTest, CdcrReplicationDistributedZkTest]
   [junit4] Completed [161/529] on J0 in 371.86s, 1 test, 1 error <<< FAILURES!

[...truncated 1149 lines...]
BUILD FAILED
/home/jenkins/workspace/Lucene-Solr-trunk-Linux/build.xml:716: The following error occurred while executing this line:
/home/jenkins/workspace/Lucene-Solr-trunk-Linux/build.xml:660: The following error occurred while executing this line:
/home/jenkins/workspace/Lucene-Solr-trunk-Linux/build.xml:59: The following error occurred while executing this line:
/home/jenkins/workspace/Lucene-Solr-trunk-Linux/solr/build.xml:230: The following error occurred while executing this line:
/home/jenkins/workspace/Lucene-Solr-trunk-Linux/solr/common-build.xml:514: The following error occurred while executing this line:
/home/jenkins/workspace/Lucene-Solr-trunk-Linux/lucene/common-build.xml:1429: The following error occurred while executing this line:
/home/jenkins/workspace/Lucene-Solr-trunk-Linux/lucene/common-build.xml:984: There were test failures: 529 suites, 2093 tests, 1 error, 65 ignored (30 assumptions)

Total time: 48 minutes 23 seconds
Build step 'Invoke Ant' marked build as failure
Archiving artifacts
Recording test results
Email was triggered for: Failure - Any
Sending email for trigger: Failure - Any



Mime
View raw message