lucene-dev mailing list archives

Site index · List index
Message view « Date » · « Thread »
Top « Date » · « Thread »
From Apache Jenkins Server <jenk...@builds.apache.org>
Subject [JENKINS] Lucene-Solr-Tests-trunk-Java8 - Build # 256 - Failure
Date Mon, 03 Aug 2015 15:06:59 GMT
Build: https://builds.apache.org/job/Lucene-Solr-Tests-trunk-Java8/256/

1 tests failed.
REGRESSION:  org.apache.solr.cloud.ChaosMonkeySafeLeaderTest.test

Error Message:
expected:<0> but was:<1>

Stack Trace:
java.lang.AssertionError: expected:<0> but was:<1>
	at __randomizedtesting.SeedInfo.seed([29C350392312E065:A1976FE38DEE8D9D]:0)
	at org.junit.Assert.fail(Assert.java:93)
	at org.junit.Assert.failNotEquals(Assert.java:647)
	at org.junit.Assert.assertEquals(Assert.java:128)
	at org.junit.Assert.assertEquals(Assert.java:472)
	at org.junit.Assert.assertEquals(Assert.java:456)
	at org.apache.solr.cloud.ChaosMonkeySafeLeaderTest.test(ChaosMonkeySafeLeaderTest.java:156)
	at sun.reflect.NativeMethodAccessorImpl.invoke0(Native Method)
	at sun.reflect.NativeMethodAccessorImpl.invoke(NativeMethodAccessorImpl.java:62)
	at sun.reflect.DelegatingMethodAccessorImpl.invoke(DelegatingMethodAccessorImpl.java:43)
	at java.lang.reflect.Method.invoke(Method.java:497)
	at com.carrotsearch.randomizedtesting.RandomizedRunner.invoke(RandomizedRunner.java:1627)
	at com.carrotsearch.randomizedtesting.RandomizedRunner$6.evaluate(RandomizedRunner.java:836)
	at com.carrotsearch.randomizedtesting.RandomizedRunner$7.evaluate(RandomizedRunner.java:872)
	at com.carrotsearch.randomizedtesting.RandomizedRunner$8.evaluate(RandomizedRunner.java:886)
	at org.apache.solr.BaseDistributedSearchTestCase$ShardsRepeatRule$ShardsFixedStatement.callStatement(BaseDistributedSearchTestCase.java:966)
	at org.apache.solr.BaseDistributedSearchTestCase$ShardsRepeatRule$ShardsStatement.evaluate(BaseDistributedSearchTestCase.java:941)
	at com.carrotsearch.randomizedtesting.rules.SystemPropertiesRestoreRule$1.evaluate(SystemPropertiesRestoreRule.java:57)
	at org.apache.lucene.util.TestRuleSetupTeardownChained$1.evaluate(TestRuleSetupTeardownChained.java:50)
	at org.apache.lucene.util.AbstractBeforeAfterRule$1.evaluate(AbstractBeforeAfterRule.java:46)
	at org.apache.lucene.util.TestRuleThreadAndTestName$1.evaluate(TestRuleThreadAndTestName.java:49)
	at org.apache.lucene.util.TestRuleIgnoreAfterMaxFailures$1.evaluate(TestRuleIgnoreAfterMaxFailures.java:65)
	at org.apache.lucene.util.TestRuleMarkFailure$1.evaluate(TestRuleMarkFailure.java:48)
	at com.carrotsearch.randomizedtesting.rules.StatementAdapter.evaluate(StatementAdapter.java:36)
	at com.carrotsearch.randomizedtesting.ThreadLeakControl$StatementRunner.run(ThreadLeakControl.java:365)
	at com.carrotsearch.randomizedtesting.ThreadLeakControl.forkTimeoutingTask(ThreadLeakControl.java:798)
	at com.carrotsearch.randomizedtesting.ThreadLeakControl$3.evaluate(ThreadLeakControl.java:458)
	at com.carrotsearch.randomizedtesting.RandomizedRunner.runSingleTest(RandomizedRunner.java:845)
	at com.carrotsearch.randomizedtesting.RandomizedRunner$3.evaluate(RandomizedRunner.java:747)
	at com.carrotsearch.randomizedtesting.RandomizedRunner$4.evaluate(RandomizedRunner.java:781)
	at com.carrotsearch.randomizedtesting.RandomizedRunner$5.evaluate(RandomizedRunner.java:792)
	at com.carrotsearch.randomizedtesting.rules.StatementAdapter.evaluate(StatementAdapter.java:36)
	at com.carrotsearch.randomizedtesting.rules.SystemPropertiesRestoreRule$1.evaluate(SystemPropertiesRestoreRule.java:57)
	at org.apache.lucene.util.AbstractBeforeAfterRule$1.evaluate(AbstractBeforeAfterRule.java:46)
	at com.carrotsearch.randomizedtesting.rules.StatementAdapter.evaluate(StatementAdapter.java:36)
	at org.apache.lucene.util.TestRuleStoreClassName$1.evaluate(TestRuleStoreClassName.java:42)
	at com.carrotsearch.randomizedtesting.rules.NoShadowingOrOverridesOnMethodsRule$1.evaluate(NoShadowingOrOverridesOnMethodsRule.java:39)
	at com.carrotsearch.randomizedtesting.rules.NoShadowingOrOverridesOnMethodsRule$1.evaluate(NoShadowingOrOverridesOnMethodsRule.java:39)
	at com.carrotsearch.randomizedtesting.rules.StatementAdapter.evaluate(StatementAdapter.java:36)
	at com.carrotsearch.randomizedtesting.rules.StatementAdapter.evaluate(StatementAdapter.java:36)
	at com.carrotsearch.randomizedtesting.rules.StatementAdapter.evaluate(StatementAdapter.java:36)
	at org.apache.lucene.util.TestRuleAssertionsRequired$1.evaluate(TestRuleAssertionsRequired.java:54)
	at org.apache.lucene.util.TestRuleMarkFailure$1.evaluate(TestRuleMarkFailure.java:48)
	at org.apache.lucene.util.TestRuleIgnoreAfterMaxFailures$1.evaluate(TestRuleIgnoreAfterMaxFailures.java:65)
	at org.apache.lucene.util.TestRuleIgnoreTestSuites$1.evaluate(TestRuleIgnoreTestSuites.java:55)
	at com.carrotsearch.randomizedtesting.rules.StatementAdapter.evaluate(StatementAdapter.java:36)
	at com.carrotsearch.randomizedtesting.ThreadLeakControl$StatementRunner.run(ThreadLeakControl.java:365)
	at java.lang.Thread.run(Thread.java:745)




Build Log:
[...truncated 10278 lines...]
   [junit4] Suite: org.apache.solr.cloud.ChaosMonkeySafeLeaderTest
   [junit4]   2> Creating dataDir: /x1/jenkins/jenkins-slave/workspace/Lucene-Solr-Tests-trunk-Java8/solr/build/solr-core/test/J1/temp/solr.cloud.ChaosMonkeySafeLeaderTest_29C350392312E065-001/init-core-data-001
   [junit4]   2> 798418 INFO  (SUITE-ChaosMonkeySafeLeaderTest-seed#[29C350392312E065]-worker) [    ] o.a.s.SolrTestCaseJ4 Randomized ssl (false) and clientAuth (true)
   [junit4]   2> 798418 INFO  (SUITE-ChaosMonkeySafeLeaderTest-seed#[29C350392312E065]-worker) [    ] o.a.s.BaseDistributedSearchTestCase Setting hostContext system property: /
   [junit4]   2> 798422 INFO  (TEST-ChaosMonkeySafeLeaderTest.test-seed#[29C350392312E065]) [    ] o.a.s.c.ZkTestServer STARTING ZK TEST SERVER
   [junit4]   2> 798422 INFO  (Thread-2017) [    ] o.a.s.c.ZkTestServer client port:0.0.0.0/0.0.0.0:0
   [junit4]   2> 798422 INFO  (Thread-2017) [    ] o.a.s.c.ZkTestServer Starting server
   [junit4]   2> 798522 INFO  (TEST-ChaosMonkeySafeLeaderTest.test-seed#[29C350392312E065]) [    ] o.a.s.c.ZkTestServer start zk server on port:38512
   [junit4]   2> 798522 INFO  (TEST-ChaosMonkeySafeLeaderTest.test-seed#[29C350392312E065]) [    ] o.a.s.c.c.SolrZkClient Using default ZkCredentialsProvider
   [junit4]   2> 798524 INFO  (TEST-ChaosMonkeySafeLeaderTest.test-seed#[29C350392312E065]) [    ] o.a.s.c.c.ConnectionManager Waiting for client to connect to ZooKeeper
   [junit4]   2> 798525 INFO  (zkCallback-692-thread-1) [    ] o.a.s.c.c.ConnectionManager Watcher org.apache.solr.common.cloud.ConnectionManager@114ccda2 name:ZooKeeperConnection Watcher:127.0.0.1:38512 got event WatchedEvent state:SyncConnected type:None path:null path:null type:None
   [junit4]   2> 798526 INFO  (TEST-ChaosMonkeySafeLeaderTest.test-seed#[29C350392312E065]) [    ] o.a.s.c.c.ConnectionManager Client is connected to ZooKeeper
   [junit4]   2> 798526 INFO  (TEST-ChaosMonkeySafeLeaderTest.test-seed#[29C350392312E065]) [    ] o.a.s.c.c.SolrZkClient Using default ZkACLProvider
   [junit4]   2> 798526 INFO  (TEST-ChaosMonkeySafeLeaderTest.test-seed#[29C350392312E065]) [    ] o.a.s.c.c.SolrZkClient makePath: /solr
   [junit4]   2> 798528 INFO  (TEST-ChaosMonkeySafeLeaderTest.test-seed#[29C350392312E065]) [    ] o.a.s.c.c.SolrZkClient Using default ZkCredentialsProvider
   [junit4]   2> 798532 INFO  (TEST-ChaosMonkeySafeLeaderTest.test-seed#[29C350392312E065]) [    ] o.a.s.c.c.ConnectionManager Waiting for client to connect to ZooKeeper
   [junit4]   2> 798532 INFO  (zkCallback-693-thread-1) [    ] o.a.s.c.c.ConnectionManager Watcher org.apache.solr.common.cloud.ConnectionManager@c59bdc7 name:ZooKeeperConnection Watcher:127.0.0.1:38512/solr got event WatchedEvent state:SyncConnected type:None path:null path:null type:None
   [junit4]   2> 798532 INFO  (TEST-ChaosMonkeySafeLeaderTest.test-seed#[29C350392312E065]) [    ] o.a.s.c.c.ConnectionManager Client is connected to ZooKeeper
   [junit4]   2> 798533 INFO  (TEST-ChaosMonkeySafeLeaderTest.test-seed#[29C350392312E065]) [    ] o.a.s.c.c.SolrZkClient Using default ZkACLProvider
   [junit4]   2> 798533 INFO  (TEST-ChaosMonkeySafeLeaderTest.test-seed#[29C350392312E065]) [    ] o.a.s.c.c.SolrZkClient makePath: /collections/collection1
   [junit4]   2> 798534 INFO  (TEST-ChaosMonkeySafeLeaderTest.test-seed#[29C350392312E065]) [    ] o.a.s.c.c.SolrZkClient makePath: /collections/collection1/shards
   [junit4]   2> 798536 INFO  (TEST-ChaosMonkeySafeLeaderTest.test-seed#[29C350392312E065]) [    ] o.a.s.c.c.SolrZkClient makePath: /collections/control_collection
   [junit4]   2> 798537 INFO  (TEST-ChaosMonkeySafeLeaderTest.test-seed#[29C350392312E065]) [    ] o.a.s.c.c.SolrZkClient makePath: /collections/control_collection/shards
   [junit4]   2> 798538 INFO  (TEST-ChaosMonkeySafeLeaderTest.test-seed#[29C350392312E065]) [    ] o.a.s.c.AbstractZkTestCase put /x1/jenkins/jenkins-slave/workspace/Lucene-Solr-Tests-trunk-Java8/solr/core/src/test-files/solr/collection1/conf/solrconfig-tlog.xml to /configs/conf1/solrconfig.xml
   [junit4]   2> 798539 INFO  (TEST-ChaosMonkeySafeLeaderTest.test-seed#[29C350392312E065]) [    ] o.a.s.c.c.SolrZkClient makePath: /configs/conf1/solrconfig.xml
   [junit4]   2> 798541 INFO  (TEST-ChaosMonkeySafeLeaderTest.test-seed#[29C350392312E065]) [    ] o.a.s.c.AbstractZkTestCase put /x1/jenkins/jenkins-slave/workspace/Lucene-Solr-Tests-trunk-Java8/solr/core/src/test-files/solr/collection1/conf/schema15.xml to /configs/conf1/schema.xml
   [junit4]   2> 798541 INFO  (TEST-ChaosMonkeySafeLeaderTest.test-seed#[29C350392312E065]) [    ] o.a.s.c.c.SolrZkClient makePath: /configs/conf1/schema.xml
   [junit4]   2> 798543 INFO  (TEST-ChaosMonkeySafeLeaderTest.test-seed#[29C350392312E065]) [    ] o.a.s.c.AbstractZkTestCase put /x1/jenkins/jenkins-slave/workspace/Lucene-Solr-Tests-trunk-Java8/solr/core/src/test-files/solr/collection1/conf/solrconfig.snippet.randomindexconfig.xml to /configs/conf1/solrconfig.snippet.randomindexconfig.xml
   [junit4]   2> 798543 INFO  (TEST-ChaosMonkeySafeLeaderTest.test-seed#[29C350392312E065]) [    ] o.a.s.c.c.SolrZkClient makePath: /configs/conf1/solrconfig.snippet.randomindexconfig.xml
   [junit4]   2> 798545 INFO  (TEST-ChaosMonkeySafeLeaderTest.test-seed#[29C350392312E065]) [    ] o.a.s.c.AbstractZkTestCase put /x1/jenkins/jenkins-slave/workspace/Lucene-Solr-Tests-trunk-Java8/solr/core/src/test-files/solr/collection1/conf/stopwords.txt to /configs/conf1/stopwords.txt
   [junit4]   2> 798545 INFO  (TEST-ChaosMonkeySafeLeaderTest.test-seed#[29C350392312E065]) [    ] o.a.s.c.c.SolrZkClient makePath: /configs/conf1/stopwords.txt
   [junit4]   2> 798547 INFO  (TEST-ChaosMonkeySafeLeaderTest.test-seed#[29C350392312E065]) [    ] o.a.s.c.AbstractZkTestCase put /x1/jenkins/jenkins-slave/workspace/Lucene-Solr-Tests-trunk-Java8/solr/core/src/test-files/solr/collection1/conf/protwords.txt to /configs/conf1/protwords.txt
   [junit4]   2> 798547 INFO  (TEST-ChaosMonkeySafeLeaderTest.test-seed#[29C350392312E065]) [    ] o.a.s.c.c.SolrZkClient makePath: /configs/conf1/protwords.txt
   [junit4]   2> 798549 INFO  (TEST-ChaosMonkeySafeLeaderTest.test-seed#[29C350392312E065]) [    ] o.a.s.c.AbstractZkTestCase put /x1/jenkins/jenkins-slave/workspace/Lucene-Solr-Tests-trunk-Java8/solr/core/src/test-files/solr/collection1/conf/currency.xml to /configs/conf1/currency.xml
   [junit4]   2> 798549 INFO  (TEST-ChaosMonkeySafeLeaderTest.test-seed#[29C350392312E065]) [    ] o.a.s.c.c.SolrZkClient makePath: /configs/conf1/currency.xml
   [junit4]   2> 798550 INFO  (TEST-ChaosMonkeySafeLeaderTest.test-seed#[29C350392312E065]) [    ] o.a.s.c.AbstractZkTestCase put /x1/jenkins/jenkins-slave/workspace/Lucene-Solr-Tests-trunk-Java8/solr/core/src/test-files/solr/collection1/conf/enumsConfig.xml to /configs/conf1/enumsConfig.xml
   [junit4]   2> 798551 INFO  (TEST-ChaosMonkeySafeLeaderTest.test-seed#[29C350392312E065]) [    ] o.a.s.c.c.SolrZkClient makePath: /configs/conf1/enumsConfig.xml
   [junit4]   2> 798552 INFO  (TEST-ChaosMonkeySafeLeaderTest.test-seed#[29C350392312E065]) [    ] o.a.s.c.AbstractZkTestCase put /x1/jenkins/jenkins-slave/workspace/Lucene-Solr-Tests-trunk-Java8/solr/core/src/test-files/solr/collection1/conf/open-exchange-rates.json to /configs/conf1/open-exchange-rates.json
   [junit4]   2> 798552 INFO  (TEST-ChaosMonkeySafeLeaderTest.test-seed#[29C350392312E065]) [    ] o.a.s.c.c.SolrZkClient makePath: /configs/conf1/open-exchange-rates.json
   [junit4]   2> 798554 INFO  (TEST-ChaosMonkeySafeLeaderTest.test-seed#[29C350392312E065]) [    ] o.a.s.c.AbstractZkTestCase put /x1/jenkins/jenkins-slave/workspace/Lucene-Solr-Tests-trunk-Java8/solr/core/src/test-files/solr/collection1/conf/mapping-ISOLatin1Accent.txt to /configs/conf1/mapping-ISOLatin1Accent.txt
   [junit4]   2> 798554 INFO  (TEST-ChaosMonkeySafeLeaderTest.test-seed#[29C350392312E065]) [    ] o.a.s.c.c.SolrZkClient makePath: /configs/conf1/mapping-ISOLatin1Accent.txt
   [junit4]   2> 798555 INFO  (TEST-ChaosMonkeySafeLeaderTest.test-seed#[29C350392312E065]) [    ] o.a.s.c.AbstractZkTestCase put /x1/jenkins/jenkins-slave/workspace/Lucene-Solr-Tests-trunk-Java8/solr/core/src/test-files/solr/collection1/conf/old_synonyms.txt to /configs/conf1/old_synonyms.txt
   [junit4]   2> 798556 INFO  (TEST-ChaosMonkeySafeLeaderTest.test-seed#[29C350392312E065]) [    ] o.a.s.c.c.SolrZkClient makePath: /configs/conf1/old_synonyms.txt
   [junit4]   2> 798557 INFO  (TEST-ChaosMonkeySafeLeaderTest.test-seed#[29C350392312E065]) [    ] o.a.s.c.AbstractZkTestCase put /x1/jenkins/jenkins-slave/workspace/Lucene-Solr-Tests-trunk-Java8/solr/core/src/test-files/solr/collection1/conf/synonyms.txt to /configs/conf1/synonyms.txt
   [junit4]   2> 798557 INFO  (TEST-ChaosMonkeySafeLeaderTest.test-seed#[29C350392312E065]) [    ] o.a.s.c.c.SolrZkClient makePath: /configs/conf1/synonyms.txt
   [junit4]   2> 798873 INFO  (TEST-ChaosMonkeySafeLeaderTest.test-seed#[29C350392312E065]) [    ] o.a.s.SolrTestCaseJ4 Writing core.properties file to /x1/jenkins/jenkins-slave/workspace/Lucene-Solr-Tests-trunk-Java8/solr/build/solr-core/test/J1/temp/solr.cloud.ChaosMonkeySafeLeaderTest_29C350392312E065-001/control-001/cores/collection1
   [junit4]   2> 798875 INFO  (TEST-ChaosMonkeySafeLeaderTest.test-seed#[29C350392312E065]) [    ] o.e.j.s.Server jetty-9.2.11.v20150529
   [junit4]   2> 798876 INFO  (TEST-ChaosMonkeySafeLeaderTest.test-seed#[29C350392312E065]) [    ] o.e.j.s.h.ContextHandler Started o.e.j.s.ServletContextHandler@3e9f0050{/,null,AVAILABLE}
   [junit4]   2> 798877 INFO  (TEST-ChaosMonkeySafeLeaderTest.test-seed#[29C350392312E065]) [    ] o.e.j.s.ServerConnector Started ServerConnector@21d7f783{HTTP/1.1}{127.0.0.1:38414}
   [junit4]   2> 798877 INFO  (TEST-ChaosMonkeySafeLeaderTest.test-seed#[29C350392312E065]) [    ] o.e.j.s.Server Started @802927ms
   [junit4]   2> 798877 INFO  (TEST-ChaosMonkeySafeLeaderTest.test-seed#[29C350392312E065]) [    ] o.a.s.c.s.e.JettySolrRunner Jetty properties: {solr.data.dir=/x1/jenkins/jenkins-slave/workspace/Lucene-Solr-Tests-trunk-Java8/solr/build/solr-core/test/J1/temp/solr.cloud.ChaosMonkeySafeLeaderTest_29C350392312E065-001/tempDir-001/control/data, hostContext=/, hostPort=38414, coreRootDirectory=/x1/jenkins/jenkins-slave/workspace/Lucene-Solr-Tests-trunk-Java8/solr/build/solr-core/test/J1/temp/solr.cloud.ChaosMonkeySafeLeaderTest_29C350392312E065-001/control-001/cores}
   [junit4]   2> 798878 INFO  (TEST-ChaosMonkeySafeLeaderTest.test-seed#[29C350392312E065]) [    ] o.a.s.s.SolrDispatchFilter SolrDispatchFilter.init(): sun.misc.Launcher$AppClassLoader@4e0e2f2a
   [junit4]   2> 798878 INFO  (TEST-ChaosMonkeySafeLeaderTest.test-seed#[29C350392312E065]) [    ] o.a.s.c.SolrResourceLoader new SolrResourceLoader for directory: '/x1/jenkins/jenkins-slave/workspace/Lucene-Solr-Tests-trunk-Java8/solr/build/solr-core/test/J1/temp/solr.cloud.ChaosMonkeySafeLeaderTest_29C350392312E065-001/control-001/'
   [junit4]   2> 798894 INFO  (TEST-ChaosMonkeySafeLeaderTest.test-seed#[29C350392312E065]) [    ] o.a.s.c.c.SolrZkClient Using default ZkCredentialsProvider
   [junit4]   2> 798895 INFO  (TEST-ChaosMonkeySafeLeaderTest.test-seed#[29C350392312E065]) [    ] o.a.s.c.c.ConnectionManager Waiting for client to connect to ZooKeeper
   [junit4]   2> 798896 INFO  (zkCallback-694-thread-1) [    ] o.a.s.c.c.ConnectionManager Watcher org.apache.solr.common.cloud.ConnectionManager@5091943f name:ZooKeeperConnection Watcher:127.0.0.1:38512/solr got event WatchedEvent state:SyncConnected type:None path:null path:null type:None
   [junit4]   2> 798896 INFO  (TEST-ChaosMonkeySafeLeaderTest.test-seed#[29C350392312E065]) [    ] o.a.s.c.c.ConnectionManager Client is connected to ZooKeeper
   [junit4]   2> 798897 INFO  (TEST-ChaosMonkeySafeLeaderTest.test-seed#[29C350392312E065]) [    ] o.a.s.c.c.SolrZkClient Using default ZkACLProvider
   [junit4]   2> 798898 INFO  (TEST-ChaosMonkeySafeLeaderTest.test-seed#[29C350392312E065]) [    ] o.a.s.s.SolrDispatchFilter Loading solr.xml from SolrHome (not found in ZooKeeper)
   [junit4]   2> 798898 INFO  (TEST-ChaosMonkeySafeLeaderTest.test-seed#[29C350392312E065]) [    ] o.a.s.c.SolrXmlConfig Loading container configuration from /x1/jenkins/jenkins-slave/workspace/Lucene-Solr-Tests-trunk-Java8/solr/build/solr-core/test/J1/temp/solr.cloud.ChaosMonkeySafeLeaderTest_29C350392312E065-001/control-001/solr.xml
   [junit4]   2> 798903 INFO  (TEST-ChaosMonkeySafeLeaderTest.test-seed#[29C350392312E065]) [    ] o.a.s.c.CoresLocator Config-defined core root directory: /x1/jenkins/jenkins-slave/workspace/Lucene-Solr-Tests-trunk-Java8/solr/build/solr-core/test/J1/temp/solr.cloud.ChaosMonkeySafeLeaderTest_29C350392312E065-001/control-001/cores
   [junit4]   2> 798903 INFO  (TEST-ChaosMonkeySafeLeaderTest.test-seed#[29C350392312E065]) [    ] o.a.s.c.CoreContainer New CoreContainer 1918579664
   [junit4]   2> 798904 INFO  (TEST-ChaosMonkeySafeLeaderTest.test-seed#[29C350392312E065]) [    ] o.a.s.c.CoreContainer Loading cores into CoreContainer [instanceDir=/x1/jenkins/jenkins-slave/workspace/Lucene-Solr-Tests-trunk-Java8/solr/build/solr-core/test/J1/temp/solr.cloud.ChaosMonkeySafeLeaderTest_29C350392312E065-001/control-001/]
   [junit4]   2> 798904 INFO  (TEST-ChaosMonkeySafeLeaderTest.test-seed#[29C350392312E065]) [    ] o.a.s.c.CoreContainer loading shared library: /x1/jenkins/jenkins-slave/workspace/Lucene-Solr-Tests-trunk-Java8/solr/build/solr-core/test/J1/temp/solr.cloud.ChaosMonkeySafeLeaderTest_29C350392312E065-001/control-001/lib
   [junit4]   2> 798904 WARN  (TEST-ChaosMonkeySafeLeaderTest.test-seed#[29C350392312E065]) [    ] o.a.s.c.SolrResourceLoader Can't find (or read) directory to add to classloader: lib (resolved as: /x1/jenkins/jenkins-slave/workspace/Lucene-Solr-Tests-trunk-Java8/solr/build/solr-core/test/J1/temp/solr.cloud.ChaosMonkeySafeLeaderTest_29C350392312E065-001/control-001/lib).
   [junit4]   2> 798912 INFO  (TEST-ChaosMonkeySafeLeaderTest.test-seed#[29C350392312E065]) [    ] o.a.s.h.c.HttpShardHandlerFactory created with socketTimeout : 90000,urlScheme : ,connTimeout : 15000,maxConnectionsPerHost : 20,maxConnections : 10000,corePoolSize : 0,maximumPoolSize : 2147483647,maxThreadIdleTime : 5,sizeOfQueue : -1,fairnessPolicy : false,useRetries : false,
   [junit4]   2> 798913 INFO  (TEST-ChaosMonkeySafeLeaderTest.test-seed#[29C350392312E065]) [    ] o.a.s.u.UpdateShardHandler Creating UpdateShardHandler HTTP client with params: socketTimeout=340000&connTimeout=45000&retry=true
   [junit4]   2> 798913 INFO  (TEST-ChaosMonkeySafeLeaderTest.test-seed#[29C350392312E065]) [    ] o.a.s.l.LogWatcher SLF4J impl is org.slf4j.impl.Log4jLoggerFactory
   [junit4]   2> 798914 INFO  (TEST-ChaosMonkeySafeLeaderTest.test-seed#[29C350392312E065]) [    ] o.a.s.l.LogWatcher Registering Log Listener [Log4j (org.slf4j.impl.Log4jLoggerFactory)]
   [junit4]   2> 798914 INFO  (TEST-ChaosMonkeySafeLeaderTest.test-seed#[29C350392312E065]) [    ] o.a.s.c.ZkContainer Zookeeper client=127.0.0.1:38512/solr
   [junit4]   2> 798914 INFO  (TEST-ChaosMonkeySafeLeaderTest.test-seed#[29C350392312E065]) [    ] o.a.s.c.ZkController zkHost includes chroot
   [junit4]   2> 798914 INFO  (TEST-ChaosMonkeySafeLeaderTest.test-seed#[29C350392312E065]) [    ] o.a.s.c.c.SolrZkClient Using default ZkCredentialsProvider
   [junit4]   2> 798915 INFO  (TEST-ChaosMonkeySafeLeaderTest.test-seed#[29C350392312E065]) [    ] o.a.s.c.c.ConnectionManager Waiting for client to connect to ZooKeeper
   [junit4]   2> 798916 INFO  (zkCallback-696-thread-1) [    ] o.a.s.c.c.ConnectionManager Watcher org.apache.solr.common.cloud.ConnectionManager@5e2bb3f1 name:ZooKeeperConnection Watcher:127.0.0.1:38512 got event WatchedEvent state:SyncConnected type:None path:null path:null type:None
   [junit4]   2> 798916 INFO  (TEST-ChaosMonkeySafeLeaderTest.test-seed#[29C350392312E065]) [    ] o.a.s.c.c.ConnectionManager Client is connected to ZooKeeper
   [junit4]   2> 798917 INFO  (TEST-ChaosMonkeySafeLeaderTest.test-seed#[29C350392312E065]) [    ] o.a.s.c.c.SolrZkClient Using default ZkACLProvider
   [junit4]   2> 798918 INFO  (TEST-ChaosMonkeySafeLeaderTest.test-seed#[29C350392312E065]) [n:127.0.0.1:38414_    ] o.a.s.c.c.ConnectionManager Waiting for client to connect to ZooKeeper
   [junit4]   2> 798919 INFO  (zkCallback-697-thread-1-processing-n:127.0.0.1:38414_) [n:127.0.0.1:38414_    ] o.a.s.c.c.ConnectionManager Watcher org.apache.solr.common.cloud.ConnectionManager@2663ddd4 name:ZooKeeperConnection Watcher:127.0.0.1:38512/solr got event WatchedEvent state:SyncConnected type:None path:null path:null type:None
   [junit4]   2> 798919 INFO  (TEST-ChaosMonkeySafeLeaderTest.test-seed#[29C350392312E065]) [n:127.0.0.1:38414_    ] o.a.s.c.c.ConnectionManager Client is connected to ZooKeeper
   [junit4]   2> 798920 INFO  (TEST-ChaosMonkeySafeLeaderTest.test-seed#[29C350392312E065]) [n:127.0.0.1:38414_    ] o.a.s.c.c.SolrZkClient makePath: /overseer/queue
   [junit4]   2> 798922 INFO  (TEST-ChaosMonkeySafeLeaderTest.test-seed#[29C350392312E065]) [n:127.0.0.1:38414_    ] o.a.s.c.c.SolrZkClient makePath: /overseer/collection-queue-work
   [junit4]   2> 798924 INFO  (TEST-ChaosMonkeySafeLeaderTest.test-seed#[29C350392312E065]) [n:127.0.0.1:38414_    ] o.a.s.c.c.SolrZkClient makePath: /overseer/collection-map-running
   [junit4]   2> 798926 INFO  (TEST-ChaosMonkeySafeLeaderTest.test-seed#[29C350392312E065]) [n:127.0.0.1:38414_    ] o.a.s.c.c.SolrZkClient makePath: /overseer/collection-map-completed
   [junit4]   2> 798927 INFO  (TEST-ChaosMonkeySafeLeaderTest.test-seed#[29C350392312E065]) [n:127.0.0.1:38414_    ] o.a.s.c.c.SolrZkClient makePath: /overseer/collection-map-failure
   [junit4]   2> 798929 INFO  (TEST-ChaosMonkeySafeLeaderTest.test-seed#[29C350392312E065]) [n:127.0.0.1:38414_    ] o.a.s.c.c.SolrZkClient makePath: /live_nodes
   [junit4]   2> 798931 INFO  (TEST-ChaosMonkeySafeLeaderTest.test-seed#[29C350392312E065]) [n:127.0.0.1:38414_    ] o.a.s.c.c.SolrZkClient makePath: /aliases.json
   [junit4]   2> 798932 INFO  (TEST-ChaosMonkeySafeLeaderTest.test-seed#[29C350392312E065]) [n:127.0.0.1:38414_    ] o.a.s.c.c.SolrZkClient makePath: /clusterstate.json
   [junit4]   2> 798933 INFO  (TEST-ChaosMonkeySafeLeaderTest.test-seed#[29C350392312E065]) [n:127.0.0.1:38414_    ] o.a.s.c.ZkController Register node as live in ZooKeeper:/live_nodes/127.0.0.1:38414_
   [junit4]   2> 798934 INFO  (TEST-ChaosMonkeySafeLeaderTest.test-seed#[29C350392312E065]) [n:127.0.0.1:38414_    ] o.a.s.c.c.SolrZkClient makePath: /live_nodes/127.0.0.1:38414_
   [junit4]   2> 798935 INFO  (TEST-ChaosMonkeySafeLeaderTest.test-seed#[29C350392312E065]) [n:127.0.0.1:38414_    ] o.a.s.c.c.SolrZkClient makePath: /overseer_elect
   [junit4]   2> 798936 INFO  (TEST-ChaosMonkeySafeLeaderTest.test-seed#[29C350392312E065]) [n:127.0.0.1:38414_    ] o.a.s.c.c.SolrZkClient makePath: /overseer_elect/election
   [junit4]   2> 798938 INFO  (TEST-ChaosMonkeySafeLeaderTest.test-seed#[29C350392312E065]) [n:127.0.0.1:38414_    ] o.a.s.c.Overseer Overseer (id=null) closing
   [junit4]   2> 798938 INFO  (TEST-ChaosMonkeySafeLeaderTest.test-seed#[29C350392312E065]) [n:127.0.0.1:38414_    ] o.a.s.c.LeaderElector Joined leadership election with path: /overseer_elect/election/94280939849383940-127.0.0.1:38414_-n_0000000000
   [junit4]   2> 798939 INFO  (TEST-ChaosMonkeySafeLeaderTest.test-seed#[29C350392312E065]) [n:127.0.0.1:38414_    ] o.a.s.c.OverseerElectionContext I am going to be the leader 127.0.0.1:38414_
   [junit4]   2> 798939 INFO  (TEST-ChaosMonkeySafeLeaderTest.test-seed#[29C350392312E065]) [n:127.0.0.1:38414_    ] o.a.s.c.c.SolrZkClient makePath: /overseer_elect/leader
   [junit4]   2> 798941 INFO  (TEST-ChaosMonkeySafeLeaderTest.test-seed#[29C350392312E065]) [n:127.0.0.1:38414_    ] o.a.s.c.Overseer Overseer (id=94280939849383940-127.0.0.1:38414_-n_0000000000) starting
   [junit4]   2> 798943 INFO  (TEST-ChaosMonkeySafeLeaderTest.test-seed#[29C350392312E065]) [n:127.0.0.1:38414_    ] o.a.s.c.c.SolrZkClient makePath: /overseer/queue-work
   [junit4]   2> 798949 INFO  (TEST-ChaosMonkeySafeLeaderTest.test-seed#[29C350392312E065]) [n:127.0.0.1:38414_    ] o.a.s.c.OverseerAutoReplicaFailoverThread Starting OverseerAutoReplicaFailoverThread autoReplicaFailoverWorkLoopDelay=10000 autoReplicaFailoverWaitAfterExpiration=30000 autoReplicaFailoverBadNodeExpiration=60000
   [junit4]   2> 798950 INFO  (TEST-ChaosMonkeySafeLeaderTest.test-seed#[29C350392312E065]) [n:127.0.0.1:38414_    ] o.a.s.c.c.ZkStateReader Updating cluster state from ZooKeeper... 
   [junit4]   2> 798950 INFO  (OverseerCollectionProcessor-94280939849383940-127.0.0.1:38414_-n_0000000000) [n:127.0.0.1:38414_    ] o.a.s.c.OverseerCollectionProcessor Process current queue of collection creations
   [junit4]   2> 798950 INFO  (OverseerStateUpdate-94280939849383940-127.0.0.1:38414_-n_0000000000) [n:127.0.0.1:38414_    ] o.a.s.c.Overseer Starting to work on the main queue
   [junit4]   2> 798953 INFO  (TEST-ChaosMonkeySafeLeaderTest.test-seed#[29C350392312E065]) [n:127.0.0.1:38414_    ] o.a.s.c.CoreContainer No authentication plugin used.
   [junit4]   2> 798953 INFO  (TEST-ChaosMonkeySafeLeaderTest.test-seed#[29C350392312E065]) [n:127.0.0.1:38414_    ] o.a.s.c.CoreContainer Security conf doesn't exist. Skipping setup for authorization module.
   [junit4]   2> 798954 INFO  (TEST-ChaosMonkeySafeLeaderTest.test-seed#[29C350392312E065]) [n:127.0.0.1:38414_    ] o.a.s.c.CoresLocator Looking for core definitions underneath /x1/jenkins/jenkins-slave/workspace/Lucene-Solr-Tests-trunk-Java8/solr/build/solr-core/test/J1/temp/solr.cloud.ChaosMonkeySafeLeaderTest_29C350392312E065-001/control-001/cores
   [junit4]   2> 798955 INFO  (TEST-ChaosMonkeySafeLeaderTest.test-seed#[29C350392312E065]) [n:127.0.0.1:38414_    ] o.a.s.c.SolrCore Created CoreDescriptor: {name=collection1, config=solrconfig.xml, transient=false, schema=schema.xml, loadOnStartup=true, configSetProperties=configsetprops.json, instanceDir=/x1/jenkins/jenkins-slave/workspace/Lucene-Solr-Tests-trunk-Java8/solr/build/solr-core/test/J1/temp/solr.cloud.ChaosMonkeySafeLeaderTest_29C350392312E065-001/control-001/cores/collection1, collection=control_collection, absoluteInstDir=/x1/jenkins/jenkins-slave/workspace/Lucene-Solr-Tests-trunk-Java8/solr/build/solr-core/test/J1/temp/solr.cloud.ChaosMonkeySafeLeaderTest_29C350392312E065-001/control-001/cores/collection1/, coreNodeName=, dataDir=data/, shard=}
   [junit4]   2> 798955 INFO  (TEST-ChaosMonkeySafeLeaderTest.test-seed#[29C350392312E065]) [n:127.0.0.1:38414_    ] o.a.s.c.CoresLocator Found core collection1 in /x1/jenkins/jenkins-slave/workspace/Lucene-Solr-Tests-trunk-Java8/solr/build/solr-core/test/J1/temp/solr.cloud.ChaosMonkeySafeLeaderTest_29C350392312E065-001/control-001/cores/collection1/
   [junit4]   2> 798955 INFO  (TEST-ChaosMonkeySafeLeaderTest.test-seed#[29C350392312E065]) [n:127.0.0.1:38414_    ] o.a.s.c.CoresLocator Found 1 core definitions
   [junit4]   2> 798956 INFO  (coreLoadExecutor-2455-thread-1-processing-n:127.0.0.1:38414_) [n:127.0.0.1:38414_ c:control_collection   x:collection1] o.a.s.c.ZkController publishing state=down
   [junit4]   2> 798956 INFO  (TEST-ChaosMonkeySafeLeaderTest.test-seed#[29C350392312E065]) [n:127.0.0.1:38414_    ] o.a.s.s.SolrDispatchFilter user.dir=/x1/jenkins/jenkins-slave/workspace/Lucene-Solr-Tests-trunk-Java8/solr/build/solr-core/test/J1
   [junit4]   2> 798957 INFO  (TEST-ChaosMonkeySafeLeaderTest.test-seed#[29C350392312E065]) [n:127.0.0.1:38414_    ] o.a.s.s.SolrDispatchFilter SolrDispatchFilter.init() done
   [junit4]   2> 798957 INFO  (coreLoadExecutor-2455-thread-1-processing-n:127.0.0.1:38414_) [n:127.0.0.1:38414_ c:control_collection   x:collection1] o.a.s.c.ZkController numShards not found on descriptor - reading it from system property
   [junit4]   2> 798958 INFO  (zkCallback-697-thread-1-processing-n:127.0.0.1:38414_) [n:127.0.0.1:38414_    ] o.a.s.c.DistributedQueue NodeChildrenChanged fired on path /overseer/queue state SyncConnected
   [junit4]   2> 798958 INFO  (coreLoadExecutor-2455-thread-1-processing-n:127.0.0.1:38414_) [n:127.0.0.1:38414_ c:control_collection   x:collection1] o.a.s.c.ZkController look for our core node name
   [junit4]   2> 798959 INFO  (OverseerStateUpdate-94280939849383940-127.0.0.1:38414_-n_0000000000) [n:127.0.0.1:38414_    ] o.a.s.c.Overseer processMessage: queueSize: 1, message = {
   [junit4]   2>   "core":"collection1",
   [junit4]   2>   "roles":null,
   [junit4]   2>   "base_url":"http://127.0.0.1:38414",
   [junit4]   2>   "node_name":"127.0.0.1:38414_",
   [junit4]   2>   "numShards":"1",
   [junit4]   2>   "state":"down",
   [junit4]   2>   "shard":null,
   [junit4]   2>   "collection":"control_collection",
   [junit4]   2>   "operation":"state"} current state version: 0
   [junit4]   2> 798959 INFO  (OverseerStateUpdate-94280939849383940-127.0.0.1:38414_-n_0000000000) [n:127.0.0.1:38414_    ] o.a.s.c.o.ReplicaMutator Update state numShards=1 message={
   [junit4]   2>   "core":"collection1",
   [junit4]   2>   "roles":null,
   [junit4]   2>   "base_url":"http://127.0.0.1:38414",
   [junit4]   2>   "node_name":"127.0.0.1:38414_",
   [junit4]   2>   "numShards":"1",
   [junit4]   2>   "state":"down",
   [junit4]   2>   "shard":null,
   [junit4]   2>   "collection":"control_collection",
   [junit4]   2>   "operation":"state"}
   [junit4]   2> 798959 INFO  (OverseerStateUpdate-94280939849383940-127.0.0.1:38414_-n_0000000000) [n:127.0.0.1:38414_    ] o.a.s.c.o.ClusterStateMutator building a new cName: control_collection
   [junit4]   2> 798960 INFO  (OverseerStateUpdate-94280939849383940-127.0.0.1:38414_-n_0000000000) [n:127.0.0.1:38414_    ] o.a.s.c.o.ReplicaMutator Assigning new node to shard shard=shard1
   [junit4]   2> 798961 INFO  (zkCallback-697-thread-1-processing-n:127.0.0.1:38414_) [n:127.0.0.1:38414_    ] o.a.s.c.c.ZkStateReader A cluster state change: WatchedEvent state:SyncConnected type:NodeDataChanged path:/clusterstate.json, has occurred - updating... (live nodes size: 1)
   [junit4]   2> 798963 INFO  (zkCallback-697-thread-1-processing-n:127.0.0.1:38414_) [n:127.0.0.1:38414_    ] o.a.s.c.c.ZkStateReader Updated cluster state version to 1
   [junit4]   2> 799958 INFO  (coreLoadExecutor-2455-thread-1-processing-n:127.0.0.1:38414_) [n:127.0.0.1:38414_ c:control_collection   x:collection1] o.a.s.c.ZkController waiting to find shard id in clusterstate for collection1
   [junit4]   2> 799959 INFO  (coreLoadExecutor-2455-thread-1-processing-n:127.0.0.1:38414_) [n:127.0.0.1:38414_ c:control_collection   x:collection1] o.a.s.c.ZkController Check for collection zkNode:control_collection
   [junit4]   2> 799959 INFO  (coreLoadExecutor-2455-thread-1-processing-n:127.0.0.1:38414_) [n:127.0.0.1:38414_ c:control_collection   x:collection1] o.a.s.c.ZkController Collection zkNode exists
   [junit4]   2> 799959 INFO  (coreLoadExecutor-2455-thread-1-processing-n:127.0.0.1:38414_) [n:127.0.0.1:38414_ c:control_collection   x:collection1] o.a.s.c.c.ZkStateReader Load collection config from:/collections/control_collection
   [junit4]   2> 799960 INFO  (coreLoadExecutor-2455-thread-1-processing-n:127.0.0.1:38414_) [n:127.0.0.1:38414_ c:control_collection   x:collection1] o.a.s.c.c.ZkStateReader path=/collections/control_collection configName=conf1 specified config exists in ZooKeeper
   [junit4]   2> 799960 INFO  (coreLoadExecutor-2455-thread-1-processing-n:127.0.0.1:38414_) [n:127.0.0.1:38414_ c:control_collection   x:collection1] o.a.s.c.SolrResourceLoader new SolrResourceLoader for directory: '/x1/jenkins/jenkins-slave/workspace/Lucene-Solr-Tests-trunk-Java8/solr/build/solr-core/test/J1/temp/solr.cloud.ChaosMonkeySafeLeaderTest_29C350392312E065-001/control-001/cores/collection1/'
   [junit4]   2> 799977 INFO  (coreLoadExecutor-2455-thread-1-processing-n:127.0.0.1:38414_) [n:127.0.0.1:38414_ c:control_collection   x:collection1] o.a.s.c.Config loaded config solrconfig.xml with version 0 
   [junit4]   2> 799981 INFO  (coreLoadExecutor-2455-thread-1-processing-n:127.0.0.1:38414_) [n:127.0.0.1:38414_ c:control_collection   x:collection1] o.a.s.c.SolrConfig current version of requestparams : -1
   [junit4]   2> 799996 INFO  (coreLoadExecutor-2455-thread-1-processing-n:127.0.0.1:38414_) [n:127.0.0.1:38414_ c:control_collection   x:collection1] o.a.s.c.SolrConfig Using Lucene MatchVersion: 6.0.0
   [junit4]   2> 800005 INFO  (coreLoadExecutor-2455-thread-1-processing-n:127.0.0.1:38414_) [n:127.0.0.1:38414_ c:control_collection   x:collection1] o.a.s.c.Config Loaded SolrConfig: solrconfig.xml
   [junit4]   2> 800007 INFO  (coreLoadExecutor-2455-thread-1-processing-n:127.0.0.1:38414_) [n:127.0.0.1:38414_ c:control_collection   x:collection1] o.a.s.s.IndexSchema Reading Solr Schema from /configs/conf1/schema.xml
   [junit4]   2> 800011 INFO  (coreLoadExecutor-2455-thread-1-processing-n:127.0.0.1:38414_) [n:127.0.0.1:38414_ c:control_collection   x:collection1] o.a.s.s.IndexSchema [collection1] Schema name=test
   [junit4]   2> 800100 INFO  (coreLoadExecutor-2455-thread-1-processing-n:127.0.0.1:38414_) [n:127.0.0.1:38414_ c:control_collection   x:collection1] o.a.s.s.IndexSchema default search field in schema is text
   [junit4]   2> 800101 INFO  (coreLoadExecutor-2455-thread-1-processing-n:127.0.0.1:38414_) [n:127.0.0.1:38414_ c:control_collection   x:collection1] o.a.s.s.IndexSchema unique key field: id
   [junit4]   2> 800102 INFO  (coreLoadExecutor-2455-thread-1-processing-n:127.0.0.1:38414_) [n:127.0.0.1:38414_ c:control_collection   x:collection1] o.a.s.s.FileExchangeRateProvider Reloading exchange rates from file currency.xml
   [junit4]   2> 800105 INFO  (coreLoadExecutor-2455-thread-1-processing-n:127.0.0.1:38414_) [n:127.0.0.1:38414_ c:control_collection   x:collection1] o.a.s.s.FileExchangeRateProvider Reloading exchange rates from file currency.xml
   [junit4]   2> 800125 INFO  (coreLoadExecutor-2455-thread-1-processing-n:127.0.0.1:38414_) [n:127.0.0.1:38414_ c:control_collection   x:collection1] o.a.s.c.ConfigSetProperties Did not find ConfigSet properties, assuming default properties: Can't find resource 'configsetprops.json' in classpath or '/configs/conf1', cwd=/x1/jenkins/jenkins-slave/workspace/Lucene-Solr-Tests-trunk-Java8/solr/build/solr-core/test/J1
   [junit4]   2> 800125 INFO  (coreLoadExecutor-2455-thread-1-processing-n:127.0.0.1:38414_) [n:127.0.0.1:38414_ c:control_collection   x:collection1] o.a.s.c.CoreContainer Creating SolrCore 'collection1' using configuration from collection control_collection
   [junit4]   2> 800126 INFO  (coreLoadExecutor-2455-thread-1-processing-n:127.0.0.1:38414_) [n:127.0.0.1:38414_ c:control_collection s:shard1 r:core_node1 x:collection1] o.a.s.c.SolrCore solr.StandardDirectoryFactory
   [junit4]   2> 800126 INFO  (coreLoadExecutor-2455-thread-1-processing-n:127.0.0.1:38414_) [n:127.0.0.1:38414_ c:control_collection s:shard1 r:core_node1 x:collection1] o.a.s.c.SolrCore [[collection1] ] Opening new SolrCore at [/x1/jenkins/jenkins-slave/workspace/Lucene-Solr-Tests-trunk-Java8/solr/build/solr-core/test/J1/temp/solr.cloud.ChaosMonkeySafeLeaderTest_29C350392312E065-001/control-001/cores/collection1/], dataDir=[null]
   [junit4]   2> 800126 INFO  (coreLoadExecutor-2455-thread-1-processing-n:127.0.0.1:38414_) [n:127.0.0.1:38414_ c:control_collection s:shard1 r:core_node1 x:collection1] o.a.s.c.JmxMonitoredMap JMX monitoring is enabled. Adding Solr mbeans to JMX Server: com.sun.jmx.mbeanserver.JmxMBeanServer@67142e1b
   [junit4]   2> 800127 INFO  (coreLoadExecutor-2455-thread-1-processing-n:127.0.0.1:38414_) [n:127.0.0.1:38414_ c:control_collection s:shard1 r:core_node1 x:collection1] o.a.s.c.CachingDirectoryFactory return new directory for /x1/jenkins/jenkins-slave/workspace/Lucene-Solr-Tests-trunk-Java8/solr/build/solr-core/test/J1/temp/solr.cloud.ChaosMonkeySafeLeaderTest_29C350392312E065-001/control-001/cores/collection1/data
   [junit4]   2> 800127 INFO  (coreLoadExecutor-2455-thread-1-processing-n:127.0.0.1:38414_) [n:127.0.0.1:38414_ c:control_collection s:shard1 r:core_node1 x:collection1] o.a.s.c.SolrCore New index directory detected: old=null new=/x1/jenkins/jenkins-slave/workspace/Lucene-Solr-Tests-trunk-Java8/solr/build/solr-core/test/J1/temp/solr.cloud.ChaosMonkeySafeLeaderTest_29C350392312E065-001/control-001/cores/collection1/data/index/
   [junit4]   2> 800127 WARN  (coreLoadExecutor-2455-thread-1-processing-n:127.0.0.1:38414_) [n:127.0.0.1:38414_ c:control_collection s:shard1 r:core_node1 x:collection1] o.a.s.c.SolrCore [collection1] Solr index directory '/x1/jenkins/jenkins-slave/workspace/Lucene-Solr-Tests-trunk-Java8/solr/build/solr-core/test/J1/temp/solr.cloud.ChaosMonkeySafeLeaderTest_29C350392312E065-001/control-001/cores/collection1/data/index' doesn't exist. Creating new index...
   [junit4]   2> 800128 INFO  (coreLoadExecutor-2455-thread-1-processing-n:127.0.0.1:38414_) [n:127.0.0.1:38414_ c:control_collection s:shard1 r:core_node1 x:collection1] o.a.s.c.CachingDirectoryFactory return new directory for /x1/jenkins/jenkins-slave/workspace/Lucene-Solr-Tests-trunk-Java8/solr/build/solr-core/test/J1/temp/solr.cloud.ChaosMonkeySafeLeaderTest_29C350392312E065-001/control-001/cores/collection1/data/index
   [junit4]   2> 800128 INFO  (coreLoadExecutor-2455-thread-1-processing-n:127.0.0.1:38414_) [n:127.0.0.1:38414_ c:control_collection s:shard1 r:core_node1 x:collection1] o.a.s.u.RandomMergePolicy RandomMergePolicy wrapping class org.apache.lucene.index.LogByteSizeMergePolicy: [LogByteSizeMergePolicy: minMergeSize=1677721, mergeFactor=21, maxMergeSize=2147483648, maxMergeSizeForForcedMerge=9223372036854775807, calibrateSizeByDeletes=true, maxMergeDocs=2147483647, maxCFSSegmentSizeMB=8.796093022207999E12, noCFSRatio=0.0]
   [junit4]   2> 800134 INFO  (coreLoadExecutor-2455-thread-1-processing-n:127.0.0.1:38414_) [n:127.0.0.1:38414_ c:control_collection s:shard1 r:core_node1 x:collection1] o.a.s.c.SolrCore SolrDeletionPolicy.onCommit: commits: num=1
   [junit4]   2> 	commit{dir=/x1/jenkins/jenkins-slave/workspace/Lucene-Solr-Tests-trunk-Java8/solr/build/solr-core/test/J1/temp/solr.cloud.ChaosMonkeySafeLeaderTest_29C350392312E065-001/control-001/cores/collection1/data/index,segFN=segments_1,generation=1}
   [junit4]   2> 800134 INFO  (coreLoadExecutor-2455-thread-1-processing-n:127.0.0.1:38414_) [n:127.0.0.1:38414_ c:control_collection s:shard1 r:core_node1 x:collection1] o.a.s.c.SolrCore newest commit generation = 1
   [junit4]   2> 800135 INFO  (OldIndexDirectoryCleanupThreadForCore-collection1) [n:127.0.0.1:38414_ c:control_collection s:shard1 r:core_node1 x:collection1] o.a.s.c.SolrCore Looking for old index directories to cleanup for core collection1 in /x1/jenkins/jenkins-slave/workspace/Lucene-Solr-Tests-trunk-Java8/solr/build/solr-core/test/J1/temp/solr.cloud.ChaosMonkeySafeLeaderTest_29C350392312E065-001/control-001/cores/collection1/data/
   [junit4]   2> 800139 INFO  (coreLoadExecutor-2455-thread-1-processing-n:127.0.0.1:38414_) [n:127.0.0.1:38414_ c:control_collection s:shard1 r:core_node1 x:collection1] o.a.s.u.p.UpdateRequestProcessorChain creating updateRequestProcessorChain "nodistrib"
   [junit4]   2> 800139 INFO  (coreLoadExecutor-2455-thread-1-processing-n:127.0.0.1:38414_) [n:127.0.0.1:38414_ c:control_collection s:shard1 r:core_node1 x:collection1] o.a.s.u.p.UpdateRequestProcessorChain creating updateRequestProcessorChain "dedupe"
   [junit4]   2> 800139 INFO  (coreLoadExecutor-2455-thread-1-processing-n:127.0.0.1:38414_) [n:127.0.0.1:38414_ c:control_collection s:shard1 r:core_node1 x:collection1] o.a.s.u.p.UpdateRequestProcessorChain inserting DistributedUpdateProcessorFactory into updateRequestProcessorChain "dedupe"
   [junit4]   2> 800139 INFO  (coreLoadExecutor-2455-thread-1-processing-n:127.0.0.1:38414_) [n:127.0.0.1:38414_ c:control_collection s:shard1 r:core_node1 x:collection1] o.a.s.u.p.UpdateRequestProcessorChain creating updateRequestProcessorChain "stored_sig"
   [junit4]   2> 800139 INFO  (coreLoadExecutor-2455-thread-1-processing-n:127.0.0.1:38414_) [n:127.0.0.1:38414_ c:control_collection s:shard1 r:core_node1 x:collection1] o.a.s.u.p.UpdateRequestProcessorChain inserting DistributedUpdateProcessorFactory into updateRequestProcessorChain "stored_sig"
   [junit4]   2> 800140 INFO  (coreLoadExecutor-2455-thread-1-processing-n:127.0.0.1:38414_) [n:127.0.0.1:38414_ c:control_collection s:shard1 r:core_node1 x:collection1] o.a.s.u.p.UpdateRequestProcessorChain creating updateRequestProcessorChain "distrib-dup-test-chain-explicit"
   [junit4]   2> 800140 INFO  (coreLoadExecutor-2455-thread-1-processing-n:127.0.0.1:38414_) [n:127.0.0.1:38414_ c:control_collection s:shard1 r:core_node1 x:collection1] o.a.s.u.p.UpdateRequestProcessorChain creating updateRequestProcessorChain "distrib-dup-test-chain-implicit"
   [junit4]   2> 800140 INFO  (coreLoadExecutor-2455-thread-1-processing-n:127.0.0.1:38414_) [n:127.0.0.1:38414_ c:control_collection s:shard1 r:core_node1 x:collection1] o.a.s.u.p.UpdateRequestProcessorChain inserting DistributedUpdateProcessorFactory into updateRequestProcessorChain "distrib-dup-test-chain-implicit"
   [junit4]   2> 800140 INFO  (coreLoadExecutor-2455-thread-1-processing-n:127.0.0.1:38414_) [n:127.0.0.1:38414_ c:control_collection s:shard1 r:core_node1 x:collection1] o.a.s.c.SolrCore no updateRequestProcessorChain defined as default, creating implicit default
   [junit4]   2> 800142 INFO  (coreLoadExecutor-2455-thread-1-processing-n:127.0.0.1:38414_) [n:127.0.0.1:38414_ c:control_collection s:shard1 r:core_node1 x:collection1] o.a.s.h.l.XMLLoader xsltCacheLifetimeSeconds=60
   [junit4]   2> 800143 INFO  (coreLoadExecutor-2455-thread-1-processing-n:127.0.0.1:38414_) [n:127.0.0.1:38414_ c:control_collection s:shard1 r:core_node1 x:collection1] o.a.s.h.l.XMLLoader xsltCacheLifetimeSeconds=60
   [junit4]   2> 800144 INFO  (coreLoadExecutor-2455-thread-1-processing-n:127.0.0.1:38414_) [n:127.0.0.1:38414_ c:control_collection s:shard1 r:core_node1 x:collection1] o.a.s.h.l.XMLLoader xsltCacheLifetimeSeconds=60
   [junit4]   2> 800145 INFO  (coreLoadExecutor-2455-thread-1-processing-n:127.0.0.1:38414_) [n:127.0.0.1:38414_ c:control_collection s:shard1 r:core_node1 x:collection1] o.a.s.h.l.XMLLoader xsltCacheLifetimeSeconds=60
   [junit4]   2> 800149 INFO  (coreLoadExecutor-2455-thread-1-processing-n:127.0.0.1:38414_) [n:127.0.0.1:38414_ c:control_collection s:shard1 r:core_node1 x:collection1] o.a.s.c.RequestHandlers Registered paths: /admin/mbeans,standard,/update/csv,/update/json/docs,/admin/luke,/admin/segments,/get,/admin/system,/replication,/admin/properties,/config,/schema,/admin/plugins,/admin/logging,/update/json,/admin/threads,/admin/ping,/update,/admin/file
   [junit4]   2> 800149 INFO  (coreLoadExecutor-2455-thread-1-processing-n:127.0.0.1:38414_) [n:127.0.0.1:38414_ c:control_collection s:shard1 r:core_node1 x:collection1] o.a.s.c.SolrCore Using default statsCache cache: org.apache.solr.search.stats.LocalStatsCache
   [junit4]   2> 800150 INFO  (coreLoadExecutor-2455-thread-1-processing-n:127.0.0.1:38414_) [n:127.0.0.1:38414_ c:control_collection s:shard1 r:core_node1 x:collection1] o.a.s.u.UpdateHandler Using UpdateLog implementation: org.apache.solr.update.UpdateLog
   [junit4]   2> 800150 INFO  (coreLoadExecutor-2455-thread-1-processing-n:127.0.0.1:38414_) [n:127.0.0.1:38414_ c:control_collection s:shard1 r:core_node1 x:collection1] o.a.s.u.UpdateLog Initializing UpdateLog: dataDir= defaultSyncLevel=FLUSH numRecordsToKeep=100 maxNumLogsToKeep=10 numVersionBuckets=65536
   [junit4]   2> 800151 INFO  (coreLoadExecutor-2455-thread-1-processing-n:127.0.0.1:38414_) [n:127.0.0.1:38414_ c:control_collection s:shard1 r:core_node1 x:collection1] o.a.s.c.SolrCore Hard AutoCommit: disabled
   [junit4]   2> 800151 INFO  (coreLoadExecutor-2455-thread-1-processing-n:127.0.0.1:38414_) [n:127.0.0.1:38414_ c:control_collection s:shard1 r:core_node1 x:collection1] o.a.s.c.SolrCore Soft AutoCommit: disabled
   [junit4]   2> 800152 INFO  (coreLoadExecutor-2455-thread-1-processing-n:127.0.0.1:38414_) [n:127.0.0.1:38414_ c:control_collection s:shard1 r:core_node1 x:collection1] o.a.s.u.RandomMergePolicy RandomMergePolicy wrapping class org.apache.lucene.index.LogDocMergePolicy: [LogDocMergePolicy: minMergeSize=1000, mergeFactor=44, maxMergeSize=9223372036854775807, maxMergeSizeForForcedMerge=9223372036854775807, calibrateSizeByDeletes=true, maxMergeDocs=2147483647, maxCFSSegmentSizeMB=8.796093022207999E12, noCFSRatio=0.0]
   [junit4]   2> 800152 INFO  (coreLoadExecutor-2455-thread-1-processing-n:127.0.0.1:38414_) [n:127.0.0.1:38414_ c:control_collection s:shard1 r:core_node1 x:collection1] o.a.s.c.SolrCore SolrDeletionPolicy.onInit: commits: num=1
   [junit4]   2> 	commit{dir=/x1/jenkins/jenkins-slave/workspace/Lucene-Solr-Tests-trunk-Java8/solr/build/solr-core/test/J1/temp/solr.cloud.ChaosMonkeySafeLeaderTest_29C350392312E065-001/control-001/cores/collection1/data/index,segFN=segments_1,generation=1}
   [junit4]   2> 800152 INFO  (coreLoadExecutor-2455-thread-1-processing-n:127.0.0.1:38414_) [n:127.0.0.1:38414_ c:control_collection s:shard1 r:core_node1 x:collection1] o.a.s.c.SolrCore newest commit generation = 1
   [junit4]   2> 800153 INFO  (coreLoadExecutor-2455-thread-1-processing-n:127.0.0.1:38414_) [n:127.0.0.1:38414_ c:control_collection s:shard1 r:core_node1 x:collection1] o.a.s.s.SolrIndexSearcher Opening Searcher@14471cdc[collection1] main
   [junit4]   2> 800153 INFO  (coreLoadExecutor-2455-thread-1-processing-n:127.0.0.1:38414_) [n:127.0.0.1:38414_ c:control_collection s:shard1 r:core_node1 x:collection1] o.a.s.c.c.ZkStateReader Load collection config from:/collections/control_collection
   [junit4]   2> 800154 INFO  (coreLoadExecutor-2455-thread-1-processing-n:127.0.0.1:38414_) [n:127.0.0.1:38414_ c:control_collection s:shard1 r:core_node1 x:collection1] o.a.s.c.c.ZkStateReader path=/collections/control_collection configName=conf1 specified config exists in ZooKeeper
   [junit4]   2> 800154 INFO  (coreLoadExecutor-2455-thread-1-processing-n:127.0.0.1:38414_) [n:127.0.0.1:38414_ c:control_collection s:shard1 r:core_node1 x:collection1] o.a.s.r.ManagedResourceStorage Setting up ZooKeeper-based storage for the RestManager with znodeBase: /configs/conf1
   [junit4]   2> 800154 INFO  (coreLoadExecutor-2455-thread-1-processing-n:127.0.0.1:38414_) [n:127.0.0.1:38414_ c:control_collection s:shard1 r:core_node1 x:collection1] o.a.s.r.ManagedResourceStorage Configured ZooKeeperStorageIO with znodeBase: /configs/conf1
   [junit4]   2> 800154 INFO  (coreLoadExecutor-2455-thread-1-processing-n:127.0.0.1:38414_) [n:127.0.0.1:38414_ c:control_collection s:shard1 r:core_node1 x:collection1] o.a.s.r.RestManager Initializing RestManager with initArgs: {}
   [junit4]   2> 800155 INFO  (coreLoadExecutor-2455-thread-1-processing-n:127.0.0.1:38414_) [n:127.0.0.1:38414_ c:control_collection s:shard1 r:core_node1 x:collection1] o.a.s.r.ManagedResourceStorage Reading _rest_managed.json using ZooKeeperStorageIO:path=/configs/conf1
   [junit4]   2> 800155 INFO  (coreLoadExecutor-2455-thread-1-processing-n:127.0.0.1:38414_) [n:127.0.0.1:38414_ c:control_collection s:shard1 r:core_node1 x:collection1] o.a.s.r.ManagedResourceStorage No data found for znode /configs/conf1/_rest_managed.json
   [junit4]   2> 800155 INFO  (coreLoadExecutor-2455-thread-1-processing-n:127.0.0.1:38414_) [n:127.0.0.1:38414_ c:control_collection s:shard1 r:core_node1 x:collection1] o.a.s.r.ManagedResourceStorage Loaded null at path _rest_managed.json using ZooKeeperStorageIO:path=/configs/conf1
   [junit4]   2> 800155 INFO  (coreLoadExecutor-2455-thread-1-processing-n:127.0.0.1:38414_) [n:127.0.0.1:38414_ c:control_collection s:shard1 r:core_node1 x:collection1] o.a.s.r.RestManager Initializing 0 registered ManagedResources
   [junit4]   2> 800155 INFO  (coreLoadExecutor-2455-thread-1-processing-n:127.0.0.1:38414_) [n:127.0.0.1:38414_ c:control_collection s:shard1 r:core_node1 x:collection1] o.a.s.h.ReplicationHandler Commits will be reserved for  10000
   [junit4]   2> 800156 INFO  (searcherExecutor-2456-thread-1-processing-n:127.0.0.1:38414_ x:collection1 s:shard1 c:control_collection r:core_node1) [n:127.0.0.1:38414_ c:control_collection s:shard1 r:core_node1 x:collection1] o.a.s.c.SolrCore [collection1] Registered new searcher Searcher@14471cdc[collection1] main{ExitableDirectoryReader(UninvertingDirectoryReader())}
   [junit4]   2> 800156 INFO  (coreLoadExecutor-2455-thread-1-processing-n:127.0.0.1:38414_) [n:127.0.0.1:38414_ c:control_collection s:shard1 r:core_node1 x:collection1] o.a.s.u.UpdateLog Looking up max value of version field to seed version buckets
   [junit4]   2> 800156 INFO  (coreLoadExecutor-2455-thread-1-processing-n:127.0.0.1:38414_) [n:127.0.0.1:38414_ c:control_collection s:shard1 r:core_node1 x:collection1] o.a.s.u.VersionInfo Refreshing highest value of _version_ for 65536 version buckets from index
   [junit4]   2> 800157 INFO  (coreLoadExecutor-2455-thread-1-processing-n:127.0.0.1:38414_) [n:127.0.0.1:38414_ c:control_collection s:shard1 r:core_node1 x:collection1] o.a.s.u.VersionInfo No terms found for _version_, cannot seed version bucket highest value from index
   [junit4]   2> 800157 INFO  (coreLoadExecutor-2455-thread-1-processing-n:127.0.0.1:38414_) [n:127.0.0.1:38414_ c:control_collection s:shard1 r:core_node1 x:collection1] o.a.s.u.UpdateLog Could not find max version in index or recent updates, using new clock 1508495039398936576
   [junit4]   2> 800159 INFO  (coreLoadExecutor-2455-thread-1-processing-n:127.0.0.1:38414_) [n:127.0.0.1:38414_ c:control_collection s:shard1 r:core_node1 x:collection1] o.a.s.u.UpdateLog Took 3 ms to seed version buckets with highest version 1508495039398936576
   [junit4]   2> 800159 INFO  (coreLoadExecutor-2455-thread-1-processing-n:127.0.0.1:38414_) [n:127.0.0.1:38414_ c:control_collection s:shard1 r:core_node1 x:collection1] o.a.s.c.ZkController watch zkdir /configs/conf1
   [junit4]   2> 800160 INFO  (coreLoadExecutor-2455-thread-1-processing-n:127.0.0.1:38414_) [n:127.0.0.1:38414_ c:control_collection s:shard1 r:core_node1 x:collection1] o.a.s.c.CoreContainer registering core: collection1
   [junit4]   2> 800160 INFO  (coreZkRegister-2449-thread-1-processing-n:127.0.0.1:38414_ x:collection1 s:shard1 c:control_collection r:core_node1) [n:127.0.0.1:38414_ c:control_collection s:shard1 r:core_node1 x:collection1] o.a.s.c.ZkController Register replica - core:collection1 address:http://127.0.0.1:38414 collection:control_collection shard:shard1
   [junit4]   2> 800161 INFO  (coreZkRegister-2449-thread-1-processing-n:127.0.0.1:38414_ x:collection1 s:shard1 c:control_collection r:core_node1) [n:127.0.0.1:38414_ c:control_collection s:shard1 r:core_node1 x:collection1] o.a.s.c.c.SolrZkClient makePath: /collections/control_collection/leader_elect/shard1/election
   [junit4]   2> 800164 INFO  (coreZkRegister-2449-thread-1-processing-n:127.0.0.1:38414_ x:collection1 s:shard1 c:control_collection r:core_node1) [n:127.0.0.1:38414_ c:control_collection s:shard1 r:core_node1 x:collection1] o.a.s.c.LeaderElector Joined leadership election with path: /collections/control_collection/leader_elect/shard1/election/94280939849383940-core_node1-n_0000000000
   [junit4]   2> 800165 INFO  (coreZkRegister-2449-thread-1-processing-n:127.0.0.1:38414_ x:collection1 s:shard1 c:control_collection r:core_node1) [n:127.0.0.1:38414_ c:control_collection s:shard1 r:core_node1 x:collection1] o.a.s.c.ShardLeaderElectionContext Running the leader process for shard shard1
   [junit4]   2> 800166 INFO  (zkCallback-697-thread-1-processing-n:127.0.0.1:38414_) [n:127.0.0.1:38414_    ] o.a.s.c.DistributedQueue NodeChildrenChanged fired on path /overseer/queue state SyncConnected
   [junit4]   2> 800167 INFO  (coreZkRegister-2449-thread-1-processing-n:127.0.0.1:38414_ x:collection1 s:shard1 c:control_collection r:core_node1) [n:127.0.0.1:38414_ c:control_collection s:shard1 r:core_node1 x:collection1] o.a.s.c.ShardLeaderElectionContext Enough replicas found to continue.
   [junit4]   2> 800167 INFO  (coreZkRegister-2449-thread-1-processing-n:127.0.0.1:38414_ x:collection1 s:shard1 c:control_collection r:core_node1) [n:127.0.0.1:38414_ c:control_collection s:shard1 r:core_node1 x:collection1] o.a.s.c.ShardLeaderElectionContext I may be the new leader - try and sync
   [junit4]   2> 800167 INFO  (OverseerStateUpdate-94280939849383940-127.0.0.1:38414_-n_0000000000) [n:127.0.0.1:38414_    ] o.a.s.c.Overseer processMessage: queueSize: 1, message = {
   [junit4]   2>   "operation":"leader",
   [junit4]   2>   "shard":"shard1",
   [junit4]   2>   "collection":"control_collection"} current state version: 1
   [junit4]   2> 800167 INFO  (coreZkRegister-2449-thread-1-processing-n:127.0.0.1:38414_ x:collection1 s:shard1 c:control_collection r:core_node1) [n:127.0.0.1:38414_ c:control_collection s:shard1 r:core_node1 x:collection1] o.a.s.c.SyncStrategy Sync replicas to http://127.0.0.1:38414/collection1/
   [junit4]   2> 800167 INFO  (coreZkRegister-2449-thread-1-processing-n:127.0.0.1:38414_ x:collection1 s:shard1 c:control_collection r:core_node1) [n:127.0.0.1:38414_ c:control_collection s:shard1 r:core_node1 x:collection1] o.a.s.c.SyncStrategy Sync Success - now sync replicas to me
   [junit4]   2> 800167 INFO  (coreZkRegister-2449-thread-1-processing-n:127.0.0.1:38414_ x:collection1 s:shard1 c:control_collection r:core_node1) [n:127.0.0.1:38414_ c:control_collection s:shard1 r:core_node1 x:collection1] o.a.s.c.SyncStrategy http://127.0.0.1:38414/collection1/ has no replicas
   [junit4]   2> 800168 INFO  (coreZkRegister-2449-thread-1-processing-n:127.0.0.1:38414_ x:collection1 s:shard1 c:control_collection r:core_node1) [n:127.0.0.1:38414_ c:control_collection s:shard1 r:core_node1 x:collection1] o.a.s.c.ShardLeaderElectionContext I am the new leader: http://127.0.0.1:38414/collection1/ shard1
   [junit4]   2> 800168 INFO  (coreZkRegister-2449-thread-1-processing-n:127.0.0.1:38414_ x:collection1 s:shard1 c:control_collection r:core_node1) [n:127.0.0.1:38414_ c:control_collection s:shard1 r:core_node1 x:collection1] o.a.s.c.c.SolrZkClient makePath: /collections/control_collection/leaders/shard1
   [junit4]   2> 800171 INFO  (zkCallback-697-thread-1-processing-n:127.0.0.1:38414_) [n:127.0.0.1:38414_    ] o.a.s.c.DistributedQueue NodeChildrenChanged fired on path /overseer/queue state SyncConnected
   [junit4]   2> 800172 INFO  (OverseerStateUpdate-94280939849383940-127.0.0.1:38414_-n_0000000000) [n:127.0.0.1:38414_    ] o.a.s.c.Overseer processMessage: queueSize: 1, message = {
   [junit4]   2>   "operation":"leader",
   [junit4]   2>   "shard":"shard1",
   [junit4]   2>   "collection":"control_collection",
   [junit4]   2>   "base_url":"http://127.0.0.1:38414",
   [junit4]   2>   "core":"collection1",
   [junit4]   2>   "state":"active"} current state version: 1
   [junit4]   2> 800277 INFO  (zkCallback-697-thread-1-processing-n:127.0.0.1:38414_) [n:127.0.0.1:38414_    ] o.a.s.c.c.ZkStateReader A cluster state change: WatchedEvent state:SyncConnected type:NodeDataChanged path:/clusterstate.json, has occurred - updating... (live nodes size: 1)
   [junit4]   2> 800279 INFO  (zkCallback-697-thread-1-processing-n:127.0.0.1:38414_) [n:127.0.0.1:38414_    ] o.a.s.c.c.ZkStateReader Updated cluster state version to 2
   [junit4]   2> 800322 INFO  (coreZkRegister-2449-thread-1-processing-n:127.0.0.1:38414_ x:collection1 s:shard1 c:control_collection r:core_node1) [n:127.0.0.1:38414_ c:control_collection s:shard1 r:core_node1 x:collection1] o.a.s.c.ZkController We are http://127.0.0.1:38414/collection1/ and leader is http://127.0.0.1:38414/collection1/
   [junit4]   2> 800323 INFO  (coreZkRegister-2449-thread-1-processing-n:127.0.0.1:38414_ x:collection1 s:shard1 c:control_collection r:core_node1) [n:127.0.0.1:38414_ c:control_collection s:shard1 r:core_node1 x:collection1] o.a.s.c.ZkController No LogReplay needed for core=collection1 baseURL=http://127.0.0.1:38414
   [junit4]   2> 800323 INFO  (coreZkRegister-2449-thread-1-processing-n:127.0.0.1:38414_ x:collection1 s:shard1 c:control_collection r:core_node1) [n:127.0.0.1:38414_ c:control_collection s:shard1 r:core_node1 x:collection1] o.a.s.c.ZkController I am the leader, no recovery necessary
   [junit4]   2> 800323 INFO  (coreZkRegister-2449-thread-1-processing-n:127.0.0.1:38414_ x:collection1 s:shard1 c:control_collection r:core_node1) [n:127.0.0.1:38414_ c:control_collection s:shard1 r:core_node1 x:collection1] o.a.s.c.ZkController publishing state=active
   [junit4]   2> 800323 INFO  (coreZkRegister-2449-thread-1-processing-n:127.0.0.1:38414_ x:collection1 s:shard1 c:control_collection r:core_node1) [n:127.0.0.1:38414_ c:control_collection s:shard1 r:core_node1 x:collection1] o.a.s.c.ZkController numShards not found on descriptor - reading it from system property
   [junit4]   2> 800324 INFO  (zkCallback-697-thread-1-processing-n:127.0.0.1:38414_) [n:127.0.0.1:38414_    ] o.a.s.c.DistributedQueue NodeChildrenChanged fired on path /overseer/queue state SyncConnected
   [junit4]   2> 800325 INFO  (OverseerStateUpdate-94280939849383940-127.0.0.1:38414_-n_0000000000) [n:127.0.0.1:38414_    ] o.a.s.c.Overseer processMessage: queueSize: 1, message = {
   [junit4]   2>   "core":"collection1",
   [junit4]   2>   "core_node_name":"core_node1",
   [junit4]   2>   "roles":null,
   [junit4]   2>   "base_url":"http://127.0.0.1:38414",
   [junit4]   2>   "node_name":"127.0.0.1:38414_",
   [junit4]   2>   "numShards":"1",
   [junit4]   2>   "state":"active",
   [junit4]   2>   "shard":"shard1",
   [junit4]   2>   "collection":"control_collection",
   [junit4]   2>   "operation":"state"} current state version: 2
   [junit4]   2> 800326 INFO  (OverseerStateUpdate-94280939849383940-127.0.0.1:38414_-n_0000000000) [n:127.0.0.1:38414_    ] o.a.s.c.o.ReplicaMutator Update state numShards=1 message={
   [junit4]   2>   "core":"collection1",
   [junit4]   2>   "core_node_name":"core_node1",
   [junit4]   2>   "roles":null,
   [junit4]   2>   "base_url":"http://127.0.0.1:38414",
   [junit4]   2>   "node_name":"127.0.0.1:38414_",
   [junit4]   2>   "numShards":"1",
   [junit4]   2>   "state":"active",
   [junit4]   2>   "shard":"shard1",
   [junit4]   2>   "collection":"control_collection",
   [junit4]   2>   "operation":"state"}
   [junit4]   2> 800428 INFO  (zkCallback-697-thread-1-processing-n:127.0.0.1:38414_) [n:127.0.0.1:38414_    ] o.a.s.c.c.ZkStateReader A cluster state change: WatchedEvent state:SyncConnected type:NodeDataChanged path:/clusterstate.json, has occurred - updating... (live nodes size: 1)
   [junit4]   2> 800430 INFO  (zkCallback-697-thread-1-processing-n:127.0.0.1:38414_) [n:127.0.0.1:38414_    ] o.a.s.c.c.ZkStateReader Updated cluster state version to 3
   [junit4]   2> 800459 INFO  (TEST-ChaosMonkeySafeLeaderTest.test-seed#[29C350392312E065]) [    ] o.a.s.c.c.SolrZkClient Using default ZkCredentialsProvider
   [junit4]   2> 800460 INFO  (TEST-ChaosMonkeySafeLeaderTest.test-seed#[29C350392312E065]) [    ] o.a.s.c.c.ConnectionManager Waiting for client to connect to ZooKeeper
   [junit4]   2> 800461 INFO  (zkCallback-699-thread-1) [    ] o.a.s.c.c.ConnectionManager Watcher org.apache.solr.common.cloud.ConnectionManager@42ef5783 name:ZooKeeperConnection Watcher:127.0.0.1:38512/solr got event WatchedEvent state:SyncConnected type:None path:null path:null type:None
   [junit4]   2> 800461 INFO  (TEST-ChaosMonkeySafeLeaderTest.test-seed#[29C350392312E065]) [    ] o.a.s.c.c.ConnectionManager Client is connected to ZooKeeper
   [junit4]   2> 800461 INFO  (TEST-ChaosMonkeySafeLeaderTest.test-seed#[29C350392312E065]) [    ] o.a.s.c.c.SolrZkClient Using default ZkACLProvider
   [junit4]   2> 800461 INFO  (TEST-ChaosMonkeySafeLeaderTest.test-seed#[29C350392312E065]) [    ] o.a.s.c.c.ZkStateReader Updating cluster state from ZooKeeper... 
   [junit4]   2> 800464 INFO  (TEST-ChaosMonkeySafeLeaderTest.test-seed#[29C350392312E065]) [    ] o.a.s.c.ChaosMonkey monkey: init - expire sessions:false cause connection loss:false
   [junit4]   2> 800799 INFO  (TEST-ChaosMonkeySafeLeaderTest.test-seed#[29C350392312E065]) [    ] o.a.s.SolrTestCaseJ4 Writing core.properties file to /x1/jenkins/jenkins-slave/workspace/Lucene-Solr-Tests-trunk-Java8/solr/build/solr-core/test/J1/temp/solr.cloud.ChaosMonkeySafeLeaderTest_29C350392312E065-001/shard-1-001/cores/collection1
   [junit4]   2> 800800 INFO  (TEST-ChaosMonkeySafeLeaderTest.test-seed#[29C350392312E065]) [    ] o.a.s.c.AbstractFullDistribZkTestBase create jetty 1 in directory /x1/jenkins/jenkins-slave/workspace/Lucene-Solr-Tests-trunk-Java8/solr/build/solr-core/test/J1/temp/solr.cloud.ChaosMonkeySafeLeaderTest_29C350392312E065-001/shard-1-001
   [junit4]   2> 800801 INFO  (TEST-ChaosMonkeySafeLeaderTest.test-seed#[29C350392312E065]) [    ] o.e.j.s.Server jetty-9.2.11.v20150529
   [junit4]   2> 800803 INFO  (TEST-ChaosMonkeySafeLeaderTest.test-seed#[29C350392312E065]) [    ] o.e.j.s.h.ContextHandler Started o.e.j.s.ServletContextHandler@5f4cc47e{/,null,AVAILABLE}
   [junit4]   2> 800804 INFO  (TEST-ChaosMonkeySafeLeaderTest.test-seed#[29C350392312E065]) [    ] o.e.j.s.ServerConnector Started ServerConnector@6d1525ca{HTTP/1.1}{127.0.0.1:40769}
   [junit4]   2> 800804 INFO  (TEST-ChaosMonkeySafeLeaderTest.test-seed#[29C350392312E065]) [    ] o.e.j.s.Server Started @804853ms
   [junit4]   2> 800804 INFO  (TEST-ChaosMonkeySafeLeaderTest.test-seed#[29C350392312E065]) [    ] o.a.s.c.s.e.JettySolrRunner Jetty properties: {solr.data.dir=/x1/jenkins/jenkins-slave/workspace/Lucene-Solr-Tests-trunk-Java8/solr/build/solr-core/test/J1/temp/solr.cloud.ChaosMonkeySafeLeaderTest_29C350392312E065-001/tempDir-001/jetty1, solrconfig=solrconfig.xml, hostContext=/, hostPort=40769, coreRootDirectory=/x1/jenkins/jenkins-slave/workspace/Lucene-Solr-Tests-trunk-Java8/solr/build/solr-core/test/J1/../../../../../../../../../../x1/jenkins/jenkins-slave/workspace/Lucene-Solr-Tests-trunk-Java8/solr/build/solr-core/test/J1/temp/solr.cloud.ChaosMonkeySafeLeaderTest_29C350392312E065-001/shard-1-001/cores}
   [junit4]   2> 800804 INFO  (TEST-ChaosMonkeySafeLeaderTest.test-seed#[29C350392312E065]) [    ] o.a.s.s.SolrDispatchFilter SolrDispatchFilter.init(): sun.misc.Launcher$AppClassLoader@4e0e2f2a
   [junit4]   2> 800804 INFO  (TEST-ChaosMonkeySafeLeaderTest.test-seed#[29C350392312E065]) [    ] o.a.s.c.SolrResourceLoader new SolrResourceLoader for directory: '/x1/jenkins/jenkins-slave/workspace/Lucene-Solr-Tests-trunk-Java8/solr/build/solr-core/test/J1/../../../../../../../../../../x1/jenkins/jenkins-slave/workspace/Lucene-Solr-Tests-trunk-Java8/solr/build/solr-core/test/J1/temp/solr.cloud.ChaosMonkeySafeLeaderTest_29C350392312E065-001/shard-1-001/'
   [junit4]   2> 800821 INFO  (TEST-ChaosMonkeySafeLeaderTest.test-seed#[29C350392312E065]) [    ] o.a.s.c.c.SolrZkClient Using default ZkCredentialsProvider
   [junit4]   2> 800824 INFO  (TEST-ChaosMonkeySafeLeaderTest.test-seed#[29C350392312E065]) [    ] o.a.s.c.c.ConnectionManager Waiting for client to connect to ZooKeeper
   [junit4]   2> 800824 INFO  (zkCallback-700-thread-1) [    ] o.a.s.c.c.ConnectionManager Watcher org.apache.solr.common.cloud.ConnectionManager@1fc91023 name:ZooKeeperConnection Watcher:127.0.0.1:38512/solr got event WatchedEvent state:SyncConnected type:None path:null path:null type:None
   [junit4]   2> 800824 INFO  (TEST-ChaosMonkeySafeLeaderTest.test-seed#[29C350392312E065]) [    ] o.a.s.c.c.ConnectionManager Client is connected to ZooKeeper
   [junit4]   2> 800825 INFO  (TEST-ChaosMonkeySafeLeaderTest.test-seed#[29C350392312E065]) [    ] o.a.s.c.c.SolrZkClient Using default ZkACLProvider
   [junit4]   2> 800826 INFO  (TEST-ChaosMonkeySafeLeaderTest.test-seed#[29C350392312E065]) [    ] o.a.s.s.SolrDispatchFilter Loading solr.xml from SolrHome (not found in ZooKeeper)
   [junit4]   2> 800826 INFO  (TEST-ChaosMonkeySafeLeaderTest.test-seed#[29C350392312E065]) [    ] o.a.s.c.SolrXmlConfig Loading container configuration from /x1/jenkins/jenkins-slave/workspace/Lucene-Solr-Tests-trunk-Java8/solr/build/solr-core/test/J1/../../../../../../../../../../x1/jenkins/jenkins-slave/workspace/Lucene-Solr-Tests-trunk-Java8/solr/build/solr-core/test/J1/temp/solr.cloud.ChaosMonkeySafeLeaderTest_29C350392312E065-001/shard-1-001/solr.xml
   [junit4]   2> 800831 INFO  (TEST-ChaosMonkeySafeLeaderTest.test-seed#[29C350392312E065]) [    ] o.a.s.c.CoresLocator Config-defined core root directory: /x1/jenkins/jenkins-slave/workspace/Lucene-Solr-Tests-trunk-Java8/solr/build/solr-core/test/J1/../../../../../../../../../../x1/jenkins/jenkins-slave/workspace/Lucene-Solr-Tests-trunk-Java8/solr/build/solr-core/test/J1/temp/solr.cloud.ChaosMonkeySafeLeaderTest_29C350392312E065-001/shard-1-001/cores
   [junit4]   2> 800832 INFO  (TEST-ChaosMonkeySafeLeaderTest.test-seed#[29C350392312E065]) [    ] o.a.s.c.CoreContainer New CoreContainer 106633840
   [junit4]   2> 800832 INFO  (TEST-ChaosMonkeySafeLeaderTest.test-seed#[29C350392312E065]) [    ] o.a.s.c.CoreContainer Loading cores into CoreContainer [instanceDir=/x1/jenkins/jenkins-slave/workspace/Lucene-Solr-Tests-trunk-Java8/solr/build/solr-core/test/J1/../../../../../../../../../../x1/jenkins/jenkins-slave/workspace/Lucene-Solr-Tests-trunk-Java8/solr/build/solr-core/test/J1/temp/solr.cloud.ChaosMonkeySafeLeaderTest_29C350392312E065-001/shard-1-001/]
   [junit4]   2> 800832 INFO  (TEST-ChaosMonkeySafeLeaderTest.test-seed#[29C350392312E065]) [    ] o.a.s.c.CoreContainer loading shared library: /x1/jenkins/jenkins-slave/workspace/Lucene-Solr-Tests-trunk-Java8/solr/build/solr-core/test/J1/../../../../../../../../../../x1/jenkins/jenkins-slave/workspace/Lucene-Solr-Tests-trunk-Java8/solr/build/solr-core/test/J1/temp/solr.cloud.ChaosMonkeySafeLeaderTest_29C350392312E065-001/shard-1-001/lib
   [junit4]   2> 800832 WARN  (TEST-ChaosMonkeySafeLeaderTest.test-seed#[29C350392312E065]) [    ] o.a.s.c.SolrResourceLoader Can't find (or read) directory to add to classloader: lib (resolved as: /x1/jenkins/jenkins-slave/workspace/Lucene-Solr-Tests-trunk-Java8/solr/build/solr-core/test/J1/../../../../../../../../../../x1/jenkins/jenkins-slave/workspace/Lucene-Solr-Tests-trunk-Java8/solr/build/solr-core/test/J1/temp/solr.cloud.ChaosMonkeySafeLeaderTest_29C350392312E065-001/shard-1-001/lib).
   [junit4]   2> 800840 INFO  (TEST-ChaosMonkeySafeLeaderTest.test-seed#[29C350392312E065]) [    ] o.a.s.h.c.HttpShardHandlerFactory created with socketTimeout : 90000,urlScheme : ,connTimeout : 15000,maxConnectionsPerHost : 20,maxConnections : 10000,corePoolSize : 0,maximumPoolSize : 2147483647,maxThreadIdleTime : 5,sizeOfQueue : -1,fairnessPolicy : false,useRetries : false,
   [junit4]   2> 800842 INFO  (TEST-ChaosMonkeySafeLeaderTest.test-seed#[29C350392312E065]) [    ] o.a.s.u.UpdateShardHandler Creating UpdateShardHandler HTTP client with params: socketTimeout=340000&connTimeout=45000&retry=true
   [junit4]   2> 800842 INFO  (TEST-ChaosMonkeySafeLeaderTest.test-seed#[29C350392312E065]) [    ] o.a.s.l.LogWatcher SLF4J impl is org.slf4j.impl.Log4jLoggerFactory
   [junit4]   2> 800842 INFO  (TEST-ChaosMonkeySafeLeaderTest.test-seed#[29C350392312E065]) [    ] o.a.s.l.LogWatcher Registering Log Listener [Log4j (org.slf4j.impl.Log4jLoggerFactory)]
   [junit4]   2> 800842 INFO  (TEST-ChaosMonkeySafeLeaderTest.test-seed#[29C350392312E065]) [    ] o.a.s.c.ZkContainer Zookeeper client=127.0.0.1:38512/solr
   [junit4]   2> 800843 INFO  (TEST-ChaosMonkeySafeLeaderTest.test-seed#[29C350392312E065]) [    ] o.a.s.c.ZkController zkHost includes chroot
   [junit4]   2> 800843 INFO  (TEST-ChaosMonkeySafeLeaderTest.test-seed#[29C350392312E065]) [    ] o.a.s.c.c.SolrZkClient Using default ZkCredentialsProvider
   [junit4]   2> 800843 INFO  (TEST-ChaosMonkeySafeLeaderTest.test-seed#[29C350392312E065]) [    ] o.a.s.c.c.ConnectionManager Waiting for client to connect to ZooKeeper
   [junit4]   2> 800845 INFO  (zkCallback-702-thread-1) [    ] o.a.s.c.c.ConnectionManager Watcher org.apache.solr.common.cloud.ConnectionManager@1d958229 name:ZooKeeperConnection Watcher:127.0.0.1:38512 got event WatchedEvent state:SyncConnected type:None path:null path:null type:None
   [junit4]   2> 800848 INFO  (TEST-ChaosMonkeySafeLeaderTest.test-seed#[29C350392312E065]) [    ] o.a.s.c.c.ConnectionManager Client is connected to ZooKeeper
   [junit4]   2> 800848 INFO  (TEST-ChaosMonkeySafeLeaderTest.test-seed#[29C350392312E065]) [    ] o.a.s.c.c.SolrZkClient Using default ZkACLProvider
   [junit4]   2> 800851 INFO  (TEST-ChaosMonkeySafeLeaderTest.test-seed#[29C350392312E065]) [n:127.0.0.1:40769_    ] o.a.s.c.c.ConnectionManager Waiting for client to connect to ZooKeeper
   [junit4]   2> 800852 INFO  (zkCallback-703-thread-1-processing-n:127.0.0.1:40769_) [n:127.0.0.1:40769_    ] o.a.s.c.c.ConnectionManager Watcher org.apache.solr.common.cloud.ConnectionManager@71bee3d3 name:ZooKeeperConnection Watcher:127.0.0.1:38512/solr got event WatchedEvent state:SyncConnected type:None path:null path:null type:None
   [junit4]   2> 800852 INFO  (TEST-ChaosMonkeySafeLeaderTest.test-seed#[29C350392312E065]) [n:127.0.0.1:40769_    ] o.a.s.c.c.ConnectionManager Client is connected to ZooKeeper
   [junit4]   2> 800858 INFO  (TEST-ChaosMonkeySafeLeaderTest.test-seed#[29C350392312E065]) [n:127.0.0.1:40769_    ] o.a.s.c.c.ZkStateReader Updating cluster state from ZooKeeper... 
   [junit4]   2> 801862 INFO  (TEST-ChaosMonkeySafeLeaderTest.test-seed#[29C350392312E065]) [n:127.0.0.1:40769_    ] o.a.s.c.ZkController Register node as live in ZooKeeper:/live_nodes/127.0.0.1:40769_
   [junit4]   2> 801862 INFO  (TEST-ChaosMonkeySafeLeaderTest.test-seed#[29C350392312E065]) [n:127.0.0.1:40769_    ] o.a.s.c.c.SolrZkClient makePath: /live_nodes/127.0.0.1:40769_
   [junit4]   2> 801866 INFO  (TEST-ChaosMonkeySafeLeaderTest.test-seed#[29C350392312E065]) [n:127.0.0.1:40769_    ] o.a.s.c.Overseer Overseer (id=null) closing
   [junit4]   2> 801867 INFO  (TEST-ChaosMonkeySafeLeaderTest.test-seed#[29C350392312E065]) [n:127.0.0.1:40769_    ] o.a.s.c.LeaderElector Joined leadership election with path: /overseer_elect/election/94280939849383944-127.0.0.1:40769_-n_0000000001
   [junit4]   2> 801868 INFO  (TEST-ChaosMonkeySafeLeaderTest.test-seed#[29C350392312E065]) [n:127.0.0.1:40769_    ] o.a.s.c.LeaderElector Watching path /overseer_elect/election/94280939849383940-127.0.0.1:38414_-n_0000000000 to know if I could be the leader
   [junit4]   2> 801868 INFO  (TEST-ChaosMonkeySafeLeaderTest.test-seed#[29C350392312E065]) [n:127.0.0.1:40769_    ] o.a.s.c.CoreContainer No authentication plugin used.
   [junit4]   2> 801869 INFO  (TEST-ChaosMonkeySafeLeaderTest.test-seed#[29C350392312E065]) [n:127.0.0.1:40769_    ] o.a.s.c.CoreContainer Security conf doesn't exist. Skipping setup for authorization module.
   [junit4]   2> 801869 INFO  (TEST-ChaosMonkeySafeLeaderTest.test-seed#[29C350392312E065]) [n:127.0.0.1:40769_    ] o.a.s.c.CoresLocator Looking for core definitions underneath /x1/jenkins/jenkins-slave/workspace/Lucene-Solr-Tests-trunk-Java8/solr/build/solr-core/test/J1/../../../../../../../../../../x1/jenkins/jenkins-slave/workspace/Lucene-Solr-Tests-trunk-Java8/solr/build/solr-core/test/J1/temp/solr.cloud.ChaosMonkeySafeLeaderTest_29C350392312E065-001/shard-1-001/cores
   [junit4]   2> 801870 INFO  (TEST-ChaosMonkeySafeLeaderTest.test-seed#[29C350392312E065]) [n:127.0.0.1:40769_    ] o.a.s.c.SolrCore Created CoreDescriptor: {name=collection1, config=solrconfig.xml, transient=false, schema=schema.xml, loadOnStartup=true, configSetProperties=configsetprops.json, instanceDir=/x1/jenkins/jenkins-slave/workspace/Lucene-Solr-Tests-trunk-Java8/solr/build/solr-core/test/J1/../../../../../../../../../../x1/jenkins/jenkins-slave/workspace/Lucene-Solr-Tests-trunk-Java8/solr/build/solr-core/test/J1/temp/solr.cloud.ChaosMonkeySafeLeaderTest_29C350392312E065-001/shard-1-001/cores/collection1, collection=collection1, absoluteInstDir=/x1/jenkins/jenkins-slave/workspace/Lucene-Solr-Tests-trunk-Java8/solr/build/solr-core/test/J1/../../../../../../../../../../x1/jenkins/jenkins-slave/workspace/Lucene-Solr-Tests-trunk-Java8/solr/build/solr-core/test/J1/temp/solr.cloud.ChaosMonkeySafeLeaderTest_29C350392312E065-001/shard-1-001/cores/collection1/, coreNodeName=, dataDir=data/, shard=}
   [junit4]   2> 801870 INFO  (TEST-ChaosMonkeySafeLeaderTest.test-seed#[29C350392312E065]) [n:127.0.0.1:40769_    ] o.a.s.c.CoresLocator Found core collection1 in /x1/jenkins/jenkins-slave/workspace/Lucene-Solr-Tests-trunk-Java8/solr/build/solr-core/test/J1/../../../../../../../../../../x1/jenkins/jenkins-slave/workspace/Lucene-Solr-Tests-trunk-Java8/solr/build/solr-core/test/J1/temp/solr.cloud.ChaosMonkeySafeLeaderTest_29C350392312E065-001/shard-1-001/cores/collection1/
   [junit4]   2> 801871 INFO  (TEST-ChaosMonkeySafeLeaderTest.test-seed#[29C350392312E065]) [n:127.0.0.1:40769_    ] o.a.s.c.CoresLocator Found 1 core definitions
   [junit4]   2> 801871 INFO  (coreLoadExecutor-2466-thread-1-processing-n:127.0.0.1:40769_) [n:127.0.0.1:40769_ c:collection1   x:collection1] o.a.s.c.ZkController publishing state=down
   [junit4]   2> 801872 INFO  (coreLoadExecutor-2466-thread-1-processing-n:127.0.0.1:40769_) [n:127.0.0.1:40769_ c:collection1   x:collection1] o.a.s.c.ZkController numShards not found on descriptor - reading it from system property
   [junit4]   2> 801872 INFO  (zkCallback-697-thread-1-processing-n:127.0.0.1:38414_) [n:127.0.0.1:38414_    ] o.a.s.c.DistributedQueue NodeChildrenChanged fired on path /overseer/queue state SyncConnected
   [junit4]   2> 801872 INFO  (coreLoadExecutor-2466-thread-1-processing-n:127.0.0.1:40769_) [n:127.0.0.1:40769_ c:collection1   x:collection1] o.a.s.c.ZkController look for our core node name
   [junit4]   2> 801872 INFO  (TEST-ChaosMonkeySafeLeaderTest.test-seed#[29C350392312E065]) [n:127.0.0.1:40769_    ] o.a.s.s.SolrDispatchFilter user.dir=/x1/jenkins/jenkins-slave/workspace/Lucene-Solr-Tests-trunk-Java8/solr/build/solr-core/test/J1
   [junit4]   2> 801873 INFO  (TEST-ChaosMonkeySafeLeaderTest.test-seed#[29C350392312E065]) [n:127.0.0.1:40769_    ] o.a.s.s.SolrDispatchFilter SolrDispatchFilter.init() done
   [junit4]   2> 801873 INFO  (OverseerStateUpdate-94280939849383940-127.0.0.1:38414_-n_0000000000) [n:127.0.0.1:38414_    ] o.a.s.c.Overseer processMessage: queueSize: 1, message = {
   [junit4]   2>   "core":"collection1",
   [junit4]   2>   "roles":null,
   [junit4]   2>   "base_url":"http://127.0.0.1:40769",
   [junit4]   2>   "node_name":"127.0.0.1:40769_",
   [junit4]   2>   "numShards":"2",
   [junit4]   2>   "state":"down",
   [junit4]   2>   "shard":null,
   [junit4]   2>   "collection":"collection1",
   [junit4]   2>   "operation":"state"} current state version: 3
   [junit4]   2> 801873 INFO  (OverseerStateUpdate-94280939849383940-127.0.0.1:38414_-n_0000000000) [n:127.0.0.1:38414_    ] o.a.s.c.o.ReplicaMutator Update state numShards=2 message={
   [junit4]   2>   "core":"collection1",
   [junit4]   2>   "roles":null,
   [junit4]   2>   "base_url":"http://127.0.0.1:40769",
   [junit4]   2>   "node_name":"127.0.0.1:40769_",
   [junit4]   2>   "numShards":"2",
   [junit4]   2>   "state":"down",
   [junit4]   2>   "shard":null,
   [junit4]   2>   "collection":"collection1",
   [junit4]   2>   "operation":"state"}
   [junit4]   2> 801874 INFO  (OverseerStateUpdate-94280939849383940-127.0.0.1:38414_-n_0000000000) [n:127.0.0.1:38414_    ] o.a.s.c.o.ClusterStateMutator building a new cName: collection1
   [junit4]   2> 801874 INFO  (OverseerStateUpdate-94280939849383940-127.0.0.1:38414_-n_0000000000) [n:127.0.0.1:38414_    ] o.a.s.c.o.ReplicaMutator Assigning new node to shard shard=shard2
   [junit4]   2> 801976 INFO  (zkCallback-699-thread-1) [    ] o.a.s.c.c.ZkStateReader A cluster state change: WatchedEvent state:SyncConnected type:NodeDataChanged path:/clusterstate.json, has occurred - updating... (live nodes size: 2)
   [junit4]   2> 801976 INFO  (zkCallback-703-thread-1-processing-n:127.0.0.1:40769_) [n:127.0.0.1:40769_    ] o.a.s.c.c.ZkStateReader A cluster state change: WatchedEvent state:SyncConnected type:NodeDataChanged path:/clusterstate.json, has occurred - updating... (live nodes size: 2)
   [junit4]   2> 801976 INFO  (zkCallback-697-thread-1-processing-n:127.0.0.1:38414_) [n:127.0.0.1:38414_    ] o.a.s.c.c.ZkStateReader A cluster state change: WatchedEvent state:SyncConnected type:NodeDataChanged path:/clusterstate.json, has occurred - updating... (live nodes size: 2)
   [junit4]   2> 801978 INFO  (zkCallback-699-thread-1) [    ] o.a.s.c.c.ZkStateReader Updated cluster state version to 4
   [junit4]   2> 801979 INFO  (zkCallback-703-thread-1-processing-n:127.0.0.1:40769_) [n:127.0.0.1:40769_    ] o.a.s.c.c.ZkStateReader Updated cluster state version to 4
   [junit4]   2> 801979 INFO  (zkCallback-697-thread-1-processing-n:127.0.0.1:38414_) [n:127.0.0.1:38414_    ] o.a.s.c.c.ZkStateReader Updated cluster state version to 4
   [junit4]   2> 802873 INFO  (coreLoadExecutor-2466-thread-1-processing-n:127.0.0.1:40769_) [n:127.0.0.1:40769_ c:collection1   x:collection1] o.a.s.c.ZkController waiting to find shard id in clusterstate for collection1
   [junit4]   2> 802873 INFO  (coreLoadExecutor-2466-thread-1-processing-n:127.0.0.1:40769_) [n:127.0.0.1:40769_ c:collection1   x:collection1] o.a.s.c.ZkController Check for collection zkNode:collection1
   [junit4]   2> 802874 INFO  (coreLoadExecutor-2466-thread-1-processing-n:127.0.0.1:40769_) [n:127.0.0.1:40769_ c:collection1   x:collection1] o.a.s.c.ZkController Collection zkNode exists
   [junit4]   2> 802874 INFO  (coreLoadExecutor-2466-thread-1-processing-n:127.0.0.1:40769_) [n:127.0.0.1:40769_ c:collection1   x:collection1] o.a.s.c.c.ZkStateReader Load collection config from:/collections/collection1
   [junit4]   2> 802875 INFO  (coreLoadExecutor-2466-thread-1-processing-n:127.0.0.1:40769_) [n:127.0.0.1:40769_ c:collection1   x:collection1] o.a.s.c.c.ZkStateReader path=/collections/collection1 configName=conf1 specified config exists in ZooKeeper
   [junit4]   2> 802875 INFO  (coreLoadExecutor-2466-thread-1-processing-n:127.0.0.1:40769_) [n:127.0.0.1:40769_ c:collection1   x:collection1] o.a.s.c.SolrResourceLoader new SolrResourceLoader for directory: '/x1/jenkins/jenkins-slave/workspace/Lucene-Solr-Tests-trunk-Java8/solr/build/solr-core/test/J1/../../../../../../../../../../x1/jenkins/jenkins-slave/workspace/Lucene-Solr-Tests-trunk-Java8/solr/build/solr-core/test/J1/temp/solr.cloud.ChaosMonkeySafeLeaderTest_29C350392312E065-001/shard-1-001/cores/collection1/'
   [junit4]   2> 802890 INFO  (coreLoadExecutor-2466-thread-1-processing-n:127.0.0.1:40769_) [n:127.0.0.1:40769_ c:collection1   x:collection1] o.a.s.c.Config loaded config solrconfig.xml with version 0 
   [junit4]   2> 802896 INFO  (coreLoadExecutor-2466-thread-1-processing-n:127.0.0.1:40769_) [n:127.0.0.1:40769_ c:collection1   x:collection1] o.a.s.c.SolrConfig current version of requestparams : -1
   [junit4]   2> 802900 INFO  (coreLoadExecutor-2466-thread-1-processing-n:127.0.0.1:40769_) [n:127.0.0.1:40769_ c:collection1   x:collection1] o.a.s.c.SolrConfig Using Lucene MatchVersion: 6.0.0
   [junit4]   2> 802909 INFO  (coreLoadExecutor-2466-thread-1-processing-n:127.0.0.1:40769_) [n:127.0.0.1:40769_ c:collection1   x:collection1] o.a.s.c.Config Loaded SolrConfig: solrconfig.xml
   [junit4]   2> 802910 INFO  (coreLoadExecutor-2466-thread-1-processing-n:127.0.0.1:40769_) [n:127.0.0.1:40769_ c:collection1   x:collection1] o.a.s.s.IndexSchema Reading Solr Schema from /configs/conf1/schema.xml
   [junit4]   2> 802914 INFO  (coreLoadExecutor-2466-thread-1-processing-n:127.0.0.1:40769_) [n:127.0.0.1:40769_ c:collection1   x:collection1] o.a.s.s.IndexSchema [collection1] Schema name=test
   [junit4]   2> 803022 INFO  (coreLoadExecutor-2466-thread-1-processing-n:127.0.0.1:40769_) [n:127.0.0.1:40769_ c:collection1   x:collection1] o.a.s.s.IndexSchema default search field in schema is text
   [junit4]   2> 803023 INFO  (coreLoadExecutor-2466-thread-1-processing-n:127.0.0.1:40769_) [n:127.0.0.1:40769_ c:collection1   x:collection1] o.a.s.s.IndexSchema unique key field: id
   [junit4]   2> 803024 INFO  (coreLoadExecutor-2466-thread-1-processing-n:127.0.0.1:40769_) [n:127.0.0.1:40769_ c:collection1   x:collection1] o.a.s.s.FileExchangeRateProvider Reloading exchange rates from file currency.xml
   [junit4]   2> 803026 INFO  (coreLoadExecutor-2466-thread-1-processing-n:127.0.0.1:40769_) [n:127.0.0.1:40769_ c:collection1   x:collection1] o.a.s.s.FileExchangeRateProvider Reloading exchange rates from file currency.xml
   [junit4]   2> 803044 INFO  (coreLoadExecutor-2466-thread-1-processing-n:127.0.0.1:40769_) [n:127.0.0.1:40769_ c:collection1   x:collection1] o.a.s.c.ConfigSetProperties Did not find ConfigSet properties, assuming default properties: Can't find resource 'configsetprops.json' in classpath or '/configs/conf1', cwd=/x1/jenkins/jenkins-slave/workspace/Lucene-Solr-Tests-trunk-Java8/solr/build/solr-core/test/J1
   [junit4]   2> 803044 INFO  (coreLoadExecutor-2466-thread-1-processing-n:127.0.0.1:40769_) [n:127.0.0.1:40769_ c:collection1   x:collection1] o.a.s.c.CoreContainer Creating SolrCore 'collection1' using configuration from collection collection1
   [junit4]   2> 803044 INFO  (coreLoadExecutor-2466-thread-1-processing-n:127.0.0.1:40769_) [n:127.0.0.1:40769_ c:collection1 s:shard2 r:core_node1 x:collection1] o.a.s.c.SolrCore solr.StandardDirectoryFactory
   [junit4]   2> 803045 INFO  (coreLoadExecutor-2466-thread-1-processing-n:127.0.0.1:40769_) [n:127.0.0.1:40769_ c:collection1 s:shard2 r:core_node1 x:collection1] o.a.s.c.SolrCore [[collection1] ] Opening new SolrCore at [/x1/jenkins/jenkins-slave/workspace/Lucene-Solr-Tests-trunk-Java8/solr/build/solr-core/test/J1/../../../../../../../../../../x1/jenkins/jenkins-slave/workspace/Lucene-Solr-Tests-trunk-Java8/solr/build/solr-core/test/J1/temp/solr.cloud.ChaosMonkeySafeLeaderTest_29C350392312E065-001/shard-1-001/cores/collection1/], dataDir=[null]
   [junit4]   2> 803045 INFO  (coreLoadExecutor-2466-thread-1-processing-n:127.0.0.1:40769_) [n:127.0.0.1:40769_ c:collection1 s:shard2 r:core_node1 x:collection1] o.a.s.c.JmxMonitoredMap JMX monitoring is enabled. Adding Solr mbeans to JMX Server: com.sun.jmx.mbeanserver.JmxMBeanServer@67142e1b
   [junit4]   2> 803046 INFO  (coreLoadExecutor-2466-thread-1-processing-n:127.0.0.1:40769_) [n:127.0.0.1:40769_ c:collection1 s:shard2 r:core_node1 x:collection1] o.a.s.c.CachingDirectoryFactory return new directory for /x1/jenkins/jenkins-slave/workspace/Lucene-Solr-Tests-trunk-Java8/solr/build/solr-core/test/J1/temp/solr.cloud.ChaosMonkeySafeLeaderTest_29C350392312E065-001/shard-1-001/cores/collection1/data
   [junit4]   2> 803046 INFO  (coreLoadExecutor-2466-thread-1-processing-n:127.0.0.1:40769_) [n:127.0.0.1:40769_ c:collection1 s:shard2 r:core_node1 x:collection1] o.a.s.c.SolrCore New index directory detected: old=null new=/x1/jenkins/jenkins-slave/workspace/Lucene-Solr-Tests-trunk-Java8/solr/build/solr-core/test/J1/temp/solr.cloud.ChaosMonkeySafeLeaderTest_29C350392312E065-001/shard-1-001/cores/collection1/data/index/
   [junit4]   2> 803046 WARN  (coreLoadExecutor-2466-thread-1-processing-n:127.0.0.1:40769_) [n:127.0.0.1:40769_ c:collection1 s:shard2 r:core_node1 x:collection1] o.a.s.c.SolrCore [collection1] Solr index directory '/x1/jenkins/jenkins-slave/workspace/Lucene-Solr-Tests-trunk-Java8/solr/build/solr-core/test/J1/temp/solr.cloud.ChaosMonkeySafeLeaderTest_29C350392312E065-001/shard-1-001/cores/collection1/data/index' doesn't exist. Creating new index...
   [junit4]   2> 803047 INFO  (coreLoadExecutor-2466-thread-1-processing-n:127.0.0.1:40769_) [n:127.0.0.1:40769_ c:collection1 s:shard2 r:core_node1 x:collection1] o.a.s.c.CachingDirectoryFactory return new directory for /x1/jenkins/jenkins-slave/workspace/Lucene-Solr-Tests-trunk-Java8/solr/build/solr-core/test/J1/temp/solr.cloud.ChaosMonkeySafeLeaderTest_29C350392312E065-001/shard-1-001/cores/collection1/data/index
   [junit4]   2> 803047 INFO  (coreLoadExecutor-2466-thread-1-processing-n:127.0.0.1:40769_) [n:127.0.0.1:40769_ c:collection1 s:shard2 r:core_node1 x:collection1] o.a.s.u.RandomMergePolicy RandomMergePolicy wrapping class org.apache.lucene.index.LogByteSizeMergePolicy: [LogByteSizeMergePolicy: minMergeSize=1677721, mergeFactor=21, maxMergeSize=2147483648, maxMergeSizeForForcedMerge=9223372036854775807, calibrateSizeByDeletes=true, maxMergeDocs=2147483647, maxCFSSegmentSizeMB=8.796093022207999E12, noCFSRatio=0.0]
   [junit4]   2> 803051 INFO  (coreLoadExecutor-2466-thread-1-processing-n:127.0.0.1:40769_) [n:127.0.0.1:40769_ c:collection1 s:shard2 r:core_node1 x:collection1] o.a.s.c.SolrCore SolrDeletionPolicy.onCommit: commits: num=1
   [junit4]   2> 	commit{dir=/x1/jenkins/jenkins-slave/workspace/Lucene-Solr-Tests-trunk-Java8/solr/build/solr-core/test/J1/temp/solr.cloud.ChaosMonkeySafeLeaderTest_29C350392312E065-001/shard-1-001/cores/collection1/data/index,segFN=segments_1,generation=1}
   [junit4]   2> 803051 INFO  (coreLoadExecutor-2466-thread-1-processing-n:127.0.0.1:40769_) [n:127.0.0.1:40769_ c:collection1 s:shard2 r:core_node1 x:collection1] o.a.s.c.SolrCore newest commit generation = 1
   [junit4]   2> 803052 INFO  (OldIndexDirectoryCleanupThreadForCore-collection1) [n:127.0.0.1:40769_ c:collection1 s:shard2 r:core_node1 x:collection1] o.a.s.c.SolrCore Looking for old index directories to cleanup for core collection1 in /x1/jenkins/jenkins-slave/workspace/Lucene-Solr-Tests-trunk-Java8/solr/build/solr-core/test/J1/temp/solr.cloud.ChaosMonkeySafeLeaderTest_29C350392312E065-001/shard-1-001/cores/collection1/data/
   [junit4]   2> 803056 INFO  (coreLoadExecutor-2466-thread-1-processing-n:127.0.0.1:40769_) [n:127.0.0.1:40769_ c:collection1 s:shard2 r:core_node1 x:collection1] o.a.s.u.p.UpdateRequestProcessorChain creating updateRequestProcessorChain "nodistrib"
   [junit4]   2> 803056 INFO  (coreLoadExecutor-2466-thread-1-processing-n:127.0.0.1:40769_) [n:127.0.0.1:40769_ c:collection1 s:shard2 r:core_node1 x:collection1] o.a.s.u.p.UpdateRequestProcessorChain creating updateRequestProcessorChain "dedupe"
   [junit4]   2> 803057 INFO  (coreLoadExecutor-2466-thread-1-processing-n:127.0.0.1:40769_) [n:127.0.0.1:40769_ c:collection1 s:shard2 r:core_node1 x:collection1] o.a.s.u.p.UpdateRequestProcessorChain inserting DistributedUpdateProcessorFactory into updateRequestProcessorChain "dedupe"
   [junit4]   2> 803057 INFO  (coreLoadExecutor-2466-thread-1-processing-n:127.0.0.1:40769_) [n:127.0.0.1:40769_ c:collection1 s:shard2 r:core_node1 x:collection1] o.a.s.u.p.UpdateRequestProcessorChain creating updateRequestProcessorChain "stored_sig"
   [junit4]   2> 803057 INFO  (coreLoadExecutor-2466-thread-1-processing-n:127.0.0.1:40769_) [n:127.0.0.1:40769_ c:collection1 s:shard2 r:core_node1 x:collection1] o.a.s.u.p.UpdateRequestProcessorChain inserting DistributedUpdateProcessorFactory into updateRequestProcessorChain "stored_sig"
   [junit4]   2> 803057 INFO  (coreLoadExecutor-2466-thread-1-processing-n:127.0.0.1:40769_) [n:127.0.0.1:40769_ c:collection1 s:shard2 r:core_node1 x:collection1] o.a.s.u.p.UpdateRequestProcessorChain creating updateRequestProcessorChain "distrib-dup-test-chain-explicit"
   [junit4]   2> 803057 INFO  (coreLoadExecutor-2466-thread-1-processing-n:127.0.0.1:40769_) [n:127.0.0.1:40769_ c:collection1 s:shard2 r:core_node1 x:collection1] o.a.s.u.p.UpdateRequestProcessorChain creating updateRequestProcessorChain "distrib-dup-test-chain-implicit"
   [junit4]   2> 803058 INFO  (coreLoadExecutor-2466-thread-1-processing-n:127.0.0.1:40769_) [n:127.0.0.1:40769_ c:collection1 s:shard2 r:core_node1 x:collection1] o.a.s.u.p.UpdateRequestProcessorChain inserting DistributedUpdateProcessorFactory into updateRequestProcessorChain "distrib-dup-test-chain-implicit"
   [junit4]   2> 803058 INFO  (coreLoadExecutor-2466-thread-1-processing-n:127.0.0.1:40769_) [n:127.0.0.1:40769_ c:collection1 s:shard2 r:core_node1 x:collection1] o.a.s.c.SolrCore no updateRequestProcessorChain defined as default, creating implicit default
   [junit4]   2> 803060 INFO  (coreLoadExecutor-2466-thread-1-processing-n:127.0.0.1:40769_) [n:127.0.0.1:40769_ c:collection1 s:shard2 r:core_node1 x:collection1] o.a.s.h.l.XMLLoader xsltCacheLifetimeSeconds=60
   [junit4]   2> 803061 INFO  (coreLoadExecutor-2466-thread-1-processing-n:127.0.0.1:40769_) [n:127.0.0.1:40769_ c:collection1 s:shard2 r:core_node1 x:collection1] o.a.s.h.l.XMLLoader xsltCacheLifetimeSeconds=60
   [junit4]   2> 803062 INFO  (coreLoadExecutor-2466-thread-1-processing-n:127.0.0.1:40769_) [n:127.0.0.1:40769_ c:collection1 s:shard2 r:core_node1 x:collection1] o.a.s.h.l.XMLLoader xsltCacheLifetimeSeconds=60
   [junit4]   2> 803063 INFO  (coreLoadExecutor-2466-thread-1-processing-n:127.0.0.1:40769_) [n:127.0.0.1:40769_ c:collection1 s:shard2 r:core_node1 x:collection1] o.a.s.h.l.XMLLoader xsltCacheLifetimeSeconds=60
   [junit4]   2> 803068 INFO  (coreLoadExecutor-2466-thread

[...truncated too long message...]

) [n:127.0.0.1:44147_ c:collection1 s:shard2 r:core_node3 x:collection1] o.a.s.c.CachingDirectoryFactory Closing directory: /x1/jenkins/jenkins-slave/workspace/Lucene-Solr-Tests-trunk-Java8/solr/build/solr-core/test/J1/temp/solr.cloud.ChaosMonkeySafeLeaderTest_29C350392312E065-001/shard-3-001/cores/collection1/data
   [junit4]   2> 819717 WARN  (zkCallback-711-thread-2-processing-n:127.0.0.1:44147_) [n:127.0.0.1:44147_ c:collection1 s:shard2 r:core_node3 x:collection1] o.a.s.c.LeaderElector 
   [junit4]   2> java.lang.RuntimeException: org.apache.zookeeper.KeeperException$SessionExpiredException: KeeperErrorCode = Session expired for /overseer
   [junit4]   2> 	at org.apache.solr.cloud.Overseer.createOverseerNode(Overseer.java:938)
   [junit4]   2> 	at org.apache.solr.cloud.Overseer.getInQueue(Overseer.java:889)
   [junit4]   2> 	at org.apache.solr.cloud.Overseer.getInQueue(Overseer.java:885)
   [junit4]   2> 	at org.apache.solr.cloud.ShardLeaderElectionContext.runLeaderProcess(ElectionContext.java:221)
   [junit4]   2> 	at org.apache.solr.cloud.LeaderElector.runIamLeaderProcess(LeaderElector.java:199)
   [junit4]   2> 	at org.apache.solr.cloud.LeaderElector.checkIfIamLeader(LeaderElector.java:159)
   [junit4]   2> 	at org.apache.solr.cloud.LeaderElector.joinElection(LeaderElector.java:348)
   [junit4]   2> 	at org.apache.solr.cloud.LeaderElector.joinElection(LeaderElector.java:257)
   [junit4]   2> 	at org.apache.solr.cloud.ShardLeaderElectionContext.rejoinLeaderElection(ElectionContext.java:481)
   [junit4]   2> 	at org.apache.solr.cloud.ShardLeaderElectionContext.runLeaderProcess(ElectionContext.java:238)
   [junit4]   2> 	at org.apache.solr.cloud.LeaderElector.runIamLeaderProcess(LeaderElector.java:199)
   [junit4]   2> 	at org.apache.solr.cloud.LeaderElector.checkIfIamLeader(LeaderElector.java:159)
   [junit4]   2> 	at org.apache.solr.cloud.LeaderElector.access$200(LeaderElector.java:56)
   [junit4]   2> 	at org.apache.solr.cloud.LeaderElector$ElectionWatcher.process(LeaderElector.java:390)
   [junit4]   2> 	at org.apache.solr.common.cloud.SolrZkClient$3$1.run(SolrZkClient.java:269)
   [junit4]   2> 	at java.util.concurrent.Executors$RunnableAdapter.call(Executors.java:511)
   [junit4]   2> 	at java.util.concurrent.FutureTask.run(FutureTask.java:266)
   [junit4]   2> 	at org.apache.solr.common.util.ExecutorUtil$MDCAwareThreadPoolExecutor$1.run(ExecutorUtil.java:209)
   [junit4]   2> 	at java.util.concurrent.ThreadPoolExecutor.runWorker(ThreadPoolExecutor.java:1142)
   [junit4]   2> 	at java.util.concurrent.ThreadPoolExecutor$Worker.run(ThreadPoolExecutor.java:617)
   [junit4]   2> 	at java.lang.Thread.run(Thread.java:745)
   [junit4]   2> Caused by: org.apache.zookeeper.KeeperException$SessionExpiredException: KeeperErrorCode = Session expired for /overseer
   [junit4]   2> 	at org.apache.zookeeper.KeeperException.create(KeeperException.java:127)
   [junit4]   2> 	at org.apache.zookeeper.KeeperException.create(KeeperException.java:51)
   [junit4]   2> 	at org.apache.zookeeper.ZooKeeper.create(ZooKeeper.java:783)
   [junit4]   2> 	at org.apache.solr.common.cloud.SolrZkClient$9.execute(SolrZkClient.java:388)
   [junit4]   2> 	at org.apache.solr.common.cloud.SolrZkClient$9.execute(SolrZkClient.java:385)
   [junit4]   2> 	at org.apache.solr.common.cloud.ZkCmdExecutor.retryOperation(ZkCmdExecutor.java:61)
   [junit4]   2> 	at org.apache.solr.common.cloud.SolrZkClient.create(SolrZkClient.java:385)
   [junit4]   2> 	at org.apache.solr.cloud.Overseer.createOverseerNode(Overseer.java:929)
   [junit4]   2> 	... 20 more
   [junit4]   2> 819718 INFO  (TEST-ChaosMonkeySafeLeaderTest.test-seed#[29C350392312E065]) [    ] o.e.j.s.ServerConnector Stopped ServerConnector@6d93fa92{HTTP/1.1}{127.0.0.1:0}
   [junit4]   2> 819719 INFO  (TEST-ChaosMonkeySafeLeaderTest.test-seed#[29C350392312E065]) [    ] o.e.j.s.h.ContextHandler Stopped o.e.j.s.ServletContextHandler@6ee4e0ab{/,null,UNAVAILABLE}
   [junit4]   2> 819720 INFO  (TEST-ChaosMonkeySafeLeaderTest.test-seed#[29C350392312E065]) [n:127.0.0.1:44147_ c:collection1 s:shard2 r:core_node3 x:collection1] o.a.s.c.ZkTestServer connecting to 127.0.0.1:38512 38512
   [junit4]   2> 819830 INFO  (Thread-2017) [    ] o.a.s.c.ZkTestServer connecting to 127.0.0.1:38512 38512
   [junit4]   2> 819831 WARN  (Thread-2017) [    ] o.a.s.c.ZkTestServer Watch limit violations: 
   [junit4]   2> Maximum concurrent create/delete watches above limit:
   [junit4]   2> 
   [junit4]   2> 	5	/solr/aliases.json
   [junit4]   2> 	5	/solr/clusterstate.json
   [junit4]   2> 	4	/solr/configs/conf1
   [junit4]   2> 
   [junit4]   2> Maximum concurrent children watches above limit:
   [junit4]   2> 
   [junit4]   2> 	5	/solr/live_nodes
   [junit4]   2> 	4	/solr/overseer/queue
   [junit4]   2> 	4	/solr/overseer/collection-queue-work
   [junit4]   2> 
   [junit4]   2> NOTE: reproduce with: ant test  -Dtestcase=ChaosMonkeySafeLeaderTest -Dtests.method=test -Dtests.seed=29C350392312E065 -Dtests.multiplier=2 -Dtests.slow=true -Dtests.locale=sr -Dtests.timezone=Africa/Nouakchott -Dtests.asserts=true -Dtests.file.encoding=US-ASCII
   [junit4] FAILURE 21.4s J1 | ChaosMonkeySafeLeaderTest.test <<<
   [junit4]    > Throwable #1: java.lang.AssertionError: expected:<0> but was:<1>
   [junit4]    > 	at __randomizedtesting.SeedInfo.seed([29C350392312E065:A1976FE38DEE8D9D]:0)
   [junit4]    > 	at org.apache.solr.cloud.ChaosMonkeySafeLeaderTest.test(ChaosMonkeySafeLeaderTest.java:156)
   [junit4]    > 	at org.apache.solr.BaseDistributedSearchTestCase$ShardsRepeatRule$ShardsFixedStatement.callStatement(BaseDistributedSearchTestCase.java:966)
   [junit4]    > 	at org.apache.solr.BaseDistributedSearchTestCase$ShardsRepeatRule$ShardsStatement.evaluate(BaseDistributedSearchTestCase.java:941)
   [junit4]    > 	at java.lang.Thread.run(Thread.java:745)
   [junit4]   2> 819838 INFO  (SUITE-ChaosMonkeySafeLeaderTest-seed#[29C350392312E065]-worker) [n:127.0.0.1:44147_ c:collection1 s:shard2 r:core_node3 x:collection1] o.a.s.SolrTestCaseJ4 ###deleteCore
   [junit4]   2> NOTE: leaving temporary files on disk at: /x1/jenkins/jenkins-slave/workspace/Lucene-Solr-Tests-trunk-Java8/solr/build/solr-core/test/J1/temp/solr.cloud.ChaosMonkeySafeLeaderTest_29C350392312E065-001
   [junit4]   2> Aug 03, 2015 10:43:15 AM com.carrotsearch.randomizedtesting.ThreadLeakControl checkThreadLeaks
   [junit4]   2> WARNING: Will linger awaiting termination of 1 leaked thread(s).
   [junit4]   2> NOTE: test params are: codec=CheapBastard, sim=DefaultSimilarity, locale=sr, timezone=Africa/Nouakchott
   [junit4]   2> NOTE: Linux 3.13.0-52-generic amd64/Oracle Corporation 1.8.0_45 (64-bit)/cpus=4,threads=1,free=169706224,total=520617984
   [junit4]   2> NOTE: All tests run in this JVM: [DistributedVersionInfoTest, CustomCollectionTest, RankQueryTest, TestRestManager, TestFileDictionaryLookup, TestSchemaNameResource, TestSimpleQParserPlugin, DocValuesMultiTest, TestRequestStatusCollectionAPI, SegmentsInfoRequestHandlerTest, TestCharFilters, TestManagedSchema, AnalysisAfterCoreReloadTest, TestConfigSets, TestCloudInspectUtil, OverseerRolesTest, TestRebalanceLeaders, TestUniqueKeyFieldResource, JsonLoaderTest, TestFastLRUCache, TestNRTOpen, UpdateParamsTest, SolrTestCaseJ4Test, SolrCmdDistributorTest, RecoveryAfterSoftCommitTest, SolrCloudExampleTest, TestSearchPerf, DistributedExpandComponentTest, TestLFUCache, HdfsThreadLeakTest, TestDistributedStatsComponentCardinality, ResourceLoaderTest, TestClusterStateMutator, DistribJoinFromCollectionTest, RAMDirectoryFactoryTest, FieldMutatingUpdateProcessorTest, DeleteLastCustomShardedReplicaTest, ChangedSchemaMergeTest, NoCacheHeaderTest, ShowFileRequestHandlerTest, TestJsonFacets, TestSchemaSimilarityResource, ShardRoutingTest, ShardRoutingCustomTest, TestCoreContainer, TestCollapseQParserPlugin, WordBreakSolrSpellCheckerTest, CopyFieldTest, DisMaxRequestHandlerTest, TestRTGBase, SpatialFilterTest, TestFiltering, PreAnalyzedFieldTest, TestAtomicUpdateErrorCases, TestClassNameShortening, BasicFunctionalityTest, DocumentAnalysisRequestHandlerTest, TestLMDirichletSimilarityFactory, TestAnalyzedSuggestions, ZkSolrClientTest, ZkCLITest, DistanceUnitsTest, TestMiniSolrCloudCluster, EchoParamsTest, BJQParserTest, TestOmitPositions, SharedFSAutoReplicaFailoverUtilsTest, TestManagedSynonymFilterFactory, TestPHPSerializedResponseWriter, TestInitQParser, HdfsUnloadDistributedZkTest, ChaosMonkeySafeLeaderTest]
   [junit4] Completed [198/529] on J1 in 22.45s, 1 test, 1 failure <<< FAILURES!

[...truncated 1054 lines...]
BUILD FAILED
/x1/jenkins/jenkins-slave/workspace/Lucene-Solr-Tests-trunk-Java8/build.xml:716: The following error occurred while executing this line:
/x1/jenkins/jenkins-slave/workspace/Lucene-Solr-Tests-trunk-Java8/build.xml:660: The following error occurred while executing this line:
/x1/jenkins/jenkins-slave/workspace/Lucene-Solr-Tests-trunk-Java8/build.xml:59: The following error occurred while executing this line:
/x1/jenkins/jenkins-slave/workspace/Lucene-Solr-Tests-trunk-Java8/solr/build.xml:230: The following error occurred while executing this line:
/x1/jenkins/jenkins-slave/workspace/Lucene-Solr-Tests-trunk-Java8/solr/common-build.xml:514: The following error occurred while executing this line:
/x1/jenkins/jenkins-slave/workspace/Lucene-Solr-Tests-trunk-Java8/lucene/common-build.xml:1429: The following error occurred while executing this line:
/x1/jenkins/jenkins-slave/workspace/Lucene-Solr-Tests-trunk-Java8/lucene/common-build.xml:984: There were test failures: 529 suites, 2093 tests, 1 failure, 41 ignored (30 assumptions)

Total time: 58 minutes 41 seconds
Build step 'Invoke Ant' marked build as failure
Archiving artifacts
Sending artifact delta relative to Lucene-Solr-Tests-trunk-Java8 #255
Archived 4 artifacts
Archive block size is 32768
Received 0 blocks and 309141873 bytes
Compression is 0.0%
Took 1 min 5 sec
Recording test results
Email was triggered for: Failure
Sending email for trigger: Failure



Mime
View raw message