lucene-dev mailing list archives

Site index · List index
Message view « Date » · « Thread »
Top « Date » · « Thread »
From Policeman Jenkins Server <jenk...@thetaphi.de>
Subject [JENKINS] Lucene-Solr-5.x-Windows (64bit/jdk1.7.0_80) - Build # 4968 - Failure!
Date Sun, 02 Aug 2015 17:45:01 GMT
Build: http://jenkins.thetaphi.de/job/Lucene-Solr-5.x-Windows/4968/
Java: 64bit/jdk1.7.0_80 -XX:-UseCompressedOops -XX:+UseG1GC

1 tests failed.
FAILED:  junit.framework.TestSuite.org.apache.solr.common.cloud.TestZkConfigManager

Error Message:
Clean up static fields (in @AfterClass?), your test seems to hang on to approximately 111,154,976
bytes (threshold is 10,485,760). Field reference sizes (counted individually):   - 7,469,816
bytes, private static org.apache.solr.cloud.ZkTestServer org.apache.solr.common.cloud.TestZkConfigManager.zkServer
  - 400 bytes, protected static java.lang.String org.apache.solr.SolrTestCaseJ4.testSolrHome
  - 328 bytes, public static org.junit.rules.TestRule org.apache.solr.SolrTestCaseJ4.solrClassRules
  - 144 bytes, private static java.lang.String org.apache.solr.SolrTestCaseJ4.factoryProp
  - 80 bytes, private static java.lang.String org.apache.solr.SolrTestCaseJ4.coreName

Stack Trace:
junit.framework.AssertionFailedError: Clean up static fields (in @AfterClass?), your test
seems to hang on to approximately 111,154,976 bytes (threshold is 10,485,760). Field reference
sizes (counted individually):
  - 7,469,816 bytes, private static org.apache.solr.cloud.ZkTestServer org.apache.solr.common.cloud.TestZkConfigManager.zkServer
  - 400 bytes, protected static java.lang.String org.apache.solr.SolrTestCaseJ4.testSolrHome
  - 328 bytes, public static org.junit.rules.TestRule org.apache.solr.SolrTestCaseJ4.solrClassRules
  - 144 bytes, private static java.lang.String org.apache.solr.SolrTestCaseJ4.factoryProp
  - 80 bytes, private static java.lang.String org.apache.solr.SolrTestCaseJ4.coreName
	at __randomizedtesting.SeedInfo.seed([8696DB8E4F0387EC]:0)
	at com.carrotsearch.randomizedtesting.rules.StaticFieldsInvariantRule$1.afterAlways(StaticFieldsInvariantRule.java:127)
	at com.carrotsearch.randomizedtesting.rules.StatementAdapter.evaluate(StatementAdapter.java:43)
	at com.carrotsearch.randomizedtesting.rules.StatementAdapter.evaluate(StatementAdapter.java:36)
	at com.carrotsearch.randomizedtesting.rules.StatementAdapter.evaluate(StatementAdapter.java:36)
	at org.apache.lucene.util.TestRuleAssertionsRequired$1.evaluate(TestRuleAssertionsRequired.java:54)
	at org.apache.lucene.util.TestRuleMarkFailure$1.evaluate(TestRuleMarkFailure.java:48)
	at org.apache.lucene.util.TestRuleIgnoreAfterMaxFailures$1.evaluate(TestRuleIgnoreAfterMaxFailures.java:65)
	at org.apache.lucene.util.TestRuleIgnoreTestSuites$1.evaluate(TestRuleIgnoreTestSuites.java:55)
	at com.carrotsearch.randomizedtesting.rules.StatementAdapter.evaluate(StatementAdapter.java:36)
	at com.carrotsearch.randomizedtesting.ThreadLeakControl$StatementRunner.run(ThreadLeakControl.java:365)
	at java.lang.Thread.run(Thread.java:745)




Build Log:
[...truncated 12180 lines...]
   [junit4] Suite: org.apache.solr.common.cloud.TestZkConfigManager
   [junit4]   2> Creating dataDir: C:\Users\JenkinsSlave\workspace\Lucene-Solr-5.x-Windows\solr\build\solr-solrj\test\J1\temp\solr.common.cloud.TestZkConfigManager_8696DB8E4F0387EC-001\init-core-data-001
   [junit4]   2> 196677 INFO  (SUITE-TestZkConfigManager-seed#[8696DB8E4F0387EC]-worker)
[    ] o.a.s.SolrTestCaseJ4 Randomized ssl (false) and clientAuth (false)
   [junit4]   2> 196677 INFO  (SUITE-TestZkConfigManager-seed#[8696DB8E4F0387EC]-worker)
[    ] o.a.s.c.ZkTestServer STARTING ZK TEST SERVER
   [junit4]   2> 196678 INFO  (Thread-433) [    ] o.a.s.c.ZkTestServer client port:0.0.0.0/0.0.0.0:0
   [junit4]   2> 196678 INFO  (Thread-433) [    ] o.a.s.c.ZkTestServer Starting server
   [junit4]   2> 196761 INFO  (SUITE-TestZkConfigManager-seed#[8696DB8E4F0387EC]-worker)
[    ] o.a.s.c.ZkTestServer start zk server on port:49192
   [junit4]   2> 196763 INFO  (TEST-TestZkConfigManager.testUploadConfig-seed#[8696DB8E4F0387EC])
[    ] o.a.s.SolrTestCaseJ4 ###Starting testUploadConfig
   [junit4]   2> 196763 INFO  (TEST-TestZkConfigManager.testUploadConfig-seed#[8696DB8E4F0387EC])
[    ] o.a.s.c.c.SolrZkClient Using default ZkCredentialsProvider
   [junit4]   2> 196765 INFO  (TEST-TestZkConfigManager.testUploadConfig-seed#[8696DB8E4F0387EC])
[    ] o.a.s.c.c.ConnectionManager Waiting for client to connect to ZooKeeper
   [junit4]   2> 196768 INFO  (zkCallback-273-thread-1) [    ] o.a.s.c.c.ConnectionManager
Watcher org.apache.solr.common.cloud.ConnectionManager@735fd796 name:ZooKeeperConnection Watcher:127.0.0.1:49192
got event WatchedEvent state:SyncConnected type:None path:null path:null type:None
   [junit4]   2> 196769 INFO  (TEST-TestZkConfigManager.testUploadConfig-seed#[8696DB8E4F0387EC])
[    ] o.a.s.c.c.ConnectionManager Client is connected to ZooKeeper
   [junit4]   2> 196769 INFO  (TEST-TestZkConfigManager.testUploadConfig-seed#[8696DB8E4F0387EC])
[    ] o.a.s.c.c.SolrZkClient Using default ZkACLProvider
   [junit4]   2> 196769 INFO  (TEST-TestZkConfigManager.testUploadConfig-seed#[8696DB8E4F0387EC])
[    ] o.a.s.c.c.SolrZkClient makePath: /solr
   [junit4]   2> 196773 INFO  (TEST-TestZkConfigManager.testUploadConfig-seed#[8696DB8E4F0387EC])
[    ] o.a.s.c.c.SolrZkClient Using default ZkCredentialsProvider
   [junit4]   2> 196774 INFO  (TEST-TestZkConfigManager.testUploadConfig-seed#[8696DB8E4F0387EC])
[    ] o.a.s.c.c.ConnectionManager Waiting for client to connect to ZooKeeper
   [junit4]   2> 196775 INFO  (zkCallback-274-thread-1) [    ] o.a.s.c.c.ConnectionManager
Watcher org.apache.solr.common.cloud.ConnectionManager@2ffbbad0 name:ZooKeeperConnection Watcher:127.0.0.1:49192/solr
got event WatchedEvent state:SyncConnected type:None path:null path:null type:None
   [junit4]   2> 196775 INFO  (TEST-TestZkConfigManager.testUploadConfig-seed#[8696DB8E4F0387EC])
[    ] o.a.s.c.c.ConnectionManager Client is connected to ZooKeeper
   [junit4]   2> 196775 INFO  (TEST-TestZkConfigManager.testUploadConfig-seed#[8696DB8E4F0387EC])
[    ] o.a.s.c.c.SolrZkClient Using default ZkACLProvider
   [junit4]   2> 196793 INFO  (TEST-TestZkConfigManager.testUploadConfig-seed#[8696DB8E4F0387EC])
[    ] o.a.s.c.c.SolrZkClient makePath: /configs/testconfig/subdir/file3
   [junit4]   2> 196798 INFO  (TEST-TestZkConfigManager.testUploadConfig-seed#[8696DB8E4F0387EC])
[    ] o.a.s.c.c.SolrZkClient makePath: /configs/testconfig/file1
   [junit4]   2> 196801 INFO  (TEST-TestZkConfigManager.testUploadConfig-seed#[8696DB8E4F0387EC])
[    ] o.a.s.c.c.SolrZkClient makePath: /configs/testconfig/file2
   [junit4]   2> 196824 INFO  (TEST-TestZkConfigManager.testUploadConfig-seed#[8696DB8E4F0387EC])
[    ] o.a.s.c.c.ZkConfigManager Writing file C:\Users\JenkinsSlave\workspace\Lucene-Solr-5.x-Windows\solr\build\solr-solrj\test\J1\temp\solr.common.cloud.TestZkConfigManager_8696DB8E4F0387EC-001\download-001\file1
   [junit4]   2> 196826 INFO  (TEST-TestZkConfigManager.testUploadConfig-seed#[8696DB8E4F0387EC])
[    ] o.a.s.c.c.ZkConfigManager Writing file C:\Users\JenkinsSlave\workspace\Lucene-Solr-5.x-Windows\solr\build\solr-solrj\test\J1\temp\solr.common.cloud.TestZkConfigManager_8696DB8E4F0387EC-001\download-001\file2
   [junit4]   2> 196828 INFO  (TEST-TestZkConfigManager.testUploadConfig-seed#[8696DB8E4F0387EC])
[    ] o.a.s.c.c.ZkConfigManager Writing file C:\Users\JenkinsSlave\workspace\Lucene-Solr-5.x-Windows\solr\build\solr-solrj\test\J1\temp\solr.common.cloud.TestZkConfigManager_8696DB8E4F0387EC-001\download-001\subdir\file3
   [junit4]   2> 196836 INFO  (TEST-TestZkConfigManager.testUploadConfig-seed#[8696DB8E4F0387EC])
[    ] o.a.s.c.c.SolrZkClient makePath: /configs/testconfig/subdir/file3
   [junit4]   2> 196842 INFO  (TEST-TestZkConfigManager.testUploadConfig-seed#[8696DB8E4F0387EC])
[    ] o.a.s.c.c.SolrZkClient makePath: /configs/testconfig/file1
   [junit4]   2> 196846 INFO  (TEST-TestZkConfigManager.testUploadConfig-seed#[8696DB8E4F0387EC])
[    ] o.a.s.c.c.SolrZkClient makePath: /configs/testconfig/file2
   [junit4]   2> 196850 INFO  (TEST-TestZkConfigManager.testUploadConfig-seed#[8696DB8E4F0387EC])
[    ] o.a.s.c.c.ZkConfigManager Writing file C:\Users\JenkinsSlave\workspace\Lucene-Solr-5.x-Windows\solr\build\solr-solrj\test\J1\temp\solr.common.cloud.TestZkConfigManager_8696DB8E4F0387EC-001\download2-001\file1
   [junit4]   2> 196851 INFO  (TEST-TestZkConfigManager.testUploadConfig-seed#[8696DB8E4F0387EC])
[    ] o.a.s.c.c.ZkConfigManager Writing file C:\Users\JenkinsSlave\workspace\Lucene-Solr-5.x-Windows\solr\build\solr-solrj\test\J1\temp\solr.common.cloud.TestZkConfigManager_8696DB8E4F0387EC-001\download2-001\file2
   [junit4]   2> 196854 INFO  (TEST-TestZkConfigManager.testUploadConfig-seed#[8696DB8E4F0387EC])
[    ] o.a.s.c.c.ZkConfigManager Writing file C:\Users\JenkinsSlave\workspace\Lucene-Solr-5.x-Windows\solr\build\solr-solrj\test\J1\temp\solr.common.cloud.TestZkConfigManager_8696DB8E4F0387EC-001\download2-001\subdir\file3
   [junit4]   2> 196855 INFO  (TEST-TestZkConfigManager.testUploadConfig-seed#[8696DB8E4F0387EC])
[    ] o.a.s.c.c.SolrZkClient makePath: /configs/config2/subdir/file3
   [junit4]   2> 196859 INFO  (TEST-TestZkConfigManager.testUploadConfig-seed#[8696DB8E4F0387EC])
[    ] o.a.s.c.c.SolrZkClient makePath: /configs/config2/file1
   [junit4]   2> 196862 INFO  (TEST-TestZkConfigManager.testUploadConfig-seed#[8696DB8E4F0387EC])
[    ] o.a.s.c.c.SolrZkClient makePath: /configs/config2/file2
   [junit4]   2> 196865 INFO  (TEST-TestZkConfigManager.testUploadConfig-seed#[8696DB8E4F0387EC])
[    ] o.a.s.SolrTestCaseJ4 ###Ending testUploadConfig
   [junit4]   2> 196866 INFO  (TEST-TestZkConfigManager.testUploadWithACL-seed#[8696DB8E4F0387EC])
[    ] o.a.s.SolrTestCaseJ4 ###Starting testUploadWithACL
   [junit4]   2> 196866 INFO  (TEST-TestZkConfigManager.testUploadWithACL-seed#[8696DB8E4F0387EC])
[    ] o.a.s.c.c.SolrZkClient Using default ZkCredentialsProvider
   [junit4]   2> 196868 INFO  (TEST-TestZkConfigManager.testUploadWithACL-seed#[8696DB8E4F0387EC])
[    ] o.a.s.c.c.ConnectionManager Waiting for client to connect to ZooKeeper
   [junit4]   2> 196871 INFO  (zkCallback-275-thread-1) [    ] o.a.s.c.c.ConnectionManager
Watcher org.apache.solr.common.cloud.ConnectionManager@7639c6b3 name:ZooKeeperConnection Watcher:127.0.0.1:49192
got event WatchedEvent state:SyncConnected type:None path:null path:null type:None
   [junit4]   2> 196871 INFO  (TEST-TestZkConfigManager.testUploadWithACL-seed#[8696DB8E4F0387EC])
[    ] o.a.s.c.c.ConnectionManager Client is connected to ZooKeeper
   [junit4]   2> 196871 INFO  (TEST-TestZkConfigManager.testUploadWithACL-seed#[8696DB8E4F0387EC])
[    ] o.a.s.c.c.SolrZkClient Using default ZkACLProvider
   [junit4]   2> 196871 INFO  (TEST-TestZkConfigManager.testUploadWithACL-seed#[8696DB8E4F0387EC])
[    ] o.a.s.c.c.SolrZkClient makePath: /acl
   [junit4]   2> 196877 INFO  (zkCallback-276-thread-1) [    ] o.a.s.c.c.ConnectionManager
Watcher org.apache.solr.common.cloud.ConnectionManager@469ff870 name:ZooKeeperConnection Watcher:127.0.0.1:49192/acl
got event WatchedEvent state:SyncConnected type:None path:null path:null type:None
   [junit4]   2> 196880 INFO  (TEST-TestZkConfigManager.testUploadWithACL-seed#[8696DB8E4F0387EC])
[    ] o.a.s.c.c.ConnectionManager Waiting for client to connect to ZooKeeper
   [junit4]   2> 196880 INFO  (TEST-TestZkConfigManager.testUploadWithACL-seed#[8696DB8E4F0387EC])
[    ] o.a.s.c.c.ConnectionManager Client is connected to ZooKeeper
   [junit4]   2> 196882 INFO  (TEST-TestZkConfigManager.testUploadWithACL-seed#[8696DB8E4F0387EC])
[    ] o.a.s.c.c.SolrZkClient makePath: /configs/acltest/file1
   [junit4]   2> 196896 INFO  (TEST-TestZkConfigManager.testUploadWithACL-seed#[8696DB8E4F0387EC])
[    ] o.a.s.c.c.ConnectionManager Waiting for client to connect to ZooKeeper
   [junit4]   2> 196897 INFO  (zkCallback-277-thread-1) [    ] o.a.s.c.c.ConnectionManager
Watcher org.apache.solr.common.cloud.ConnectionManager@7d128aaf name:ZooKeeperConnection Watcher:127.0.0.1:49192/acl
got event WatchedEvent state:SyncConnected type:None path:null path:null type:None
   [junit4]   2> 196897 INFO  (TEST-TestZkConfigManager.testUploadWithACL-seed#[8696DB8E4F0387EC])
[    ] o.a.s.c.c.ConnectionManager Client is connected to ZooKeeper
   [junit4]   2> 196898 INFO  (TEST-TestZkConfigManager.testUploadWithACL-seed#[8696DB8E4F0387EC])
[    ] o.a.s.c.c.SolrZkClient makePath: /configs/acltest2/file1
   [junit4]   2> 196902 INFO  (TEST-TestZkConfigManager.testUploadWithACL-seed#[8696DB8E4F0387EC])
[    ] o.a.s.c.c.SolrZkClient Using default ZkCredentialsProvider
   [junit4]   2> 196903 INFO  (TEST-TestZkConfigManager.testUploadWithACL-seed#[8696DB8E4F0387EC])
[    ] o.a.s.c.c.ConnectionManager Waiting for client to connect to ZooKeeper
   [junit4]   2> 196904 INFO  (zkCallback-278-thread-1) [    ] o.a.s.c.c.ConnectionManager
Watcher org.apache.solr.common.cloud.ConnectionManager@4b129eec name:ZooKeeperConnection Watcher:127.0.0.1:49192/acl
got event WatchedEvent state:SyncConnected type:None path:null path:null type:None
   [junit4]   2> 196905 INFO  (TEST-TestZkConfigManager.testUploadWithACL-seed#[8696DB8E4F0387EC])
[    ] o.a.s.c.c.ConnectionManager Client is connected to ZooKeeper
   [junit4]   2> 196905 INFO  (TEST-TestZkConfigManager.testUploadWithACL-seed#[8696DB8E4F0387EC])
[    ] o.a.s.c.c.SolrZkClient Using default ZkACLProvider
   [junit4]   2> 196906 INFO  (TEST-TestZkConfigManager.testUploadWithACL-seed#[8696DB8E4F0387EC])
[    ] o.a.s.SolrTestCaseJ4 ###Ending testUploadWithACL
   [junit4]   2> 196906 INFO  (SUITE-TestZkConfigManager-seed#[8696DB8E4F0387EC]-worker)
[    ] o.a.s.c.ZkTestServer connecting to 127.0.0.1:49192 49192
   [junit4]   2> 198786 INFO  (Thread-433) [    ] o.a.s.c.ZkTestServer connecting to 127.0.0.1:49192
49192
   [junit4]   2> 198787 INFO  (SUITE-TestZkConfigManager-seed#[8696DB8E4F0387EC]-worker)
[    ] o.a.s.SolrTestCaseJ4 ###deleteCore
   [junit4]   2> NOTE: test params are: codec=Asserting(Lucene53): {}, docValues:{}, sim=DefaultSimilarity,
locale=mk, timezone=PST8PDT
   [junit4]   2> NOTE: Windows 7 6.1 amd64/Oracle Corporation 1.7.0_80 (64-bit)/cpus=3,threads=1,free=209459296,total=536870912
   [junit4]   2> NOTE: All tests run in this JVM: [TestDateUtil, TestCloudSolrClientConnections,
TestFastInputStream, LargeVolumeBinaryJettyTest, MergeIndexesEmbeddedTest, SolrPingTest, QueryResponseTest,
GetByIdTest, SolrExampleJettyTest, IteratorChainTest, TestRetryUtil, CloudSolrClientTest,
StreamExpressionParserTest, TestNamedListCodec, AnlysisResponseBaseTest, ExternalHttpClientTest,
StreamExpressionToExpessionTest, StreamingTest, TestClusteringResponse, TestZkConfigManager]
   [junit4]   2> NOTE: reproduce with: ant test  -Dtestcase=TestZkConfigManager -Dtests.seed=8696DB8E4F0387EC
-Dtests.slow=true -Dtests.locale=mk -Dtests.timezone=PST8PDT -Dtests.asserts=true -Dtests.file.encoding=UTF-8
   [junit4] ERROR   0.00s J1 | TestZkConfigManager (suite) <<<
   [junit4]    > Throwable #1: junit.framework.AssertionFailedError: Clean up static fields
(in @AfterClass?), your test seems to hang on to approximately 111,154,976 bytes (threshold
is 10,485,760). Field reference sizes (counted individually):
   [junit4]    >   - 7,469,816 bytes, private static org.apache.solr.cloud.ZkTestServer
org.apache.solr.common.cloud.TestZkConfigManager.zkServer
   [junit4]    >   - 400 bytes, protected static java.lang.String org.apache.solr.SolrTestCaseJ4.testSolrHome
   [junit4]    >   - 328 bytes, public static org.junit.rules.TestRule org.apache.solr.SolrTestCaseJ4.solrClassRules
   [junit4]    >   - 144 bytes, private static java.lang.String org.apache.solr.SolrTestCaseJ4.factoryProp
   [junit4]    >   - 80 bytes, private static java.lang.String org.apache.solr.SolrTestCaseJ4.coreName
   [junit4]    > 	at __randomizedtesting.SeedInfo.seed([8696DB8E4F0387EC]:0)
   [junit4]    > 	at java.lang.Thread.run(Thread.java:745)
   [junit4] Completed [61/65] on J1 in 3.96s, 2 tests, 1 failure <<< FAILURES!

[...truncated 22 lines...]
BUILD FAILED
C:\Users\JenkinsSlave\workspace\Lucene-Solr-5.x-Windows\build.xml:726: The following error
occurred while executing this line:
C:\Users\JenkinsSlave\workspace\Lucene-Solr-5.x-Windows\build.xml:670: The following error
occurred while executing this line:
C:\Users\JenkinsSlave\workspace\Lucene-Solr-5.x-Windows\build.xml:59: The following error
occurred while executing this line:
C:\Users\JenkinsSlave\workspace\Lucene-Solr-5.x-Windows\solr\build.xml:243: The following
error occurred while executing this line:
C:\Users\JenkinsSlave\workspace\Lucene-Solr-5.x-Windows\solr\common-build.xml:524: The following
error occurred while executing this line:
C:\Users\JenkinsSlave\workspace\Lucene-Solr-5.x-Windows\lucene\common-build.xml:1449: The
following error occurred while executing this line:
C:\Users\JenkinsSlave\workspace\Lucene-Solr-5.x-Windows\lucene\common-build.xml:1003: There
were test failures: 65 suites, 455 tests, 1 suite-level error

Total time: 81 minutes 16 seconds
Build step 'Invoke Ant' marked build as failure
Archiving artifacts
Recording test results
Email was triggered for: Failure - Any
Sending email for trigger: Failure - Any



Mime
View raw message