lucene-dev mailing list archives

Site index · List index
Message view « Date » · « Thread »
Top « Date » · « Thread »
From Policeman Jenkins Server <jenk...@thetaphi.de>
Subject [JENKINS-EA] Lucene-Solr-trunk-Linux (32bit/jdk1.9.0-ea-b60) - Build # 13717 - Failure!
Date Mon, 03 Aug 2015 16:01:32 GMT
Build: http://jenkins.thetaphi.de/job/Lucene-Solr-trunk-Linux/13717/
Java: 32bit/jdk1.9.0-ea-b60 -server -XX:+UseSerialGC -Djava.locale.providers=JRE,SPI

1 tests failed.
FAILED:  org.apache.solr.cloud.CdcrReplicationDistributedZkTest.doTests

Error Message:
Timeout while trying to assert update logs @ collection=source_collection

Stack Trace:
java.lang.AssertionError: Timeout while trying to assert update logs @ collection=source_collection
	at __randomizedtesting.SeedInfo.seed([9B17B83096A8FC9A:9377CD1C99A6D491]:0)
	at org.apache.solr.cloud.CdcrReplicationDistributedZkTest.assertNumberOfTlogFiles(CdcrReplicationDistributedZkTest.java:644)
	at org.apache.solr.cloud.CdcrReplicationDistributedZkTest.doTestUpdateLogSynchronisation(CdcrReplicationDistributedZkTest.java:384)
	at org.apache.solr.cloud.CdcrReplicationDistributedZkTest.doTests(CdcrReplicationDistributedZkTest.java:50)
	at sun.reflect.NativeMethodAccessorImpl.invoke0(Native Method)
	at sun.reflect.NativeMethodAccessorImpl.invoke(NativeMethodAccessorImpl.java:62)
	at sun.reflect.DelegatingMethodAccessorImpl.invoke(DelegatingMethodAccessorImpl.java:43)
	at java.lang.reflect.Method.invoke(Method.java:502)
	at com.carrotsearch.randomizedtesting.RandomizedRunner.invoke(RandomizedRunner.java:1627)
	at com.carrotsearch.randomizedtesting.RandomizedRunner$6.evaluate(RandomizedRunner.java:836)
	at com.carrotsearch.randomizedtesting.RandomizedRunner$7.evaluate(RandomizedRunner.java:872)
	at com.carrotsearch.randomizedtesting.RandomizedRunner$8.evaluate(RandomizedRunner.java:886)
	at org.apache.solr.BaseDistributedSearchTestCase$ShardsRepeatRule$ShardsFixedStatement.callStatement(BaseDistributedSearchTestCase.java:966)
	at org.apache.solr.BaseDistributedSearchTestCase$ShardsRepeatRule$ShardsStatement.evaluate(BaseDistributedSearchTestCase.java:941)
	at com.carrotsearch.randomizedtesting.rules.SystemPropertiesRestoreRule$1.evaluate(SystemPropertiesRestoreRule.java:57)
	at org.apache.lucene.util.TestRuleSetupTeardownChained$1.evaluate(TestRuleSetupTeardownChained.java:50)
	at org.apache.lucene.util.AbstractBeforeAfterRule$1.evaluate(AbstractBeforeAfterRule.java:46)
	at org.apache.lucene.util.TestRuleThreadAndTestName$1.evaluate(TestRuleThreadAndTestName.java:49)
	at org.apache.lucene.util.TestRuleIgnoreAfterMaxFailures$1.evaluate(TestRuleIgnoreAfterMaxFailures.java:65)
	at org.apache.lucene.util.TestRuleMarkFailure$1.evaluate(TestRuleMarkFailure.java:48)
	at com.carrotsearch.randomizedtesting.rules.StatementAdapter.evaluate(StatementAdapter.java:36)
	at com.carrotsearch.randomizedtesting.ThreadLeakControl$StatementRunner.run(ThreadLeakControl.java:365)
	at com.carrotsearch.randomizedtesting.ThreadLeakControl.forkTimeoutingTask(ThreadLeakControl.java:798)
	at com.carrotsearch.randomizedtesting.ThreadLeakControl$3.evaluate(ThreadLeakControl.java:458)
	at com.carrotsearch.randomizedtesting.RandomizedRunner.runSingleTest(RandomizedRunner.java:845)
	at com.carrotsearch.randomizedtesting.RandomizedRunner$3.evaluate(RandomizedRunner.java:747)
	at com.carrotsearch.randomizedtesting.RandomizedRunner$4.evaluate(RandomizedRunner.java:781)
	at com.carrotsearch.randomizedtesting.RandomizedRunner$5.evaluate(RandomizedRunner.java:792)
	at com.carrotsearch.randomizedtesting.rules.StatementAdapter.evaluate(StatementAdapter.java:36)
	at com.carrotsearch.randomizedtesting.rules.SystemPropertiesRestoreRule$1.evaluate(SystemPropertiesRestoreRule.java:57)
	at org.apache.lucene.util.AbstractBeforeAfterRule$1.evaluate(AbstractBeforeAfterRule.java:46)
	at com.carrotsearch.randomizedtesting.rules.StatementAdapter.evaluate(StatementAdapter.java:36)
	at org.apache.lucene.util.TestRuleStoreClassName$1.evaluate(TestRuleStoreClassName.java:42)
	at com.carrotsearch.randomizedtesting.rules.NoShadowingOrOverridesOnMethodsRule$1.evaluate(NoShadowingOrOverridesOnMethodsRule.java:39)
	at com.carrotsearch.randomizedtesting.rules.NoShadowingOrOverridesOnMethodsRule$1.evaluate(NoShadowingOrOverridesOnMethodsRule.java:39)
	at com.carrotsearch.randomizedtesting.rules.StatementAdapter.evaluate(StatementAdapter.java:36)
	at com.carrotsearch.randomizedtesting.rules.StatementAdapter.evaluate(StatementAdapter.java:36)
	at com.carrotsearch.randomizedtesting.rules.StatementAdapter.evaluate(StatementAdapter.java:36)
	at org.apache.lucene.util.TestRuleAssertionsRequired$1.evaluate(TestRuleAssertionsRequired.java:54)
	at org.apache.lucene.util.TestRuleMarkFailure$1.evaluate(TestRuleMarkFailure.java:48)
	at org.apache.lucene.util.TestRuleIgnoreAfterMaxFailures$1.evaluate(TestRuleIgnoreAfterMaxFailures.java:65)
	at org.apache.lucene.util.TestRuleIgnoreTestSuites$1.evaluate(TestRuleIgnoreTestSuites.java:55)
	at com.carrotsearch.randomizedtesting.rules.StatementAdapter.evaluate(StatementAdapter.java:36)
	at com.carrotsearch.randomizedtesting.ThreadLeakControl$StatementRunner.run(ThreadLeakControl.java:365)
	at java.lang.Thread.run(Thread.java:745)
Caused by: java.lang.AssertionError: Number of tlogs on replica: 67 is superior to: 50.
	at org.junit.Assert.fail(Assert.java:93)
	at org.junit.Assert.assertTrue(Assert.java:43)
	at org.apache.solr.cloud.CdcrReplicationDistributedZkTest._assertNumberOfTlogFiles(CdcrReplicationDistributedZkTest.java:674)
	at org.apache.solr.cloud.CdcrReplicationDistributedZkTest.assertNumberOfTlogFiles(CdcrReplicationDistributedZkTest.java:634)
	... 43 more




Build Log:
[...truncated 10925 lines...]
   [junit4] Suite: org.apache.solr.cloud.CdcrReplicationDistributedZkTest
   [junit4]   2> Creating dataDir: /home/jenkins/workspace/Lucene-Solr-trunk-Linux/solr/build/solr-core/test/J1/temp/solr.cloud.CdcrReplicationDistributedZkTest_9B17B83096A8FC9A-001/init-core-data-001
   [junit4]   2> 910829 INFO  (SUITE-CdcrReplicationDistributedZkTest-seed#[9B17B83096A8FC9A]-worker) [    ] o.a.s.SolrTestCaseJ4 Randomized ssl (false) and clientAuth (true)
   [junit4]   2> 910829 INFO  (SUITE-CdcrReplicationDistributedZkTest-seed#[9B17B83096A8FC9A]-worker) [    ] o.a.s.BaseDistributedSearchTestCase Setting hostContext system property: /vy_/xq
   [junit4]   2> 910831 INFO  (TEST-CdcrReplicationDistributedZkTest.doTests-seed#[9B17B83096A8FC9A]) [    ] o.a.s.c.ZkTestServer STARTING ZK TEST SERVER
   [junit4]   2> 910831 INFO  (Thread-2984) [    ] o.a.s.c.ZkTestServer client port:0.0.0.0/0.0.0.0:0
   [junit4]   2> 910831 INFO  (Thread-2984) [    ] o.a.s.c.ZkTestServer Starting server
   [junit4]   2> 910931 INFO  (TEST-CdcrReplicationDistributedZkTest.doTests-seed#[9B17B83096A8FC9A]) [    ] o.a.s.c.ZkTestServer start zk server on port:46098
   [junit4]   2> 910931 INFO  (TEST-CdcrReplicationDistributedZkTest.doTests-seed#[9B17B83096A8FC9A]) [    ] o.a.s.c.c.SolrZkClient Using default ZkCredentialsProvider
   [junit4]   2> 910932 INFO  (TEST-CdcrReplicationDistributedZkTest.doTests-seed#[9B17B83096A8FC9A]) [    ] o.a.s.c.c.ConnectionManager Waiting for client to connect to ZooKeeper
   [junit4]   2> 910933 INFO  (zkCallback-908-thread-1) [    ] o.a.s.c.c.ConnectionManager Watcher org.apache.solr.common.cloud.ConnectionManager@e2bcb3 name:ZooKeeperConnection Watcher:127.0.0.1:46098 got event WatchedEvent state:SyncConnected type:None path:null path:null type:None
   [junit4]   2> 910934 INFO  (TEST-CdcrReplicationDistributedZkTest.doTests-seed#[9B17B83096A8FC9A]) [    ] o.a.s.c.c.ConnectionManager Client is connected to ZooKeeper
   [junit4]   2> 910934 INFO  (TEST-CdcrReplicationDistributedZkTest.doTests-seed#[9B17B83096A8FC9A]) [    ] o.a.s.c.c.SolrZkClient Using default ZkACLProvider
   [junit4]   2> 910934 INFO  (TEST-CdcrReplicationDistributedZkTest.doTests-seed#[9B17B83096A8FC9A]) [    ] o.a.s.c.c.SolrZkClient makePath: /solr
   [junit4]   2> 910936 INFO  (TEST-CdcrReplicationDistributedZkTest.doTests-seed#[9B17B83096A8FC9A]) [    ] o.a.s.c.c.SolrZkClient Using default ZkCredentialsProvider
   [junit4]   2> 910936 INFO  (TEST-CdcrReplicationDistributedZkTest.doTests-seed#[9B17B83096A8FC9A]) [    ] o.a.s.c.c.ConnectionManager Waiting for client to connect to ZooKeeper
   [junit4]   2> 910937 INFO  (zkCallback-909-thread-1) [    ] o.a.s.c.c.ConnectionManager Watcher org.apache.solr.common.cloud.ConnectionManager@1ad00b4 name:ZooKeeperConnection Watcher:127.0.0.1:46098/solr got event WatchedEvent state:SyncConnected type:None path:null path:null type:None
   [junit4]   2> 910937 INFO  (TEST-CdcrReplicationDistributedZkTest.doTests-seed#[9B17B83096A8FC9A]) [    ] o.a.s.c.c.ConnectionManager Client is connected to ZooKeeper
   [junit4]   2> 910937 INFO  (TEST-CdcrReplicationDistributedZkTest.doTests-seed#[9B17B83096A8FC9A]) [    ] o.a.s.c.c.SolrZkClient Using default ZkACLProvider
   [junit4]   2> 910937 INFO  (TEST-CdcrReplicationDistributedZkTest.doTests-seed#[9B17B83096A8FC9A]) [    ] o.a.s.c.c.SolrZkClient makePath: /collections/collection1
   [junit4]   2> 910938 INFO  (TEST-CdcrReplicationDistributedZkTest.doTests-seed#[9B17B83096A8FC9A]) [    ] o.a.s.c.c.SolrZkClient makePath: /collections/collection1/shards
   [junit4]   2> 910938 INFO  (TEST-CdcrReplicationDistributedZkTest.doTests-seed#[9B17B83096A8FC9A]) [    ] o.a.s.c.c.SolrZkClient makePath: /collections/control_collection
   [junit4]   2> 910939 INFO  (TEST-CdcrReplicationDistributedZkTest.doTests-seed#[9B17B83096A8FC9A]) [    ] o.a.s.c.c.SolrZkClient makePath: /collections/control_collection/shards
   [junit4]   2> 910940 INFO  (TEST-CdcrReplicationDistributedZkTest.doTests-seed#[9B17B83096A8FC9A]) [    ] o.a.s.c.AbstractZkTestCase put /home/jenkins/workspace/Lucene-Solr-trunk-Linux/solr/core/src/test-files/solr/collection1/conf/solrconfig-cdcr.xml to /configs/conf1/solrconfig.xml
   [junit4]   2> 910940 INFO  (TEST-CdcrReplicationDistributedZkTest.doTests-seed#[9B17B83096A8FC9A]) [    ] o.a.s.c.c.SolrZkClient makePath: /configs/conf1/solrconfig.xml
   [junit4]   2> 910941 INFO  (TEST-CdcrReplicationDistributedZkTest.doTests-seed#[9B17B83096A8FC9A]) [    ] o.a.s.c.AbstractZkTestCase put /home/jenkins/workspace/Lucene-Solr-trunk-Linux/solr/core/src/test-files/solr/collection1/conf/schema15.xml to /configs/conf1/schema.xml
   [junit4]   2> 910941 INFO  (TEST-CdcrReplicationDistributedZkTest.doTests-seed#[9B17B83096A8FC9A]) [    ] o.a.s.c.c.SolrZkClient makePath: /configs/conf1/schema.xml
   [junit4]   2> 910942 INFO  (TEST-CdcrReplicationDistributedZkTest.doTests-seed#[9B17B83096A8FC9A]) [    ] o.a.s.c.AbstractZkTestCase put /home/jenkins/workspace/Lucene-Solr-trunk-Linux/solr/core/src/test-files/solr/collection1/conf/solrconfig.snippet.randomindexconfig.xml to /configs/conf1/solrconfig.snippet.randomindexconfig.xml
   [junit4]   2> 910942 INFO  (TEST-CdcrReplicationDistributedZkTest.doTests-seed#[9B17B83096A8FC9A]) [    ] o.a.s.c.c.SolrZkClient makePath: /configs/conf1/solrconfig.snippet.randomindexconfig.xml
   [junit4]   2> 910942 INFO  (TEST-CdcrReplicationDistributedZkTest.doTests-seed#[9B17B83096A8FC9A]) [    ] o.a.s.c.AbstractZkTestCase put /home/jenkins/workspace/Lucene-Solr-trunk-Linux/solr/core/src/test-files/solr/collection1/conf/stopwords.txt to /configs/conf1/stopwords.txt
   [junit4]   2> 910943 INFO  (TEST-CdcrReplicationDistributedZkTest.doTests-seed#[9B17B83096A8FC9A]) [    ] o.a.s.c.c.SolrZkClient makePath: /configs/conf1/stopwords.txt
   [junit4]   2> 910943 INFO  (TEST-CdcrReplicationDistributedZkTest.doTests-seed#[9B17B83096A8FC9A]) [    ] o.a.s.c.AbstractZkTestCase put /home/jenkins/workspace/Lucene-Solr-trunk-Linux/solr/core/src/test-files/solr/collection1/conf/protwords.txt to /configs/conf1/protwords.txt
   [junit4]   2> 910944 INFO  (TEST-CdcrReplicationDistributedZkTest.doTests-seed#[9B17B83096A8FC9A]) [    ] o.a.s.c.c.SolrZkClient makePath: /configs/conf1/protwords.txt
   [junit4]   2> 910944 INFO  (TEST-CdcrReplicationDistributedZkTest.doTests-seed#[9B17B83096A8FC9A]) [    ] o.a.s.c.AbstractZkTestCase put /home/jenkins/workspace/Lucene-Solr-trunk-Linux/solr/core/src/test-files/solr/collection1/conf/currency.xml to /configs/conf1/currency.xml
   [junit4]   2> 910944 INFO  (TEST-CdcrReplicationDistributedZkTest.doTests-seed#[9B17B83096A8FC9A]) [    ] o.a.s.c.c.SolrZkClient makePath: /configs/conf1/currency.xml
   [junit4]   2> 910945 INFO  (TEST-CdcrReplicationDistributedZkTest.doTests-seed#[9B17B83096A8FC9A]) [    ] o.a.s.c.AbstractZkTestCase put /home/jenkins/workspace/Lucene-Solr-trunk-Linux/solr/core/src/test-files/solr/collection1/conf/enumsConfig.xml to /configs/conf1/enumsConfig.xml
   [junit4]   2> 910945 INFO  (TEST-CdcrReplicationDistributedZkTest.doTests-seed#[9B17B83096A8FC9A]) [    ] o.a.s.c.c.SolrZkClient makePath: /configs/conf1/enumsConfig.xml
   [junit4]   2> 910946 INFO  (TEST-CdcrReplicationDistributedZkTest.doTests-seed#[9B17B83096A8FC9A]) [    ] o.a.s.c.AbstractZkTestCase put /home/jenkins/workspace/Lucene-Solr-trunk-Linux/solr/core/src/test-files/solr/collection1/conf/open-exchange-rates.json to /configs/conf1/open-exchange-rates.json
   [junit4]   2> 910946 INFO  (TEST-CdcrReplicationDistributedZkTest.doTests-seed#[9B17B83096A8FC9A]) [    ] o.a.s.c.c.SolrZkClient makePath: /configs/conf1/open-exchange-rates.json
   [junit4]   2> 910947 INFO  (TEST-CdcrReplicationDistributedZkTest.doTests-seed#[9B17B83096A8FC9A]) [    ] o.a.s.c.AbstractZkTestCase put /home/jenkins/workspace/Lucene-Solr-trunk-Linux/solr/core/src/test-files/solr/collection1/conf/mapping-ISOLatin1Accent.txt to /configs/conf1/mapping-ISOLatin1Accent.txt
   [junit4]   2> 910947 INFO  (TEST-CdcrReplicationDistributedZkTest.doTests-seed#[9B17B83096A8FC9A]) [    ] o.a.s.c.c.SolrZkClient makePath: /configs/conf1/mapping-ISOLatin1Accent.txt
   [junit4]   2> 910948 INFO  (TEST-CdcrReplicationDistributedZkTest.doTests-seed#[9B17B83096A8FC9A]) [    ] o.a.s.c.AbstractZkTestCase put /home/jenkins/workspace/Lucene-Solr-trunk-Linux/solr/core/src/test-files/solr/collection1/conf/old_synonyms.txt to /configs/conf1/old_synonyms.txt
   [junit4]   2> 910948 INFO  (TEST-CdcrReplicationDistributedZkTest.doTests-seed#[9B17B83096A8FC9A]) [    ] o.a.s.c.c.SolrZkClient makePath: /configs/conf1/old_synonyms.txt
   [junit4]   2> 910949 INFO  (TEST-CdcrReplicationDistributedZkTest.doTests-seed#[9B17B83096A8FC9A]) [    ] o.a.s.c.AbstractZkTestCase put /home/jenkins/workspace/Lucene-Solr-trunk-Linux/solr/core/src/test-files/solr/collection1/conf/synonyms.txt to /configs/conf1/synonyms.txt
   [junit4]   2> 910949 INFO  (TEST-CdcrReplicationDistributedZkTest.doTests-seed#[9B17B83096A8FC9A]) [    ] o.a.s.c.c.SolrZkClient makePath: /configs/conf1/synonyms.txt
   [junit4]   2> 910950 INFO  (TEST-CdcrReplicationDistributedZkTest.doTests-seed#[9B17B83096A8FC9A]) [    ] o.a.s.SolrTestCaseJ4 ###Starting doTests
   [junit4]   2> 911011 INFO  (TEST-CdcrReplicationDistributedZkTest.doTests-seed#[9B17B83096A8FC9A]) [    ] o.a.s.SolrTestCaseJ4 Writing core.properties file to /home/jenkins/workspace/Lucene-Solr-trunk-Linux/solr/build/solr-core/test/J1/temp/solr.cloud.CdcrReplicationDistributedZkTest_9B17B83096A8FC9A-001/jetty-001/cores/collection1
   [junit4]   2> 911013 INFO  (TEST-CdcrReplicationDistributedZkTest.doTests-seed#[9B17B83096A8FC9A]) [    ] o.e.j.s.Server jetty-9.2.11.v20150529
   [junit4]   2> 911013 INFO  (TEST-CdcrReplicationDistributedZkTest.doTests-seed#[9B17B83096A8FC9A]) [    ] o.e.j.s.h.ContextHandler Started o.e.j.s.ServletContextHandler@f63947{/vy_/xq,null,AVAILABLE}
   [junit4]   2> 911015 INFO  (TEST-CdcrReplicationDistributedZkTest.doTests-seed#[9B17B83096A8FC9A]) [    ] o.e.j.s.ServerConnector Started ServerConnector@92f90b{HTTP/1.1}{127.0.0.1:59567}
   [junit4]   2> 911015 INFO  (TEST-CdcrReplicationDistributedZkTest.doTests-seed#[9B17B83096A8FC9A]) [    ] o.e.j.s.Server Started @912862ms
   [junit4]   2> 911015 INFO  (TEST-CdcrReplicationDistributedZkTest.doTests-seed#[9B17B83096A8FC9A]) [    ] o.a.s.c.s.e.JettySolrRunner Jetty properties: {shards=shard1, hostContext=/vy_/xq, hostPort=59567, coreRootDirectory=/home/jenkins/workspace/Lucene-Solr-trunk-Linux/solr/build/solr-core/test/J1/temp/solr.cloud.CdcrReplicationDistributedZkTest_9B17B83096A8FC9A-001/jetty-001/cores}
   [junit4]   2> 911016 INFO  (TEST-CdcrReplicationDistributedZkTest.doTests-seed#[9B17B83096A8FC9A]) [    ] o.a.s.s.SolrDispatchFilter SolrDispatchFilter.init(): sun.misc.Launcher$AppClassLoader@19ebb3d
   [junit4]   2> 911016 INFO  (TEST-CdcrReplicationDistributedZkTest.doTests-seed#[9B17B83096A8FC9A]) [    ] o.a.s.c.SolrResourceLoader new SolrResourceLoader for directory: '/home/jenkins/workspace/Lucene-Solr-trunk-Linux/solr/build/solr-core/test/J1/temp/solr.cloud.CdcrReplicationDistributedZkTest_9B17B83096A8FC9A-001/jetty-001/'
   [junit4]   2> 911026 INFO  (TEST-CdcrReplicationDistributedZkTest.doTests-seed#[9B17B83096A8FC9A]) [    ] o.a.s.c.c.SolrZkClient Using default ZkCredentialsProvider
   [junit4]   2> 911026 INFO  (TEST-CdcrReplicationDistributedZkTest.doTests-seed#[9B17B83096A8FC9A]) [    ] o.a.s.c.c.ConnectionManager Waiting for client to connect to ZooKeeper
   [junit4]   2> 911027 INFO  (zkCallback-910-thread-1) [    ] o.a.s.c.c.ConnectionManager Watcher org.apache.solr.common.cloud.ConnectionManager@f46f9a name:ZooKeeperConnection Watcher:127.0.0.1:46098/solr got event WatchedEvent state:SyncConnected type:None path:null path:null type:None
   [junit4]   2> 911027 INFO  (TEST-CdcrReplicationDistributedZkTest.doTests-seed#[9B17B83096A8FC9A]) [    ] o.a.s.c.c.ConnectionManager Client is connected to ZooKeeper
   [junit4]   2> 911027 INFO  (TEST-CdcrReplicationDistributedZkTest.doTests-seed#[9B17B83096A8FC9A]) [    ] o.a.s.c.c.SolrZkClient Using default ZkACLProvider
   [junit4]   2> 911028 INFO  (TEST-CdcrReplicationDistributedZkTest.doTests-seed#[9B17B83096A8FC9A]) [    ] o.a.s.s.SolrDispatchFilter Loading solr.xml from SolrHome (not found in ZooKeeper)
   [junit4]   2> 911028 INFO  (TEST-CdcrReplicationDistributedZkTest.doTests-seed#[9B17B83096A8FC9A]) [    ] o.a.s.c.SolrXmlConfig Loading container configuration from /home/jenkins/workspace/Lucene-Solr-trunk-Linux/solr/build/solr-core/test/J1/temp/solr.cloud.CdcrReplicationDistributedZkTest_9B17B83096A8FC9A-001/jetty-001/solr.xml
   [junit4]   2> 911031 INFO  (TEST-CdcrReplicationDistributedZkTest.doTests-seed#[9B17B83096A8FC9A]) [    ] o.a.s.c.CoresLocator Config-defined core root directory: /home/jenkins/workspace/Lucene-Solr-trunk-Linux/solr/build/solr-core/test/J1/temp/solr.cloud.CdcrReplicationDistributedZkTest_9B17B83096A8FC9A-001/jetty-001/cores
   [junit4]   2> 911032 INFO  (TEST-CdcrReplicationDistributedZkTest.doTests-seed#[9B17B83096A8FC9A]) [    ] o.a.s.c.CoreContainer New CoreContainer 14527227
   [junit4]   2> 911032 INFO  (TEST-CdcrReplicationDistributedZkTest.doTests-seed#[9B17B83096A8FC9A]) [    ] o.a.s.c.CoreContainer Loading cores into CoreContainer [instanceDir=/home/jenkins/workspace/Lucene-Solr-trunk-Linux/solr/build/solr-core/test/J1/temp/solr.cloud.CdcrReplicationDistributedZkTest_9B17B83096A8FC9A-001/jetty-001/]
   [junit4]   2> 911032 INFO  (TEST-CdcrReplicationDistributedZkTest.doTests-seed#[9B17B83096A8FC9A]) [    ] o.a.s.c.CoreContainer loading shared library: /home/jenkins/workspace/Lucene-Solr-trunk-Linux/solr/build/solr-core/test/J1/temp/solr.cloud.CdcrReplicationDistributedZkTest_9B17B83096A8FC9A-001/jetty-001/lib
   [junit4]   2> 911032 WARN  (TEST-CdcrReplicationDistributedZkTest.doTests-seed#[9B17B83096A8FC9A]) [    ] o.a.s.c.SolrResourceLoader Can't find (or read) directory to add to classloader: lib (resolved as: /home/jenkins/workspace/Lucene-Solr-trunk-Linux/solr/build/solr-core/test/J1/temp/solr.cloud.CdcrReplicationDistributedZkTest_9B17B83096A8FC9A-001/jetty-001/lib).
   [junit4]   2> 911051 INFO  (TEST-CdcrReplicationDistributedZkTest.doTests-seed#[9B17B83096A8FC9A]) [    ] o.a.s.h.c.HttpShardHandlerFactory created with socketTimeout : 90000,urlScheme : ,connTimeout : 15000,maxConnectionsPerHost : 20,maxConnections : 10000,corePoolSize : 0,maximumPoolSize : 2147483647,maxThreadIdleTime : 5,sizeOfQueue : -1,fairnessPolicy : false,useRetries : false,
   [junit4]   2> 911052 INFO  (TEST-CdcrReplicationDistributedZkTest.doTests-seed#[9B17B83096A8FC9A]) [    ] o.a.s.u.UpdateShardHandler Creating UpdateShardHandler HTTP client with params: socketTimeout=340000&connTimeout=45000&retry=true
   [junit4]   2> 911053 INFO  (TEST-CdcrReplicationDistributedZkTest.doTests-seed#[9B17B83096A8FC9A]) [    ] o.a.s.l.LogWatcher SLF4J impl is org.slf4j.impl.Log4jLoggerFactory
   [junit4]   2> 911053 INFO  (TEST-CdcrReplicationDistributedZkTest.doTests-seed#[9B17B83096A8FC9A]) [    ] o.a.s.l.LogWatcher Registering Log Listener [Log4j (org.slf4j.impl.Log4jLoggerFactory)]
   [junit4]   2> 911053 INFO  (TEST-CdcrReplicationDistributedZkTest.doTests-seed#[9B17B83096A8FC9A]) [    ] o.a.s.c.ZkContainer Zookeeper client=127.0.0.1:46098/solr
   [junit4]   2> 911053 INFO  (TEST-CdcrReplicationDistributedZkTest.doTests-seed#[9B17B83096A8FC9A]) [    ] o.a.s.c.ZkController zkHost includes chroot
   [junit4]   2> 911053 INFO  (TEST-CdcrReplicationDistributedZkTest.doTests-seed#[9B17B83096A8FC9A]) [    ] o.a.s.c.c.SolrZkClient Using default ZkCredentialsProvider
   [junit4]   2> 911054 INFO  (TEST-CdcrReplicationDistributedZkTest.doTests-seed#[9B17B83096A8FC9A]) [    ] o.a.s.c.c.ConnectionManager Waiting for client to connect to ZooKeeper
   [junit4]   2> 911055 INFO  (zkCallback-912-thread-1) [    ] o.a.s.c.c.ConnectionManager Watcher org.apache.solr.common.cloud.ConnectionManager@815795 name:ZooKeeperConnection Watcher:127.0.0.1:46098 got event WatchedEvent state:SyncConnected type:None path:null path:null type:None
   [junit4]   2> 911055 INFO  (TEST-CdcrReplicationDistributedZkTest.doTests-seed#[9B17B83096A8FC9A]) [    ] o.a.s.c.c.ConnectionManager Client is connected to ZooKeeper
   [junit4]   2> 911055 INFO  (TEST-CdcrReplicationDistributedZkTest.doTests-seed#[9B17B83096A8FC9A]) [    ] o.a.s.c.c.SolrZkClient Using default ZkACLProvider
   [junit4]   2> 911056 INFO  (TEST-CdcrReplicationDistributedZkTest.doTests-seed#[9B17B83096A8FC9A]) [n:127.0.0.1:59567_vy_%2Fxq    ] o.a.s.c.c.ConnectionManager Waiting for client to connect to ZooKeeper
   [junit4]   2> 911056 INFO  (zkCallback-913-thread-1-processing-n:127.0.0.1:59567_vy_%2Fxq) [n:127.0.0.1:59567_vy_%2Fxq    ] o.a.s.c.c.ConnectionManager Watcher org.apache.solr.common.cloud.ConnectionManager@17a8b2e name:ZooKeeperConnection Watcher:127.0.0.1:46098/solr got event WatchedEvent state:SyncConnected type:None path:null path:null type:None
   [junit4]   2> 911057 INFO  (TEST-CdcrReplicationDistributedZkTest.doTests-seed#[9B17B83096A8FC9A]) [n:127.0.0.1:59567_vy_%2Fxq    ] o.a.s.c.c.ConnectionManager Client is connected to ZooKeeper
   [junit4]   2> 911057 INFO  (TEST-CdcrReplicationDistributedZkTest.doTests-seed#[9B17B83096A8FC9A]) [n:127.0.0.1:59567_vy_%2Fxq    ] o.a.s.c.c.SolrZkClient makePath: /overseer/queue
   [junit4]   2> 911058 INFO  (TEST-CdcrReplicationDistributedZkTest.doTests-seed#[9B17B83096A8FC9A]) [n:127.0.0.1:59567_vy_%2Fxq    ] o.a.s.c.c.SolrZkClient makePath: /overseer/collection-queue-work
   [junit4]   2> 911059 INFO  (TEST-CdcrReplicationDistributedZkTest.doTests-seed#[9B17B83096A8FC9A]) [n:127.0.0.1:59567_vy_%2Fxq    ] o.a.s.c.c.SolrZkClient makePath: /overseer/collection-map-running
   [junit4]   2> 911060 INFO  (TEST-CdcrReplicationDistributedZkTest.doTests-seed#[9B17B83096A8FC9A]) [n:127.0.0.1:59567_vy_%2Fxq    ] o.a.s.c.c.SolrZkClient makePath: /overseer/collection-map-completed
   [junit4]   2> 911061 INFO  (TEST-CdcrReplicationDistributedZkTest.doTests-seed#[9B17B83096A8FC9A]) [n:127.0.0.1:59567_vy_%2Fxq    ] o.a.s.c.c.SolrZkClient makePath: /overseer/collection-map-failure
   [junit4]   2> 911062 INFO  (TEST-CdcrReplicationDistributedZkTest.doTests-seed#[9B17B83096A8FC9A]) [n:127.0.0.1:59567_vy_%2Fxq    ] o.a.s.c.c.SolrZkClient makePath: /live_nodes
   [junit4]   2> 911062 INFO  (TEST-CdcrReplicationDistributedZkTest.doTests-seed#[9B17B83096A8FC9A]) [n:127.0.0.1:59567_vy_%2Fxq    ] o.a.s.c.c.SolrZkClient makePath: /aliases.json
   [junit4]   2> 911065 INFO  (TEST-CdcrReplicationDistributedZkTest.doTests-seed#[9B17B83096A8FC9A]) [n:127.0.0.1:59567_vy_%2Fxq    ] o.a.s.c.c.SolrZkClient makePath: /clusterstate.json
   [junit4]   2> 911066 INFO  (TEST-CdcrReplicationDistributedZkTest.doTests-seed#[9B17B83096A8FC9A]) [n:127.0.0.1:59567_vy_%2Fxq    ] o.a.s.c.ZkController Register node as live in ZooKeeper:/live_nodes/127.0.0.1:59567_vy_%2Fxq
   [junit4]   2> 911066 INFO  (TEST-CdcrReplicationDistributedZkTest.doTests-seed#[9B17B83096A8FC9A]) [n:127.0.0.1:59567_vy_%2Fxq    ] o.a.s.c.c.SolrZkClient makePath: /live_nodes/127.0.0.1:59567_vy_%2Fxq
   [junit4]   2> 911067 INFO  (TEST-CdcrReplicationDistributedZkTest.doTests-seed#[9B17B83096A8FC9A]) [n:127.0.0.1:59567_vy_%2Fxq    ] o.a.s.c.c.SolrZkClient makePath: /overseer_elect
   [junit4]   2> 911068 INFO  (TEST-CdcrReplicationDistributedZkTest.doTests-seed#[9B17B83096A8FC9A]) [n:127.0.0.1:59567_vy_%2Fxq    ] o.a.s.c.c.SolrZkClient makePath: /overseer_elect/election
   [junit4]   2> 911069 INFO  (TEST-CdcrReplicationDistributedZkTest.doTests-seed#[9B17B83096A8FC9A]) [n:127.0.0.1:59567_vy_%2Fxq    ] o.a.s.c.Overseer Overseer (id=null) closing
   [junit4]   2> 911069 INFO  (TEST-CdcrReplicationDistributedZkTest.doTests-seed#[9B17B83096A8FC9A]) [n:127.0.0.1:59567_vy_%2Fxq    ] o.a.s.c.LeaderElector Joined leadership election with path: /overseer_elect/election/94281195018780676-127.0.0.1:59567_vy_%2Fxq-n_0000000000
   [junit4]   2> 911069 INFO  (TEST-CdcrReplicationDistributedZkTest.doTests-seed#[9B17B83096A8FC9A]) [n:127.0.0.1:59567_vy_%2Fxq    ] o.a.s.c.OverseerElectionContext I am going to be the leader 127.0.0.1:59567_vy_%2Fxq
   [junit4]   2> 911069 INFO  (TEST-CdcrReplicationDistributedZkTest.doTests-seed#[9B17B83096A8FC9A]) [n:127.0.0.1:59567_vy_%2Fxq    ] o.a.s.c.c.SolrZkClient makePath: /overseer_elect/leader
   [junit4]   2> 911070 INFO  (TEST-CdcrReplicationDistributedZkTest.doTests-seed#[9B17B83096A8FC9A]) [n:127.0.0.1:59567_vy_%2Fxq    ] o.a.s.c.Overseer Overseer (id=94281195018780676-127.0.0.1:59567_vy_%2Fxq-n_0000000000) starting
   [junit4]   2> 911072 INFO  (TEST-CdcrReplicationDistributedZkTest.doTests-seed#[9B17B83096A8FC9A]) [n:127.0.0.1:59567_vy_%2Fxq    ] o.a.s.c.c.SolrZkClient makePath: /overseer/queue-work
   [junit4]   2> 911075 INFO  (TEST-CdcrReplicationDistributedZkTest.doTests-seed#[9B17B83096A8FC9A]) [n:127.0.0.1:59567_vy_%2Fxq    ] o.a.s.c.OverseerAutoReplicaFailoverThread Starting OverseerAutoReplicaFailoverThread autoReplicaFailoverWorkLoopDelay=10000 autoReplicaFailoverWaitAfterExpiration=30000 autoReplicaFailoverBadNodeExpiration=60000
   [junit4]   2> 911075 INFO  (OverseerCollectionProcessor-94281195018780676-127.0.0.1:59567_vy_%2Fxq-n_0000000000) [n:127.0.0.1:59567_vy_%2Fxq    ] o.a.s.c.OverseerCollectionProcessor Process current queue of collection creations
   [junit4]   2> 911076 INFO  (OverseerStateUpdate-94281195018780676-127.0.0.1:59567_vy_%2Fxq-n_0000000000) [n:127.0.0.1:59567_vy_%2Fxq    ] o.a.s.c.Overseer Starting to work on the main queue
   [junit4]   2> 911079 INFO  (TEST-CdcrReplicationDistributedZkTest.doTests-seed#[9B17B83096A8FC9A]) [n:127.0.0.1:59567_vy_%2Fxq    ] o.a.s.c.c.ZkStateReader Updating cluster state from ZooKeeper... 
   [junit4]   2> 911088 INFO  (TEST-CdcrReplicationDistributedZkTest.doTests-seed#[9B17B83096A8FC9A]) [n:127.0.0.1:59567_vy_%2Fxq    ] o.a.s.c.CoreContainer No authentication plugin used.
   [junit4]   2> 911088 INFO  (TEST-CdcrReplicationDistributedZkTest.doTests-seed#[9B17B83096A8FC9A]) [n:127.0.0.1:59567_vy_%2Fxq    ] o.a.s.c.CoreContainer Security conf doesn't exist. Skipping setup for authorization module.
   [junit4]   2> 911089 INFO  (TEST-CdcrReplicationDistributedZkTest.doTests-seed#[9B17B83096A8FC9A]) [n:127.0.0.1:59567_vy_%2Fxq    ] o.a.s.c.CoresLocator Looking for core definitions underneath /home/jenkins/workspace/Lucene-Solr-trunk-Linux/solr/build/solr-core/test/J1/temp/solr.cloud.CdcrReplicationDistributedZkTest_9B17B83096A8FC9A-001/jetty-001/cores
   [junit4]   2> 911090 INFO  (TEST-CdcrReplicationDistributedZkTest.doTests-seed#[9B17B83096A8FC9A]) [n:127.0.0.1:59567_vy_%2Fxq    ] o.a.s.c.SolrCore Created CoreDescriptor: {name=collection1, config=solrconfig.xml, transient=false, schema=schema.xml, loadOnStartup=true, configSetProperties=configsetprops.json, instanceDir=/home/jenkins/workspace/Lucene-Solr-trunk-Linux/solr/build/solr-core/test/J1/temp/solr.cloud.CdcrReplicationDistributedZkTest_9B17B83096A8FC9A-001/jetty-001/cores/collection1, collection=tmp_collection, absoluteInstDir=/home/jenkins/workspace/Lucene-Solr-trunk-Linux/solr/build/solr-core/test/J1/temp/solr.cloud.CdcrReplicationDistributedZkTest_9B17B83096A8FC9A-001/jetty-001/cores/collection1/, coreNodeName=, dataDir=data/, shard=}
   [junit4]   2> 911090 INFO  (TEST-CdcrReplicationDistributedZkTest.doTests-seed#[9B17B83096A8FC9A]) [n:127.0.0.1:59567_vy_%2Fxq    ] o.a.s.c.CoresLocator Found core collection1 in /home/jenkins/workspace/Lucene-Solr-trunk-Linux/solr/build/solr-core/test/J1/temp/solr.cloud.CdcrReplicationDistributedZkTest_9B17B83096A8FC9A-001/jetty-001/cores/collection1/
   [junit4]   2> 911090 INFO  (TEST-CdcrReplicationDistributedZkTest.doTests-seed#[9B17B83096A8FC9A]) [n:127.0.0.1:59567_vy_%2Fxq    ] o.a.s.c.CoresLocator Found 1 core definitions
   [junit4]   2> 911091 INFO  (coreLoadExecutor-3705-thread-1-processing-n:127.0.0.1:59567_vy_%2Fxq) [n:127.0.0.1:59567_vy_%2Fxq c:tmp_collection   x:collection1] o.a.s.c.ZkController publishing state=down
   [junit4]   2> 911091 INFO  (coreLoadExecutor-3705-thread-1-processing-n:127.0.0.1:59567_vy_%2Fxq) [n:127.0.0.1:59567_vy_%2Fxq c:tmp_collection   x:collection1] o.a.s.c.ZkController numShards not found on descriptor - reading it from system property
   [junit4]   2> 911092 INFO  (TEST-CdcrReplicationDistributedZkTest.doTests-seed#[9B17B83096A8FC9A]) [n:127.0.0.1:59567_vy_%2Fxq    ] o.a.s.s.SolrDispatchFilter user.dir=/home/jenkins/workspace/Lucene-Solr-trunk-Linux/solr/build/solr-core/test/J1
   [junit4]   2> 911092 INFO  (TEST-CdcrReplicationDistributedZkTest.doTests-seed#[9B17B83096A8FC9A]) [n:127.0.0.1:59567_vy_%2Fxq    ] o.a.s.s.SolrDispatchFilter SolrDispatchFilter.init() done
   [junit4]   2> 911092 INFO  (zkCallback-913-thread-1-processing-n:127.0.0.1:59567_vy_%2Fxq) [n:127.0.0.1:59567_vy_%2Fxq    ] o.a.s.c.DistributedQueue NodeChildrenChanged fired on path /overseer/queue state SyncConnected
   [junit4]   2> 911092 INFO  (coreLoadExecutor-3705-thread-1-processing-n:127.0.0.1:59567_vy_%2Fxq) [n:127.0.0.1:59567_vy_%2Fxq c:tmp_collection   x:collection1] o.a.s.c.ZkController look for our core node name
   [junit4]   2> 911093 INFO  (OverseerStateUpdate-94281195018780676-127.0.0.1:59567_vy_%2Fxq-n_0000000000) [n:127.0.0.1:59567_vy_%2Fxq    ] o.a.s.c.Overseer processMessage: queueSize: 1, message = {
   [junit4]   2>   "core":"collection1",
   [junit4]   2>   "roles":null,
   [junit4]   2>   "base_url":"http://127.0.0.1:59567/vy_/xq",
   [junit4]   2>   "node_name":"127.0.0.1:59567_vy_%2Fxq",
   [junit4]   2>   "numShards":"2",
   [junit4]   2>   "state":"down",
   [junit4]   2>   "shard":null,
   [junit4]   2>   "collection":"tmp_collection",
   [junit4]   2>   "operation":"state"} current state version: 0
   [junit4]   2> 911093 INFO  (OverseerStateUpdate-94281195018780676-127.0.0.1:59567_vy_%2Fxq-n_0000000000) [n:127.0.0.1:59567_vy_%2Fxq    ] o.a.s.c.o.ReplicaMutator Update state numShards=2 message={
   [junit4]   2>   "core":"collection1",
   [junit4]   2>   "roles":null,
   [junit4]   2>   "base_url":"http://127.0.0.1:59567/vy_/xq",
   [junit4]   2>   "node_name":"127.0.0.1:59567_vy_%2Fxq",
   [junit4]   2>   "numShards":"2",
   [junit4]   2>   "state":"down",
   [junit4]   2>   "shard":null,
   [junit4]   2>   "collection":"tmp_collection",
   [junit4]   2>   "operation":"state"}
   [junit4]   2> 911093 INFO  (OverseerStateUpdate-94281195018780676-127.0.0.1:59567_vy_%2Fxq-n_0000000000) [n:127.0.0.1:59567_vy_%2Fxq    ] o.a.s.c.o.ClusterStateMutator building a new cName: tmp_collection
   [junit4]   2> 911094 INFO  (OverseerStateUpdate-94281195018780676-127.0.0.1:59567_vy_%2Fxq-n_0000000000) [n:127.0.0.1:59567_vy_%2Fxq    ] o.a.s.c.o.ReplicaMutator Assigning new node to shard shard=shard2
   [junit4]   2> 911094 INFO  (zkCallback-913-thread-1-processing-n:127.0.0.1:59567_vy_%2Fxq) [n:127.0.0.1:59567_vy_%2Fxq    ] o.a.s.c.c.ZkStateReader A cluster state change: WatchedEvent state:SyncConnected type:NodeDataChanged path:/clusterstate.json, has occurred - updating... (live nodes size: 1)
   [junit4]   2> 911097 INFO  (zkCallback-913-thread-1-processing-n:127.0.0.1:59567_vy_%2Fxq) [n:127.0.0.1:59567_vy_%2Fxq    ] o.a.s.c.c.ZkStateReader Updated cluster state version to 1
   [junit4]   2> 912093 INFO  (coreLoadExecutor-3705-thread-1-processing-n:127.0.0.1:59567_vy_%2Fxq) [n:127.0.0.1:59567_vy_%2Fxq c:tmp_collection   x:collection1] o.a.s.c.ZkController waiting to find shard id in clusterstate for collection1
   [junit4]   2> 912093 INFO  (coreLoadExecutor-3705-thread-1-processing-n:127.0.0.1:59567_vy_%2Fxq) [n:127.0.0.1:59567_vy_%2Fxq c:tmp_collection   x:collection1] o.a.s.c.ZkController Check for collection zkNode:tmp_collection
   [junit4]   2> 912093 INFO  (coreLoadExecutor-3705-thread-1-processing-n:127.0.0.1:59567_vy_%2Fxq) [n:127.0.0.1:59567_vy_%2Fxq c:tmp_collection   x:collection1] o.a.s.c.ZkController Creating collection in ZooKeeper:tmp_collection
   [junit4]   2> 912093 INFO  (coreLoadExecutor-3705-thread-1-processing-n:127.0.0.1:59567_vy_%2Fxq) [n:127.0.0.1:59567_vy_%2Fxq c:tmp_collection   x:collection1] o.a.s.c.ZkController Looking for collection configName
   [junit4]   2> 912094 INFO  (coreLoadExecutor-3705-thread-1-processing-n:127.0.0.1:59567_vy_%2Fxq) [n:127.0.0.1:59567_vy_%2Fxq c:tmp_collection   x:collection1] o.a.s.c.ZkController Only one config set found in zk - using it:conf1
   [junit4]   2> 912094 INFO  (coreLoadExecutor-3705-thread-1-processing-n:127.0.0.1:59567_vy_%2Fxq) [n:127.0.0.1:59567_vy_%2Fxq c:tmp_collection   x:collection1] o.a.s.c.c.SolrZkClient makePath: /collections/tmp_collection
   [junit4]   2> 912094 INFO  (coreLoadExecutor-3705-thread-1-processing-n:127.0.0.1:59567_vy_%2Fxq) [n:127.0.0.1:59567_vy_%2Fxq c:tmp_collection   x:collection1] o.a.s.c.c.ZkStateReader Load collection config from:/collections/tmp_collection
   [junit4]   2> 912095 INFO  (coreLoadExecutor-3705-thread-1-processing-n:127.0.0.1:59567_vy_%2Fxq) [n:127.0.0.1:59567_vy_%2Fxq c:tmp_collection   x:collection1] o.a.s.c.c.ZkStateReader path=/collections/tmp_collection configName=conf1 specified config exists in ZooKeeper
   [junit4]   2> 912095 INFO  (coreLoadExecutor-3705-thread-1-processing-n:127.0.0.1:59567_vy_%2Fxq) [n:127.0.0.1:59567_vy_%2Fxq c:tmp_collection   x:collection1] o.a.s.c.SolrResourceLoader new SolrResourceLoader for directory: '/home/jenkins/workspace/Lucene-Solr-trunk-Linux/solr/build/solr-core/test/J1/temp/solr.cloud.CdcrReplicationDistributedZkTest_9B17B83096A8FC9A-001/jetty-001/cores/collection1/'
   [junit4]   2> 912105 INFO  (coreLoadExecutor-3705-thread-1-processing-n:127.0.0.1:59567_vy_%2Fxq) [n:127.0.0.1:59567_vy_%2Fxq c:tmp_collection   x:collection1] o.a.s.c.Config loaded config solrconfig.xml with version 0 
   [junit4]   2> 912108 INFO  (coreLoadExecutor-3705-thread-1-processing-n:127.0.0.1:59567_vy_%2Fxq) [n:127.0.0.1:59567_vy_%2Fxq c:tmp_collection   x:collection1] o.a.s.c.SolrConfig current version of requestparams : -1
   [junit4]   2> 912111 INFO  (coreLoadExecutor-3705-thread-1-processing-n:127.0.0.1:59567_vy_%2Fxq) [n:127.0.0.1:59567_vy_%2Fxq c:tmp_collection   x:collection1] o.a.s.c.SolrConfig Using Lucene MatchVersion: 6.0.0
   [junit4]   2> 912116 INFO  (coreLoadExecutor-3705-thread-1-processing-n:127.0.0.1:59567_vy_%2Fxq) [n:127.0.0.1:59567_vy_%2Fxq c:tmp_collection   x:collection1] o.a.s.c.Config Loaded SolrConfig: solrconfig.xml
   [junit4]   2> 912116 INFO  (coreLoadExecutor-3705-thread-1-processing-n:127.0.0.1:59567_vy_%2Fxq) [n:127.0.0.1:59567_vy_%2Fxq c:tmp_collection   x:collection1] o.a.s.s.IndexSchema Reading Solr Schema from /configs/conf1/schema.xml
   [junit4]   2> 912121 INFO  (coreLoadExecutor-3705-thread-1-processing-n:127.0.0.1:59567_vy_%2Fxq) [n:127.0.0.1:59567_vy_%2Fxq c:tmp_collection   x:collection1] o.a.s.s.IndexSchema [collection1] Schema name=test
   [junit4]   2> 912178 INFO  (coreLoadExecutor-3705-thread-1-processing-n:127.0.0.1:59567_vy_%2Fxq) [n:127.0.0.1:59567_vy_%2Fxq c:tmp_collection   x:collection1] o.a.s.s.IndexSchema default search field in schema is text
   [junit4]   2> 912179 INFO  (coreLoadExecutor-3705-thread-1-processing-n:127.0.0.1:59567_vy_%2Fxq) [n:127.0.0.1:59567_vy_%2Fxq c:tmp_collection   x:collection1] o.a.s.s.IndexSchema unique key field: id
   [junit4]   2> 912180 INFO  (coreLoadExecutor-3705-thread-1-processing-n:127.0.0.1:59567_vy_%2Fxq) [n:127.0.0.1:59567_vy_%2Fxq c:tmp_collection   x:collection1] o.a.s.s.FileExchangeRateProvider Reloading exchange rates from file currency.xml
   [junit4]   2> 912181 INFO  (coreLoadExecutor-3705-thread-1-processing-n:127.0.0.1:59567_vy_%2Fxq) [n:127.0.0.1:59567_vy_%2Fxq c:tmp_collection   x:collection1] o.a.s.s.FileExchangeRateProvider Reloading exchange rates from file currency.xml
   [junit4]   2> 912188 INFO  (coreLoadExecutor-3705-thread-1-processing-n:127.0.0.1:59567_vy_%2Fxq) [n:127.0.0.1:59567_vy_%2Fxq c:tmp_collection   x:collection1] o.a.s.c.ConfigSetProperties Did not find ConfigSet properties, assuming default properties: Can't find resource 'configsetprops.json' in classpath or '/configs/conf1', cwd=/home/jenkins/workspace/Lucene-Solr-trunk-Linux/solr/build/solr-core/test/J1
   [junit4]   2> 912189 INFO  (coreLoadExecutor-3705-thread-1-processing-n:127.0.0.1:59567_vy_%2Fxq) [n:127.0.0.1:59567_vy_%2Fxq c:tmp_collection   x:collection1] o.a.s.c.CoreContainer Creating SolrCore 'collection1' using configuration from collection tmp_collection
   [junit4]   2> 912189 INFO  (coreLoadExecutor-3705-thread-1-processing-n:127.0.0.1:59567_vy_%2Fxq) [n:127.0.0.1:59567_vy_%2Fxq c:tmp_collection s:shard2 r:core_node1 x:collection1] o.a.s.c.SolrCore org.apache.solr.core.MockDirectoryFactory
   [junit4]   2> 912189 INFO  (coreLoadExecutor-3705-thread-1-processing-n:127.0.0.1:59567_vy_%2Fxq) [n:127.0.0.1:59567_vy_%2Fxq c:tmp_collection s:shard2 r:core_node1 x:collection1] o.a.s.c.SolrCore [[collection1] ] Opening new SolrCore at [/home/jenkins/workspace/Lucene-Solr-trunk-Linux/solr/build/solr-core/test/J1/temp/solr.cloud.CdcrReplicationDistributedZkTest_9B17B83096A8FC9A-001/jetty-001/cores/collection1/], dataDir=[null]
   [junit4]   2> 912189 INFO  (coreLoadExecutor-3705-thread-1-processing-n:127.0.0.1:59567_vy_%2Fxq) [n:127.0.0.1:59567_vy_%2Fxq c:tmp_collection s:shard2 r:core_node1 x:collection1] o.a.s.c.JmxMonitoredMap JMX monitoring is enabled. Adding Solr mbeans to JMX Server: com.sun.jmx.mbeanserver.JmxMBeanServer@1f455c4
   [junit4]   2> 912189 INFO  (coreLoadExecutor-3705-thread-1-processing-n:127.0.0.1:59567_vy_%2Fxq) [n:127.0.0.1:59567_vy_%2Fxq c:tmp_collection s:shard2 r:core_node1 x:collection1] o.a.s.c.CachingDirectoryFactory return new directory for /home/jenkins/workspace/Lucene-Solr-trunk-Linux/solr/build/solr-core/test/J1/temp/solr.cloud.CdcrReplicationDistributedZkTest_9B17B83096A8FC9A-001/jetty-001/cores/collection1/data
   [junit4]   2> 912190 INFO  (coreLoadExecutor-3705-thread-1-processing-n:127.0.0.1:59567_vy_%2Fxq) [n:127.0.0.1:59567_vy_%2Fxq c:tmp_collection s:shard2 r:core_node1 x:collection1] o.a.s.c.SolrCore New index directory detected: old=null new=/home/jenkins/workspace/Lucene-Solr-trunk-Linux/solr/build/solr-core/test/J1/temp/solr.cloud.CdcrReplicationDistributedZkTest_9B17B83096A8FC9A-001/jetty-001/cores/collection1/data/index/
   [junit4]   2> 912190 WARN  (coreLoadExecutor-3705-thread-1-processing-n:127.0.0.1:59567_vy_%2Fxq) [n:127.0.0.1:59567_vy_%2Fxq c:tmp_collection s:shard2 r:core_node1 x:collection1] o.a.s.c.SolrCore [collection1] Solr index directory '/home/jenkins/workspace/Lucene-Solr-trunk-Linux/solr/build/solr-core/test/J1/temp/solr.cloud.CdcrReplicationDistributedZkTest_9B17B83096A8FC9A-001/jetty-001/cores/collection1/data/index' doesn't exist. Creating new index...
   [junit4]   2> 912190 INFO  (coreLoadExecutor-3705-thread-1-processing-n:127.0.0.1:59567_vy_%2Fxq) [n:127.0.0.1:59567_vy_%2Fxq c:tmp_collection s:shard2 r:core_node1 x:collection1] o.a.s.c.CachingDirectoryFactory return new directory for /home/jenkins/workspace/Lucene-Solr-trunk-Linux/solr/build/solr-core/test/J1/temp/solr.cloud.CdcrReplicationDistributedZkTest_9B17B83096A8FC9A-001/jetty-001/cores/collection1/data/index
   [junit4]   2> 912190 INFO  (coreLoadExecutor-3705-thread-1-processing-n:127.0.0.1:59567_vy_%2Fxq) [n:127.0.0.1:59567_vy_%2Fxq c:tmp_collection s:shard2 r:core_node1 x:collection1] o.a.s.u.RandomMergePolicy RandomMergePolicy wrapping class org.apache.lucene.index.TieredMergePolicy: [TieredMergePolicy: maxMergeAtOnce=10, maxMergeAtOnceExplicit=32, maxMergedSegmentMB=63.748046875, floorSegmentMB=0.974609375, forceMergeDeletesPctAllowed=22.593143116977924, segmentsPerTier=32.0, maxCFSSegmentSizeMB=8.796093022207999E12, noCFSRatio=0.3041561421156552
   [junit4]   2> 912190 INFO  (coreLoadExecutor-3705-thread-1-processing-n:127.0.0.1:59567_vy_%2Fxq) [n:127.0.0.1:59567_vy_%2Fxq c:tmp_collection s:shard2 r:core_node1 x:collection1] o.a.s.c.SolrCore SolrDeletionPolicy.onCommit: commits: num=1
   [junit4]   2> 	commit{dir=MockDirectoryWrapper(RAMDirectory@e7351d lockFactory=org.apache.lucene.store.SingleInstanceLockFactory@1f5d1bb),segFN=segments_1,generation=1}
   [junit4]   2> 912190 INFO  (coreLoadExecutor-3705-thread-1-processing-n:127.0.0.1:59567_vy_%2Fxq) [n:127.0.0.1:59567_vy_%2Fxq c:tmp_collection s:shard2 r:core_node1 x:collection1] o.a.s.c.SolrCore newest commit generation = 1
   [junit4]   2> 912191 INFO  (OldIndexDirectoryCleanupThreadForCore-collection1) [n:127.0.0.1:59567_vy_%2Fxq c:tmp_collection s:shard2 r:core_node1 x:collection1] o.a.s.c.SolrCore Looking for old index directories to cleanup for core collection1 in /home/jenkins/workspace/Lucene-Solr-trunk-Linux/solr/build/solr-core/test/J1/temp/solr.cloud.CdcrReplicationDistributedZkTest_9B17B83096A8FC9A-001/jetty-001/cores/collection1/data/
   [junit4]   2> 912191 WARN  (OldIndexDirectoryCleanupThreadForCore-collection1) [n:127.0.0.1:59567_vy_%2Fxq c:tmp_collection s:shard2 r:core_node1 x:collection1] o.a.s.c.DirectoryFactory /home/jenkins/workspace/Lucene-Solr-trunk-Linux/solr/build/solr-core/test/J1/temp/solr.cloud.CdcrReplicationDistributedZkTest_9B17B83096A8FC9A-001/jetty-001/cores/collection1/data/ does not point to a valid data directory; skipping clean-up of old index directories.
   [junit4]   2> 912192 INFO  (coreLoadExecutor-3705-thread-1-processing-n:127.0.0.1:59567_vy_%2Fxq) [n:127.0.0.1:59567_vy_%2Fxq c:tmp_collection s:shard2 r:core_node1 x:collection1] o.a.s.u.p.UpdateRequestProcessorChain creating updateRequestProcessorChain "cdcr-processor-chain"
   [junit4]   2> 912193 INFO  (coreLoadExecutor-3705-thread-1-processing-n:127.0.0.1:59567_vy_%2Fxq) [n:127.0.0.1:59567_vy_%2Fxq c:tmp_collection s:shard2 r:core_node1 x:collection1] o.a.s.c.SolrCore no updateRequestProcessorChain defined as default, creating implicit default
   [junit4]   2> 912194 INFO  (coreLoadExecutor-3705-thread-1-processing-n:127.0.0.1:59567_vy_%2Fxq) [n:127.0.0.1:59567_vy_%2Fxq c:tmp_collection s:shard2 r:core_node1 x:collection1] o.a.s.h.l.XMLLoader xsltCacheLifetimeSeconds=60
   [junit4]   2> 912194 INFO  (coreLoadExecutor-3705-thread-1-processing-n:127.0.0.1:59567_vy_%2Fxq) [n:127.0.0.1:59567_vy_%2Fxq c:tmp_collection s:shard2 r:core_node1 x:collection1] o.a.s.h.l.XMLLoader xsltCacheLifetimeSeconds=60
   [junit4]   2> 912195 INFO  (coreLoadExecutor-3705-thread-1-processing-n:127.0.0.1:59567_vy_%2Fxq) [n:127.0.0.1:59567_vy_%2Fxq c:tmp_collection s:shard2 r:core_node1 x:collection1] o.a.s.h.l.XMLLoader xsltCacheLifetimeSeconds=60
   [junit4]   2> 912196 INFO  (coreLoadExecutor-3705-thread-1-processing-n:127.0.0.1:59567_vy_%2Fxq) [n:127.0.0.1:59567_vy_%2Fxq c:tmp_collection s:shard2 r:core_node1 x:collection1] o.a.s.h.l.XMLLoader xsltCacheLifetimeSeconds=60
   [junit4]   2> 912197 INFO  (coreLoadExecutor-3705-thread-1-processing-n:127.0.0.1:59567_vy_%2Fxq) [n:127.0.0.1:59567_vy_%2Fxq c:tmp_collection s:shard2 r:core_node1 x:collection1] o.a.s.c.RequestHandlers Registered paths: /admin/mbeans,standard,/update/csv,/update/json/docs,/admin/luke,/admin/segments,/get,/admin/system,/replication,/admin/properties,/config,/schema,/admin/plugins,/admin/logging,/update/json,/admin/threads,/admin/ping,/cdcr,/update,/admin/file
   [junit4]   2> 912198 INFO  (coreLoadExecutor-3705-thread-1-processing-n:127.0.0.1:59567_vy_%2Fxq) [n:127.0.0.1:59567_vy_%2Fxq c:tmp_collection s:shard2 r:core_node1 x:collection1] o.a.s.c.SolrCore Using default statsCache cache: org.apache.solr.search.stats.LocalStatsCache
   [junit4]   2> 912198 INFO  (coreLoadExecutor-3705-thread-1-processing-n:127.0.0.1:59567_vy_%2Fxq) [n:127.0.0.1:59567_vy_%2Fxq c:tmp_collection s:shard2 r:core_node1 x:collection1] o.a.s.u.UpdateHandler Using UpdateLog implementation: org.apache.solr.update.CdcrUpdateLog
   [junit4]   2> 912198 INFO  (coreLoadExecutor-3705-thread-1-processing-n:127.0.0.1:59567_vy_%2Fxq) [n:127.0.0.1:59567_vy_%2Fxq c:tmp_collection s:shard2 r:core_node1 x:collection1] o.a.s.u.UpdateLog Initializing UpdateLog: dataDir= defaultSyncLevel=FLUSH numRecordsToKeep=100 maxNumLogsToKeep=10 numVersionBuckets=65536
   [junit4]   2> 912199 INFO  (coreLoadExecutor-3705-thread-1-processing-n:127.0.0.1:59567_vy_%2Fxq) [n:127.0.0.1:59567_vy_%2Fxq c:tmp_collection s:shard2 r:core_node1 x:collection1] o.a.s.c.SolrCore Hard AutoCommit: disabled
   [junit4]   2> 912199 INFO  (coreLoadExecutor-3705-thread-1-processing-n:127.0.0.1:59567_vy_%2Fxq) [n:127.0.0.1:59567_vy_%2Fxq c:tmp_collection s:shard2 r:core_node1 x:collection1] o.a.s.c.SolrCore Soft AutoCommit: disabled
   [junit4]   2> 912199 INFO  (coreLoadExecutor-3705-thread-1-processing-n:127.0.0.1:59567_vy_%2Fxq) [n:127.0.0.1:59567_vy_%2Fxq c:tmp_collection s:shard2 r:core_node1 x:collection1] o.a.s.u.RandomMergePolicy RandomMergePolicy wrapping class org.apache.lucene.index.AlcoholicMergePolicy: [AlcoholicMergePolicy: minMergeSize=0, mergeFactor=10, maxMergeSize=112970557, maxMergeSizeForForcedMerge=9223372036854775807, calibrateSizeByDeletes=true, maxMergeDocs=2147483647, maxCFSSegmentSizeMB=8.796093022207999E12, noCFSRatio=0.1]
   [junit4]   2> 912199 INFO  (coreLoadExecutor-3705-thread-1-processing-n:127.0.0.1:59567_vy_%2Fxq) [n:127.0.0.1:59567_vy_%2Fxq c:tmp_collection s:shard2 r:core_node1 x:collection1] o.a.s.c.SolrCore SolrDeletionPolicy.onInit: commits: num=1
   [junit4]   2> 	commit{dir=MockDirectoryWrapper(RAMDirectory@e7351d lockFactory=org.apache.lucene.store.SingleInstanceLockFactory@1f5d1bb),segFN=segments_1,generation=1}
   [junit4]   2> 912199 INFO  (coreLoadExecutor-3705-thread-1-processing-n:127.0.0.1:59567_vy_%2Fxq) [n:127.0.0.1:59567_vy_%2Fxq c:tmp_collection s:shard2 r:core_node1 x:collection1] o.a.s.c.SolrCore newest commit generation = 1
   [junit4]   2> 912199 INFO  (coreLoadExecutor-3705-thread-1-processing-n:127.0.0.1:59567_vy_%2Fxq) [n:127.0.0.1:59567_vy_%2Fxq c:tmp_collection s:shard2 r:core_node1 x:collection1] o.a.s.s.SolrIndexSearcher Opening Searcher@1acc64e[collection1] main
   [junit4]   2> 912200 INFO  (coreLoadExecutor-3705-thread-1-processing-n:127.0.0.1:59567_vy_%2Fxq) [n:127.0.0.1:59567_vy_%2Fxq c:tmp_collection s:shard2 r:core_node1 x:collection1] o.a.s.c.c.ZkStateReader Load collection config from:/collections/tmp_collection
   [junit4]   2> 912200 INFO  (coreLoadExecutor-3705-thread-1-processing-n:127.0.0.1:59567_vy_%2Fxq) [n:127.0.0.1:59567_vy_%2Fxq c:tmp_collection s:shard2 r:core_node1 x:collection1] o.a.s.c.c.ZkStateReader path=/collections/tmp_collection configName=conf1 specified config exists in ZooKeeper
   [junit4]   2> 912200 INFO  (coreLoadExecutor-3705-thread-1-processing-n:127.0.0.1:59567_vy_%2Fxq) [n:127.0.0.1:59567_vy_%2Fxq c:tmp_collection s:shard2 r:core_node1 x:collection1] o.a.s.r.ManagedResourceStorage Setting up ZooKeeper-based storage for the RestManager with znodeBase: /configs/conf1
   [junit4]   2> 912200 INFO  (coreLoadExecutor-3705-thread-1-processing-n:127.0.0.1:59567_vy_%2Fxq) [n:127.0.0.1:59567_vy_%2Fxq c:tmp_collection s:shard2 r:core_node1 x:collection1] o.a.s.r.ManagedResourceStorage Configured ZooKeeperStorageIO with znodeBase: /configs/conf1
   [junit4]   2> 912200 INFO  (coreLoadExecutor-3705-thread-1-processing-n:127.0.0.1:59567_vy_%2Fxq) [n:127.0.0.1:59567_vy_%2Fxq c:tmp_collection s:shard2 r:core_node1 x:collection1] o.a.s.r.RestManager Initializing RestManager with initArgs: {}
   [junit4]   2> 912200 INFO  (coreLoadExecutor-3705-thread-1-processing-n:127.0.0.1:59567_vy_%2Fxq) [n:127.0.0.1:59567_vy_%2Fxq c:tmp_collection s:shard2 r:core_node1 x:collection1] o.a.s.r.ManagedResourceStorage Reading _rest_managed.json using ZooKeeperStorageIO:path=/configs/conf1
   [junit4]   2> 912201 INFO  (coreLoadExecutor-3705-thread-1-processing-n:127.0.0.1:59567_vy_%2Fxq) [n:127.0.0.1:59567_vy_%2Fxq c:tmp_collection s:shard2 r:core_node1 x:collection1] o.a.s.r.ManagedResourceStorage No data found for znode /configs/conf1/_rest_managed.json
   [junit4]   2> 912201 INFO  (coreLoadExecutor-3705-thread-1-processing-n:127.0.0.1:59567_vy_%2Fxq) [n:127.0.0.1:59567_vy_%2Fxq c:tmp_collection s:shard2 r:core_node1 x:collection1] o.a.s.r.ManagedResourceStorage Loaded null at path _rest_managed.json using ZooKeeperStorageIO:path=/configs/conf1
   [junit4]   2> 912201 INFO  (coreLoadExecutor-3705-thread-1-processing-n:127.0.0.1:59567_vy_%2Fxq) [n:127.0.0.1:59567_vy_%2Fxq c:tmp_collection s:shard2 r:core_node1 x:collection1] o.a.s.r.RestManager Initializing 0 registered ManagedResources
   [junit4]   2> 912201 INFO  (coreLoadExecutor-3705-thread-1-processing-n:127.0.0.1:59567_vy_%2Fxq) [n:127.0.0.1:59567_vy_%2Fxq c:tmp_collection s:shard2 r:core_node1 x:collection1] o.a.s.h.ReplicationHandler Commits will be reserved for  10000
   [junit4]   2> 912201 INFO  (coreLoadExecutor-3705-thread-1-processing-n:127.0.0.1:59567_vy_%2Fxq) [n:127.0.0.1:59567_vy_%2Fxq c:tmp_collection s:shard2 r:core_node1 x:collection1] o.a.s.c.c.SolrZkClient makePath: /collections/tmp_collection/cdcr/state
   [junit4]   2> 912202 INFO  (coreLoadExecutor-3705-thread-1-processing-n:127.0.0.1:59567_vy_%2Fxq) [n:127.0.0.1:59567_vy_%2Fxq c:tmp_collection s:shard2 r:core_node1 x:collection1] o.a.s.h.CdcrBufferStateManager Created znode /collections/tmp_collection/cdcr/state/buffer
   [junit4]   2> 912203 INFO  (coreLoadExecutor-3705-thread-1-processing-n:127.0.0.1:59567_vy_%2Fxq) [n:127.0.0.1:59567_vy_%2Fxq c:tmp_collection s:shard2 r:core_node1 x:collection1] o.a.s.h.CdcrProcessStateManager Created znode /collections/tmp_collection/cdcr/state/process
   [junit4]   2> 912203 INFO  (searcherExecutor-3706-thread-1-processing-n:127.0.0.1:59567_vy_%2Fxq x:collection1 s:shard2 c:tmp_collection r:core_node1) [n:127.0.0.1:59567_vy_%2Fxq c:tmp_collection s:shard2 r:core_node1 x:collection1] o.a.s.c.SolrCore [collection1] Registered new searcher Searcher@1acc64e[collection1] main{ExitableDirectoryReader(UninvertingDirectoryReader())}
   [junit4]   2> 912203 INFO  (coreLoadExecutor-3705-thread-1-processing-n:127.0.0.1:59567_vy_%2Fxq) [n:127.0.0.1:59567_vy_%2Fxq c:tmp_collection s:shard2 r:core_node1 x:collection1] o.a.s.u.UpdateLog Looking up max value of version field to seed version buckets
   [junit4]   2> 912204 INFO  (coreLoadExecutor-3705-thread-1-processing-n:127.0.0.1:59567_vy_%2Fxq) [n:127.0.0.1:59567_vy_%2Fxq c:tmp_collection s:shard2 r:core_node1 x:collection1] o.a.s.u.VersionInfo Refreshing highest value of _version_ for 65536 version buckets from index
   [junit4]   2> 912204 INFO  (coreLoadExecutor-3705-thread-1-processing-n:127.0.0.1:59567_vy_%2Fxq) [n:127.0.0.1:59567_vy_%2Fxq c:tmp_collection s:shard2 r:core_node1 x:collection1] o.a.s.u.VersionInfo No terms found for _version_, cannot seed version bucket highest value from index
   [junit4]   2> 912204 INFO  (coreLoadExecutor-3705-thread-1-processing-n:127.0.0.1:59567_vy_%2Fxq) [n:127.0.0.1:59567_vy_%2Fxq c:tmp_collection s:shard2 r:core_node1 x:collection1] o.a.s.u.UpdateLog Could not find max version in index or recent updates, using new clock 1508499121739137024
   [junit4]   2> 912205 INFO  (coreLoadExecutor-3705-thread-1-processing-n:127.0.0.1:59567_vy_%2Fxq) [n:127.0.0.1:59567_vy_%2Fxq c:tmp_collection s:shard2 r:core_node1 x:collection1] o.a.s.u.UpdateLog Took 1 ms to seed version buckets with highest version 1508499121739137024
   [junit4]   2> 912205 INFO  (coreLoadExecutor-3705-thread-1-processing-n:127.0.0.1:59567_vy_%2Fxq) [n:127.0.0.1:59567_vy_%2Fxq c:tmp_collection s:shard2 r:core_node1 x:collection1] o.a.s.c.ZkController watch zkdir /configs/conf1
   [junit4]   2> 912206 INFO  (coreLoadExecutor-3705-thread-1-processing-n:127.0.0.1:59567_vy_%2Fxq) [n:127.0.0.1:59567_vy_%2Fxq c:tmp_collection s:shard2 r:core_node1 x:collection1] o.a.s.c.CoreContainer registering core: collection1
   [junit4]   2> 912206 INFO  (coreZkRegister-3699-thread-1-processing-n:127.0.0.1:59567_vy_%2Fxq x:collection1 s:shard2 c:tmp_collection r:core_node1) [n:127.0.0.1:59567_vy_%2Fxq c:tmp_collection s:shard2 r:core_node1 x:collection1] o.a.s.c.ZkController Register replica - core:collection1 address:http://127.0.0.1:59567/vy_/xq collection:tmp_collection shard:shard2
   [junit4]   2> 912206 INFO  (coreZkRegister-3699-thread-1-processing-n:127.0.0.1:59567_vy_%2Fxq x:collection1 s:shard2 c:tmp_collection r:core_node1) [n:127.0.0.1:59567_vy_%2Fxq c:tmp_collection s:shard2 r:core_node1 x:collection1] o.a.s.c.c.SolrZkClient makePath: /collections/tmp_collection/leader_elect/shard2/election
   [junit4]   2> 912207 INFO  (coreZkRegister-3699-thread-1-processing-n:127.0.0.1:59567_vy_%2Fxq x:collection1 s:shard2 c:tmp_collection r:core_node1) [n:127.0.0.1:59567_vy_%2Fxq c:tmp_collection s:shard2 r:core_node1 x:collection1] o.a.s.c.LeaderElector Joined leadership election with path: /collections/tmp_collection/leader_elect/shard2/election/94281195018780676-core_node1-n_0000000000
   [junit4]   2> 912208 INFO  (coreZkRegister-3699-thread-1-processing-n:127.0.0.1:59567_vy_%2Fxq x:collection1 s:shard2 c:tmp_collection r:core_node1) [n:127.0.0.1:59567_vy_%2Fxq c:tmp_collection s:shard2 r:core_node1 x:collection1] o.a.s.c.ShardLeaderElectionContext Running the leader process for shard shard2
   [junit4]   2> 912208 INFO  (zkCallback-913-thread-1-processing-n:127.0.0.1:59567_vy_%2Fxq) [n:127.0.0.1:59567_vy_%2Fxq    ] o.a.s.c.DistributedQueue NodeChildrenChanged fired on path /overseer/queue state SyncConnected
   [junit4]   2> 912208 INFO  (coreZkRegister-3699-thread-1-processing-n:127.0.0.1:59567_vy_%2Fxq x:collection1 s:shard2 c:tmp_collection r:core_node1) [n:127.0.0.1:59567_vy_%2Fxq c:tmp_collection s:shard2 r:core_node1 x:collection1] o.a.s.c.ShardLeaderElectionContext Enough replicas found to continue.
   [junit4]   2> 912208 INFO  (coreZkRegister-3699-thread-1-processing-n:127.0.0.1:59567_vy_%2Fxq x:collection1 s:shard2 c:tmp_collection r:core_node1) [n:127.0.0.1:59567_vy_%2Fxq c:tmp_collection s:shard2 r:core_node1 x:collection1] o.a.s.c.ShardLeaderElectionContext I may be the new leader - try and sync
   [junit4]   2> 912208 INFO  (coreZkRegister-3699-thread-1-processing-n:127.0.0.1:59567_vy_%2Fxq x:collection1 s:shard2 c:tmp_collection r:core_node1) [n:127.0.0.1:59567_vy_%2Fxq c:tmp_collection s:shard2 r:core_node1 x:collection1] o.a.s.c.SyncStrategy Sync replicas to http://127.0.0.1:59567/vy_/xq/collection1/
   [junit4]   2> 912208 INFO  (OverseerStateUpdate-94281195018780676-127.0.0.1:59567_vy_%2Fxq-n_0000000000) [n:127.0.0.1:59567_vy_%2Fxq    ] o.a.s.c.Overseer processMessage: queueSize: 1, message = {
   [junit4]   2>   "operation":"leader",
   [junit4]   2>   "shard":"shard2",
   [junit4]   2>   "collection":"tmp_collection"} current state version: 1
   [junit4]   2> 912208 INFO  (coreZkRegister-3699-thread-1-processing-n:127.0.0.1:59567_vy_%2Fxq x:collection1 s:shard2 c:tmp_collection r:core_node1) [n:127.0.0.1:59567_vy_%2Fxq c:tmp_collection s:shard2 r:core_node1 x:collection1] o.a.s.c.SyncStrategy Sync Success - now sync replicas to me
   [junit4]   2> 912209 INFO  (coreZkRegister-3699-thread-1-processing-n:127.0.0.1:59567_vy_%2Fxq x:collection1 s:shard2 c:tmp_collection r:core_node1) [n:127.0.0.1:59567_vy_%2Fxq c:tmp_collection s:shard2 r:core_node1 x:collection1] o.a.s.c.SyncStrategy http://127.0.0.1:59567/vy_/xq/collection1/ has no replicas
   [junit4]   2> 912209 INFO  (coreZkRegister-3699-thread-1-processing-n:127.0.0.1:59567_vy_%2Fxq x:collection1 s:shard2 c:tmp_collection r:core_node1) [n:127.0.0.1:59567_vy_%2Fxq c:tmp_collection s:shard2 r:core_node1 x:collection1] o.a.s.c.ShardLeaderElectionContext I am the new leader: http://127.0.0.1:59567/vy_/xq/collection1/ shard2
   [junit4]   2> 912209 INFO  (coreZkRegister-3699-thread-1-processing-n:127.0.0.1:59567_vy_%2Fxq x:collection1 s:shard2 c:tmp_collection r:core_node1) [n:127.0.0.1:59567_vy_%2Fxq c:tmp_collection s:shard2 r:core_node1 x:collection1] o.a.s.c.c.SolrZkClient makePath: /collections/tmp_collection/leaders/shard2
   [junit4]   2> 912209 INFO  (zkCallback-913-thread-1-processing-n:127.0.0.1:59567_vy_%2Fxq) [n:127.0.0.1:59567_vy_%2Fxq    ] o.a.s.h.CdcrProcessStateManager Received new leader state @ tmp_collection:shard2
   [junit4]   2> 912210 INFO  (zkCallback-913-thread-1-processing-n:127.0.0.1:59567_vy_%2Fxq) [n:127.0.0.1:59567_vy_%2Fxq    ] o.a.s.c.DistributedQueue NodeChildrenChanged fired on path /overseer/queue state SyncConnected
   [junit4]   2> 912211 INFO  (OverseerStateUpdate-94281195018780676-127.0.0.1:59567_vy_%2Fxq-n_0000000000) [n:127.0.0.1:59567_vy_%2Fxq    ] o.a.s.c.Overseer processMessage: queueSize: 1, message = {
   [junit4]   2>   "operation":"leader",
   [junit4]   2>   "shard":"shard2",
   [junit4]   2>   "collection":"tmp_collection",
   [junit4]   2>   "base_url":"http://127.0.0.1:59567/vy_/xq",
   [junit4]   2>   "core":"collection1",
   [junit4]   2>   "state":"active"} current state version: 1
   [junit4]   2> 912312 INFO  (zkCallback-913-thread-1-processing-n:127.0.0.1:59567_vy_%2Fxq) [n:127.0.0.1:59567_vy_%2Fxq    ] o.a.s.c.c.ZkStateReader A cluster state change: WatchedEvent state:SyncConnected type:NodeDataChanged path:/clusterstate.json, has occurred - updating... (live nodes size: 1)
   [junit4]   2> 912313 INFO  (zkCallback-913-thread-1-processing-n:127.0.0.1:59567_vy_%2Fxq) [n:127.0.0.1:59567_vy_%2Fxq    ] o.a.s.c.c.ZkStateReader Updated cluster state version to 2
   [junit4]   2> 912361 INFO  (coreZkRegister-3699-thread-1-processing-n:127.0.0.1:59567_vy_%2Fxq x:collection1 s:shard2 c:tmp_collection r:core_node1) [n:127.0.0.1:59567_vy_%2Fxq c:tmp_collection s:shard2 r:core_node1 x:collection1] o.a.s.c.ZkController We are http://127.0.0.1:59567/vy_/xq/collection1/ and leader is http://127.0.0.1:59567/vy_/xq/collection1/
   [junit4]   2> 912361 INFO  (coreZkRegister-3699-thread-1-processing-n:127.0.0.1:59567_vy_%2Fxq x:collection1 s:shard2 c:tmp_collection r:core_node1) [n:127.0.0.1:59567_vy_%2Fxq c:tmp_collection s:shard2 r:core_node1 x:collection1] o.a.s.c.ZkController No LogReplay needed for core=collection1 baseURL=http://127.0.0.1:59567/vy_/xq
   [junit4]   2> 912361 INFO  (coreZkRegister-3699-thread-1-processing-n:127.0.0.1:59567_vy_%2Fxq x:collection1 s:shard2 c:tmp_collection r:core_node1) [n:127.0.0.1:59567_vy_%2Fxq c:tmp_collection s:shard2 r:core_node1 x:collection1] o.a.s.c.ZkController I am the leader, no recovery necessary
   [junit4]   2> 912361 INFO  (coreZkRegister-3699-thread-1-processing-n:127.0.0.1:59567_vy_%2Fxq x:collection1 s:shard2 c:tmp_collection r:core_node1) [n:127.0.0.1:59567_vy_%2Fxq c:tmp_collection s:shard2 r:core_node1 x:collection1] o.a.s.c.ZkController publishing state=active
   [junit4]   2> 912361 INFO  (coreZkRegister-3699-thread-1-processing-n:127.0.0.1:59567_vy_%2Fxq x:collection1 s:shard2 c:tmp_collection r:core_node1) [n:127.0.0.1:59567_vy_%2Fxq c:tmp_collection s:shard2 r:core_node1 x:collection1] o.a.s.c.ZkController numShards not found on descriptor - reading it from system property
   [junit4]   2> 912362 INFO  (zkCallback-913-thread-1-processing-n:127.0.0.1:59567_vy_%2Fxq) [n:127.0.0.1:59567_vy_%2Fxq    ] o.a.s.c.DistributedQueue NodeChildrenChanged fired on path /overseer/queue state SyncConnected
   [junit4]   2> 912363 INFO  (OverseerStateUpdate-94281195018780676-127.0.0.1:59567_vy_%2Fxq-n_0000000000) [n:127.0.0.1:59567_vy_%2Fxq    ] o.a.s.c.Overseer processMessage: queueSize: 1, message = {
   [junit4]   2>   "core":"collection1",
   [junit4]   2>   "core_node_name":"core_node1",
   [junit4]   2>   "roles":null,
   [junit4]   2>   "base_url":"http://127.0.0.1:59567/vy_/xq",
   [junit4]   2>   "node_name":"127.0.0.1:59567_vy_%2Fxq",
   [junit4]   2>   "numShards":"2",
   [junit4]   2>   "state":"active",
   [junit4]   2>   "shard":"shard2",
   [junit4]   2>   "collection":"tmp_collection",
   [junit4]   2>   "operation":"state"} current state version: 2
   [junit4]   2> 912363 INFO  (OverseerStateUpdate-94281195018780676-127.0.0.1:59567_vy_%2Fxq-n_0000000000) [n:127.0.0.1:59567_vy_%2Fxq    ] o.a.s.c.o.ReplicaMutator Update state numShards=2 message={
   [junit4]   2>   "core":"collection1",
   [junit4]   2>   "core_node_name":"core_node1",
   [junit4]   2>   "roles":null,
   [junit4]   2>   "base_url":"http://127.0.0.1:59567/vy_/xq",
   [junit4]   2>   "node_name":"127.0.0.1:59567_vy_%2Fxq",
   [junit4]   2>   "numShards":"2",
   [junit4]   2>   "state":"active",
   [junit4]   2>   "shard":"shard2",
   [junit4]   2>   "collection":"tmp_collection",
   [junit4]   2>   "operation":"state"}
   [junit4]   2> 912464 INFO  (zkCallback-913-thread-1-processing-n:127.0.0.1:59567_vy_%2Fxq) [n:127.0.0.1:59567_vy_%2Fxq    ] o.a.s.c.c.ZkStateReader A cluster state change: WatchedEvent state:SyncConnected type:NodeDataChanged path:/clusterstate.json, has occurred - updating... (live nodes size: 1)
   [junit4]   2> 912465 INFO  (zkCallback-913-thread-1-processing-n:127.0.0.1:59567_vy_%2Fxq) [n:127.0.0.1:59567_vy_%2Fxq    ] o.a.s.c.c.ZkStateReader Updated cluster state version to 3
   [junit4]   2> 912644 INFO  (TEST-CdcrReplicationDistributedZkTest.doTests-seed#[9B17B83096A8FC9A]) [    ] o.a.s.SolrTestCaseJ4 Writing core.properties file to /home/jenkins/workspace/Lucene-Solr-trunk-Linux/solr/build/solr-core/test/J1/temp/solr.cloud.CdcrReplicationDistributedZkTest_9B17B83096A8FC9A-001/jetty-002/cores/collection1
   [junit4]   2> 912645 INFO  (TEST-CdcrReplicationDistributedZkTest.doTests-seed#[9B17B83096A8FC9A]) [    ] o.e.j.s.Server jetty-9.2.11.v20150529
   [junit4]   2> 912645 INFO  (TEST-CdcrReplicationDistributedZkTest.doTests-seed#[9B17B83096A8FC9A]) [    ] o.e.j.s.h.ContextHandler Started o.e.j.s.ServletContextHandler@16db102{/vy_/xq,null,AVAILABLE}
   [junit4]   2> 912646 INFO  (TEST-CdcrReplicationDistributedZkTest.doTests-seed#[9B17B83096A8FC9A]) [    ] o.e.j.s.ServerConnector Started ServerConnector@10458aa{HTTP/1.1}{127.0.0.1:42520}
   [junit4]   2> 912646 INFO  (TEST-CdcrReplicationDistributedZkTest.doTests-seed#[9B17B83096A8FC9A]) [    ] o.e.j.s.Server Started @914493ms
   [junit4]   2> 912646 INFO  (TEST-CdcrReplicationDistributedZkTest.doTests-seed#[9B17B83096A8FC9A]) [    ] o.a.s.c.s.e.JettySolrRunner Jetty properties: {shards=shard2, hostContext=/vy_/xq, hostPort=42520, coreRootDirectory=/home/jenkins/workspace/Lucene-Solr-trunk-Linux/solr/build/solr-core/test/J1/temp/solr.cloud.CdcrReplicationDistributedZkTest_9B17B83096A8FC9A-001/jetty-002/cores}
   [junit4]   2> 912646 INFO  (TEST-CdcrReplicationDistributedZkTest.doTests-seed#[9B17B83096A8FC9A]) [    ] o.a.s.s.SolrDispatchFilter SolrDispatchFilter.init(): sun.misc.Launcher$AppClassLoader@19ebb3d
   [junit4]   2> 912646 INFO  (TEST-CdcrReplicationDistributedZkTest.doTests-seed#[9B17B83096A8FC9A]) [    ] o.a.s.c.SolrResourceLoader new SolrResourceLoader for directory: '/home/jenkins/workspace/Lucene-Solr-trunk-Linux/solr/build/solr-core/test/J1/temp/solr.cloud.CdcrReplicationDistributedZkTest_9B17B83096A8FC9A-001/jetty-002/'
   [junit4]   2> 912655 INFO  (TEST-CdcrReplicationDistributedZkTest.doTests-seed#[9B17B83096A8FC9A]) [    ] o.a.s.c.c.SolrZkClient Using default ZkCredentialsProvider
   [junit4]   2> 912655 INFO  (TEST-CdcrReplicationDistributedZkTest.doTests-seed#[9B17B83096A8FC9A]) [    ] o.a.s.c.c.ConnectionManager Waiting for client to connect to ZooKeeper
   [junit4]   2> 912656 INFO  (zkCallback-914-thread-1) [    ] o.a.s.c.c.ConnectionManager Watcher org.apache.solr.common.cloud.ConnectionManager@1f01a03 name:ZooKeeperConnection Watcher:127.0.0.1:46098/solr got event WatchedEvent state:SyncConnected type:None path:null path:null type:None
   [junit4]   2> 912656 INFO  (TEST-CdcrReplicationDistributedZkTest.doTests-seed#[9B17B83096A8FC9A]) [    ] o.a.s.c.c.ConnectionManager Client is connected to ZooKeeper
   [junit4]   2> 912656 INFO  (TEST-CdcrReplicationDistributedZkTest.doTests-seed#[9B17B83096A8FC9A]) [    ] o.a.s.c.c.SolrZkClient Using default ZkACLProvider
   [junit4]   2> 912657 INFO  (TEST-CdcrReplicationDistributedZkTest.doTests-seed#[9B17B83096A8FC9A]) [    ] o.a.s.s.SolrDispatchFilter Loading solr.xml from SolrHome (not found in ZooKeeper)
   [junit4]   2> 912657 INFO  (TEST-CdcrReplicationDistributedZkTest.doTests-seed#[9B17B83096A8FC9A]) [    ] o.a.s.c.SolrXmlConfig Loading container configuration from /home/jenkins/workspace/Lucene-Solr-trunk-Linux/solr/build/solr-core/test/J1/temp/solr.cloud.CdcrReplicationDistributedZkTest_9B17B83096A8FC9A-001/jetty-002/solr.xml
   [junit4]   2> 912659 INFO  (TEST-CdcrReplicationDistributedZkTest.doTests-seed#[9B17B83096A8FC9A]) [    ] o.a.s.c.CoresLocator Config-defined core root directory: /home/jenkins/workspace/Lucene-Solr-trunk-Linux/solr/build/solr-core/test/J1/temp/solr.cloud.CdcrReplicationDistributedZkTest_9B17B83096A8FC9A-001/jetty-002/cores
   [junit4]   2> 912660 INFO  (TEST-CdcrReplicationDistributedZkTest.doTests-seed#[9B17B83096A8FC9A]) [    ] o.a.s.c.CoreContainer New CoreContainer 15271294
   [junit4]   2> 912660 INFO  (TEST-CdcrReplicationDistributedZkTest.doTests-seed#[9B17B83096A8FC9A]) [    ] o.a.s.c.CoreContainer Loading cores into CoreContainer [instanceDir=/home/jenkins/workspace/Lucene-Solr-trunk-Linux/solr/build/solr-core/test/J1/temp/solr.cloud.CdcrReplicationDistributedZkTest_9B17B83096A8FC9A-001/jetty-002/]
   [junit4]   2> 912660 INFO  (TEST-CdcrReplicationDistributedZkTest.doTests-seed#[9B17B83096A8FC9A]) [    ] o.a.s.c.CoreContainer loading shared library: /home/jenkins/workspace/Lucene-Solr-trunk-Linux/solr/build/solr-core/test/J1/temp/solr.cloud.CdcrReplicationDistributedZkTest_9B17B83096A8FC9A-001/jetty-002/lib
   [junit4]   2> 912660 WARN  (TEST-CdcrReplicationDistributedZkTest.doTests-seed#[9B17B83096A8FC9A]) [    ] o.a.s.c.SolrResourceLoader Can't find (or read) directory to add to classloader: lib (resolved as: /home/jenkins/workspace/Lucene-Solr-trunk-Linux/solr/build/solr-core/test/J1/temp/solr.cloud.CdcrReplicationDistributedZkTest_9B17B83096A8FC9A-001/jetty-002/lib).
   [junit4]   2> 912664 INFO  (TEST-CdcrReplicationDistributedZkTest.doTests-seed#[9B17B83096A8FC9A]) [    ] o.a.s.h.c.HttpShardHandlerFactory created with socketTimeout : 90000,urlScheme : ,connTimeout : 15000,maxConnectionsPerHost : 20,maxConnections : 10000,corePoolSize : 0,maximumPoolSize : 2147483647,maxThreadIdleTime : 5,sizeOfQueue : -1,fairnessPolicy : false,useRetries : false,
   [junit4]   2> 912665 INFO  (TEST-CdcrReplicationDistributedZkTest.doTests-seed#[9B17B83096A8FC9A]) [    ] o.a.s.u.UpdateShardHandler Creating UpdateShardHandler HTTP client with params: socketTimeout=340000&connTimeout=45000&retry=true
   [junit4]   2> 912665 INFO  (TEST-CdcrReplicationDistributedZkTest.doTests-seed#[9B17B83096A8FC9A]) [    ] o.a.s.l.LogWatcher SLF4J impl is org.slf4j.impl.Log4jLoggerFactory
   [junit4]   2> 912666 INFO  (TEST-CdcrReplicationDistributedZkTest.doTests-seed#[9B17B83096A8FC9A]) [    ] o.a.s.l.LogWatcher Registering Log Listener [Log4j (org.slf4j.impl.Log4jLoggerFactory)]
   [junit4]   2> 912666 INFO  (TEST-CdcrReplicationDistributedZkTest.doTests-seed#[9B17B83096A8FC9A]) [    ] o.a.s.c.ZkContainer Zookeeper client=127.0.0.1:46098/solr
   [junit4]   2> 912666 INFO  (TEST-CdcrReplicationDistributedZkTest.doTests-seed#[9B17B83096A8FC9A]) [    ] o.a.s.c.ZkController zkHost includes chroot
   [junit4]   2> 912666 INFO  (TEST-CdcrReplicationDistributedZkTest.doTests-seed#[9B17B83096A8FC9A]) [    ] o.a.s.c.c.SolrZkClient Using default ZkCredentialsProvider
   [junit4]   2> 912666 INFO  (TEST-CdcrReplicationDistributedZkTest.doTests-seed#[9B17B83096A8FC9A]) [    ] o.a.s.c.c.ConnectionManager Waiting for client to connect to ZooKeeper
   [junit4]   2> 912667 INFO  (zkCallback-916-thread-1) [    ] o.a.s.c.c.ConnectionManager Watcher org.apache.solr.common.cloud.ConnectionManager@105e742 name:ZooKeeperConnection Watcher:127.0.0.1:46098 got event WatchedEvent state:SyncConnected type:None path:null path:null type:None
   [junit4]   2> 912667 INFO  (TEST-CdcrReplicationDistributedZkTest.doTests-seed#[9B17B83096A8FC9A]) [    ] o.a.s.c.c.ConnectionManager Client is connected to ZooKeeper
   [junit4]   2> 912667 INFO  (TEST-CdcrReplicationDistributedZkTest.doTests-seed#[9B17B83096A8FC9A]) [    ] o.a.s.c.c.SolrZkClient Using default ZkACLProvider
   [junit4]   2> 912668 INFO  (TEST-CdcrReplicationDistributedZkTest.doTests-seed#[9B17B83096A8FC9A]) [n:127.0.0.1:42520_vy_%2Fxq    ] o.a.s.c.c.ConnectionManager Waiting for client to connect to ZooKeeper
   [junit4]   2> 912668 INFO  (zkCallback-917-thread-1-processing-n:127.0.0.1:42520_vy_%2Fxq) [n:127.0.0.1:42520_vy_%2Fxq    ] o.a.s.c.c.ConnectionManager Watcher org.apache.solr.common.cloud.ConnectionManager@1846246 name:ZooKeeperConnection Watcher:127.0.0.1:46098/solr got event WatchedEvent state:SyncConnected type:None path:null path:null type:None
   [junit4]   2> 912668 INFO  (TEST-CdcrReplicationDistributedZkTest.doTests-seed#[9B17B83096A8FC9A]) [n:127.0.0.1:42520_vy_%2Fxq    ] o.a.s.c.c.ConnectionManager Client is connected to ZooKeeper
   [junit4]   2> 912671 INFO  (TEST-CdcrReplicationDistributedZkTest.doTests-seed#[9B17B83096A8FC9A]) [n:127.0.0.1:42520_vy_%2Fxq    ] o.a.s.c.c.ZkStateReader Updating cluster state from ZooKeeper... 
   [junit4]   2> 913672 INFO  (TEST-CdcrReplicationDistributedZkTest.doTests-seed#[9B17B83096A8FC9A]) [n:127.0.0.1:42520_vy_%2Fxq    ] o.a.s.c.ZkController Register node as live in ZooKeeper:/live_nodes/127.0.0.1:42520_vy_%2Fxq
   [junit4]   2> 913673 INFO  (TEST-CdcrReplicationDistributedZkTest.doTests-seed#[9B17B83096A8FC9A]) [n:127.0.0.1:42520_vy_%2Fxq    ] o.a.s.c.c.SolrZkClient makePath: /live_nodes/127.0.0.1:42520_vy_%2Fxq
   [junit4]   2> 913674 INFO  (TEST-CdcrReplicationDistributedZkTest.doTests-seed#[9B17B83096A8FC9A]) [n:127.0.0.1:42520_vy_%2Fxq    ] o.a.s.c.Overseer Overseer (id=null) closing
   [junit4]   2> 913674 INFO  (TEST-CdcrReplicationDistributedZkTest.doTests-seed#[9B17B83096A8FC9A]) [n:127.0.0.1:42520_vy_%2Fxq    ] o.a.s.c.LeaderElector Joined leadership election with path: /overseer_elect/election/94281195018780679-127.0.0.1:42520_vy_%2Fxq-n_0000000001
   [junit4]   2> 913675 INFO  (TEST-CdcrReplicationDistributedZkTest.doTests-seed#[9B17B83096A8FC9A]) [n:127.0.0.1:42520_vy_%2Fxq    ] o.a.s.c.LeaderElector Watching path /overseer_elect/election/94281195018780676-127.0.0.1:59567_vy_%2Fxq-n_0000000000 to know if I could be the leader
   [junit4]   2> 913675 INFO  (TEST-CdcrReplicationDistributedZkTest.doTests-seed#[9B17B83096A8FC9A]) [n:127.0.0.1:42520_vy_%2Fxq    ] o.a.s.c.CoreContainer No authentication plugin used.
   [junit4]   2> 913675 INFO  (TEST-CdcrReplicationDistributedZkTest.doTests-seed#[9B17B83096A8FC9A]) [n:127.0.0.1:42520_vy_%2Fxq    ] o.a.s.c.CoreContainer Security conf doesn't exist. Skipping setup for authorization module.
   [junit4]   2> 913675 INFO  (TEST-CdcrReplicationDistributedZkTest.doTests-seed#[9B17B83096A8FC9A]) [n:127.0.0.1:42520_vy_%2Fxq    ] o.a.s.c.CoresLocator Looking for core definitions underneath /home/jenkins/workspace/Lucene-Solr-trunk-Linux/solr/build/solr-core/test/J1/temp/solr.cloud.CdcrReplicationDistributedZkTest_9B17B83096A8FC9A-001/jetty-002/cores
   [junit4]   2> 913676 INFO  (TEST-CdcrReplicationDistributedZkTest.doTests-seed#[9B17B83096A8FC9A]) [n:127.0.0.1:42520_vy_%2Fxq    ] o.a.s.c.SolrCore Created CoreDescriptor: {name=collection1, config=solrconfig.xml, transient=false, schema=schema.xml, loadOnStartup=true, configSetProperties=configsetprops.json, instanceDir=/home/jenkins/workspace/Lucene-Solr-trunk-Linux/solr/build/solr-core/test/J1/temp/solr.cloud.CdcrReplicationDistributedZkTest_9B17B83096A8FC9A-001/jetty-002/cores/collection1, collection=tmp_collection, absoluteInstDir=/home/jenkins/workspace/Lucene-Solr-trunk-Linux/solr/build/solr-core/test/J1/temp/solr.cloud.CdcrReplicationDistributedZkTest_9B17B83096A8FC9A-001/jetty-002/cores/collection1/, coreNodeName=, dataDir=data/, shard=}
   [junit4]   2> 913676 INFO  (TEST-CdcrReplicationDistributedZkTest.doTests-seed#[9B17B83096A8FC9A]) [n:127.0.0.1:42520_vy_%2Fxq    ] o.a.s.c.CoresLocator Found core collection1 in /home/jenkins/workspace/Lucene-Solr-trunk-Linux/solr/build/solr-core/test/J1/temp/solr.cloud.CdcrReplicationDistributedZkTest_9B17B83096A8FC9A-001/jetty-002/cores/collection1/
   [junit4]   2> 913676 INFO  (TEST-CdcrReplicationDistributedZkTest.doTests-seed#[9B17B83096A8FC9A]) [n:127.0.0.1:42520_vy_%2Fxq    ] o.a.s.c.CoresLocator Found 1 core definitions
   [junit4]   2> 913676 INFO  (coreLoadExecutor-3717-thread-1-processing-n:127.0.0.1:42520_vy_%2Fxq) [n:127.0.0.1:42520_vy_%2Fxq c:tmp_collection   x:collection1] o.a.s.c.ZkController publishing state=down
   [junit4]   2> 913677 INFO  (coreLoadExecutor-3717-thread-1-processing-n:127.0.0.1:42520_vy_%2Fxq) [n:127.0.0.1:42520_vy_%2Fxq c:tmp_collection   x:collection1] o.a.s.c.ZkController numShards not found on descriptor - reading it from system property
   [junit4]   2> 913677 INFO  (TEST-CdcrReplicationDistributedZkTest.doTests-seed#[9B17B83096A8FC9A]) [n:127.0.0.1:42520_vy_%2Fxq    ] o.a.s.s.SolrDispatchFilter user.dir=/home/jenkins/workspace/Lucene-Solr-trunk-Linux/solr/build/solr-core/test/J1
   [junit4]   2> 913677 INFO  (TEST-CdcrReplicationDistributedZkTest.doTests-seed#[9B17B83096A8FC9A]) [n:127.0.0.1:42520_vy_%2Fxq    ] o.a.s.s.SolrDispatchFilter SolrDispatchFilter.init() done
   [junit4]   2> 913677 INFO  (zkCallback-913-thread-1-processing-n:127.0.0.1:59567_vy_%2Fxq) [n:127.0.0.1:59567_vy_%2Fxq    ] o.a.s.c.DistributedQueue NodeChildrenChanged fired on path /overseer/queue state SyncConnected
   [junit4]   2> 913677 INFO  (coreLoadExecutor-3717-thread-1-processing-n:127.0.0.1:42520_vy_%2Fxq) [n:127.0.0.1:42520_vy_%2Fxq c:tmp_collection   x:collection1] o.a.s.c.ZkController look for our core node name
   [junit4]   2> 913677 INFO  (OverseerStateUpdate-94281195018780676-127.0.0.1:59567_vy_%2Fxq-n_0000000000) [n:127.0.0.1:59567_vy_%2Fxq    ] o.a.s.c.Overseer processMessage: queueSize: 1, message = {
   [junit4]   2>   "core":"collection1",
   [junit4]   2>   "roles":null,
   [junit4]   2>   "base_url":"http://127.0.0.1:42520/vy_/xq",
   [junit4]   2>   "node_name":"127.0.0.1:42520_vy_%2Fxq",
   [junit4]   2>   "numShards":"2",
   [junit4]   2>   "state":"down",
   [junit4]   2>   "shard":null,
   [junit4]   2>   "collection":"tmp_collection",
   [junit4]   2>   "operation":"state"} current state version: 3
   [junit4]   2> 913678 INFO  (OverseerStateUpdate-94281195018780676-127.0.0.1:59567_vy_%2Fxq-n_0000000000) [n:127.0.0.1:59567_vy_%2Fxq    ] o.a.s.c.o.ReplicaMutator Update state numShards=2 message={
   [junit4]   2>   "core":"collection1",
   [junit4]   2>   "roles":null,
   [junit4]   2>   "base_url":"http://127.0.0.1:42520/vy_/xq",
   [junit4]   2>   "node_name":"127.0.0.1:42520_vy_%2Fxq",
   [junit4]   2>   "numShards":"2",
   [junit4]   2>   "state":"down",
   [junit4]   2>   "shard":null,
   [junit4]   2>   "collection":"tmp_collection",
   [junit4]   2>   "operation":"state"}
   [junit4]   2> 913678 INFO  (OverseerStateUpdate-94281195018780676-127.0.0.1:59567_vy_%2Fxq-n_0000000000) [n:127.0.0.1:59567_vy_%2Fxq    ] o.a.s.c.o.ReplicaMutator Collection already exists with numShards=2
   [junit4]   2> 913678 INFO  (OverseerStateUpdate-94281195018780676-127.0.0.1:59567_vy_%2Fxq-n_0000000000) [n:127.0.0.1:59567_vy_%2Fxq    ] o.a.s.c.o.ReplicaMutator Assigning new node to shard shard=shard1
   [junit4]   2> 913779 INFO  (zkCallback-913-thread-1-processing-n:127.0.0.1:59567_vy_%2Fxq) [n:127.0.0.1:59567_vy_%2Fxq    ] o.a.s.c.c.ZkStateReader A cluster state change: WatchedEvent state:SyncConnected type:NodeDataChanged path:/clusterstate.json, has occurred - updating... (live nodes size: 2)
   [junit4]   2> 913779 INFO  (zkCallback-917-thread-1-processing-n:127.0.0.1:42520_vy_%2Fxq) [n:127.0.0.1:42520_vy_%2Fxq    ] o.a.s.c.c.ZkStateReader A cluster state change: WatchedEvent state:SyncConnected type:NodeDataChanged path:/clusterstate.json, has occurred - updating... (live nodes size: 2)
   [junit4]   2> 913780 INFO  (zkCallback-913-thread-1-processing-n:127.0.0.1:59567_vy_%2Fxq) [n:127.0.0.1:59567_vy_%2Fxq    ] o.a.s.c.c.ZkStateReader Updated cluster state version to 4
   [junit4]   2> 913780 INFO  (zkCallback-917-thread-1-processing-n:127.0.0.1:42520_vy_%2Fxq) [n:127.0.0.1:42520_vy_%2Fxq    ] o.a.s.c.c.ZkStateReader Updated cluster state version to 4
   [junit4]   2> 914677 INFO  (coreLoadExecutor-3717-thread-1-processing-n:127.0.0.1:42520_vy_%2Fxq) [n:127.0.0.1:42520_vy_%2Fxq c:tmp_collection   x:collection1] o.a.s.c.ZkController waiting to find shard id in clusterstate for collection1
   [junit4]   2> 914677 INFO  (coreLoadExecutor-3717-thread-1-processing-n:127.0.0.1:42520_vy_%2Fxq) [n:127.0.0.1:42520_vy_%2Fxq c:tmp_collection   x:collection1] o.a.s.c.ZkController Check for collection zkNode:tmp_collection
   [junit4]   2> 914678 INFO  (coreLoadExecutor-3717-thread-1-processing-n:127.0.0.1:42520_vy_%2Fxq) [n:127.0.0.1:42520_vy_%2Fxq c:tmp_collection   x:collection1] o.a.s.c.ZkController Collection zkNode exists
   [junit4]   2> 914678 INFO  (coreLoadExecutor-3717-thread-1-processing-n:127.0.0.1:42520_vy_%2Fxq) [n:127.0.0.1:42520_vy_%2Fxq c:tmp_collection   x:collection1] o.a.s.c.c.ZkStateReader Load collection config from:/collections/tmp_collection
   [junit4]   2> 914678 INFO  (coreLoadExecutor-3717-thread-1-processing-n:127.0.0.1:42520_vy_%2Fxq) [n:127.0.0.1:42520_vy_%2Fxq c:tmp_collection   x:collection1] o.a.s.c.c.ZkStateReader path=/collections/tmp_collection configName=conf1 specified config exists in ZooKeeper
   [junit4]   2> 914678 INFO  (coreLoadExecutor-3717-thread-1-processing-n:127.0.0.1:42520_vy_%2Fxq) [n:127.0.0.1:42520_vy_%2Fxq c:tmp_collection   x:collection1] o.a.s.c.SolrResourceLoader new SolrResourceLoader for directory: '/home/jenkins/workspace/Lucene-Solr-trunk-Linux/solr/build/solr-core/test/J1/temp/solr.cloud.CdcrReplicationDistributedZkTest_9B17B83096A8FC9A-001/jetty-002/cores/collection1/'
   [junit4]   2> 914685 INFO  (coreLoadExecutor-3717-thread-1-processing-n:127.0.0.1:42520_vy_%2Fxq) [n:127.0.0.1:42520_vy_%2Fxq c:tmp_collection   x:collection1] o.a.s.c.Config loaded config solrconfig.xml with version 0 
   [junit4]   2> 914688 INFO  (coreLoadExecutor-3717-thread-1-processing-n:127.0.0.1:42520_vy_%2Fxq) [n:127.0.0.1:42520_vy_%2Fxq c:tmp_collection   x:collection1] o.a.s.c.SolrConfig current version of requestparams : -1
   [junit4]   2> 914689 INFO  (coreLoadExecutor-3717-thread-1-processing-n:127.0.0.1:42520_vy_%2Fxq) [n:127.0.0.1:42520_vy_%2Fxq c:tmp_collection   x:collection1] o.a.s.c.SolrConfig Using Lucene MatchVersion: 6.0.0
   [junit4]   2> 914693 INFO  (coreLoadExecutor-3717-thread-1-processing-n:127.0.0.1:42520_vy_%2Fxq) [n:127.0.0.1:42520_vy_%2Fxq c:tmp_collection   x:collection1] o.a.s.c.Config Loaded SolrConfig: solrconfig.xml
   [junit4]   2> 914693 INFO  (coreLoadExecutor-3717-thread-1-processing-n:127.0.0.1:42520_vy_%2Fxq) [n:127.0.0.1:42520_vy_%2Fxq c:tmp_collection   x:collection1] o.a.s.s.IndexSchema Reading Solr Schema from /configs/conf1/schema.xml
   [junit4]   2> 914696 INFO  (coreLoadExecutor-3717-thread-1-processing-n:127.0.0.1:42520_vy_%2Fxq) [n:127.0.0.1:42520_vy_%2Fxq c:tmp_collection   x:collection1] o.a.s.s.IndexSchema [collection1] Schema name=test
   [junit4]   2> 914751 INFO  (coreLoadExecutor-3717-thread-1-processing-n:127.0.0.1:42520_vy_%2Fxq) [n:127.0.0.1:42520_vy_%2Fxq c:tmp_collection   x:collection1] o.a.s.s.IndexSchema default search field in schema is text
   [junit4]   2> 914752 INFO  (coreLoadExecutor-3717-thread-1-processing-n:127.0.0.1:42520_vy_%2Fxq) [n:127.0.0.1:42520_vy_%2Fxq c:tmp_collection   x:collection1] o.a.s.s.IndexSchema unique key field: id
   [junit4]   2> 914752 INFO  (coreLoadExecutor-3717-thread-1-processing-n:127.0.0.1:42520_vy_%2Fxq) [n:127.0.0.1:42520_vy_%2Fxq c:tmp_collection   x:collection1] o.a.s.s.FileExchangeRateProvider Reloading exchange rates from file currency.xml
   [junit4]   2> 914770 INFO  (coreLoadExecutor-3717-thread-1-processing-n:127.0.0.1:42520_vy_%2Fxq) [n:127.0.0.1:42520_vy_%2Fxq c:tmp_collection   x:collection1] o.a.s.s.FileExchangeRateProvider Reloading exchange rates from file currency.xml
   [junit4]   2> 914782 INFO  (coreLoadExecutor-3717-thread-1-processing-n:127.0.0.1:42520_vy_%2Fxq) [n:127.0.0.1:42520_vy_%2Fxq c:tmp_collection   x:collection1] o.a.s.c.ConfigSetProperties Did not find ConfigSet properties, assuming default properties: Can't find resource 'configsetprops.json' in classpath or '/configs/conf1', cwd=/home/jenkins/workspace/Lucene-Solr-trunk-Linux/solr/build/solr-core/test/J1
   [junit4]   2> 914782 INFO  (coreLoadExecutor-3717-thread-1-processing-n:127.0.0.1:42520_vy_%2Fxq) [n:127.0.0.1:42520_vy_%2Fxq c:tmp_collection   x:collection1] o.a.s.c.CoreContainer Creating SolrCore 'collection1' using configuration from collection tmp_collection
   [junit4]   2> 914782 INFO  (coreLoadExecutor-3717-thread-1-processing-n:127.0.0.1:42520_vy_%2Fxq) [n:127.0.0.1:42520_vy_%2Fxq c:tmp_collection s:shard1 r:core_node2 x:collection1] o.a.s.c.SolrCore org.apache.solr.core.MockDirectoryFactory
   [junit4]   2> 914782 INFO  (coreLoadExecutor-3717-thread-1-processing-n:127.0.0.1:42520_vy_%2Fxq) [n:127.0.0.1:42520_vy_%2Fxq c:tmp_collection s:shard1 r:core_node2 x:collection1] o.a.s.c.SolrCore [[collection1] ] Opening new SolrCore at [/home/jenkins/workspace/Lucene-Solr-trunk-Linux/solr/build/solr-core/test/J1/temp/solr.cloud.CdcrReplicationDistributedZkTest_9B17B83096A8FC9A-001/jetty-002/cores/collection1/], dataDir=[null]
   [junit4]   2> 914783 INFO  (coreLoadExecutor-3717-thread-1-processing-n:127.0.0.1:42520_vy_%2Fxq) [n:127.0.0.1:42520_vy_%2Fxq c:tmp_collection s:shard1 r:core_node2 x:collection1] o.a.s.c.JmxMonitoredMap JMX monitoring is enabled. Adding Solr mbeans to JMX Server: com.sun.jmx.mbeanserver.JmxMBeanServer@1f455c4
   [junit4]   2> 914783 INFO  (coreLoadExecutor-3717-thread-1-processing-n:127.0.0.1:42520_vy_%2Fxq) [n:127.0.0.1:42520_vy_%2Fxq c:tmp_collection s:shard1 r:core_node2 x:collection1] o.a.s.c.CachingDirectoryFactory return new directory for /home/jenkins/workspace/Lucene-Solr-trunk-Linux/solr/build/solr-core/test/J1/temp/solr.cloud.CdcrReplicationDistributedZkTest_9B17B83096A8FC9A-001/jetty-002/cores/collection1/data
   [junit4]   2> 914783 INFO  (coreLoadExecutor-3717-thread-1-processing-n:127.0.0.1:42520_vy_%2Fxq) [n:127.0.0.1:42520_vy_%2Fxq c:tmp_collection s:shard1 r:core_node2 x:collection1] o.a.s.c.SolrCore New index directory detected: old=null new=/home/jenkins/workspace/Lucene-Solr-trunk-Linux/solr/build/solr-core/test/J1/temp/solr.cloud.CdcrReplicationDistributedZkTest_9B17B83096A8FC9A-001/jetty-002/cores/collection1/data/index/
   [junit4]   2> 914784 WARN  (coreLoadExecutor-3717-thread-1-processing-n:127.0.0.1:42520_vy_%2Fxq) [n:127.0.0.1:42520_vy_%2Fxq c:tmp_collection s:shard1 r:core_node2 x:collection1] o.a.s.c.SolrCore [collection1] Solr index directory '/home/jenkins/workspace/Lucene-Solr-trunk-Linux/solr/build/solr-core/test/J1/temp/solr.cloud.CdcrReplicationDistributedZkTest_9B17B83096A8FC9A-001/jetty-002/cores/collection1/data/index' doesn't exist. Creating new index...
   [junit4]   2> 914784 INFO  (coreLoadExecutor-3717-thread-1-processing-n:127.0.0.1:42520_vy_%2Fxq) [n:127.0.0.1:42520_vy_%2Fxq c:tmp_collection s:shard1 r:core_node2 x:collection1] o.a.s.c.CachingDirectoryFactory return new directory for /home/jenkins/workspace/Lucene-Solr-trunk-Linux/solr/build/solr-core/test/J1/temp/solr.cloud.CdcrReplicationDistributedZkTest_9B17B83096A8FC9A-001/jetty-002/cores/collection1/data/index
   [junit4]   2> 914784 INFO  (coreLoadExecutor-3717-thread-1-processing-n:127.0.0.1:42520_vy_%2Fxq) [n:127.0.0.1:42520_vy_%2Fxq c:tmp_collection s:shard1 r:core_node2 x:collection1] o.a.s.u.RandomMergePolicy RandomMergePolicy wrapping class org.apache.lucene.index.TieredMergePolicy: [TieredMergePolicy: maxMergeAtOnce=10, maxMergeAtOnceExplicit=32, maxMergedSegmentMB=63.748046875, floorSegmentMB=0.974609375, forceMergeDeletesPctAllowed=22.593143116977924, segmentsPerTier=32.0, maxCFSSegmentSizeMB=8.796093022207999E12, noCFSRatio=0.3041561421156552
   [junit4]   2> 914785 INFO  (coreLoadExecutor-3717-thread-1-processing-n:127.0.0.1:42520_vy_%2Fxq) [n:127.0.0.1:42520_vy_%2Fxq c:tmp_collection s:shard1 r:core_node2 x:collection1] o.a.s.c.SolrCore SolrDeletionPolicy.onCommit: commits: num=1
   [junit4]   2> 	commit{dir=MockDirectoryWrapper(RAMDirectory@11048a8 lockFactory=org.apache.lucene.store.SingleInstanceLockFactory@17dd6f3),segFN=segments_1,generation=1}
   [junit4]   2> 914785 INFO  (coreLoadExecutor-3717-thread-1-processing-n:127.0.0.1:42520_vy_%2Fxq) [n:127.0.0.1:42520_vy_%2Fxq c:tmp_collection s:shard1 r:core_node2 x:collection1] o.a.s.c.SolrCore newest commit generation = 1
   [junit4]   2> 914785 INFO  (OldIndexDirectoryCleanupThreadForCore-collection1) [n:127.0.0.1:42520_vy_%2Fxq c:tmp_collection s:shard1 r:core_node2 x:collection1] o.a.s.c.SolrCore Looking for old index directories to cleanup for core collection1 in /home/jenkins/workspace/Lucene-Solr-trunk-Linux/solr/build/solr-core/test/J1/temp/solr.cloud.CdcrReplicationDistributedZkTest_9B17B83096A8FC9A-001/jetty-002/cores/collection1/data/
   [junit4]   2> 914785 WARN  (OldIndexDirectoryCleanupThreadForCore-collection1) [n:127.0.0.1:42520_vy_%2Fxq c:tmp_collection s:shard1 r:core_node2 x:collection1] o.a.s.c.DirectoryFactory /home/jenkins/workspace/Lucene-Solr-trunk-Linux/solr/build/solr-core/test/J1/temp/solr.cloud.CdcrReplicationDistributedZkTest_9B17B83096A8FC9A-001/jetty-002/cores/collection1/data/ does not point to a valid data directory; skipping clean-up of old index directories.
   [junit4]   2> 914789 INFO  (coreLoadExecutor-3717-thread-1-processing-n:127.0.0.1:42520_vy_%2Fxq) [n:127.0.0.1:42520_vy_%2Fxq c:tmp_collection s:shard1 r:core_node2 x:collection1] o.a.s.u.p.UpdateRequestProcessorChain creating updateRequestProcessorChain "cdcr-processor-chain"
   [junit4]   2> 914789 INFO  (coreLoadExecutor-3717-thread-1-processing-n:127.0.0.1:42520_vy_%2Fxq) [n:127.0.0.1:42520_vy_%2Fxq c:tmp_collection s:shard1 r:core_node2 x:collection1] o.a.s.c.SolrCore no updateRequestProcessorChain defined as default, creating implicit default
   [junit4]   2> 914791 INFO  (coreLoadExecutor-3717-thread-1-processing-n:127.0.0.1:42520_vy_%2Fxq) [n:127.0.0.1:42520_vy_%2Fxq c:tmp_collection s:shard1 r:core_node2 x:collection1] o.a.s.h.l.XMLLoader xsltCacheLifetimeSeconds=60
   [junit4]   2> 914792 INFO  (coreLoadExecutor-3717-thread-1-processing-n:127.0.0.1:42520_vy_%2Fxq) [n:127.0.0.1:42520_vy_%2Fxq c:tmp_collection s:shard1 r:core_node2 x:collection1] o.a.s.h.l.XMLLoader xsltCacheLifetimeSeconds=60
   [junit4]   2> 914793 INFO  (coreLoadExecutor-3717-thread-1-processing-n:127.0.0.1:42520_vy_%2Fxq) [n:127.0.0.1:42520_vy_%2Fxq c:tmp_collection s:shard1 r:core_node2 x:collection1] o.a.s.h.l.XMLLoader xsltCacheLifetimeSeconds=60
   [junit4]   2> 914794 INFO  (coreLoadExecutor-3717-thread-1-processing-n:127.0.0.1:42520_vy_%2Fxq) [n:127.0.0.1:42520_vy_%2Fxq c:tmp_collection s:shard1 r:core_node2 x:collection1] o.a.s.h.l.XMLLoader xsltCacheLifetimeSeconds=60
   [junit4]   2> 914798 INFO  (coreLoadExecutor-3717-thread-1-processing-n:127.0.0.1:42520_vy_%2Fxq) [n:127.0.0.1:42520_vy_%2Fxq c:tmp_collection s:shard1 r:core_node2 x:collection1] o.a.s.c.RequestHandlers Registered paths: /admin/mbeans,standard,/update/csv,/update/json/docs,/admin/luke,/admin/segments,/get,/admin/system,/replication,/admin/properties,/config,/schema,/admin/plugins,/admin/logging,/update/json,/admin/threads,/admin/ping,/cdcr,/update,/admin/file
   [junit4]   2> 914799 INFO  (coreLoadExecutor-3717-thread-1-processing-n:127.0.0.1:42520_vy_%2Fxq) [n:127.0.0.1:42520_vy_%2Fxq c:tmp_collection s:shard1 r:core_node2 x:collection1] o.a.s.c.SolrCore Using default statsCache cache: org.apache.solr.search.stats.LocalStatsCache
   [junit4]   2> 914799 INFO  (coreLoadExecutor-3717-thread-1-processing-n:127.0.0.1:42520_vy_%2Fxq) [n:127.0.0.1:42520_vy_%2Fxq c:tmp_collection s:shard1 r:core_node2 x:collection1] o.a.s.u.UpdateHandler Using UpdateLog implementation: org.apache.solr.update.CdcrUpdateLog
   [junit4]   2> 914799 INFO  (coreLoadExecutor-3717-thread-1-processing-n:127.0.0.1:42520_vy_%2Fxq) [n:127.0.0.1:42520_vy_%2Fxq c:tmp_collection s:shard1 r:core_node2 x:collection1] o.a.s.u.UpdateLog Initializing UpdateLog: dataDir= defaultSyncLevel=FLUSH numRecordsToKeep=100 maxNumLogsToKeep=10 numVersionBuckets=65536
   [junit4]   2> 914800 INFO  (coreLoadEx

[...truncated too long message...]

  [junit4]   2> 	80	/solr/configs/conf1
   [junit4]   2> 	36	/solr/collections/source_collection/state.json
   [junit4]   2> 	35	/solr/collections/target_collection/state.json
   [junit4]   2> 	3	/solr/collections/source_collection/leaders/shard1
   [junit4]   2> 	2	/solr/collections/source_collection/leaders/shard2
   [junit4]   2> 	2	/solr/collections/tmp_collection/leaders/shard1
   [junit4]   2> 	2	/solr/collections/tmp_collection/leaders/shard2
   [junit4]   2> 	2	/solr/collections/target_collection/leaders/shard1
   [junit4]   2> 	2	/solr/collections/target_collection/leaders/shard2
   [junit4]   2> 
   [junit4]   2> Maximum concurrent data watches above limit:
   [junit4]   2> 
   [junit4]   2> 	45	/solr/collections/source_collection/cdcr/state/process
   [junit4]   2> 	38	/solr/collections/source_collection/cdcr/state/buffer
   [junit4]   2> 	35	/solr/collections/target_collection/cdcr/state/buffer
   [junit4]   2> 	35	/solr/collections/target_collection/cdcr/state/process
   [junit4]   2> 	8	/solr/collections/tmp_collection/cdcr/state/buffer
   [junit4]   2> 	8	/solr/collections/tmp_collection/cdcr/state/process
   [junit4]   2> 	4	/solr/collections/target_collection/leader_elect/shard2/election/94281195018780694-core_node3-n_0000000000
   [junit4]   2> 	3	/solr/overseer_elect/election/94281195018780700-127.0.0.1:53545_vy_%2Fxq-n_0000000006
   [junit4]   2> 	2	/solr/collections/source_collection/leader_elect/shard1/election/94281195018780679-core_node1-n_0000000000
   [junit4]   2> 	2	/solr/overseer_elect/election/94281195018780740-127.0.0.1:56570_vy_%2Fxq-n_0000000009
   [junit4]   2> 	2	/solr/collections/source_collection/leader_elect/shard2/election/94281195018780685-core_node3-n_0000000000
   [junit4]   2> 	2	/solr/overseer_elect/election/94281195018780816-127.0.0.1:59567_vy_%2Fxq-n_0000000010
   [junit4]   2> 	2	/solr/overseer_elect/election/94281195018780685-127.0.0.1:56083_vy_%2Fxq-n_0000000003
   [junit4]   2> 	2	/solr/collections/source_collection/leader_elect/shard2/election/94281195018780682-core_node2-n_0000000000
   [junit4]   2> 	2	/solr/collections/source_collection/leader_elect/shard1/election/94281195018780682-core_node2-n_0000000000
   [junit4]   2> 	2	/solr/overseer_elect/election/94281195018780697-127.0.0.1:47609_vy_%2Fxq-n_0000000005
   [junit4]   2> 
   [junit4]   2> Maximum concurrent children watches above limit:
   [junit4]   2> 
   [junit4]   2> 	285	/solr/live_nodes
   [junit4]   2> 	6	/solr/overseer/queue
   [junit4]   2> 	6	/solr/overseer/collection-queue-work
   [junit4]   2> 
   [junit4]   2> NOTE: reproduce with: ant test  -Dtestcase=CdcrReplicationDistributedZkTest -Dtests.method=doTests -Dtests.seed=9B17B83096A8FC9A -Dtests.multiplier=3 -Dtests.slow=true -Dtests.locale=en_NZ -Dtests.timezone=CAT -Dtests.asserts=true -Dtests.file.encoding=UTF-8
   [junit4] FAILURE  355s J1 | CdcrReplicationDistributedZkTest.doTests <<<
   [junit4]    > Throwable #1: java.lang.AssertionError: Timeout while trying to assert update logs @ collection=source_collection
   [junit4]    > 	at __randomizedtesting.SeedInfo.seed([9B17B83096A8FC9A:9377CD1C99A6D491]:0)
   [junit4]    > 	at org.apache.solr.cloud.CdcrReplicationDistributedZkTest.assertNumberOfTlogFiles(CdcrReplicationDistributedZkTest.java:644)
   [junit4]    > 	at org.apache.solr.cloud.CdcrReplicationDistributedZkTest.doTestUpdateLogSynchronisation(CdcrReplicationDistributedZkTest.java:384)
   [junit4]    > 	at org.apache.solr.cloud.CdcrReplicationDistributedZkTest.doTests(CdcrReplicationDistributedZkTest.java:50)
   [junit4]    > 	at org.apache.solr.BaseDistributedSearchTestCase$ShardsRepeatRule$ShardsFixedStatement.callStatement(BaseDistributedSearchTestCase.java:966)
   [junit4]    > 	at org.apache.solr.BaseDistributedSearchTestCase$ShardsRepeatRule$ShardsStatement.evaluate(BaseDistributedSearchTestCase.java:941)
   [junit4]    > 	at java.lang.Thread.run(Thread.java:745)
   [junit4]    > Caused by: java.lang.AssertionError: Number of tlogs on replica: 67 is superior to: 50.
   [junit4]    > 	at org.apache.solr.cloud.CdcrReplicationDistributedZkTest._assertNumberOfTlogFiles(CdcrReplicationDistributedZkTest.java:674)
   [junit4]    > 	at org.apache.solr.cloud.CdcrReplicationDistributedZkTest.assertNumberOfTlogFiles(CdcrReplicationDistributedZkTest.java:634)
   [junit4]    > 	... 43 more
   [junit4]   2> 1265351 INFO  (SUITE-CdcrReplicationDistributedZkTest-seed#[9B17B83096A8FC9A]-worker) [n:127.0.0.1:56570_vy_%2Fxq c:target_collection s:shard1 r:core_node1 x:target_collection_shard1_replica1] o.a.s.SolrTestCaseJ4 ###deleteCore
   [junit4]   2> NOTE: leaving temporary files on disk at: /home/jenkins/workspace/Lucene-Solr-trunk-Linux/solr/build/solr-core/test/J1/temp/solr.cloud.CdcrReplicationDistributedZkTest_9B17B83096A8FC9A-001
   [junit4]   2> Aug 03, 2015 3:53:41 PM com.carrotsearch.randomizedtesting.ThreadLeakControl checkThreadLeaks
   [junit4]   2> WARNING: Will linger awaiting termination of 1 leaked thread(s).
   [junit4]   2> NOTE: test params are: codec=Asserting(Lucene53): {_version_=FST50, id=PostingsFormat(name=LuceneVarGapFixedInterval)}, docValues:{}, sim=DefaultSimilarity, locale=en_NZ, timezone=CAT
   [junit4]   2> NOTE: Linux 3.16.0-44-generic i386/Oracle Corporation 1.9.0-ea (32-bit)/cpus=12,threads=1,free=110160008,total=402542592
   [junit4]   2> NOTE: All tests run in this JVM: [TestPivotHelperCode, TestSuggestSpellingConverter, DocumentBuilderTest, AnalyticsMergeStrategyTest, TestCoreContainer, TestRequestStatusCollectionAPI, TestSchemaNameResource, TestManagedSchema, FieldMutatingUpdateProcessorTest, TestLMDirichletSimilarityFactory, SolrPluginUtilsTest, CoreAdminHandlerTest, SolrTestCaseJ4Test, BlockDirectoryTest, HdfsWriteToMultipleCollectionsTest, DistributedFacetPivotLongTailTest, TestCloudInspectUtil, TestFiltering, TestMiniSolrCloudCluster, SmileWriterTest, AnalysisAfterCoreReloadTest, TestJsonFacets, TestFreeTextSuggestions, TestInitQParser, PreAnalyzedFieldTest, TestNonDefinedSimilarityFactory, TestSchemaSimilarityResource, TestCharFilters, TestShardHandlerFactory, TestScoreJoinQPScore, RecoveryAfterSoftCommitTest, TestWriterPerf, DocumentAnalysisRequestHandlerTest, SpellPossibilityIteratorTest, ZkStateWriterTest, TestChildDocTransformer, TestBulkSchemaAPI, SolrCmdDistributorTest, CurrencyFieldOpenExchangeTest, TestJsonRequest, TestReplicationHandlerBackup, TestConfigReload, SaslZkACLProviderTest, RequiredFieldsTest, TestFieldSortValues, TestCloudPivotFacet, AlternateDirectoryTest, ZkControllerTest, SuggesterTSTTest, TestFastLRUCache, TestAnalyzedSuggestions, TestElisionMultitermQuery, TestHashPartitioner, HdfsThreadLeakTest, DeleteLastCustomShardedReplicaTest, ShowFileRequestHandlerTest, TestCollapseQParserPlugin, BadComponentTest, SharedFSAutoReplicaFailoverTest, OpenCloseCoreStressTest, WordBreakSolrSpellCheckerTest, DocValuesMultiTest, CdcrRequestHandlerTest, TestStressVersions, CursorMarkTest, JsonLoaderTest, TestIntervalFaceting, DisMaxRequestHandlerTest, FileUtilsTest, DistributedVersionInfoTest, TestSearchPerf, TestSolrDeletionPolicy2, UUIDUpdateProcessorFallbackTest, BitVectorTest, EnumFieldTest, ShardRoutingTest, TestNamedUpdateProcessors, NoCacheHeaderTest, ShardRoutingCustomTest, ClusterStateUpdateTest, DirectSolrConnectionTest, HdfsNNFailoverTest, TestRandomRequestDistribution, DistanceUnitsTest, IndexSchemaRuntimeFieldTest, TestStressUserVersions, BasicDistributedZkTest, SyncSliceTest, ZkSolrClientTest, ZkCLITest, TestDistributedGrouping, HardAutoCommitTest, SimpleFacetsTest, SpellCheckComponentTest, OverseerCollectionProcessorTest, HighlighterTest, SimplePostToolTest, TestCoreDiscovery, SuggesterFSTTest, TestFoldingMultitermQuery, DocValuesTest, SpatialFilterTest, SuggesterWFSTTest, SchemaVersionSpecificBehaviorTest, TestWordDelimiterFilterFactory, SortByFunctionTest, TestRemoteStreaming, TestSolrDeletionPolicy1, TestQueryUtils, DirectSolrSpellCheckerTest, FileBasedSpellCheckerTest, TestValueSourceCache, TestIndexingPerformance, TestSolrQueryParser, TestJmxIntegration, JSONWriterTest, TestPartialUpdateDeduplication, TestComponentsName, TestBinaryResponseWriter, SOLR749Test, CopyFieldTest, TestSolrCoreProperties, TestCodecSupport, SynonymTokenizerTest, EchoParamsTest, TestLMJelinekMercerSimilarityFactory, TestFastWriter, ResourceLoaderTest, OpenExchangeRatesOrgProviderTest, TestSystemIdResolver, SpellingQueryConverterTest, DOMUtilTest, RAMDirectoryFactoryTest, TestSolrJ, TestLRUCache, ZkNodePropsTest, SliceStateTest, SystemInfoHandlerTest, UUIDFieldTest, DistributedMLTComponentTest, TestRTGBase, DistributedIntervalFacetingTest, TestCrossCoreJoin, TestDistributedMissingSort, TestTolerantSearch, TestJettySolrRunner, ActionThrottleTest, CdcrReplicationDistributedZkTest]
   [junit4] Completed [406/529] on J1 in 354.79s, 1 test, 1 failure <<< FAILURES!

[...truncated 408 lines...]
BUILD FAILED
/home/jenkins/workspace/Lucene-Solr-trunk-Linux/build.xml:716: The following error occurred while executing this line:
/home/jenkins/workspace/Lucene-Solr-trunk-Linux/build.xml:660: The following error occurred while executing this line:
/home/jenkins/workspace/Lucene-Solr-trunk-Linux/build.xml:59: The following error occurred while executing this line:
/home/jenkins/workspace/Lucene-Solr-trunk-Linux/solr/build.xml:230: The following error occurred while executing this line:
/home/jenkins/workspace/Lucene-Solr-trunk-Linux/solr/common-build.xml:514: The following error occurred while executing this line:
/home/jenkins/workspace/Lucene-Solr-trunk-Linux/lucene/common-build.xml:1429: The following error occurred while executing this line:
/home/jenkins/workspace/Lucene-Solr-trunk-Linux/lucene/common-build.xml:984: There were test failures: 529 suites, 2093 tests, 1 failure, 65 ignored (30 assumptions)

Total time: 48 minutes 32 seconds
Build step 'Invoke Ant' marked build as failure
Archiving artifacts
Recording test results
Email was triggered for: Failure - Any
Sending email for trigger: Failure - Any



Mime
View raw message