lucene-dev mailing list archives

Site index · List index
Message view « Date » · « Thread »
Top « Date » · « Thread »
From Apache Jenkins Server <jenk...@builds.apache.org>
Subject [JENKINS] Lucene-Solr-Tests-trunk-Java8 - Build # 297 - Failure
Date Thu, 20 Aug 2015 08:39:34 GMT
Build: https://builds.apache.org/job/Lucene-Solr-Tests-trunk-Java8/297/

1 tests failed.
REGRESSION:  org.apache.solr.client.solrj.impl.CloudSolrClientTest.test

Error Message:
There should be 3 documents because there should be two id=1 docs due to overwrite=false expected:<3> but was:<1>

Stack Trace:
java.lang.AssertionError: There should be 3 documents because there should be two id=1 docs due to overwrite=false expected:<3> but was:<1>
	at __randomizedtesting.SeedInfo.seed([F2BEC23974BD3686:7AEAFDE3DA415B7E]:0)
	at org.junit.Assert.fail(Assert.java:93)
	at org.junit.Assert.failNotEquals(Assert.java:647)
	at org.junit.Assert.assertEquals(Assert.java:128)
	at org.junit.Assert.assertEquals(Assert.java:472)
	at org.apache.solr.client.solrj.impl.CloudSolrClientTest.testOverwriteOption(CloudSolrClientTest.java:159)
	at org.apache.solr.client.solrj.impl.CloudSolrClientTest.test(CloudSolrClientTest.java:117)
	at sun.reflect.NativeMethodAccessorImpl.invoke0(Native Method)
	at sun.reflect.NativeMethodAccessorImpl.invoke(NativeMethodAccessorImpl.java:62)
	at sun.reflect.DelegatingMethodAccessorImpl.invoke(DelegatingMethodAccessorImpl.java:43)
	at java.lang.reflect.Method.invoke(Method.java:497)
	at com.carrotsearch.randomizedtesting.RandomizedRunner.invoke(RandomizedRunner.java:1627)
	at com.carrotsearch.randomizedtesting.RandomizedRunner$6.evaluate(RandomizedRunner.java:836)
	at com.carrotsearch.randomizedtesting.RandomizedRunner$7.evaluate(RandomizedRunner.java:872)
	at com.carrotsearch.randomizedtesting.RandomizedRunner$8.evaluate(RandomizedRunner.java:886)
	at org.junit.rules.ExpectedException$ExpectedExceptionStatement.evaluate(ExpectedException.java:110)
	at org.apache.solr.BaseDistributedSearchTestCase$ShardsRepeatRule$ShardsFixedStatement.callStatement(BaseDistributedSearchTestCase.java:963)
	at org.apache.solr.BaseDistributedSearchTestCase$ShardsRepeatRule$ShardsStatement.evaluate(BaseDistributedSearchTestCase.java:938)
	at com.carrotsearch.randomizedtesting.rules.SystemPropertiesRestoreRule$1.evaluate(SystemPropertiesRestoreRule.java:57)
	at org.apache.lucene.util.TestRuleSetupTeardownChained$1.evaluate(TestRuleSetupTeardownChained.java:50)
	at org.apache.lucene.util.AbstractBeforeAfterRule$1.evaluate(AbstractBeforeAfterRule.java:46)
	at org.apache.lucene.util.TestRuleThreadAndTestName$1.evaluate(TestRuleThreadAndTestName.java:49)
	at org.apache.lucene.util.TestRuleIgnoreAfterMaxFailures$1.evaluate(TestRuleIgnoreAfterMaxFailures.java:65)
	at org.apache.lucene.util.TestRuleMarkFailure$1.evaluate(TestRuleMarkFailure.java:48)
	at com.carrotsearch.randomizedtesting.rules.StatementAdapter.evaluate(StatementAdapter.java:36)
	at com.carrotsearch.randomizedtesting.ThreadLeakControl$StatementRunner.run(ThreadLeakControl.java:365)
	at com.carrotsearch.randomizedtesting.ThreadLeakControl.forkTimeoutingTask(ThreadLeakControl.java:798)
	at com.carrotsearch.randomizedtesting.ThreadLeakControl$3.evaluate(ThreadLeakControl.java:458)
	at com.carrotsearch.randomizedtesting.RandomizedRunner.runSingleTest(RandomizedRunner.java:845)
	at com.carrotsearch.randomizedtesting.RandomizedRunner$3.evaluate(RandomizedRunner.java:747)
	at com.carrotsearch.randomizedtesting.RandomizedRunner$4.evaluate(RandomizedRunner.java:781)
	at com.carrotsearch.randomizedtesting.RandomizedRunner$5.evaluate(RandomizedRunner.java:792)
	at com.carrotsearch.randomizedtesting.rules.StatementAdapter.evaluate(StatementAdapter.java:36)
	at com.carrotsearch.randomizedtesting.rules.SystemPropertiesRestoreRule$1.evaluate(SystemPropertiesRestoreRule.java:57)
	at org.apache.lucene.util.AbstractBeforeAfterRule$1.evaluate(AbstractBeforeAfterRule.java:46)
	at com.carrotsearch.randomizedtesting.rules.StatementAdapter.evaluate(StatementAdapter.java:36)
	at org.apache.lucene.util.TestRuleStoreClassName$1.evaluate(TestRuleStoreClassName.java:42)
	at com.carrotsearch.randomizedtesting.rules.NoShadowingOrOverridesOnMethodsRule$1.evaluate(NoShadowingOrOverridesOnMethodsRule.java:39)
	at com.carrotsearch.randomizedtesting.rules.NoShadowingOrOverridesOnMethodsRule$1.evaluate(NoShadowingOrOverridesOnMethodsRule.java:39)
	at com.carrotsearch.randomizedtesting.rules.StatementAdapter.evaluate(StatementAdapter.java:36)
	at com.carrotsearch.randomizedtesting.rules.StatementAdapter.evaluate(StatementAdapter.java:36)
	at com.carrotsearch.randomizedtesting.rules.StatementAdapter.evaluate(StatementAdapter.java:36)
	at org.apache.lucene.util.TestRuleAssertionsRequired$1.evaluate(TestRuleAssertionsRequired.java:54)
	at org.apache.lucene.util.TestRuleMarkFailure$1.evaluate(TestRuleMarkFailure.java:48)
	at org.apache.lucene.util.TestRuleIgnoreAfterMaxFailures$1.evaluate(TestRuleIgnoreAfterMaxFailures.java:65)
	at org.apache.lucene.util.TestRuleIgnoreTestSuites$1.evaluate(TestRuleIgnoreTestSuites.java:55)
	at com.carrotsearch.randomizedtesting.rules.StatementAdapter.evaluate(StatementAdapter.java:36)
	at com.carrotsearch.randomizedtesting.ThreadLeakControl$StatementRunner.run(ThreadLeakControl.java:365)
	at java.lang.Thread.run(Thread.java:745)




Build Log:
[...truncated 11465 lines...]
   [junit4] Suite: org.apache.solr.client.solrj.impl.CloudSolrClientTest
   [junit4]   2> Creating dataDir: /x1/jenkins/jenkins-slave/workspace/Lucene-Solr-Tests-trunk-Java8/solr/build/solr-solrj/test/J0/temp/solr.client.solrj.impl.CloudSolrClientTest_F2BEC23974BD3686-001/init-core-data-001
   [junit4]   2> 91625 INFO  (SUITE-CloudSolrClientTest-seed#[F2BEC23974BD3686]-worker) [    ] o.a.s.SolrTestCaseJ4 Randomized ssl (false) and clientAuth (false)
   [junit4]   2> 91625 INFO  (SUITE-CloudSolrClientTest-seed#[F2BEC23974BD3686]-worker) [    ] o.a.s.BaseDistributedSearchTestCase Setting hostContext system property: /
   [junit4]   2> 91631 WARN  (SUITE-CloudSolrClientTest-seed#[F2BEC23974BD3686]-worker) [    ] o.a.s.c.AbstractZkTestCase TEST_HOME() does not exist - solrj test?
   [junit4]   2> 91675 INFO  (TEST-CloudSolrClientTest.testShutdown-seed#[F2BEC23974BD3686]) [    ] o.a.s.c.ZkTestServer STARTING ZK TEST SERVER
   [junit4]   2> 91714 INFO  (Thread-132) [    ] o.a.s.c.ZkTestServer client port:0.0.0.0/0.0.0.0:0
   [junit4]   2> 91716 INFO  (Thread-132) [    ] o.a.s.c.ZkTestServer Starting server
   [junit4]   2> 91812 INFO  (TEST-CloudSolrClientTest.testShutdown-seed#[F2BEC23974BD3686]) [    ] o.a.s.c.ZkTestServer start zk server on port:54715
   [junit4]   2> 91837 INFO  (TEST-CloudSolrClientTest.testShutdown-seed#[F2BEC23974BD3686]) [    ] o.a.s.c.c.SolrZkClient Using default ZkCredentialsProvider
   [junit4]   2> 92034 INFO  (TEST-CloudSolrClientTest.testShutdown-seed#[F2BEC23974BD3686]) [    ] o.a.s.c.c.ConnectionManager Waiting for client to connect to ZooKeeper
   [junit4]   2> 92078 WARN  (NIOServerCxn.Factory:0.0.0.0/0.0.0.0:0) [    ] o.a.z.s.NIOServerCnxn Exception causing close of session 0x0 due to java.io.IOException: ZooKeeperServer not running
   [junit4]   2> 94157 INFO  (zkCallback-19-thread-1) [    ] o.a.s.c.c.ConnectionManager Watcher org.apache.solr.common.cloud.ConnectionManager@39642db2 name:ZooKeeperConnection Watcher:127.0.0.1:54715 got event WatchedEvent state:SyncConnected type:None path:null path:null type:None
   [junit4]   2> 94158 INFO  (TEST-CloudSolrClientTest.testShutdown-seed#[F2BEC23974BD3686]) [    ] o.a.s.c.c.ConnectionManager Client is connected to ZooKeeper
   [junit4]   2> 94158 INFO  (TEST-CloudSolrClientTest.testShutdown-seed#[F2BEC23974BD3686]) [    ] o.a.s.c.c.SolrZkClient Using default ZkACLProvider
   [junit4]   2> 94161 INFO  (TEST-CloudSolrClientTest.testShutdown-seed#[F2BEC23974BD3686]) [    ] o.a.s.c.c.SolrZkClient makePath: /solr
   [junit4]   2> 94187 INFO  (TEST-CloudSolrClientTest.testShutdown-seed#[F2BEC23974BD3686]) [    ] o.a.s.c.c.SolrZkClient Using default ZkCredentialsProvider
   [junit4]   2> 94187 WARN  (NIOServerCxn.Factory:0.0.0.0/0.0.0.0:0) [    ] o.a.z.s.NIOServerCnxn caught end of stream exception
   [junit4]   2> EndOfStreamException: Unable to read additional data from client sessionid 0x14f4a413a0f0000, likely client has closed socket
   [junit4]   2> 	at org.apache.zookeeper.server.NIOServerCnxn.doIO(NIOServerCnxn.java:228)
   [junit4]   2> 	at org.apache.zookeeper.server.NIOServerCnxnFactory.run(NIOServerCnxnFactory.java:208)
   [junit4]   2> 	at java.lang.Thread.run(Thread.java:745)
   [junit4]   2> 94187 INFO  (TEST-CloudSolrClientTest.testShutdown-seed#[F2BEC23974BD3686]) [    ] o.a.s.c.c.ConnectionManager Waiting for client to connect to ZooKeeper
   [junit4]   2> 94195 INFO  (zkCallback-20-thread-1) [    ] o.a.s.c.c.ConnectionManager Watcher org.apache.solr.common.cloud.ConnectionManager@6dc316fe name:ZooKeeperConnection Watcher:127.0.0.1:54715/solr got event WatchedEvent state:SyncConnected type:None path:null path:null type:None
   [junit4]   2> 94195 INFO  (TEST-CloudSolrClientTest.testShutdown-seed#[F2BEC23974BD3686]) [    ] o.a.s.c.c.ConnectionManager Client is connected to ZooKeeper
   [junit4]   2> 94195 INFO  (TEST-CloudSolrClientTest.testShutdown-seed#[F2BEC23974BD3686]) [    ] o.a.s.c.c.SolrZkClient Using default ZkACLProvider
   [junit4]   2> 94197 INFO  (TEST-CloudSolrClientTest.testShutdown-seed#[F2BEC23974BD3686]) [    ] o.a.s.c.c.SolrZkClient makePath: /collections/collection1
   [junit4]   2> 94202 INFO  (TEST-CloudSolrClientTest.testShutdown-seed#[F2BEC23974BD3686]) [    ] o.a.s.c.c.SolrZkClient makePath: /collections/collection1/shards
   [junit4]   2> 94206 INFO  (TEST-CloudSolrClientTest.testShutdown-seed#[F2BEC23974BD3686]) [    ] o.a.s.c.c.SolrZkClient makePath: /collections/control_collection
   [junit4]   2> 94209 INFO  (TEST-CloudSolrClientTest.testShutdown-seed#[F2BEC23974BD3686]) [    ] o.a.s.c.c.SolrZkClient makePath: /collections/control_collection/shards
   [junit4]   2> 94219 INFO  (TEST-CloudSolrClientTest.testShutdown-seed#[F2BEC23974BD3686]) [    ] o.a.s.c.AbstractZkTestCase put /x1/jenkins/jenkins-slave/workspace/Lucene-Solr-Tests-trunk-Java8/solr/solrj/src/test-files/solrj/solr/collection1/conf/solrconfig.xml to /configs/conf1/solrconfig.xml
   [junit4]   2> 94219 INFO  (TEST-CloudSolrClientTest.testShutdown-seed#[F2BEC23974BD3686]) [    ] o.a.s.c.c.SolrZkClient makePath: /configs/conf1/solrconfig.xml
   [junit4]   2> 94240 INFO  (TEST-CloudSolrClientTest.testShutdown-seed#[F2BEC23974BD3686]) [    ] o.a.s.c.AbstractZkTestCase put /x1/jenkins/jenkins-slave/workspace/Lucene-Solr-Tests-trunk-Java8/solr/solrj/src/test-files/solrj/solr/collection1/conf/schema.xml to /configs/conf1/schema.xml
   [junit4]   2> 94241 INFO  (TEST-CloudSolrClientTest.testShutdown-seed#[F2BEC23974BD3686]) [    ] o.a.s.c.c.SolrZkClient makePath: /configs/conf1/schema.xml
   [junit4]   2> 94245 INFO  (TEST-CloudSolrClientTest.testShutdown-seed#[F2BEC23974BD3686]) [    ] o.a.s.c.AbstractZkTestCase skipping /x1/jenkins/jenkins-slave/workspace/Lucene-Solr-Tests-trunk-Java8/solr/solrj/src/test-files/solrj/solr/collection1/conf/solrconfig.snippet.randomindexconfig.xml because it doesn't exist
   [junit4]   2> 94245 INFO  (TEST-CloudSolrClientTest.testShutdown-seed#[F2BEC23974BD3686]) [    ] o.a.s.c.AbstractZkTestCase skipping /x1/jenkins/jenkins-slave/workspace/Lucene-Solr-Tests-trunk-Java8/solr/solrj/src/test-files/solrj/solr/collection1/conf/stopwords.txt because it doesn't exist
   [junit4]   2> 94245 INFO  (TEST-CloudSolrClientTest.testShutdown-seed#[F2BEC23974BD3686]) [    ] o.a.s.c.AbstractZkTestCase skipping /x1/jenkins/jenkins-slave/workspace/Lucene-Solr-Tests-trunk-Java8/solr/solrj/src/test-files/solrj/solr/collection1/conf/protwords.txt because it doesn't exist
   [junit4]   2> 94245 INFO  (TEST-CloudSolrClientTest.testShutdown-seed#[F2BEC23974BD3686]) [    ] o.a.s.c.AbstractZkTestCase skipping /x1/jenkins/jenkins-slave/workspace/Lucene-Solr-Tests-trunk-Java8/solr/solrj/src/test-files/solrj/solr/collection1/conf/currency.xml because it doesn't exist
   [junit4]   2> 94246 INFO  (TEST-CloudSolrClientTest.testShutdown-seed#[F2BEC23974BD3686]) [    ] o.a.s.c.AbstractZkTestCase skipping /x1/jenkins/jenkins-slave/workspace/Lucene-Solr-Tests-trunk-Java8/solr/solrj/src/test-files/solrj/solr/collection1/conf/enumsConfig.xml because it doesn't exist
   [junit4]   2> 94246 INFO  (TEST-CloudSolrClientTest.testShutdown-seed#[F2BEC23974BD3686]) [    ] o.a.s.c.AbstractZkTestCase skipping /x1/jenkins/jenkins-slave/workspace/Lucene-Solr-Tests-trunk-Java8/solr/solrj/src/test-files/solrj/solr/collection1/conf/open-exchange-rates.json because it doesn't exist
   [junit4]   2> 94246 INFO  (TEST-CloudSolrClientTest.testShutdown-seed#[F2BEC23974BD3686]) [    ] o.a.s.c.AbstractZkTestCase skipping /x1/jenkins/jenkins-slave/workspace/Lucene-Solr-Tests-trunk-Java8/solr/solrj/src/test-files/solrj/solr/collection1/conf/mapping-ISOLatin1Accent.txt because it doesn't exist
   [junit4]   2> 94246 INFO  (TEST-CloudSolrClientTest.testShutdown-seed#[F2BEC23974BD3686]) [    ] o.a.s.c.AbstractZkTestCase skipping /x1/jenkins/jenkins-slave/workspace/Lucene-Solr-Tests-trunk-Java8/solr/solrj/src/test-files/solrj/solr/collection1/conf/old_synonyms.txt because it doesn't exist
   [junit4]   2> 94247 INFO  (TEST-CloudSolrClientTest.testShutdown-seed#[F2BEC23974BD3686]) [    ] o.a.s.c.AbstractZkTestCase skipping /x1/jenkins/jenkins-slave/workspace/Lucene-Solr-Tests-trunk-Java8/solr/solrj/src/test-files/solrj/solr/collection1/conf/synonyms.txt because it doesn't exist
   [junit4]   2> 94347 INFO  (TEST-CloudSolrClientTest.testShutdown-seed#[F2BEC23974BD3686]) [    ] o.a.s.SolrTestCaseJ4 Writing core.properties file to /x1/jenkins/jenkins-slave/workspace/Lucene-Solr-Tests-trunk-Java8/solr/build/solr-solrj/test/J0/temp/solr.client.solrj.impl.CloudSolrClientTest_F2BEC23974BD3686-001/control-001/cores/collection1
   [junit4]   2> 94350 INFO  (TEST-CloudSolrClientTest.testShutdown-seed#[F2BEC23974BD3686]) [    ] o.e.j.s.Server jetty-9.2.13.v20150730
   [junit4]   2> 94395 INFO  (TEST-CloudSolrClientTest.testShutdown-seed#[F2BEC23974BD3686]) [    ] o.e.j.s.h.ContextHandler Started o.e.j.s.ServletContextHandler@3772a5e7{/,null,AVAILABLE}
   [junit4]   2> 94409 INFO  (TEST-CloudSolrClientTest.testShutdown-seed#[F2BEC23974BD3686]) [    ] o.e.j.s.ServerConnector Started ServerConnector@427967d8{HTTP/1.1}{127.0.0.1:49110}
   [junit4]   2> 94409 INFO  (TEST-CloudSolrClientTest.testShutdown-seed#[F2BEC23974BD3686]) [    ] o.e.j.s.Server Started @102015ms
   [junit4]   2> 94409 INFO  (TEST-CloudSolrClientTest.testShutdown-seed#[F2BEC23974BD3686]) [    ] o.a.s.c.s.e.JettySolrRunner Jetty properties: {solr.data.dir=/x1/jenkins/jenkins-slave/workspace/Lucene-Solr-Tests-trunk-Java8/solr/build/solr-solrj/test/J0/temp/solr.client.solrj.impl.CloudSolrClientTest_F2BEC23974BD3686-001/tempDir-001/control/data, hostContext=/, hostPort=49110, coreRootDirectory=/x1/jenkins/jenkins-slave/workspace/Lucene-Solr-Tests-trunk-Java8/solr/build/solr-solrj/test/J0/../../../../../../../../../../x1/jenkins/jenkins-slave/workspace/Lucene-Solr-Tests-trunk-Java8/solr/build/solr-solrj/test/J0/temp/solr.client.solrj.impl.CloudSolrClientTest_F2BEC23974BD3686-001/control-001/cores}
   [junit4]   2> 94410 INFO  (TEST-CloudSolrClientTest.testShutdown-seed#[F2BEC23974BD3686]) [    ] o.a.s.s.SolrDispatchFilter SolrDispatchFilter.init(): sun.misc.Launcher$AppClassLoader@659e0bfd
   [junit4]   2> 94410 INFO  (TEST-CloudSolrClientTest.testShutdown-seed#[F2BEC23974BD3686]) [    ] o.a.s.c.SolrResourceLoader new SolrResourceLoader for directory: '/x1/jenkins/jenkins-slave/workspace/Lucene-Solr-Tests-trunk-Java8/solr/build/solr-solrj/test/J0/../../../../../../../../../../x1/jenkins/jenkins-slave/workspace/Lucene-Solr-Tests-trunk-Java8/solr/build/solr-solrj/test/J0/temp/solr.client.solrj.impl.CloudSolrClientTest_F2BEC23974BD3686-001/control-001/'
   [junit4]   2> 94424 INFO  (TEST-CloudSolrClientTest.testShutdown-seed#[F2BEC23974BD3686]) [    ] o.a.s.c.c.SolrZkClient Using default ZkCredentialsProvider
   [junit4]   2> 94447 INFO  (TEST-CloudSolrClientTest.testShutdown-seed#[F2BEC23974BD3686]) [    ] o.a.s.c.c.ConnectionManager Waiting for client to connect to ZooKeeper
   [junit4]   2> 94488 INFO  (zkCallback-21-thread-1) [    ] o.a.s.c.c.ConnectionManager Watcher org.apache.solr.common.cloud.ConnectionManager@63caa055 name:ZooKeeperConnection Watcher:127.0.0.1:54715/solr got event WatchedEvent state:SyncConnected type:None path:null path:null type:None
   [junit4]   2> 94489 INFO  (TEST-CloudSolrClientTest.testShutdown-seed#[F2BEC23974BD3686]) [    ] o.a.s.c.c.ConnectionManager Client is connected to ZooKeeper
   [junit4]   2> 94490 INFO  (TEST-CloudSolrClientTest.testShutdown-seed#[F2BEC23974BD3686]) [    ] o.a.s.c.c.SolrZkClient Using default ZkACLProvider
   [junit4]   2> 94494 INFO  (TEST-CloudSolrClientTest.testShutdown-seed#[F2BEC23974BD3686]) [    ] o.a.s.s.SolrDispatchFilter Loading solr.xml from SolrHome (not found in ZooKeeper)
   [junit4]   2> 94495 INFO  (TEST-CloudSolrClientTest.testShutdown-seed#[F2BEC23974BD3686]) [    ] o.a.s.c.SolrXmlConfig Loading container configuration from /x1/jenkins/jenkins-slave/workspace/Lucene-Solr-Tests-trunk-Java8/solr/build/solr-solrj/test/J0/../../../../../../../../../../x1/jenkins/jenkins-slave/workspace/Lucene-Solr-Tests-trunk-Java8/solr/build/solr-solrj/test/J0/temp/solr.client.solrj.impl.CloudSolrClientTest_F2BEC23974BD3686-001/control-001/solr.xml
   [junit4]   2> 94502 INFO  (TEST-CloudSolrClientTest.testShutdown-seed#[F2BEC23974BD3686]) [    ] o.a.s.c.CoresLocator Config-defined core root directory: /x1/jenkins/jenkins-slave/workspace/Lucene-Solr-Tests-trunk-Java8/solr/build/solr-solrj/test/J0/../../../../../../../../../../x1/jenkins/jenkins-slave/workspace/Lucene-Solr-Tests-trunk-Java8/solr/build/solr-solrj/test/J0/temp/solr.client.solrj.impl.CloudSolrClientTest_F2BEC23974BD3686-001/control-001/cores
   [junit4]   2> 94502 INFO  (TEST-CloudSolrClientTest.testShutdown-seed#[F2BEC23974BD3686]) [    ] o.a.s.c.CoreContainer New CoreContainer 896700430
   [junit4]   2> 94502 INFO  (TEST-CloudSolrClientTest.testShutdown-seed#[F2BEC23974BD3686]) [    ] o.a.s.c.CoreContainer Loading cores into CoreContainer [instanceDir=/x1/jenkins/jenkins-slave/workspace/Lucene-Solr-Tests-trunk-Java8/solr/build/solr-solrj/test/J0/../../../../../../../../../../x1/jenkins/jenkins-slave/workspace/Lucene-Solr-Tests-trunk-Java8/solr/build/solr-solrj/test/J0/temp/solr.client.solrj.impl.CloudSolrClientTest_F2BEC23974BD3686-001/control-001/]
   [junit4]   2> 94502 INFO  (TEST-CloudSolrClientTest.testShutdown-seed#[F2BEC23974BD3686]) [    ] o.a.s.c.CoreContainer loading shared library: /x1/jenkins/jenkins-slave/workspace/Lucene-Solr-Tests-trunk-Java8/solr/build/solr-solrj/test/J0/../../../../../../../../../../x1/jenkins/jenkins-slave/workspace/Lucene-Solr-Tests-trunk-Java8/solr/build/solr-solrj/test/J0/temp/solr.client.solrj.impl.CloudSolrClientTest_F2BEC23974BD3686-001/control-001/lib
   [junit4]   2> 94503 WARN  (TEST-CloudSolrClientTest.testShutdown-seed#[F2BEC23974BD3686]) [    ] o.a.s.c.SolrResourceLoader Can't find (or read) directory to add to classloader: lib (resolved as: /x1/jenkins/jenkins-slave/workspace/Lucene-Solr-Tests-trunk-Java8/solr/build/solr-solrj/test/J0/../../../../../../../../../../x1/jenkins/jenkins-slave/workspace/Lucene-Solr-Tests-trunk-Java8/solr/build/solr-solrj/test/J0/temp/solr.client.solrj.impl.CloudSolrClientTest_F2BEC23974BD3686-001/control-001/lib).
   [junit4]   2> 94524 INFO  (TEST-CloudSolrClientTest.testShutdown-seed#[F2BEC23974BD3686]) [    ] o.a.s.h.c.HttpShardHandlerFactory created with socketTimeout : 90000,urlScheme : ,connTimeout : 15000,maxConnectionsPerHost : 20,maxConnections : 10000,corePoolSize : 0,maximumPoolSize : 2147483647,maxThreadIdleTime : 5,sizeOfQueue : -1,fairnessPolicy : false,useRetries : false,
   [junit4]   2> 94526 INFO  (TEST-CloudSolrClientTest.testShutdown-seed#[F2BEC23974BD3686]) [    ] o.a.s.u.UpdateShardHandler Creating UpdateShardHandler HTTP client with params: socketTimeout=340000&connTimeout=45000&retry=true
   [junit4]   2> 94526 INFO  (TEST-CloudSolrClientTest.testShutdown-seed#[F2BEC23974BD3686]) [    ] o.a.s.l.LogWatcher SLF4J impl is org.slf4j.impl.Log4jLoggerFactory
   [junit4]   2> 94527 INFO  (TEST-CloudSolrClientTest.testShutdown-seed#[F2BEC23974BD3686]) [    ] o.a.s.l.LogWatcher Registering Log Listener [Log4j (org.slf4j.impl.Log4jLoggerFactory)]
   [junit4]   2> 94527 INFO  (TEST-CloudSolrClientTest.testShutdown-seed#[F2BEC23974BD3686]) [    ] o.a.s.c.ZkContainer Zookeeper client=127.0.0.1:54715/solr
   [junit4]   2> 94545 INFO  (TEST-CloudSolrClientTest.testShutdown-seed#[F2BEC23974BD3686]) [    ] o.a.s.c.ZkController zkHost includes chroot
   [junit4]   2> 94545 INFO  (TEST-CloudSolrClientTest.testShutdown-seed#[F2BEC23974BD3686]) [    ] o.a.s.c.c.SolrZkClient Using default ZkCredentialsProvider
   [junit4]   2> 94546 INFO  (TEST-CloudSolrClientTest.testShutdown-seed#[F2BEC23974BD3686]) [    ] o.a.s.c.c.ConnectionManager Waiting for client to connect to ZooKeeper
   [junit4]   2> 94552 INFO  (zkCallback-23-thread-1) [    ] o.a.s.c.c.ConnectionManager Watcher org.apache.solr.common.cloud.ConnectionManager@76d064d6 name:ZooKeeperConnection Watcher:127.0.0.1:54715 got event WatchedEvent state:SyncConnected type:None path:null path:null type:None
   [junit4]   2> 94558 INFO  (TEST-CloudSolrClientTest.testShutdown-seed#[F2BEC23974BD3686]) [    ] o.a.s.c.c.ConnectionManager Client is connected to ZooKeeper
   [junit4]   2> 94559 INFO  (TEST-CloudSolrClientTest.testShutdown-seed#[F2BEC23974BD3686]) [    ] o.a.s.c.c.SolrZkClient Using default ZkACLProvider
   [junit4]   2> 94576 INFO  (TEST-CloudSolrClientTest.testShutdown-seed#[F2BEC23974BD3686]) [n:127.0.0.1:49110_    ] o.a.s.c.c.ConnectionManager Waiting for client to connect to ZooKeeper
   [junit4]   2> 94589 INFO  (zkCallback-24-thread-1-processing-n:127.0.0.1:49110_) [n:127.0.0.1:49110_    ] o.a.s.c.c.ConnectionManager Watcher org.apache.solr.common.cloud.ConnectionManager@3f81bc7e name:ZooKeeperConnection Watcher:127.0.0.1:54715/solr got event WatchedEvent state:SyncConnected type:None path:null path:null type:None
   [junit4]   2> 94590 INFO  (TEST-CloudSolrClientTest.testShutdown-seed#[F2BEC23974BD3686]) [n:127.0.0.1:49110_    ] o.a.s.c.c.ConnectionManager Client is connected to ZooKeeper
   [junit4]   2> 94597 INFO  (TEST-CloudSolrClientTest.testShutdown-seed#[F2BEC23974BD3686]) [n:127.0.0.1:49110_    ] o.a.s.c.c.SolrZkClient makePath: /overseer/queue
   [junit4]   2> 94610 INFO  (TEST-CloudSolrClientTest.testShutdown-seed#[F2BEC23974BD3686]) [n:127.0.0.1:49110_    ] o.a.s.c.c.SolrZkClient makePath: /overseer/collection-queue-work
   [junit4]   2> 94623 INFO  (TEST-CloudSolrClientTest.testShutdown-seed#[F2BEC23974BD3686]) [n:127.0.0.1:49110_    ] o.a.s.c.c.SolrZkClient makePath: /overseer/collection-map-running
   [junit4]   2> 94628 INFO  (TEST-CloudSolrClientTest.testShutdown-seed#[F2BEC23974BD3686]) [n:127.0.0.1:49110_    ] o.a.s.c.c.SolrZkClient makePath: /overseer/collection-map-completed
   [junit4]   2> 94631 INFO  (TEST-CloudSolrClientTest.testShutdown-seed#[F2BEC23974BD3686]) [n:127.0.0.1:49110_    ] o.a.s.c.c.SolrZkClient makePath: /overseer/collection-map-failure
   [junit4]   2> 94647 INFO  (TEST-CloudSolrClientTest.testShutdown-seed#[F2BEC23974BD3686]) [n:127.0.0.1:49110_    ] o.a.s.c.c.SolrZkClient makePath: /live_nodes
   [junit4]   2> 94650 INFO  (TEST-CloudSolrClientTest.testShutdown-seed#[F2BEC23974BD3686]) [n:127.0.0.1:49110_    ] o.a.s.c.c.SolrZkClient makePath: /aliases.json
   [junit4]   2> 94653 INFO  (TEST-CloudSolrClientTest.testShutdown-seed#[F2BEC23974BD3686]) [n:127.0.0.1:49110_    ] o.a.s.c.c.SolrZkClient makePath: /clusterstate.json
   [junit4]   2> 94656 INFO  (TEST-CloudSolrClientTest.testShutdown-seed#[F2BEC23974BD3686]) [n:127.0.0.1:49110_    ] o.a.s.c.c.SolrZkClient makePath: /security.json
   [junit4]   2> 94657 INFO  (TEST-CloudSolrClientTest.testShutdown-seed#[F2BEC23974BD3686]) [n:127.0.0.1:49110_    ] o.a.s.c.ZkController Register node as live in ZooKeeper:/live_nodes/127.0.0.1:49110_
   [junit4]   2> 94662 INFO  (TEST-CloudSolrClientTest.testShutdown-seed#[F2BEC23974BD3686]) [n:127.0.0.1:49110_    ] o.a.s.c.c.SolrZkClient makePath: /live_nodes/127.0.0.1:49110_
   [junit4]   2> 94671 INFO  (TEST-CloudSolrClientTest.testShutdown-seed#[F2BEC23974BD3686]) [n:127.0.0.1:49110_    ] o.a.s.c.c.SolrZkClient makePath: /overseer_elect
   [junit4]   2> 94673 INFO  (TEST-CloudSolrClientTest.testShutdown-seed#[F2BEC23974BD3686]) [n:127.0.0.1:49110_    ] o.a.s.c.c.SolrZkClient makePath: /overseer_elect/election
   [junit4]   2> 94681 INFO  (TEST-CloudSolrClientTest.testShutdown-seed#[F2BEC23974BD3686]) [n:127.0.0.1:49110_    ] o.a.s.c.Overseer Overseer (id=null) closing
   [junit4]   2> 94683 INFO  (TEST-CloudSolrClientTest.testShutdown-seed#[F2BEC23974BD3686]) [n:127.0.0.1:49110_    ] o.a.s.c.LeaderElector Joined leadership election with path: /overseer_elect/election/94375761205460996-127.0.0.1:49110_-n_0000000000
   [junit4]   2> 94689 INFO  (TEST-CloudSolrClientTest.testShutdown-seed#[F2BEC23974BD3686]) [n:127.0.0.1:49110_    ] o.a.s.c.OverseerElectionContext I am going to be the leader 127.0.0.1:49110_
   [junit4]   2> 94689 INFO  (TEST-CloudSolrClientTest.testShutdown-seed#[F2BEC23974BD3686]) [n:127.0.0.1:49110_    ] o.a.s.c.c.SolrZkClient makePath: /overseer_elect/leader
   [junit4]   2> 94691 INFO  (TEST-CloudSolrClientTest.testShutdown-seed#[F2BEC23974BD3686]) [n:127.0.0.1:49110_    ] o.a.s.c.Overseer Overseer (id=94375761205460996-127.0.0.1:49110_-n_0000000000) starting
   [junit4]   2> 94699 INFO  (TEST-CloudSolrClientTest.testShutdown-seed#[F2BEC23974BD3686]) [n:127.0.0.1:49110_    ] o.a.s.c.c.SolrZkClient makePath: /overseer/queue-work
   [junit4]   2> 94731 INFO  (TEST-CloudSolrClientTest.testShutdown-seed#[F2BEC23974BD3686]) [n:127.0.0.1:49110_    ] o.a.s.c.OverseerAutoReplicaFailoverThread Starting OverseerAutoReplicaFailoverThread autoReplicaFailoverWorkLoopDelay=10000 autoReplicaFailoverWaitAfterExpiration=30000 autoReplicaFailoverBadNodeExpiration=60000
   [junit4]   2> 94735 INFO  (OverseerCollectionProcessor-94375761205460996-127.0.0.1:49110_-n_0000000000) [n:127.0.0.1:49110_    ] o.a.s.c.OverseerProcessor Process current queue of overseer operations
   [junit4]   2> 94739 INFO  (TEST-CloudSolrClientTest.testShutdown-seed#[F2BEC23974BD3686]) [n:127.0.0.1:49110_    ] o.a.s.c.c.ZkStateReader Updating cluster state from ZooKeeper... 
   [junit4]   2> 94743 INFO  (OverseerStateUpdate-94375761205460996-127.0.0.1:49110_-n_0000000000) [n:127.0.0.1:49110_    ] o.a.s.c.Overseer Starting to work on the main queue
   [junit4]   2> 94899 INFO  (TEST-CloudSolrClientTest.testShutdown-seed#[F2BEC23974BD3686]) [n:127.0.0.1:49110_    ] o.a.s.c.CoreContainer Security conf doesn't exist. Skipping setup for authorization module.
   [junit4]   2> 94899 INFO  (TEST-CloudSolrClientTest.testShutdown-seed#[F2BEC23974BD3686]) [n:127.0.0.1:49110_    ] o.a.s.c.CoreContainer No authentication plugin used.
   [junit4]   2> 94902 INFO  (TEST-CloudSolrClientTest.testShutdown-seed#[F2BEC23974BD3686]) [n:127.0.0.1:49110_    ] o.a.s.c.CoresLocator Looking for core definitions underneath /x1/jenkins/jenkins-slave/workspace/Lucene-Solr-Tests-trunk-Java8/solr/build/solr-solrj/test/J0/../../../../../../../../../../x1/jenkins/jenkins-slave/workspace/Lucene-Solr-Tests-trunk-Java8/solr/build/solr-solrj/test/J0/temp/solr.client.solrj.impl.CloudSolrClientTest_F2BEC23974BD3686-001/control-001/cores
   [junit4]   2> 94905 INFO  (TEST-CloudSolrClientTest.testShutdown-seed#[F2BEC23974BD3686]) [n:127.0.0.1:49110_    ] o.a.s.c.SolrCore Created CoreDescriptor: {name=collection1, config=solrconfig.xml, transient=false, schema=schema.xml, loadOnStartup=true, configSetProperties=configsetprops.json, instanceDir=/x1/jenkins/jenkins-slave/workspace/Lucene-Solr-Tests-trunk-Java8/solr/build/solr-solrj/test/J0/../../../../../../../../../../x1/jenkins/jenkins-slave/workspace/Lucene-Solr-Tests-trunk-Java8/solr/build/solr-solrj/test/J0/temp/solr.client.solrj.impl.CloudSolrClientTest_F2BEC23974BD3686-001/control-001/cores/collection1, collection=control_collection, absoluteInstDir=/x1/jenkins/jenkins-slave/workspace/Lucene-Solr-Tests-trunk-Java8/solr/build/solr-solrj/test/J0/../../../../../../../../../../x1/jenkins/jenkins-slave/workspace/Lucene-Solr-Tests-trunk-Java8/solr/build/solr-solrj/test/J0/temp/solr.client.solrj.impl.CloudSolrClientTest_F2BEC23974BD3686-001/control-001/cores/collection1/, coreNodeName=, dataDir=data/, shard=}
   [junit4]   2> 94906 INFO  (TEST-CloudSolrClientTest.testShutdown-seed#[F2BEC23974BD3686]) [n:127.0.0.1:49110_    ] o.a.s.c.CoresLocator Found core collection1 in /x1/jenkins/jenkins-slave/workspace/Lucene-Solr-Tests-trunk-Java8/solr/build/solr-solrj/test/J0/../../../../../../../../../../x1/jenkins/jenkins-slave/workspace/Lucene-Solr-Tests-trunk-Java8/solr/build/solr-solrj/test/J0/temp/solr.client.solrj.impl.CloudSolrClientTest_F2BEC23974BD3686-001/control-001/cores/collection1/
   [junit4]   2> 94906 INFO  (TEST-CloudSolrClientTest.testShutdown-seed#[F2BEC23974BD3686]) [n:127.0.0.1:49110_    ] o.a.s.c.CoresLocator Found 1 core definitions
   [junit4]   2> 94908 INFO  (coreLoadExecutor-149-thread-1-processing-n:127.0.0.1:49110_) [n:127.0.0.1:49110_ c:control_collection   x:collection1] o.a.s.c.ZkController publishing state=down
   [junit4]   2> 94908 INFO  (coreLoadExecutor-149-thread-1-processing-n:127.0.0.1:49110_) [n:127.0.0.1:49110_ c:control_collection   x:collection1] o.a.s.c.ZkController numShards not found on descriptor - reading it from system property
   [junit4]   2> 94909 INFO  (TEST-CloudSolrClientTest.testShutdown-seed#[F2BEC23974BD3686]) [n:127.0.0.1:49110_    ] o.a.s.s.SolrDispatchFilter user.dir=/x1/jenkins/jenkins-slave/workspace/Lucene-Solr-Tests-trunk-Java8/solr/build/solr-solrj/test/J0
   [junit4]   2> 94911 INFO  (TEST-CloudSolrClientTest.testShutdown-seed#[F2BEC23974BD3686]) [n:127.0.0.1:49110_    ] o.a.s.s.SolrDispatchFilter SolrDispatchFilter.init() done
   [junit4]   2> 94926 INFO  (OverseerStateUpdate-94375761205460996-127.0.0.1:49110_-n_0000000000) [n:127.0.0.1:49110_    ] o.a.s.c.Overseer processMessage: queueSize: 1, message = {
   [junit4]   2>   "core":"collection1",
   [junit4]   2>   "roles":null,
   [junit4]   2>   "base_url":"http://127.0.0.1:49110",
   [junit4]   2>   "node_name":"127.0.0.1:49110_",
   [junit4]   2>   "numShards":"1",
   [junit4]   2>   "state":"down",
   [junit4]   2>   "shard":null,
   [junit4]   2>   "collection":"control_collection",
   [junit4]   2>   "operation":"state"} current state version: 0
   [junit4]   2> 94936 INFO  (coreLoadExecutor-149-thread-1-processing-n:127.0.0.1:49110_) [n:127.0.0.1:49110_ c:control_collection   x:collection1] o.a.s.c.ZkController look for our core node name
   [junit4]   2> 94948 INFO  (OverseerStateUpdate-94375761205460996-127.0.0.1:49110_-n_0000000000) [n:127.0.0.1:49110_    ] o.a.s.c.o.ReplicaMutator Update state numShards=1 message={
   [junit4]   2>   "core":"collection1",
   [junit4]   2>   "roles":null,
   [junit4]   2>   "base_url":"http://127.0.0.1:49110",
   [junit4]   2>   "node_name":"127.0.0.1:49110_",
   [junit4]   2>   "numShards":"1",
   [junit4]   2>   "state":"down",
   [junit4]   2>   "shard":null,
   [junit4]   2>   "collection":"control_collection",
   [junit4]   2>   "operation":"state"}
   [junit4]   2> 94951 INFO  (OverseerStateUpdate-94375761205460996-127.0.0.1:49110_-n_0000000000) [n:127.0.0.1:49110_    ] o.a.s.c.o.ClusterStateMutator building a new cName: control_collection
   [junit4]   2> 94972 INFO  (OverseerStateUpdate-94375761205460996-127.0.0.1:49110_-n_0000000000) [n:127.0.0.1:49110_    ] o.a.s.c.o.ReplicaMutator Assigning new node to shard shard=shard1
   [junit4]   2> 94990 INFO  (zkCallback-24-thread-1-processing-n:127.0.0.1:49110_) [n:127.0.0.1:49110_    ] o.a.s.c.c.ZkStateReader A cluster state change: WatchedEvent state:SyncConnected type:NodeDataChanged path:/clusterstate.json, has occurred - updating... (live nodes size: 1)
   [junit4]   2> 95945 INFO  (coreLoadExecutor-149-thread-1-processing-n:127.0.0.1:49110_) [n:127.0.0.1:49110_ c:control_collection   x:collection1] o.a.s.c.ZkController waiting to find shard id in clusterstate for collection1
   [junit4]   2> 95945 INFO  (coreLoadExecutor-149-thread-1-processing-n:127.0.0.1:49110_) [n:127.0.0.1:49110_ c:control_collection   x:collection1] o.a.s.c.ZkController Check for collection zkNode:control_collection
   [junit4]   2> 95946 INFO  (coreLoadExecutor-149-thread-1-processing-n:127.0.0.1:49110_) [n:127.0.0.1:49110_ c:control_collection   x:collection1] o.a.s.c.ZkController Collection zkNode exists
   [junit4]   2> 95946 INFO  (coreLoadExecutor-149-thread-1-processing-n:127.0.0.1:49110_) [n:127.0.0.1:49110_ c:control_collection   x:collection1] o.a.s.c.c.ZkStateReader Load collection config from:/collections/control_collection
   [junit4]   2> 95947 INFO  (coreLoadExecutor-149-thread-1-processing-n:127.0.0.1:49110_) [n:127.0.0.1:49110_ c:control_collection   x:collection1] o.a.s.c.c.ZkStateReader path=/collections/control_collection configName=conf1 specified config exists in ZooKeeper
   [junit4]   2> 95947 INFO  (coreLoadExecutor-149-thread-1-processing-n:127.0.0.1:49110_) [n:127.0.0.1:49110_ c:control_collection   x:collection1] o.a.s.c.SolrResourceLoader new SolrResourceLoader for directory: '/x1/jenkins/jenkins-slave/workspace/Lucene-Solr-Tests-trunk-Java8/solr/build/solr-solrj/test/J0/../../../../../../../../../../x1/jenkins/jenkins-slave/workspace/Lucene-Solr-Tests-trunk-Java8/solr/build/solr-solrj/test/J0/temp/solr.client.solrj.impl.CloudSolrClientTest_F2BEC23974BD3686-001/control-001/cores/collection1/'
   [junit4]   2> 95984 INFO  (coreLoadExecutor-149-thread-1-processing-n:127.0.0.1:49110_) [n:127.0.0.1:49110_ c:control_collection   x:collection1] o.a.s.c.Config loaded config solrconfig.xml with version 0 
   [junit4]   2> 95998 INFO  (coreLoadExecutor-149-thread-1-processing-n:127.0.0.1:49110_) [n:127.0.0.1:49110_ c:control_collection   x:collection1] o.a.s.c.SolrConfig current version of requestparams : -1
   [junit4]   2> 96001 INFO  (coreLoadExecutor-149-thread-1-processing-n:127.0.0.1:49110_) [n:127.0.0.1:49110_ c:control_collection   x:collection1] o.a.s.c.SolrConfig Using Lucene MatchVersion: 6.0.0
   [junit4]   2> 96041 INFO  (coreLoadExecutor-149-thread-1-processing-n:127.0.0.1:49110_) [n:127.0.0.1:49110_ c:control_collection   x:collection1] o.a.s.c.Config Loaded SolrConfig: solrconfig.xml
   [junit4]   2> 96043 INFO  (coreLoadExecutor-149-thread-1-processing-n:127.0.0.1:49110_) [n:127.0.0.1:49110_ c:control_collection   x:collection1] o.a.s.s.IndexSchema Reading Solr Schema from /configs/conf1/schema.xml
   [junit4]   2> 96057 INFO  (coreLoadExecutor-149-thread-1-processing-n:127.0.0.1:49110_) [n:127.0.0.1:49110_ c:control_collection   x:collection1] o.a.s.s.IndexSchema [collection1] Schema name=test
   [junit4]   2> 96270 INFO  (coreLoadExecutor-149-thread-1-processing-n:127.0.0.1:49110_) [n:127.0.0.1:49110_ c:control_collection   x:collection1] o.a.s.s.IndexSchema default search field in schema is text
   [junit4]   2> 96271 INFO  (coreLoadExecutor-149-thread-1-processing-n:127.0.0.1:49110_) [n:127.0.0.1:49110_ c:control_collection   x:collection1] o.a.s.s.IndexSchema unique key field: id
   [junit4]   2> 96272 WARN  (coreLoadExecutor-149-thread-1-processing-n:127.0.0.1:49110_) [n:127.0.0.1:49110_ c:control_collection   x:collection1] o.a.s.s.IndexSchema Field lowerfilt1and2 is not multivalued and destination for multiple copyFields (2)
   [junit4]   2> 96272 WARN  (coreLoadExecutor-149-thread-1-processing-n:127.0.0.1:49110_) [n:127.0.0.1:49110_ c:control_collection   x:collection1] o.a.s.s.IndexSchema Field text is not multivalued and destination for multiple copyFields (3)
   [junit4]   2> 96302 INFO  (coreLoadExecutor-149-thread-1-processing-n:127.0.0.1:49110_) [n:127.0.0.1:49110_ c:control_collection   x:collection1] o.a.s.c.ConfigSetProperties Did not find ConfigSet properties, assuming default properties: Can't find resource 'configsetprops.json' in classpath or '/configs/conf1', cwd=/x1/jenkins/jenkins-slave/workspace/Lucene-Solr-Tests-trunk-Java8/solr/build/solr-solrj/test/J0
   [junit4]   2> 96302 INFO  (coreLoadExecutor-149-thread-1-processing-n:127.0.0.1:49110_) [n:127.0.0.1:49110_ c:control_collection   x:collection1] o.a.s.c.CoreContainer Creating SolrCore 'collection1' using configuration from collection control_collection
   [junit4]   2> 96303 INFO  (coreLoadExecutor-149-thread-1-processing-n:127.0.0.1:49110_) [n:127.0.0.1:49110_ c:control_collection s:shard1 r:core_node1 x:collection1] o.a.s.c.SolrCore org.apache.solr.core.MockDirectoryFactory
   [junit4]   2> 96303 INFO  (coreLoadExecutor-149-thread-1-processing-n:127.0.0.1:49110_) [n:127.0.0.1:49110_ c:control_collection s:shard1 r:core_node1 x:collection1] o.a.s.c.SolrCore [[collection1] ] Opening new SolrCore at [/x1/jenkins/jenkins-slave/workspace/Lucene-Solr-Tests-trunk-Java8/solr/build/solr-solrj/test/J0/../../../../../../../../../../x1/jenkins/jenkins-slave/workspace/Lucene-Solr-Tests-trunk-Java8/solr/build/solr-solrj/test/J0/temp/solr.client.solrj.impl.CloudSolrClientTest_F2BEC23974BD3686-001/control-001/cores/collection1/], dataDir=[null]
   [junit4]   2> 96303 INFO  (coreLoadExecutor-149-thread-1-processing-n:127.0.0.1:49110_) [n:127.0.0.1:49110_ c:control_collection s:shard1 r:core_node1 x:collection1] o.a.s.c.SolrCore JMX monitoring not detected for core: collection1
   [junit4]   2> 96304 INFO  (coreLoadExecutor-149-thread-1-processing-n:127.0.0.1:49110_) [n:127.0.0.1:49110_ c:control_collection s:shard1 r:core_node1 x:collection1] o.a.s.c.CachingDirectoryFactory return new directory for /x1/jenkins/jenkins-slave/workspace/Lucene-Solr-Tests-trunk-Java8/solr/build/solr-solrj/test/J0/../../../../../../../../../../x1/jenkins/jenkins-slave/workspace/Lucene-Solr-Tests-trunk-Java8/solr/build/solr-solrj/test/J0/temp/solr.client.solrj.impl.CloudSolrClientTest_F2BEC23974BD3686-001/control-001/cores/collection1/data
   [junit4]   2> 96304 INFO  (coreLoadExecutor-149-thread-1-processing-n:127.0.0.1:49110_) [n:127.0.0.1:49110_ c:control_collection s:shard1 r:core_node1 x:collection1] o.a.s.c.SolrCore New index directory detected: old=null new=/x1/jenkins/jenkins-slave/workspace/Lucene-Solr-Tests-trunk-Java8/solr/build/solr-solrj/test/J0/../../../../../../../../../../x1/jenkins/jenkins-slave/workspace/Lucene-Solr-Tests-trunk-Java8/solr/build/solr-solrj/test/J0/temp/solr.client.solrj.impl.CloudSolrClientTest_F2BEC23974BD3686-001/control-001/cores/collection1/data/index/
   [junit4]   2> 96304 WARN  (coreLoadExecutor-149-thread-1-processing-n:127.0.0.1:49110_) [n:127.0.0.1:49110_ c:control_collection s:shard1 r:core_node1 x:collection1] o.a.s.c.SolrCore [collection1] Solr index directory '/x1/jenkins/jenkins-slave/workspace/Lucene-Solr-Tests-trunk-Java8/solr/build/solr-solrj/test/J0/../../../../../../../../../../x1/jenkins/jenkins-slave/workspace/Lucene-Solr-Tests-trunk-Java8/solr/build/solr-solrj/test/J0/temp/solr.client.solrj.impl.CloudSolrClientTest_F2BEC23974BD3686-001/control-001/cores/collection1/data/index' doesn't exist. Creating new index...
   [junit4]   2> 96305 INFO  (coreLoadExecutor-149-thread-1-processing-n:127.0.0.1:49110_) [n:127.0.0.1:49110_ c:control_collection s:shard1 r:core_node1 x:collection1] o.a.s.c.CachingDirectoryFactory return new directory for /x1/jenkins/jenkins-slave/workspace/Lucene-Solr-Tests-trunk-Java8/solr/build/solr-solrj/test/J0/../../../../../../../../../../x1/jenkins/jenkins-slave/workspace/Lucene-Solr-Tests-trunk-Java8/solr/build/solr-solrj/test/J0/temp/solr.client.solrj.impl.CloudSolrClientTest_F2BEC23974BD3686-001/control-001/cores/collection1/data/index
   [junit4]   2> 96311 INFO  (coreLoadExecutor-149-thread-1-processing-n:127.0.0.1:49110_) [n:127.0.0.1:49110_ c:control_collection s:shard1 r:core_node1 x:collection1] o.a.s.c.SolrCore SolrDeletionPolicy.onCommit: commits: num=1
   [junit4]   2> 	commit{dir=MockDirectoryWrapper(RAMDirectory@4f41428 lockFactory=org.apache.lucene.store.SingleInstanceLockFactory@2a091752),segFN=segments_1,generation=1}
   [junit4]   2> 96311 INFO  (coreLoadExecutor-149-thread-1-processing-n:127.0.0.1:49110_) [n:127.0.0.1:49110_ c:control_collection s:shard1 r:core_node1 x:collection1] o.a.s.c.SolrCore newest commit generation = 1
   [junit4]   2> 96324 INFO  (OldIndexDirectoryCleanupThreadForCore-collection1) [n:127.0.0.1:49110_ c:control_collection s:shard1 r:core_node1 x:collection1] o.a.s.c.SolrCore Looking for old index directories to cleanup for core collection1 in /x1/jenkins/jenkins-slave/workspace/Lucene-Solr-Tests-trunk-Java8/solr/build/solr-solrj/test/J0/../../../../../../../../../../x1/jenkins/jenkins-slave/workspace/Lucene-Solr-Tests-trunk-Java8/solr/build/solr-solrj/test/J0/temp/solr.client.solrj.impl.CloudSolrClientTest_F2BEC23974BD3686-001/control-001/cores/collection1/data/
   [junit4]   2> 96324 WARN  (OldIndexDirectoryCleanupThreadForCore-collection1) [n:127.0.0.1:49110_ c:control_collection s:shard1 r:core_node1 x:collection1] o.a.s.c.DirectoryFactory /x1/jenkins/jenkins-slave/workspace/Lucene-Solr-Tests-trunk-Java8/solr/build/solr-solrj/test/J0/../../../../../../../../../../x1/jenkins/jenkins-slave/workspace/Lucene-Solr-Tests-trunk-Java8/solr/build/solr-solrj/test/J0/temp/solr.client.solrj.impl.CloudSolrClientTest_F2BEC23974BD3686-001/control-001/cores/collection1/data/ does not point to a valid data directory; skipping clean-up of old index directories.
   [junit4]   2> 96350 INFO  (coreLoadExecutor-149-thread-1-processing-n:127.0.0.1:49110_) [n:127.0.0.1:49110_ c:control_collection s:shard1 r:core_node1 x:collection1] o.a.s.c.SolrCore no updateRequestProcessorChain defined as default, creating implicit default
   [junit4]   2> 96352 INFO  (coreLoadExecutor-149-thread-1-processing-n:127.0.0.1:49110_) [n:127.0.0.1:49110_ c:control_collection s:shard1 r:core_node1 x:collection1] o.a.s.h.l.XMLLoader xsltCacheLifetimeSeconds=60
   [junit4]   2> 96352 INFO  (coreLoadExecutor-149-thread-1-processing-n:127.0.0.1:49110_) [n:127.0.0.1:49110_ c:control_collection s:shard1 r:core_node1 x:collection1] o.a.s.h.l.XMLLoader xsltCacheLifetimeSeconds=60
   [junit4]   2> 96353 INFO  (coreLoadExecutor-149-thread-1-processing-n:127.0.0.1:49110_) [n:127.0.0.1:49110_ c:control_collection s:shard1 r:core_node1 x:collection1] o.a.s.h.l.XMLLoader xsltCacheLifetimeSeconds=60
   [junit4]   2> 96366 INFO  (coreLoadExecutor-149-thread-1-processing-n:127.0.0.1:49110_) [n:127.0.0.1:49110_ c:control_collection s:shard1 r:core_node1 x:collection1] o.a.s.h.l.XMLLoader xsltCacheLifetimeSeconds=60
   [junit4]   2> 96398 INFO  (coreLoadExecutor-149-thread-1-processing-n:127.0.0.1:49110_) [n:127.0.0.1:49110_ c:control_collection s:shard1 r:core_node1 x:collection1] o.a.s.c.RequestHandlers Registered paths: /admin/mbeans,standard,,/update/csv,/update/json/docs,/admin/luke,/admin/segments,/get,/admin/system,/replication,/admin/properties,/config,/schema,/admin/plugins,/admin/logging,/update/json,/admin/threads,/admin/ping,/update,/admin/file
   [junit4]   2> 96398 WARN  (coreLoadExecutor-149-thread-1-processing-n:127.0.0.1:49110_) [n:127.0.0.1:49110_ c:control_collection s:shard1 r:core_node1 x:collection1] o.a.s.c.RequestHandlers no default request handler is registered (either '/select' or 'standard')
   [junit4]   2> 96399 INFO  (coreLoadExecutor-149-thread-1-processing-n:127.0.0.1:49110_) [n:127.0.0.1:49110_ c:control_collection s:shard1 r:core_node1 x:collection1] o.a.s.c.SolrCore Using default statsCache cache: org.apache.solr.search.stats.LocalStatsCache
   [junit4]   2> 96418 INFO  (coreLoadExecutor-149-thread-1-processing-n:127.0.0.1:49110_) [n:127.0.0.1:49110_ c:control_collection s:shard1 r:core_node1 x:collection1] o.a.s.u.UpdateHandler Using UpdateLog implementation: org.apache.solr.update.UpdateLog
   [junit4]   2> 96418 INFO  (coreLoadExecutor-149-thread-1-processing-n:127.0.0.1:49110_) [n:127.0.0.1:49110_ c:control_collection s:shard1 r:core_node1 x:collection1] o.a.s.u.UpdateLog Initializing UpdateLog: dataDir= defaultSyncLevel=FLUSH numRecordsToKeep=100 maxNumLogsToKeep=10 numVersionBuckets=65536
   [junit4]   2> 96419 INFO  (coreLoadExecutor-149-thread-1-processing-n:127.0.0.1:49110_) [n:127.0.0.1:49110_ c:control_collection s:shard1 r:core_node1 x:collection1] o.a.s.c.SolrCore Hard AutoCommit: disabled
   [junit4]   2> 96419 INFO  (coreLoadExecutor-149-thread-1-processing-n:127.0.0.1:49110_) [n:127.0.0.1:49110_ c:control_collection s:shard1 r:core_node1 x:collection1] o.a.s.c.SolrCore Soft AutoCommit: disabled
   [junit4]   2> 96420 INFO  (coreLoadExecutor-149-thread-1-processing-n:127.0.0.1:49110_) [n:127.0.0.1:49110_ c:control_collection s:shard1 r:core_node1 x:collection1] o.a.s.c.SolrCore SolrDeletionPolicy.onInit: commits: num=1
   [junit4]   2> 	commit{dir=MockDirectoryWrapper(RAMDirectory@4f41428 lockFactory=org.apache.lucene.store.SingleInstanceLockFactory@2a091752),segFN=segments_1,generation=1}
   [junit4]   2> 96420 INFO  (coreLoadExecutor-149-thread-1-processing-n:127.0.0.1:49110_) [n:127.0.0.1:49110_ c:control_collection s:shard1 r:core_node1 x:collection1] o.a.s.c.SolrCore newest commit generation = 1
   [junit4]   2> 96420 INFO  (coreLoadExecutor-149-thread-1-processing-n:127.0.0.1:49110_) [n:127.0.0.1:49110_ c:control_collection s:shard1 r:core_node1 x:collection1] o.a.s.s.SolrIndexSearcher Opening Searcher@747f50fc[collection1] main
   [junit4]   2> 96420 INFO  (coreLoadExecutor-149-thread-1-processing-n:127.0.0.1:49110_) [n:127.0.0.1:49110_ c:control_collection s:shard1 r:core_node1 x:collection1] o.a.s.c.c.ZkStateReader Load collection config from:/collections/control_collection
   [junit4]   2> 96424 INFO  (coreLoadExecutor-149-thread-1-processing-n:127.0.0.1:49110_) [n:127.0.0.1:49110_ c:control_collection s:shard1 r:core_node1 x:collection1] o.a.s.c.c.ZkStateReader path=/collections/control_collection configName=conf1 specified config exists in ZooKeeper
   [junit4]   2> 96424 INFO  (coreLoadExecutor-149-thread-1-processing-n:127.0.0.1:49110_) [n:127.0.0.1:49110_ c:control_collection s:shard1 r:core_node1 x:collection1] o.a.s.r.ManagedResourceStorage Setting up ZooKeeper-based storage for the RestManager with znodeBase: /configs/conf1
   [junit4]   2> 96427 INFO  (coreLoadExecutor-149-thread-1-processing-n:127.0.0.1:49110_) [n:127.0.0.1:49110_ c:control_collection s:shard1 r:core_node1 x:collection1] o.a.s.r.ManagedResourceStorage Configured ZooKeeperStorageIO with znodeBase: /configs/conf1
   [junit4]   2> 96427 INFO  (coreLoadExecutor-149-thread-1-processing-n:127.0.0.1:49110_) [n:127.0.0.1:49110_ c:control_collection s:shard1 r:core_node1 x:collection1] o.a.s.r.RestManager Initializing RestManager with initArgs: {}
   [junit4]   2> 96427 INFO  (coreLoadExecutor-149-thread-1-processing-n:127.0.0.1:49110_) [n:127.0.0.1:49110_ c:control_collection s:shard1 r:core_node1 x:collection1] o.a.s.r.ManagedResourceStorage Reading _rest_managed.json using ZooKeeperStorageIO:path=/configs/conf1
   [junit4]   2> 96429 INFO  (coreLoadExecutor-149-thread-1-processing-n:127.0.0.1:49110_) [n:127.0.0.1:49110_ c:control_collection s:shard1 r:core_node1 x:collection1] o.a.s.r.ManagedResourceStorage No data found for znode /configs/conf1/_rest_managed.json
   [junit4]   2> 96429 INFO  (coreLoadExecutor-149-thread-1-processing-n:127.0.0.1:49110_) [n:127.0.0.1:49110_ c:control_collection s:shard1 r:core_node1 x:collection1] o.a.s.r.ManagedResourceStorage Loaded null at path _rest_managed.json using ZooKeeperStorageIO:path=/configs/conf1
   [junit4]   2> 96429 INFO  (coreLoadExecutor-149-thread-1-processing-n:127.0.0.1:49110_) [n:127.0.0.1:49110_ c:control_collection s:shard1 r:core_node1 x:collection1] o.a.s.r.RestManager Initializing 0 registered ManagedResources
   [junit4]   2> 96429 INFO  (coreLoadExecutor-149-thread-1-processing-n:127.0.0.1:49110_) [n:127.0.0.1:49110_ c:control_collection s:shard1 r:core_node1 x:collection1] o.a.s.h.ReplicationHandler Commits will be reserved for  10000
   [junit4]   2> 96430 INFO  (searcherExecutor-150-thread-1-processing-n:127.0.0.1:49110_ x:collection1 s:shard1 c:control_collection r:core_node1) [n:127.0.0.1:49110_ c:control_collection s:shard1 r:core_node1 x:collection1] o.a.s.c.SolrCore [collection1] Registered new searcher Searcher@747f50fc[collection1] main{ExitableDirectoryReader(UninvertingDirectoryReader())}
   [junit4]   2> 96430 INFO  (coreLoadExecutor-149-thread-1-processing-n:127.0.0.1:49110_) [n:127.0.0.1:49110_ c:control_collection s:shard1 r:core_node1 x:collection1] o.a.s.u.UpdateLog Looking up max value of version field to seed version buckets
   [junit4]   2> 96430 INFO  (coreLoadExecutor-149-thread-1-processing-n:127.0.0.1:49110_) [n:127.0.0.1:49110_ c:control_collection s:shard1 r:core_node1 x:collection1] o.a.s.u.VersionInfo Refreshing highest value of _version_ for 65536 version buckets from index
   [junit4]   2> 96430 INFO  (coreLoadExecutor-149-thread-1-processing-n:127.0.0.1:49110_) [n:127.0.0.1:49110_ c:control_collection s:shard1 r:core_node1 x:collection1] o.a.s.u.VersionInfo No terms found for _version_, cannot seed version bucket highest value from index
   [junit4]   2> 96430 INFO  (coreLoadExecutor-149-thread-1-processing-n:127.0.0.1:49110_) [n:127.0.0.1:49110_ c:control_collection s:shard1 r:core_node1 x:collection1] o.a.s.u.UpdateLog Could not find max version in index or recent updates, using new clock 1510012184103485440
   [junit4]   2> 96432 INFO  (coreLoadExecutor-149-thread-1-processing-n:127.0.0.1:49110_) [n:127.0.0.1:49110_ c:control_collection s:shard1 r:core_node1 x:collection1] o.a.s.u.UpdateLog Took 2.0ms to seed version buckets with highest version 1510012184103485440
   [junit4]   2> 96434 INFO  (coreLoadExecutor-149-thread-1-processing-n:127.0.0.1:49110_) [n:127.0.0.1:49110_ c:control_collection s:shard1 r:core_node1 x:collection1] o.a.s.c.ZkController watch zkdir /configs/conf1
   [junit4]   2> 96445 INFO  (coreLoadExecutor-149-thread-1-processing-n:127.0.0.1:49110_) [n:127.0.0.1:49110_ c:control_collection s:shard1 r:core_node1 x:collection1] o.a.s.c.CoreContainer registering core: collection1
   [junit4]   2> 96455 INFO  (coreZkRegister-143-thread-1-processing-n:127.0.0.1:49110_ x:collection1 s:shard1 c:control_collection r:core_node1) [n:127.0.0.1:49110_ c:control_collection s:shard1 r:core_node1 x:collection1] o.a.s.c.ZkController Register replica - core:collection1 address:http://127.0.0.1:49110 collection:control_collection shard:shard1
   [junit4]   2> 96477 INFO  (coreZkRegister-143-thread-1-processing-n:127.0.0.1:49110_ x:collection1 s:shard1 c:control_collection r:core_node1) [n:127.0.0.1:49110_ c:control_collection s:shard1 r:core_node1 x:collection1] o.a.s.c.c.SolrZkClient makePath: /collections/control_collection/leader_elect/shard1/election
   [junit4]   2> 96498 INFO  (coreZkRegister-143-thread-1-processing-n:127.0.0.1:49110_ x:collection1 s:shard1 c:control_collection r:core_node1) [n:127.0.0.1:49110_ c:control_collection s:shard1 r:core_node1 x:collection1] o.a.s.c.LeaderElector Joined leadership election with path: /collections/control_collection/leader_elect/shard1/election/94375761205460996-core_node1-n_0000000000
   [junit4]   2> 96500 INFO  (coreZkRegister-143-thread-1-processing-n:127.0.0.1:49110_ x:collection1 s:shard1 c:control_collection r:core_node1) [n:127.0.0.1:49110_ c:control_collection s:shard1 r:core_node1 x:collection1] o.a.s.c.ShardLeaderElectionContext Running the leader process for shard shard1
   [junit4]   2> 96504 INFO  (OverseerStateUpdate-94375761205460996-127.0.0.1:49110_-n_0000000000) [n:127.0.0.1:49110_    ] o.a.s.c.Overseer processMessage: queueSize: 1, message = {
   [junit4]   2>   "operation":"leader",
   [junit4]   2>   "shard":"shard1",
   [junit4]   2>   "collection":"control_collection"} current state version: 1
   [junit4]   2> 96509 INFO  (zkCallback-24-thread-1-processing-n:127.0.0.1:49110_) [n:127.0.0.1:49110_    ] o.a.s.c.c.ZkStateReader A cluster state change: WatchedEvent state:SyncConnected type:NodeDataChanged path:/clusterstate.json, has occurred - updating... (live nodes size: 1)
   [junit4]   2> 96511 INFO  (coreZkRegister-143-thread-1-processing-n:127.0.0.1:49110_ x:collection1 s:shard1 c:control_collection r:core_node1) [n:127.0.0.1:49110_ c:control_collection s:shard1 r:core_node1 x:collection1] o.a.s.c.ShardLeaderElectionContext Enough replicas found to continue.
   [junit4]   2> 96511 INFO  (coreZkRegister-143-thread-1-processing-n:127.0.0.1:49110_ x:collection1 s:shard1 c:control_collection r:core_node1) [n:127.0.0.1:49110_ c:control_collection s:shard1 r:core_node1 x:collection1] o.a.s.c.ShardLeaderElectionContext I may be the new leader - try and sync
   [junit4]   2> 96511 INFO  (coreZkRegister-143-thread-1-processing-n:127.0.0.1:49110_ x:collection1 s:shard1 c:control_collection r:core_node1) [n:127.0.0.1:49110_ c:control_collection s:shard1 r:core_node1 x:collection1] o.a.s.c.SyncStrategy Sync replicas to http://127.0.0.1:49110/collection1/
   [junit4]   2> 96512 INFO  (coreZkRegister-143-thread-1-processing-n:127.0.0.1:49110_ x:collection1 s:shard1 c:control_collection r:core_node1) [n:127.0.0.1:49110_ c:control_collection s:shard1 r:core_node1 x:collection1] o.a.s.c.SyncStrategy Sync Success - now sync replicas to me
   [junit4]   2> 96512 INFO  (coreZkRegister-143-thread-1-processing-n:127.0.0.1:49110_ x:collection1 s:shard1 c:control_collection r:core_node1) [n:127.0.0.1:49110_ c:control_collection s:shard1 r:core_node1 x:collection1] o.a.s.c.SyncStrategy http://127.0.0.1:49110/collection1/ has no replicas
   [junit4]   2> 96512 INFO  (coreZkRegister-143-thread-1-processing-n:127.0.0.1:49110_ x:collection1 s:shard1 c:control_collection r:core_node1) [n:127.0.0.1:49110_ c:control_collection s:shard1 r:core_node1 x:collection1] o.a.s.c.ShardLeaderElectionContext I am the new leader: http://127.0.0.1:49110/collection1/ shard1
   [junit4]   2> 96514 INFO  (coreZkRegister-143-thread-1-processing-n:127.0.0.1:49110_ x:collection1 s:shard1 c:control_collection r:core_node1) [n:127.0.0.1:49110_ c:control_collection s:shard1 r:core_node1 x:collection1] o.a.s.c.c.SolrZkClient makePath: /collections/control_collection/leaders/shard1
   [junit4]   2> 96806 INFO  (OverseerStateUpdate-94375761205460996-127.0.0.1:49110_-n_0000000000) [n:127.0.0.1:49110_    ] o.a.s.c.Overseer processMessage: queueSize: 1, message = {
   [junit4]   2>   "operation":"leader",
   [junit4]   2>   "shard":"shard1",
   [junit4]   2>   "collection":"control_collection",
   [junit4]   2>   "base_url":"http://127.0.0.1:49110",
   [junit4]   2>   "core":"collection1",
   [junit4]   2>   "state":"active"} current state version: 2
   [junit4]   2> 96911 INFO  (zkCallback-24-thread-1-processing-n:127.0.0.1:49110_) [n:127.0.0.1:49110_    ] o.a.s.c.c.ZkStateReader A cluster state change: WatchedEvent state:SyncConnected type:NodeDataChanged path:/clusterstate.json, has occurred - updating... (live nodes size: 1)
   [junit4]   2> 96940 INFO  (TEST-CloudSolrClientTest.testShutdown-seed#[F2BEC23974BD3686]) [    ] o.a.s.c.c.SolrZkClient Using default ZkCredentialsProvider
   [junit4]   2> 96949 INFO  (coreZkRegister-143-thread-1-processing-n:127.0.0.1:49110_ x:collection1 s:shard1 c:control_collection r:core_node1) [n:127.0.0.1:49110_ c:control_collection s:shard1 r:core_node1 x:collection1] o.a.s.c.ZkController We are http://127.0.0.1:49110/collection1/ and leader is http://127.0.0.1:49110/collection1/
   [junit4]   2> 96950 INFO  (coreZkRegister-143-thread-1-processing-n:127.0.0.1:49110_ x:collection1 s:shard1 c:control_collection r:core_node1) [n:127.0.0.1:49110_ c:control_collection s:shard1 r:core_node1 x:collection1] o.a.s.c.ZkController No LogReplay needed for core=collection1 baseURL=http://127.0.0.1:49110
   [junit4]   2> 96950 INFO  (coreZkRegister-143-thread-1-processing-n:127.0.0.1:49110_ x:collection1 s:shard1 c:control_collection r:core_node1) [n:127.0.0.1:49110_ c:control_collection s:shard1 r:core_node1 x:collection1] o.a.s.c.ZkController I am the leader, no recovery necessary
   [junit4]   2> 96950 INFO  (coreZkRegister-143-thread-1-processing-n:127.0.0.1:49110_ x:collection1 s:shard1 c:control_collection r:core_node1) [n:127.0.0.1:49110_ c:control_collection s:shard1 r:core_node1 x:collection1] o.a.s.c.ZkController publishing state=active
   [junit4]   2> 96950 INFO  (coreZkRegister-143-thread-1-processing-n:127.0.0.1:49110_ x:collection1 s:shard1 c:control_collection r:core_node1) [n:127.0.0.1:49110_ c:control_collection s:shard1 r:core_node1 x:collection1] o.a.s.c.ZkController numShards not found on descriptor - reading it from system property
   [junit4]   2> 96955 INFO  (OverseerStateUpdate-94375761205460996-127.0.0.1:49110_-n_0000000000) [n:127.0.0.1:49110_    ] o.a.s.c.Overseer processMessage: queueSize: 1, message = {
   [junit4]   2>   "core":"collection1",
   [junit4]   2>   "core_node_name":"core_node1",
   [junit4]   2>   "roles":null,
   [junit4]   2>   "base_url":"http://127.0.0.1:49110",
   [junit4]   2>   "node_name":"127.0.0.1:49110_",
   [junit4]   2>   "numShards":"2",
   [junit4]   2>   "state":"active",
   [junit4]   2>   "shard":"shard1",
   [junit4]   2>   "collection":"control_collection",
   [junit4]   2>   "operation":"state"} current state version: 3
   [junit4]   2> 96956 INFO  (OverseerStateUpdate-94375761205460996-127.0.0.1:49110_-n_0000000000) [n:127.0.0.1:49110_    ] o.a.s.c.o.ReplicaMutator Update state numShards=2 message={
   [junit4]   2>   "core":"collection1",
   [junit4]   2>   "core_node_name":"core_node1",
   [junit4]   2>   "roles":null,
   [junit4]   2>   "base_url":"http://127.0.0.1:49110",
   [junit4]   2>   "node_name":"127.0.0.1:49110_",
   [junit4]   2>   "numShards":"2",
   [junit4]   2>   "state":"active",
   [junit4]   2>   "shard":"shard1",
   [junit4]   2>   "collection":"control_collection",
   [junit4]   2>   "operation":"state"}
   [junit4]   2> 96985 INFO  (TEST-CloudSolrClientTest.testShutdown-seed#[F2BEC23974BD3686]) [    ] o.a.s.c.c.ConnectionManager Waiting for client to connect to ZooKeeper
   [junit4]   2> 96996 INFO  (zkCallback-26-thread-1) [    ] o.a.s.c.c.ConnectionManager Watcher org.apache.solr.common.cloud.ConnectionManager@1aff70e3 name:ZooKeeperConnection Watcher:127.0.0.1:54715/solr got event WatchedEvent state:SyncConnected type:None path:null path:null type:None
   [junit4]   2> 96996 INFO  (TEST-CloudSolrClientTest.testShutdown-seed#[F2BEC23974BD3686]) [    ] o.a.s.c.c.ConnectionManager Client is connected to ZooKeeper
   [junit4]   2> 96996 INFO  (TEST-CloudSolrClientTest.testShutdown-seed#[F2BEC23974BD3686]) [    ] o.a.s.c.c.SolrZkClient Using default ZkACLProvider
   [junit4]   2> 96996 INFO  (TEST-CloudSolrClientTest.testShutdown-seed#[F2BEC23974BD3686]) [    ] o.a.s.c.c.ZkStateReader Updating cluster state from ZooKeeper... 
   [junit4]   2> 97004 INFO  (TEST-CloudSolrClientTest.testShutdown-seed#[F2BEC23974BD3686]) [    ] o.a.s.c.ChaosMonkey monkey: init - expire sessions:false cause connection loss:false
   [junit4]   2> 97004 INFO  (TEST-CloudSolrClientTest.testShutdown-seed#[F2BEC23974BD3686]) [    ] o.a.s.c.AbstractFullDistribZkTestBase Creating collection1 with stateFormat=2
   [junit4]   2> 97004 INFO  (TEST-CloudSolrClientTest.testShutdown-seed#[F2BEC23974BD3686]) [    ] o.a.s.c.c.SolrZkClient Using default ZkCredentialsProvider
   [junit4]   2> 97020 INFO  (TEST-CloudSolrClientTest.testShutdown-seed#[F2BEC23974BD3686]) [    ] o.a.s.c.c.ConnectionManager Waiting for client to connect to ZooKeeper
   [junit4]   2> 97028 INFO  (zkCallback-27-thread-1) [    ] o.a.s.c.c.ConnectionManager Watcher org.apache.solr.common.cloud.ConnectionManager@290246ef name:ZooKeeperConnection Watcher:127.0.0.1:54715/solr got event WatchedEvent state:SyncConnected type:None path:null path:null type:None
   [junit4]   2> 97029 INFO  (TEST-CloudSolrClientTest.testShutdown-seed#[F2BEC23974BD3686]) [    ] o.a.s.c.c.ConnectionManager Client is connected to ZooKeeper
   [junit4]   2> 97029 INFO  (TEST-CloudSolrClientTest.testShutdown-seed#[F2BEC23974BD3686]) [    ] o.a.s.c.c.SolrZkClient Using default ZkACLProvider
   [junit4]   2> 97038 INFO  (OverseerStateUpdate-94375761205460996-127.0.0.1:49110_-n_0000000000) [n:127.0.0.1:49110_    ] o.a.s.c.Overseer processMessage: queueSize: 1, message = {
   [junit4]   2>   "operation":"create",
   [junit4]   2>   "name":"collection1",
   [junit4]   2>   "numShards":"2",
   [junit4]   2>   "stateFormat":"2"} current state version: 3
   [junit4]   2> 97038 INFO  (OverseerStateUpdate-94375761205460996-127.0.0.1:49110_-n_0000000000) [n:127.0.0.1:49110_    ] o.a.s.c.o.ClusterStateMutator building a new cName: collection1
   [junit4]   2> 97040 INFO  (zkCallback-26-thread-1) [    ] o.a.s.c.c.ZkStateReader A cluster state change: WatchedEvent state:SyncConnected type:NodeDataChanged path:/clusterstate.json, has occurred - updating... (live nodes size: 1)
   [junit4]   2> 97040 INFO  (zkCallback-24-thread-1-processing-n:127.0.0.1:49110_) [n:127.0.0.1:49110_    ] o.a.s.c.c.ZkStateReader A cluster state change: WatchedEvent state:SyncConnected type:NodeDataChanged path:/clusterstate.json, has occurred - updating... (live nodes size: 1)
   [junit4]   2> 97165 INFO  (OverseerStateUpdate-94375761205460996-127.0.0.1:49110_-n_0000000000) [n:127.0.0.1:49110_    ] o.a.s.c.o.ZkStateWriter going to create_collection /collections/collection1/state.json
   [junit4]   2> 97167 INFO  (zkCallback-26-thread-1) [    ] o.a.s.c.c.ZkStateReader A cluster state change: WatchedEvent state:SyncConnected type:NodeDataChanged path:/clusterstate.json, has occurred - updating... (live nodes size: 1)
   [junit4]   2> 97167 INFO  (zkCallback-24-thread-1-processing-n:127.0.0.1:49110_) [n:127.0.0.1:49110_    ] o.a.s.c.c.ZkStateReader A cluster state change: WatchedEvent state:SyncConnected type:NodeDataChanged path:/clusterstate.json, has occurred - updating... (live nodes size: 1)
   [junit4]   2> 97244 INFO  (TEST-CloudSolrClientTest.testShutdown-seed#[F2BEC23974BD3686]) [    ] o.a.s.SolrTestCaseJ4 Writing core.properties file to /x1/jenkins/jenkins-slave/workspace/Lucene-Solr-Tests-trunk-Java8/solr/build/solr-solrj/test/J0/temp/solr.client.solrj.impl.CloudSolrClientTest_F2BEC23974BD3686-001/shard-1-001/cores/collection1
   [junit4]   2> 97245 INFO  (TEST-CloudSolrClientTest.testShutdown-seed#[F2BEC23974BD3686]) [    ] o.a.s.c.AbstractFullDistribZkTestBase create jetty 1 in directory /x1/jenkins/jenkins-slave/workspace/Lucene-Solr-Tests-trunk-Java8/solr/build/solr-solrj/test/J0/temp/solr.client.solrj.impl.CloudSolrClientTest_F2BEC23974BD3686-001/shard-1-001
   [junit4]   2> 97246 INFO  (TEST-CloudSolrClientTest.testShutdown-seed#[F2BEC23974BD3686]) [    ] o.e.j.s.Server jetty-9.2.13.v20150730
   [junit4]   2> 97302 INFO  (TEST-CloudSolrClientTest.testShutdown-seed#[F2BEC23974BD3686]) [    ] o.e.j.s.h.ContextHandler Started o.e.j.s.ServletContextHandler@59069b21{/,null,AVAILABLE}
   [junit4]   2> 97303 INFO  (TEST-CloudSolrClientTest.testShutdown-seed#[F2BEC23974BD3686]) [    ] o.e.j.s.ServerConnector Started ServerConnector@4fd6f9b9{HTTP/1.1}{127.0.0.1:55716}
   [junit4]   2> 97303 INFO  (TEST-CloudSolrClientTest.testShutdown-seed#[F2BEC23974BD3686]) [    ] o.e.j.s.Server Started @104909ms
   [junit4]   2> 97303 INFO  (TEST-CloudSolrClientTest.testShutdown-seed#[F2BEC23974BD3686]) [    ] o.a.s.c.s.e.JettySolrRunner Jetty properties: {solr.data.dir=/x1/jenkins/jenkins-slave/workspace/Lucene-Solr-Tests-trunk-Java8/solr/build/solr-solrj/test/J0/temp/solr.client.solrj.impl.CloudSolrClientTest_F2BEC23974BD3686-001/tempDir-001/jetty1, solrconfig=solrconfig.xml, hostContext=/, hostPort=55716, coreRootDirectory=/x1/jenkins/jenkins-slave/workspace/Lucene-Solr-Tests-trunk-Java8/solr/build/solr-solrj/test/J0/../../../../../../../../../../x1/jenkins/jenkins-slave/workspace/Lucene-Solr-Tests-trunk-Java8/solr/build/solr-solrj/test/J0/temp/solr.client.solrj.impl.CloudSolrClientTest_F2BEC23974BD3686-001/shard-1-001/cores}
   [junit4]   2> 97304 INFO  (TEST-CloudSolrClientTest.testShutdown-seed#[F2BEC23974BD3686]) [    ] o.a.s.s.SolrDispatchFilter SolrDispatchFilter.init(): sun.misc.Launcher$AppClassLoader@659e0bfd
   [junit4]   2> 97304 INFO  (TEST-CloudSolrClientTest.testShutdown-seed#[F2BEC23974BD3686]) [    ] o.a.s.c.SolrResourceLoader new SolrResourceLoader for directory: '/x1/jenkins/jenkins-slave/workspace/Lucene-Solr-Tests-trunk-Java8/solr/build/solr-solrj/test/J0/../../../../../../../../../../x1/jenkins/jenkins-slave/workspace/Lucene-Solr-Tests-trunk-Java8/solr/build/solr-solrj/test/J0/temp/solr.client.solrj.impl.CloudSolrClientTest_F2BEC23974BD3686-001/shard-1-001/'
   [junit4]   2> 97351 INFO  (TEST-CloudSolrClientTest.testShutdown-seed#[F2BEC23974BD3686]) [    ] o.a.s.c.c.SolrZkClient Using default ZkCredentialsProvider
   [junit4]   2> 97374 INFO  (TEST-CloudSolrClientTest.testShutdown-seed#[F2BEC23974BD3686]) [    ] o.a.s.c.c.ConnectionManager Waiting for client to connect to ZooKeeper
   [junit4]   2> 97385 INFO  (zkCallback-28-thread-1) [    ] o.a.s.c.c.ConnectionManager Watcher org.apache.solr.common.cloud.ConnectionManager@58fbb474 name:ZooKeeperConnection Watcher:127.0.0.1:54715/solr got event WatchedEvent state:SyncConnected type:None path:null path:null type:None
   [junit4]   2> 97386 INFO  (TEST-CloudSolrClientTest.testShutdown-seed#[F2BEC23974BD3686]) [    ] o.a.s.c.c.ConnectionManager Client is connected to ZooKeeper
   [junit4]   2> 97387 INFO  (TEST-CloudSolrClientTest.testShutdown-seed#[F2BEC23974BD3686]) [    ] o.a.s.c.c.SolrZkClient Using default ZkACLProvider
   [junit4]   2> 97389 INFO  (TEST-CloudSolrClientTest.testShutdown-seed#[F2BEC23974BD3686]) [    ] o.a.s.s.SolrDispatchFilter Loading solr.xml from SolrHome (not found in ZooKeeper)
   [junit4]   2> 97389 INFO  (TEST-CloudSolrClientTest.testShutdown-seed#[F2BEC23974BD3686]) [    ] o.a.s.c.SolrXmlConfig Loading container configuration from /x1/jenkins/jenkins-slave/workspace/Lucene-Solr-Tests-trunk-Java8/solr/build/solr-solrj/test/J0/../../../../../../../../../../x1/jenkins/jenkins-slave/workspace/Lucene-Solr-Tests-trunk-Java8/solr/build/solr-solrj/test/J0/temp/solr.client.solrj.impl.CloudSolrClientTest_F2BEC23974BD3686-001/shard-1-001/solr.xml
   [junit4]   2> 97395 INFO  (TEST-CloudSolrClientTest.testShutdown-seed#[F2BEC23974BD3686]) [    ] o.a.s.c.CoresLocator Config-defined core root directory: /x1/jenkins/jenkins-slave/workspace/Lucene-Solr-Tests-trunk-Java8/solr/build/solr-solrj/test/J0/../../../../../../../../../../x1/jenkins/jenkins-slave/workspace/Lucene-Solr-Tests-trunk-Java8/solr/build/solr-solrj/test/J0/temp/solr.client.solrj.impl.CloudSolrClientTest_F2BEC23974BD3686-001/shard-1-001/cores
   [junit4]   2> 97395 INFO  (TEST-CloudSolrClientTest.testShutdown-seed#[F2BEC23974BD3686]) [    ] o.a.s.c.CoreContainer New CoreContainer 569046221
   [junit4]   2> 97395 INFO  (TEST-CloudSolrClientTest.testShutdown-seed#[F2BEC23974BD3686]) [    ] o.a.s.c.CoreContainer Loading cores into CoreContainer [instanceDir=/x1/jenkins/jenkins-slave/workspace/Lucene-Solr-Tests-trunk-Java8/solr/build/solr-solrj/test/J0/../../../../../../../../../../x1/jenkins/jenkins-slave/workspace/Lucene-Solr-Tests-trunk-Java8/solr/build/solr-solrj/test/J0/temp/solr.client.solrj.impl.CloudSolrClientTest_F2BEC23974BD3686-001/shard-1-001/]
   [junit4]   2> 97396 INFO  (TEST-CloudSolrClientTest.testShutdown-seed#[F2BEC23974BD3686]) [    ] o.a.s.c.CoreContainer loading shared library: /x1/jenkins/jenkins-slave/workspace/Lucene-Solr-Tests-trunk-Java8/solr/build/solr-solrj/test/J0/../../../../../../../../../../x1/jenkins/jenkins-slave/workspace/Lucene-Solr-Tests-trunk-Java8/solr/build/solr-solrj/test/J0/temp/solr.client.solrj.impl.CloudSolrClientTest_F2BEC23974BD3686-001/shard-1-001/lib
   [junit4]   2> 97396 WARN  (TEST-CloudSolrClientTest.testShutdown-seed#[F2BEC23974BD3686]) [    ] o.a.s.c.SolrResourceLoader Can't find (or read) directory to add to classloader: lib (resolved as: /x1/jenkins/jenkins-slave/workspace/Lucene-Solr-Tests-trunk-Java8/solr/build/solr-solrj/test/J0/../../../../../../../../../../x1/jenkins/jenkins-slave/workspace/Lucene-Solr-Tests-trunk-Java8/solr/build/solr-solrj/test/J0/temp/solr.client.solrj.impl.CloudSolrClientTest_F2BEC23974BD3686-001/shard-1-001/lib).
   [junit4]   2> 97403 INFO  (TEST-CloudSolrClientTest.testShutdown-seed#[F2BEC23974BD3686]) [    ] o.a.s.h.c.HttpShardHandlerFactory created with socketTimeout : 90000,urlScheme : ,connTimeout : 15000,maxConnectionsPerHost : 20,maxConnections : 10000,corePoolSize : 0,maximumPoolSize : 2147483647,maxThreadIdleTime : 5,sizeOfQueue : -1,fairnessPolicy : false,useRetries : false,
   [junit4]   2> 97404 INFO  (TEST-CloudSolrClientTest.testShutdown-seed#[F2BEC23974BD3686]) [    ] o.a.s.u.UpdateShardHandler Creating UpdateShardHandler HTTP client with params: socketTimeout=340000&connTimeout=45000&retry=true
   [junit4]   2> 97405 INFO  (TEST-CloudSolrClientTest.testShutdown-seed#[F2BEC23974BD3686]) [    ] o.a.s.l.LogWatcher SLF4J impl is org.slf4j.impl.Log4jLoggerFactory
   [junit4]   2> 97405 INFO  (TEST-CloudSolrClientTest.testShutdown-seed#[F2BEC23974BD3686]) [    ] o.a.s.l.LogWatcher Registering Log Listener [Log4j (org.slf4j.impl.Log4jLoggerFactory)]
   [junit4]   2> 97405 INFO  (TEST-CloudSolrClientTest.testShutdown-seed#[F2BEC23974BD3686]) [    ] o.a.s.c.ZkContainer Zookeeper client=127.0.0.1:54715/solr
   [junit4]   2> 97405 INFO  (TEST-CloudSolrClientTest.testShutdown-seed#[F2BEC23974BD3686]) [    ] o.a.s.c.ZkController zkHost includes chroot
   [junit4]   2> 97405 INFO  (TEST-CloudSolrClientTest.testShutdown-seed#[F2BEC23974BD3686]) [    ] o.a.s.c.c.SolrZkClient Using default ZkCredentialsProvider
   [junit4]   2> 97416 INFO  (TEST-CloudSolrClientTest.testShutdown-seed#[F2BEC23974BD3686]) [    ] o.a.s.c.c.ConnectionManager Waiting for client to connect to ZooKeeper
   [junit4]   2> 97417 INFO  (zkCallback-30-thread-1) [    ] o.a.s.c.c.ConnectionManager Watcher org.apache.solr.common.cloud.ConnectionManager@783d5eba name:ZooKeeperConnection Watcher:127.0.0.1:54715 got event WatchedEvent state:SyncConnected type:None path:null path:null type:None
   [junit4]   2> 97418 INFO  (TEST-CloudSolrClientTest.testShutdown-seed#[F2BEC23974BD3686]) [    ] o.a.s.c.c.ConnectionManager Client is connected to ZooKeeper
   [junit4]   2> 97418 INFO  (TEST-CloudSolrClientTest.testShutdown-seed#[F2BEC23974BD3686]) [    ] o.a.s.c.c.SolrZkClient Using default ZkACLProvider
   [junit4]   2> 97439 INFO  (TEST-CloudSolrClientTest.testShutdown-seed#[F2BEC23974BD3686]) [n:127.0.0.1:55716_    ] o.a.s.c.c.ConnectionManager Waiting for client to connect to ZooKeeper
   [junit4]   2> 97471 INFO  (zkCallback-31-thread-1-processing-n:127.0.0.1:55716_) [n:127.0.0.1:55716_    ] o.a.s.c.c.ConnectionManager Watcher org.apache.solr.common.cloud.ConnectionManager@4e233ef1 name:ZooKeeperConnection Watcher:127.0.0.1:54715/solr got event WatchedEvent state:SyncConnected type:None path:null path:null type:None
   [junit4]   2> 97471 INFO  (TEST-CloudSolrClientTest.testShutdown-seed#[F2BEC23974BD3686]) [n:127.0.0.1:55716_    ] o.a.s.c.c.ConnectionManager Client is connected to ZooKeeper
   [junit4]   2> 97480 INFO  (TEST-CloudSolrClientTest.testShutdown-seed#[F2BEC23974BD3686]) [n:127.0.0.1:55716_    ] o.a.s.c.c.ZkStateReader Updating cluster state from ZooKeeper... 
   [junit4]   2> 98496 INFO  (TEST-CloudSolrClientTest.testShutdown-seed#[F2BEC23974BD3686]) [n:127.0.0.1:55716_    ] o.a.s.c.ZkController Register node as live in ZooKeeper:/live_nodes/127.0.0.1:55716_
   [junit4]   2> 98502 INFO  (TEST-CloudSolrClientTest.testShutdown-seed#[F2BEC23974BD3686]) [n:127.0.0.1:55716_    ] o.a.s.c.c.SolrZkClient makePath: /live_nodes/127.0.0.1:55716_
   [junit4]   2> 98506 INFO  (zkCallback-26-thread-1) [    ] o.a.s.c.c.ZkStateReader A live node change: WatchedEvent state:SyncConnected type:NodeChildrenChanged path:/live_nodes, has occurred - updating... (live nodes size: 1)
   [junit4]   2> 98506 INFO  (zkCallback-24-thread-1-processing-n:127.0.0.1:49110_) [n:127.0.0.1:49110_    ] o.a.s.c.c.ZkStateReader A live node change: WatchedEvent state:SyncConnected type:NodeChildrenChanged path:/live_nodes, has occurred - updating... (live nodes size: 1)
   [junit4]   2> 98507 INFO  (zkCallback-31-thread-1-processing-n:127.0.0.1:55716_) [n:127.0.0.1:55716_    ] o.a.s.c.c.ZkStateReader A live node change: WatchedEvent state:SyncConnected type:NodeChildrenChanged path:/live_nodes, has occurred - updating... (live nodes size: 1)
   [junit4]   2> 98560 INFO  (TEST-CloudSolrClientTest.testShutdown-seed#[F2BEC23974BD3686]) [n:127.0.0.1:55716_    ] o.a.s.c.Overseer Overseer (id=null) closing
   [junit4]   2> 98562 INFO  (TEST-CloudSolrClientTest.testShutdown-seed#[F2BEC23974BD3686]) [n:127.0.0.1:55716_    ] o.a.s.c.LeaderElector Joined leadership election with path: /overseer_elect/election/94375761205461001-127.0.0.1:55716_-n_0000000001
   [junit4]   2> 98566 INFO  (TEST-CloudSolrClientTest.testShutdown-seed#[F2BEC23974BD3686]) [n:127.0.0.1:55716_    ] o.a.s.c.LeaderElector Watching path /overseer_elect/election/94375761205460996-127.0.0.1:49110_-n_0000000000 to know if I could be the leader
   [junit4]   2> 98639 INFO  (TEST-CloudSolrClientTest.testShutdown-seed#[F2BEC23974BD3686]) [n:127.0.0.1:55716_    ] o.a.s.c.CoreContainer Security conf doesn't exist. Skipping setup for authorization module.
   [junit4]   2> 98639 INFO  (TEST-CloudSolrClientTest.testShutdown-seed#[F2BEC23974BD3686]) [n:127.0.0.1:55716_    ] o.a.s.c.CoreContainer No authentication plugin used.
   [junit4]   2> 98640 INFO  (TEST-CloudSolrClientTest.testShutdown-seed#[F2BEC23974BD3686]) [n:127.0.0.1:55716_    ] o.a.s.c.CoresLocator Looking for core definitions underneath /x1/jenkins/jenkins-slave/workspace/Lucene-Solr-Tests-trunk-Java8/solr/build/solr-solrj/test/J0/../../../../../../../../../../x1/jenkins/jenkins-slave/workspace/Lucene-Solr-Tests-trunk-Java8/solr/build/solr-solrj/test/J0/temp/solr.client.solrj.impl.CloudSolrClientTest_F2BEC23974BD3686-001/shard-1-001/cores
   [junit4]   2> 98641 INFO  (TEST-CloudSolrClientTest.testShutdown-seed#[F2BEC23974BD3686]) [n:127.0.0.1:55716_    ] o.a.s.c.SolrCore Created CoreDescriptor: {name=collection1, config=solrconfig.xml, transient=false, schema=schema.xml, loadOnStartup=true, configSetProperties=configsetprops.json, instanceDir=/x1/jenkins/jenkins-slave/workspace/Lucene-Solr-Tests-trunk-Java8/solr/build/solr-solrj/test/J0/../../../../../../../../../../x1/jenkins/jenkins-slave/workspace/Lucene-Solr-Tests-trunk-Java8/solr/build/solr-solrj/test/J0/temp/solr.client.solrj.impl.CloudSolrClientTest_F2BEC23974BD3686-001/shard-1-001/cores/collection1, collection=collection1, absoluteInstDir=/x1/jenkins/jenkins-slave/workspace/Lucene-Solr-Tests-trunk-Java8/solr/build/solr-solrj/test/J0/../../../../../../../../../../x1/jenkins/jenkins-slave/workspace/Lucene-Solr-Tests-trunk-Java8/solr/build/solr-solrj/test/J0/temp/solr.client.solrj.impl.CloudSolrClientTest_F2BEC23974BD3686-001/shard-1-001/cores/collection1/, coreNodeName=, dataDir=data/, shard=}
   [junit4]   2> 98641 INFO  (TEST-CloudSolrClientTest.testShutdown-seed#[F2BEC23974BD3686]) [n:127.0.0.1:55716_    ] o.a.s.c.CoresLocator Found core collection1 in /x1/jenkins/jenkins-slave/workspace/Lucene-Solr-Tests-trunk-Java8/solr/build/solr-solrj/test/J0/../../../../../../../../../../x1/jenkins/jenkins-slave/workspace/Lucene-Solr-Tests-trunk-Java8/solr/build/solr-solrj/test/J0/temp/solr.client.solrj.impl.CloudSolrClientTest_F2BEC23974BD3686-001/shard-1-001/cores/collection1/
   [junit4]   2> 98641 INFO  (TEST-CloudSolrClientTest.testShutdown-seed#[F2BEC23974BD3686]) [n:127.0.0.1:55716_    ] o.a.s.c.CoresLocator Found 1 core definitions
   [junit4]   2> 98656 INFO  (coreLoadExecutor-160-thread-1-processing-n:127.0.0.1:55716_) [n:127.0.0.1:55716_ c:collection1   x:collection1] o.a.s.c.ZkController publishing state=down
   [junit4]   2> 98656 INFO  (coreLoadExecutor-160-thread-1-processing-n:127.0.0.1:55716_) [n:127.0.0.1:55716_ c:collection1   x:collection1] o.a.s.c.ZkController numShards not found on descriptor - reading it from system property
   [junit4]   2> 98659 INFO  (OverseerStateUpdate-94375761205460996-127.0.0.1:49110_-n_0000000000) [n:127.0.0.1:49110_    ] o.a.s.c.Overseer processMessage: queueSize: 1, message = {
   [junit4]   2>   "core":"collection1",
   [junit4]   2>   "roles":null,
   [junit4]   2>   "base_url":"http://127.0.0.1:55716",
   [junit4]   2>   "node_name":"127.0.0.1:55716_",
   [junit4]   2>   "numShards":"2",
   [junit4]   2>   "state":"down",
   [junit4]   2>   "shard":null,
   [junit4]   2>   "collection":"collection1",
   [junit4]   2>   "operation":"state"} current state version: 5
   [junit4]   2> 98660 INFO  (OverseerStateUpdate-94375761205460996-127.0.0.1:49110_-n_0000000000) [n:127.0.0.1:49110_    ] o.a.s.c.o.ReplicaMutator Update state numShards=2 message={
   [junit4]   2>   "core":"collection1",
   [junit4]   2>   "roles":null,
   [junit4]   2>   "base_url":"http://127.0.0.1:55716",
   [junit4]   2>   "node_name":"127.0.0.1:55716_",
   [junit4]   2>   "numShards":"2",
   [junit4]   2>   "state":"down",
   [junit4]   2>   "shard":null,
   [junit4]   2>   "collection":"collection1",
   [junit4]   2>   "operation":"state"}
   [junit4]   2> 98660 INFO  (OverseerStateUpdate-94375761205460996-127.0.0.1:49110_-n_0000000000) [n:127.0.0.1:49110_    ] o.a.s.c.o.ReplicaMutator Collection already exists with numShards=2
   [junit4]   2> 98660 INFO  (OverseerStateUpdate-94375761205460996-127.0.0.1:49110_-n_0000000000) [n:127.0.0.1:49110_    ] o.a.s.c.o.ReplicaMutator Assigning new node to shard shard=shard2
   [junit4]   2> 98662 INFO  (coreLoadExecutor-160-thread-1-processing-n:127.0.0.1:55716_) [n:127.0.0.1:55716_ c:collection1   x:collection1] o.a.s.c.ZkController Registering watch for collection collection1
   [junit4]   2> 98662 INFO  (coreLoadExecutor-160-thread-1-processing-n:127.0.0.1:55716_) [n:127.0.0.1:55716_ c:collection1   x:collection1] o.a.s.c.c.ZkStateReader addZkWatch collection1
   [junit4]   2> 98679 INFO  (coreLoadExecutor-160-thread-1-processing-n:127.0.0.1:55716_) [n:127.0.0.1:55716_ c:collection1   x:collection1] o.a.s.c.c.ZkStateReader Add data for collection1 ver 0 
   [junit4]   2> 98679 INFO  (coreLoadExecutor-160-thread-1-processing-n:127.0.0.1:55716_) [n:127.0.0.1:55716_ c:collection1   x:collection1] o.a.s.c.ZkController look for our core node name
   [junit4]   2> 98686 INFO  (TEST-CloudSolrClientTest.testShutdown-seed#[F2BEC23974BD3686]) [n:127.0.0.1:55716_    ] o.a.s.s.SolrDispatchFilter user.dir=/x1/jenkins/jenkins-slave/workspace/Lucene-Solr-Tests-trunk-Java8/solr/build/solr-solrj/test/J0
   [junit4]   2> 98687 INFO  (TEST-CloudSolrClientTest.testShutdown-seed#[F2BEC23974BD3686]) [n:127.0.0.1:55716_    ] o.a.s.s.SolrDispatchFilter SolrDispatchFilter.init() done
   [junit4]   2> 98784 INFO  (OverseerStateUpdate-94375761205460996-127.0.0.1:49110_-n_0000000000) [n:127.0.0.1:49110_    ] o.a.s.c.o.ZkStateWriter going to update_collection /collections/collection1/state.json version: 0
   [junit4]   2> 98785 INFO  (zkCallback-31-thread-1-processing-n:127.0.0.1:55716_) [n:127.0.0.1:55716_    ] o.a.s.c.c.ZkStateReader A cluster state change: WatchedEvent state:SyncConnected type:NodeDataChanged path:/collections/collection1/state.json for collection collection1 has occurred - updating... (live nodes size: 2)
   [junit4]   2> 98787 INFO  (zkCallback-31-thread-1-processing-n:127.0.0.1:55716_) [n:127.0.0.1:55716_    ] o.a.s.c.c.ZkStateReader Updating data for collection1 from 0 to 1 
   [junit4]   2> 99679 INFO  (coreLoadExecutor-160-thread-1-processing-n:127.0.0.1:55716_) [n:127.0.0.1:55716_ c:collection1   x:collection1] o.a.s.c.ZkController waiting to find shard id in clusterstate for collection1
   [junit4]   2> 99680 INFO  (coreLoadExecutor-160-thread-1-processing-n:127.0.0.1:55716_) [n:127.0.0.1:55716_ c:collection1   x:collection1] o.a.s.c.ZkController Check for collection zkNode:collection1
   [junit4]   2> 99681 INFO  (coreLoadExecutor-160-thread-1-processing-n:127.0.0.1:55716_) [n:127.0.0.1:55716_ c:collection1   x:collection1] o.a.s.c.ZkController Collection zkNode exists
   [junit4]   2> 99681 INFO  (coreLoadExecutor-160-thread-1-processing-n:127.0.0.1:55716_) [n:127.0.0.1:55716_ c:collection1   x:collection1] o.a.s.c.c.ZkStateReader Load collection config from:/collections/collection1
   [junit4]   2> 99684 INFO  (coreLoadExecutor-160-thread-1-processing-n:127.0.0.1:55716_) [n:127.0.0.1:55716_ c:collection1   x:collection1] o.a.s.c.c.ZkStateReader path=/collections/collection1 configName=conf1 specified config exists in ZooKeeper
   [junit4]   2> 99684 INFO  (coreLoadExecutor-160-thread-1-processing-n:127.0.0.1:55716_) [n:127.0.0.1:55716_ c:collection1   x:collection1] o.a.s.c.SolrResourceLoader new SolrResourceLoader for directory: '/x1/jenkins/jenkins-slave/workspace/Lucene-Solr-Tests-trunk-Java8/solr/build/solr-solrj/test/J0/../../../../../../../../../../x1/jenkins/jenkins-slave/workspace/Lucene-Solr-Tests-trunk-Java8/solr/build/solr-solrj/test/J0/temp/solr.client.solrj.impl.CloudSolrClientTest_F2BEC23974BD3686-001/shard-1-001/cores/collection1/'
   [junit4]   2> 99705 INFO  (coreLoadExecutor-160-thread-1-processing-n:127.0.0.1:55716_) [n:127.0.0.1:55716_ c:collection1   x:collection1] o.a.s.c.Config loaded config solrconfig.xml with version 0 
   [junit4]   2> 99714 INFO  (coreLoadExecutor-160-thread-1-processing-n:127.0.0.1:55716_) [n:127.0.0.1:55716_ c:collection1   x:collection1] o.a.s.c.SolrConfig current version of requestparams : -1
   [junit4]   2> 99725 INFO  (coreLoadExecutor-160-thread-1-processing-n:127.0.0.1:55716_) [n:127.0.0.1:55716_ c:collection1   x:collection1] o.a.s.c.SolrConfig Using Lucene MatchVersion: 6.0.0
   [junit4]   2> 99731 INFO  (coreLoadExecutor-160-thread-1-processing-n:127.0.0.1:55716_) [n:127.0.0.1:55716_ c:collection1   x:collection1] o.a.s.c.Config Loaded SolrConfig: solrconfig.xml
   [junit4]   2> 99739 INFO  (coreLoadExecutor-160-thread-1-processing-n:127.0.0.1:55716_) [n:127.0.0.1:55716_ c:collection1   x:collection1] o.a.s.s.IndexSchema Reading Solr Schema from /configs/conf1/schema.xml
   [junit4]   2> 99755 INFO  (coreLoadExecutor-160-thread-1-processing-n:127.0.0.1:55716_) [n:127.0.0.1:55716_ c:collection1   x:collection1] o.a.s.s.IndexSchema [collection1] Schema name=test
   [junit4]   2> 99885 INFO  (coreLoadExecutor-160-thread-1-processing-n:127.0.0.1:55716_) [n:127.0.0.1:55716_ c:collection1   x:collection1] o.a.s.s.IndexSchema default search field in schema is text
   [junit4]   2> 99886 INFO  (coreLoadExecutor-160-thread-1-processing-n:127.0.0.1:55716_) [n:127.0.0.1:55716_ c:collection1   x:collection1] o.a.s.s.IndexSchema unique key field: id
   [junit4]   2> 99887 WARN  (coreLoadExecutor-160-thread-1-processing-n:127.0.0.1:55716_) [n:127.0.0.1:55716_ c:collection1   x:collection1] o.a.s.s.IndexSchema Field lowerfilt1and2 is not multivalued and destination for multiple copyFields (2)
   [junit4]   2> 99887 WARN  (coreLoadExecutor-160-thread-1-processing-n:127.0.0.1:55716_) [n:127.0.0.1:55716_ c:collection1   x:collection1] o.a.s.s.IndexSchema Field text is not multivalued and destination for multiple copyFields (3)
   [junit4]   2> 99894 INFO  (coreLoadExecutor-160-thread-1-processing-n:127.0.0.1:55716_) [n:127.0.0.1:55716_ c:collection1   x:collection1] o.a.s.c.ConfigSetProperties Did not find ConfigSet properties, assuming default properties: Can't find resource 'configsetprops.json' in classpath or '/configs/conf1', cwd=/x1/jenkins/jenkins-slave/workspace/Lucene-Solr-Tests-trunk-Java8/solr/build/solr-solrj/test/J0
   [junit4]   2> 99894 INFO  (coreLoadExecutor-160-thread-1-processing-n:127.0.0.1:55716_) [n:127.0.0.1:55716_ c:collection1   x:collection1] o.a.s.c.CoreContainer Creating SolrCore 'collection1' using configuration from collection collection1
   [junit4]   2> 99894 INFO  (coreLoadExecutor-160-thread-1-processing-n:127.0.0.1:55716_) [n:127.0.0.1:55716_ c:collection1 s:shard2 r:core_node1 x:collection1] o.a.s.c.SolrCore org.apache.solr.core.MockDirectoryFactory
   [junit4]   2> 99895 INFO  (coreLoadExecutor-160-thread-1-processing-n:127.0.0.1:55716_) [n:127.0.0.1:55716_ c:collection1 s:shard2 r:core_node1 x:collection1] o.a.s.c.SolrCore [[collection1] ] Opening new SolrCore at [/x1/jenkins/jenkins-slave/workspace/Lucene-Solr-Tests-trunk-Java8/solr/build/solr-solrj/test/J0/../../../../../../../../../../x1/jenkins/jenkins-slave/workspace/Lucene-Solr-Tests-trunk-Java8/solr/build/solr-solrj/test/J0/temp/solr.client.solrj.impl.CloudSolrClientTest_F2BEC23974BD3686-001/shard-1-001/cores/collection1/], dataDir=[null]
   [junit4]   2> 99895 INFO  (coreLoadExecutor-160-thread-1-processing-n:127.0.0.1:55716_) [n:127.0.0.1:55716_ c:collection1 s:shard2 r:core_node1 x:collection1] o.a.s.c.SolrCore JMX monitoring not detected for core: collection1
   [junit4]   2> 99896 INFO  (coreLoadExecutor-160-thread-1-processing-n:127.0.0.1:55716_) [n:127.0.0.1:55716_ c:collection1 s:shard2 r:core_node1 x:collection1] o.a.s.c.CachingDirectoryFactory return new directory for /x1/jenkins/jenkins-slave/workspace/Lucene-Solr-Tests-trunk-Java8/solr/build/solr-solrj/test/J0/../../../../../../../../../../x1/jenkins/jenkins-slave/workspace/Lucene-Solr-Tests-trunk-Java8/solr/build/solr-solrj/test/J0/temp/solr.client.solrj.impl.CloudSolrClientTest_F2BEC23974BD3686-001/shard-1-001/cores/collection1/data
   [junit4]   2> 99899 INFO  (coreLoadExecutor-160-thread-1-processing-n:127.0.0.1:55716_) [n:127.0.0.1:55716_ c:collection1 s:shard2 r:core_node1 x:collection1] o.a.s.c.SolrCore New index directory detected: old=null new=/x1/jenkins/jenkins-slave/workspace/Lucene-Solr-Tests-trunk-Java8/solr/build/solr-solrj/test/J0/../../../../../../../../../../x1/jenkins/jenkins-slave/workspace/Lucene-Solr-Tests-trunk-Java8/solr/build/solr-solrj/test/J0/temp/solr.client.solrj.impl.CloudSolrClientTest_F2BEC23974BD3686-001/shard-1-001/cores/collection1/data/index/
   [junit4]   2> 99899 WARN  (coreLoadExecutor-160-thread-1-processing-n:127.0.0.1:55716_) [n:127.0.0.1:55716_ c:collection1 s:shard2 r:core_node1 x:collection1] o.a.s.c.SolrCore [collection1] Solr index directory '/x1/jenkins/jenkins-slave/workspace/Lucene-Solr-Tests-trunk-Java8/solr/build/solr-solrj/test/J0/../../../../../../../../../../x1/jenkins/jenkins-slave/workspace/Lucene-Solr-Tests-trunk-Java8/solr/build/solr-solrj/test/J0/temp/solr.client.solrj.impl.CloudSolrClientTest_F2BEC23974BD3686-001/shard-1-001/cores/collection1/data/index' doesn't exist. Creating new index...
   [junit4]   2> 99899 INFO  (coreLoadExecutor-160-thread-1-processing-n:127.0.0.1:55716_) [n:127.0.0.1:55716_ c:collection1 s:shard2 r:core_node1 x:collection1] o.a.s.c.CachingDirectoryFactory return new directory for /x1/jenkins/jenkins-slave/workspace/Lucene-Solr-Tests-trunk-Java8/solr/build/solr-solrj/test/J0/../../../../../../../../../../x1/jenkins/jenkins-slave/workspace/Lucene-Solr-Tests-trunk-Java8/solr/build/solr-solrj/test/J0/temp/solr.client.solrj.impl.CloudSolrClientTest_F2BEC23974BD3686-001/shard-1-001/cores/collection1/data/index
   [junit4]   2> 99910 INFO  (coreLoadExecutor-160-thread-1-processing-n:127.0.0.1:55716_) [n:127.0.0.1:55716_ c:collection1 s:shard2 r:core_node1 x:collection1] o.a.s.c.SolrCore SolrDeletionPolicy.onCommit: commits: num=1
   [junit4]   2> 	commit{dir=MockDirectoryWrapper(RAMDirectory@643f64c6 lockFactory=org.apache.lucene.store.SingleInstanceLockFactory@4e46cce0),segFN=segments_1,generation=1}
   [junit4]   2> 99911 INFO  (coreLoadExecutor-160-thread-1-processing-n:127.0.0.1:55716_) [n:127.0.0.1:55716_ c:collection1 s:shard2 r:core_node1 x:collection1] o.a.s.c.SolrCore newest commit generation = 1
   [junit4]   2> 99911 INFO  (OldIndexDirectoryCleanupThreadForCore-collection1) [n:127.0.0.1:55716_ c:collection1 s:shard2 r:core_node1 x:collection1] o.a.s.c.SolrCore Looking for old index directories to cleanup for core collection1 in /x1/jenkins/jenkins-slave/workspace/Lucene-Solr-Tests-trunk-Java8/solr/build/solr-solrj/test/J0/../../../../../../../../../../x1/jenkins/jenkins-slave/workspace/Lucene-Solr-Tests-trunk-Java8/solr/build/solr-solrj/test/J0/temp/solr.client.solrj.impl.CloudSolrClientTest_F2BEC23974BD3686-001/shard-1-001/cores/collection1/data/
   [junit4]   2> 99912 WARN  (OldIndexDirectoryCleanupThreadForCore-collection1) [n:127.0.0.1:55716_ c:collection1 s:shard2 r:core_node1 x:collection1] o.a.s.c.DirectoryFactory /x1/jenkins/jenkins-slave/workspace/Lucene-Solr-Tests-trunk-Java8/solr/build/solr-solrj/test/J0/../../../../../../../../../../x1/jenkins/jenkins-slave/workspace/Lucene-Solr-Tests-trunk-Java8/solr/build/solr-solrj/test/J0/temp/solr.client.solrj.impl.CloudSolrClientTest_F2BEC23974BD3686-001/shard-1-001/cores/collection1/data/ does not point to a valid data directory; skipping clean-up of old index directories.
   [junit4]   2> 99915 INFO  (coreLoadExecutor-160-thread-1-processing-n:127.0.0.1:55716_) [n:127.0.0.1:55716_ c:collection1 s:shard2 r:core_node1 x:collection1] o.a.s.c.SolrCore no updateRequestProcessorChain defined as default, creating implicit default
   [junit4]   2> 99916 INFO  (coreLoadExecutor-160-thread-1-processing-n:127.0.0.1:55716_) [n:127.0.0.1:55716_ c:collection1 s:shard2 r:core_node1 x:collection1] o.a.s.h.l.XMLLoader xsltCacheLifetimeSeconds=60
   [junit4]   2> 99917 INFO  (coreLoadExecutor-160-thread-1-processing-n:127.0.0.1:55716_) [n:127.0.0.1:55716_ c:collection1 s:shard2 r:core_node1 x:collection1] o.a.s.h.l.XMLLoader xsltCacheLifetimeSeconds=60
   [junit4]   2> 99918 INFO  (coreLoadExecutor-160-thread-1-processing-n:127.0.0.1:55716_) [n:127.0.0.1:55716_ c:collection1 s:shard2 r:core_node1 x:collection1] o.a.s.h.l.XMLLoader xsl

[...truncated too long message...]

20 INFO  (TEST-CloudSolrClientTest.test-seed#[F2BEC23974BD3686]) [n:127.0.0.1:39490_ c:clientTestExternColl s:shard1 r:core_node2 x:clientTestExternColl_shard1_replica1] o.a.s.c.CachingDirectoryFactory Closing directory: /x1/jenkins/jenkins-slave/workspace/Lucene-Solr-Tests-trunk-Java8/solr/build/solr-solrj/test/J0/../../../../../../../../../../x1/jenkins/jenkins-slave/workspace/Lucene-Solr-Tests-trunk-Java8/solr/build/solr-solrj/test/J0/temp/solr.client.solrj.impl.CloudSolrClientTest_F2BEC23974BD3686-001/shard-3-003/cores/clientTestExternColl_shard1_replica1/data/index
   [junit4]   2> 192120 INFO  (TEST-CloudSolrClientTest.test-seed#[F2BEC23974BD3686]) [n:127.0.0.1:39490_ c:clientTestExternColl s:shard1 r:core_node2 x:clientTestExternColl_shard1_replica1] o.a.s.c.CachingDirectoryFactory looking to close /x1/jenkins/jenkins-slave/workspace/Lucene-Solr-Tests-trunk-Java8/solr/build/solr-solrj/test/J0/../../../../../../../../../../x1/jenkins/jenkins-slave/workspace/Lucene-Solr-Tests-trunk-Java8/solr/build/solr-solrj/test/J0/temp/solr.client.solrj.impl.CloudSolrClientTest_F2BEC23974BD3686-001/shard-3-003/cores/clientTestExternColl_shard1_replica1/data [CachedDir<<refCount=0;path=/x1/jenkins/jenkins-slave/workspace/Lucene-Solr-Tests-trunk-Java8/solr/build/solr-solrj/test/J0/../../../../../../../../../../x1/jenkins/jenkins-slave/workspace/Lucene-Solr-Tests-trunk-Java8/solr/build/solr-solrj/test/J0/temp/solr.client.solrj.impl.CloudSolrClientTest_F2BEC23974BD3686-001/shard-3-003/cores/clientTestExternColl_shard1_replica1/data;done=false>>]
   [junit4]   2> 192121 INFO  (TEST-CloudSolrClientTest.test-seed#[F2BEC23974BD3686]) [n:127.0.0.1:39490_ c:clientTestExternColl s:shard1 r:core_node2 x:clientTestExternColl_shard1_replica1] o.a.s.c.CachingDirectoryFactory Closing directory: /x1/jenkins/jenkins-slave/workspace/Lucene-Solr-Tests-trunk-Java8/solr/build/solr-solrj/test/J0/../../../../../../../../../../x1/jenkins/jenkins-slave/workspace/Lucene-Solr-Tests-trunk-Java8/solr/build/solr-solrj/test/J0/temp/solr.client.solrj.impl.CloudSolrClientTest_F2BEC23974BD3686-001/shard-3-003/cores/clientTestExternColl_shard1_replica1/data
   [junit4]   2> 192124 INFO  (TEST-CloudSolrClientTest.test-seed#[F2BEC23974BD3686]) [n:127.0.0.1:39490_ c:clientTestExternColl s:shard1 r:core_node2 x:clientTestExternColl_shard1_replica1] o.a.s.c.Overseer Overseer (id=94375764294631438-127.0.0.1:39490_-n_0000000003) closing
   [junit4]   2> 192125 INFO  (OverseerStateUpdate-94375764294631438-127.0.0.1:39490_-n_0000000003) [n:127.0.0.1:39490_    ] o.a.s.c.Overseer Overseer Loop exiting : 127.0.0.1:39490_
   [junit4]   2> 192142 ERROR (TEST-CloudSolrClientTest.test-seed#[F2BEC23974BD3686]-EventThread) [n:127.0.0.1:39490_    ] o.a.z.ClientCnxn Error while calling watcher 
   [junit4]   2> java.util.concurrent.RejectedExecutionException: Task org.apache.solr.common.util.ExecutorUtil$MDCAwareThreadPoolExecutor$1@4ddce87e rejected from org.apache.solr.common.util.ExecutorUtil$MDCAwareThreadPoolExecutor@2d8a4d28[Shutting down, pool size = 3, active threads = 0, queued tasks = 0, completed tasks = 67]
   [junit4]   2> 	at java.util.concurrent.ThreadPoolExecutor$AbortPolicy.rejectedExecution(ThreadPoolExecutor.java:2047)
   [junit4]   2> 	at java.util.concurrent.ThreadPoolExecutor.reject(ThreadPoolExecutor.java:823)
   [junit4]   2> 	at java.util.concurrent.ThreadPoolExecutor.execute(ThreadPoolExecutor.java:1369)
   [junit4]   2> 	at org.apache.solr.common.util.ExecutorUtil$MDCAwareThreadPoolExecutor.execute(ExecutorUtil.java:193)
   [junit4]   2> 	at java.util.concurrent.AbstractExecutorService.submit(AbstractExecutorService.java:112)
   [junit4]   2> 	at org.apache.solr.common.cloud.SolrZkClient$3.process(SolrZkClient.java:266)
   [junit4]   2> 	at org.apache.zookeeper.ClientCnxn$EventThread.processEvent(ClientCnxn.java:522)
   [junit4]   2> 	at org.apache.zookeeper.ClientCnxn$EventThread.run(ClientCnxn.java:498)
   [junit4]   2> 192173 INFO  (TEST-CloudSolrClientTest.test-seed#[F2BEC23974BD3686]) [    ] o.e.j.s.ServerConnector Stopped ServerConnector@1d911bad{HTTP/1.1}{127.0.0.1:0}
   [junit4]   2> 192173 INFO  (TEST-CloudSolrClientTest.test-seed#[F2BEC23974BD3686]) [    ] o.e.j.s.h.ContextHandler Stopped o.e.j.s.ServletContextHandler@234b832{/,null,UNAVAILABLE}
   [junit4]   2> 192177 INFO  (TEST-CloudSolrClientTest.test-seed#[F2BEC23974BD3686]) [n:127.0.0.1:39490_ c:clientTestExternColl s:shard1 r:core_node2 x:clientTestExternColl_shard1_replica1] o.a.s.c.ZkTestServer connecting to 127.0.0.1:35106 35106
   [junit4]   2> 192396 INFO  (Thread-249) [n:127.0.0.1:55644_ c:collection1 s:shard2 r:core_node3 x:collection1] o.a.s.c.ZkTestServer connecting to 127.0.0.1:35106 35106
   [junit4]   2> 192397 WARN  (Thread-249) [n:127.0.0.1:55644_ c:collection1 s:shard2 r:core_node3 x:collection1] o.a.s.c.ZkTestServer Watch limit violations: 
   [junit4]   2> Maximum concurrent create/delete watches above limit:
   [junit4]   2> 
   [junit4]   2> 	12	/solr/aliases.json
   [junit4]   2> 	5	/solr/security.json
   [junit4]   2> 	4	/solr/configs/conf1
   [junit4]   2> 
   [junit4]   2> Maximum concurrent data watches above limit:
   [junit4]   2> 
   [junit4]   2> 	56	/solr/clusterstate.json
   [junit4]   2> 
   [junit4]   2> Maximum concurrent children watches above limit:
   [junit4]   2> 
   [junit4]   2> 	15	/solr/live_nodes
   [junit4]   2> 	4	/solr/overseer/queue
   [junit4]   2> 	4	/solr/overseer/collection-queue-work
   [junit4]   2> 
   [junit4]   2> NOTE: reproduce with: ant test  -Dtestcase=CloudSolrClientTest -Dtests.method=test -Dtests.seed=F2BEC23974BD3686 -Dtests.multiplier=2 -Dtests.slow=true -Dtests.locale=et_EE -Dtests.timezone=America/Cambridge_Bay -Dtests.asserts=true -Dtests.file.encoding=US-ASCII
   [junit4] FAILURE 53.5s J0 | CloudSolrClientTest.test <<<
   [junit4]    > Throwable #1: java.lang.AssertionError: There should be 3 documents because there should be two id=1 docs due to overwrite=false expected:<3> but was:<1>
   [junit4]    > 	at __randomizedtesting.SeedInfo.seed([F2BEC23974BD3686:7AEAFDE3DA415B7E]:0)
   [junit4]    > 	at org.apache.solr.client.solrj.impl.CloudSolrClientTest.testOverwriteOption(CloudSolrClientTest.java:159)
   [junit4]    > 	at org.apache.solr.client.solrj.impl.CloudSolrClientTest.test(CloudSolrClientTest.java:117)
   [junit4]    > 	at org.apache.solr.BaseDistributedSearchTestCase$ShardsRepeatRule$ShardsFixedStatement.callStatement(BaseDistributedSearchTestCase.java:963)
   [junit4]    > 	at org.apache.solr.BaseDistributedSearchTestCase$ShardsRepeatRule$ShardsStatement.evaluate(BaseDistributedSearchTestCase.java:938)
   [junit4]    > 	at java.lang.Thread.run(Thread.java:745)
   [junit4]   2> 192462 INFO  (SUITE-CloudSolrClientTest-seed#[F2BEC23974BD3686]-worker) [n:127.0.0.1:39490_ c:clientTestExternColl s:shard1 r:core_node2 x:clientTestExternColl_shard1_replica1] o.a.s.SolrTestCaseJ4 ###deleteCore
   [junit4]   2> NOTE: leaving temporary files on disk at: /x1/jenkins/jenkins-slave/workspace/Lucene-Solr-Tests-trunk-Java8/solr/build/solr-solrj/test/J0/temp/solr.client.solrj.impl.CloudSolrClientTest_F2BEC23974BD3686-001
   [junit4]   2> Aug 20, 2015 4:38:53 AM com.carrotsearch.randomizedtesting.ThreadLeakControl checkThreadLeaks
   [junit4]   2> WARNING: Will linger awaiting termination of 1 leaked thread(s).
   [junit4]   2> NOTE: test params are: codec=HighCompressionCompressingStoredFields(storedFieldsFormat=CompressingStoredFieldsFormat(compressionMode=HIGH_COMPRESSION, chunkSize=2, maxDocsPerChunk=9, blockSize=4), termVectorsFormat=CompressingTermVectorsFormat(compressionMode=HIGH_COMPRESSION, chunkSize=2, blockSize=4)), sim=RandomSimilarityProvider(queryNorm=false,coord=no): {}, locale=et_EE, timezone=America/Cambridge_Bay
   [junit4]   2> NOTE: Linux 3.13.0-52-generic amd64/Oracle Corporation 1.8.0_45 (64-bit)/cpus=4,threads=1,free=139298232,total=342884352
   [junit4]   2> NOTE: All tests run in this JVM: [TestDateUtil, TestXMLEscaping, SolrExampleStreamingTest, IteratorChainTest, TestSpellCheckResponse, ConcurrentUpdateSolrClientTest, TestJsonRecordReader, TestClusteringResponse, NamedListTest, ExternalHttpClientTest, LargeVolumeBinaryJettyTest, SolrExampleBinaryTest, LargeVolumeEmbeddedTest, SolrParamTest, TermsResponseTest, TestEmbeddedSolrServer, TestNamedListCodec, SolrQueryTest, ContentStreamTest, CollectionAdminRequestRequiredParamsTest, SolrSchemalessExampleTest, CloudSolrClientMultiConstructorTest, CloudSolrClientTest]
   [junit4] Completed [66/66] on J0 in 101.46s, 3 tests, 1 failure <<< FAILURES!

[...truncated 11 lines...]
BUILD FAILED
/x1/jenkins/jenkins-slave/workspace/Lucene-Solr-Tests-trunk-Java8/build.xml:775: The following error occurred while executing this line:
/x1/jenkins/jenkins-slave/workspace/Lucene-Solr-Tests-trunk-Java8/build.xml:719: The following error occurred while executing this line:
/x1/jenkins/jenkins-slave/workspace/Lucene-Solr-Tests-trunk-Java8/build.xml:59: The following error occurred while executing this line:
/x1/jenkins/jenkins-slave/workspace/Lucene-Solr-Tests-trunk-Java8/solr/build.xml:246: The following error occurred while executing this line:
/x1/jenkins/jenkins-slave/workspace/Lucene-Solr-Tests-trunk-Java8/solr/common-build.xml:514: The following error occurred while executing this line:
/x1/jenkins/jenkins-slave/workspace/Lucene-Solr-Tests-trunk-Java8/lucene/common-build.xml:1431: The following error occurred while executing this line:
/x1/jenkins/jenkins-slave/workspace/Lucene-Solr-Tests-trunk-Java8/lucene/common-build.xml:986: There were test failures: 66 suites, 463 tests, 1 failure

Total time: 74 minutes 48 seconds
Build step 'Invoke Ant' marked build as failure
Archiving artifacts
Sending artifact delta relative to Lucene-Solr-Tests-trunk-Java8 #296
Archived 4 artifacts
Archive block size is 32768
Received 0 blocks and 20941172 bytes
Compression is 0.0%
Took 3.6 sec
Recording test results
Email was triggered for: Failure
Sending email for trigger: Failure



Mime
View raw message