lucene-dev mailing list archives

Site index · List index
Message view « Date » · « Thread »
Top « Date » · « Thread »
From Apache Jenkins Server <jenk...@builds.apache.org>
Subject [JENKINS] Lucene-Solr-Tests-5.x-Java7 - Build # 3390 - Failure
Date Mon, 03 Aug 2015 16:55:57 GMT
Build: https://builds.apache.org/job/Lucene-Solr-Tests-5.x-Java7/3390/

1 tests failed.
REGRESSION:  org.apache.solr.cloud.ChaosMonkeySafeLeaderTest.test

Error Message:
expected:<0> but was:<1>

Stack Trace:
java.lang.AssertionError: expected:<0> but was:<1>
	at __randomizedtesting.SeedInfo.seed([2B6CE069A5DB5A50:A338DFB30B2737A8]:0)
	at org.junit.Assert.fail(Assert.java:93)
	at org.junit.Assert.failNotEquals(Assert.java:647)
	at org.junit.Assert.assertEquals(Assert.java:128)
	at org.junit.Assert.assertEquals(Assert.java:472)
	at org.junit.Assert.assertEquals(Assert.java:456)
	at org.apache.solr.cloud.ChaosMonkeySafeLeaderTest.test(ChaosMonkeySafeLeaderTest.java:156)
	at sun.reflect.NativeMethodAccessorImpl.invoke0(Native Method)
	at sun.reflect.NativeMethodAccessorImpl.invoke(NativeMethodAccessorImpl.java:57)
	at sun.reflect.DelegatingMethodAccessorImpl.invoke(DelegatingMethodAccessorImpl.java:43)
	at java.lang.reflect.Method.invoke(Method.java:606)
	at com.carrotsearch.randomizedtesting.RandomizedRunner.invoke(RandomizedRunner.java:1627)
	at com.carrotsearch.randomizedtesting.RandomizedRunner$6.evaluate(RandomizedRunner.java:836)
	at com.carrotsearch.randomizedtesting.RandomizedRunner$7.evaluate(RandomizedRunner.java:872)
	at com.carrotsearch.randomizedtesting.RandomizedRunner$8.evaluate(RandomizedRunner.java:886)
	at org.apache.solr.BaseDistributedSearchTestCase$ShardsRepeatRule$ShardsFixedStatement.callStatement(BaseDistributedSearchTestCase.java:966)
	at org.apache.solr.BaseDistributedSearchTestCase$ShardsRepeatRule$ShardsStatement.evaluate(BaseDistributedSearchTestCase.java:941)
	at com.carrotsearch.randomizedtesting.rules.SystemPropertiesRestoreRule$1.evaluate(SystemPropertiesRestoreRule.java:57)
	at org.apache.lucene.util.TestRuleSetupTeardownChained$1.evaluate(TestRuleSetupTeardownChained.java:50)
	at org.apache.lucene.util.AbstractBeforeAfterRule$1.evaluate(AbstractBeforeAfterRule.java:46)
	at org.apache.lucene.util.TestRuleThreadAndTestName$1.evaluate(TestRuleThreadAndTestName.java:49)
	at org.apache.lucene.util.TestRuleIgnoreAfterMaxFailures$1.evaluate(TestRuleIgnoreAfterMaxFailures.java:65)
	at org.apache.lucene.util.TestRuleMarkFailure$1.evaluate(TestRuleMarkFailure.java:48)
	at com.carrotsearch.randomizedtesting.rules.StatementAdapter.evaluate(StatementAdapter.java:36)
	at com.carrotsearch.randomizedtesting.ThreadLeakControl$StatementRunner.run(ThreadLeakControl.java:365)
	at com.carrotsearch.randomizedtesting.ThreadLeakControl.forkTimeoutingTask(ThreadLeakControl.java:798)
	at com.carrotsearch.randomizedtesting.ThreadLeakControl$3.evaluate(ThreadLeakControl.java:458)
	at com.carrotsearch.randomizedtesting.RandomizedRunner.runSingleTest(RandomizedRunner.java:845)
	at com.carrotsearch.randomizedtesting.RandomizedRunner$3.evaluate(RandomizedRunner.java:747)
	at com.carrotsearch.randomizedtesting.RandomizedRunner$4.evaluate(RandomizedRunner.java:781)
	at com.carrotsearch.randomizedtesting.RandomizedRunner$5.evaluate(RandomizedRunner.java:792)
	at com.carrotsearch.randomizedtesting.rules.StatementAdapter.evaluate(StatementAdapter.java:36)
	at com.carrotsearch.randomizedtesting.rules.SystemPropertiesRestoreRule$1.evaluate(SystemPropertiesRestoreRule.java:57)
	at org.apache.lucene.util.AbstractBeforeAfterRule$1.evaluate(AbstractBeforeAfterRule.java:46)
	at com.carrotsearch.randomizedtesting.rules.StatementAdapter.evaluate(StatementAdapter.java:36)
	at org.apache.lucene.util.TestRuleStoreClassName$1.evaluate(TestRuleStoreClassName.java:42)
	at com.carrotsearch.randomizedtesting.rules.NoShadowingOrOverridesOnMethodsRule$1.evaluate(NoShadowingOrOverridesOnMethodsRule.java:39)
	at com.carrotsearch.randomizedtesting.rules.NoShadowingOrOverridesOnMethodsRule$1.evaluate(NoShadowingOrOverridesOnMethodsRule.java:39)
	at com.carrotsearch.randomizedtesting.rules.StatementAdapter.evaluate(StatementAdapter.java:36)
	at com.carrotsearch.randomizedtesting.rules.StatementAdapter.evaluate(StatementAdapter.java:36)
	at com.carrotsearch.randomizedtesting.rules.StatementAdapter.evaluate(StatementAdapter.java:36)
	at org.apache.lucene.util.TestRuleAssertionsRequired$1.evaluate(TestRuleAssertionsRequired.java:54)
	at org.apache.lucene.util.TestRuleMarkFailure$1.evaluate(TestRuleMarkFailure.java:48)
	at org.apache.lucene.util.TestRuleIgnoreAfterMaxFailures$1.evaluate(TestRuleIgnoreAfterMaxFailures.java:65)
	at org.apache.lucene.util.TestRuleIgnoreTestSuites$1.evaluate(TestRuleIgnoreTestSuites.java:55)
	at com.carrotsearch.randomizedtesting.rules.StatementAdapter.evaluate(StatementAdapter.java:36)
	at com.carrotsearch.randomizedtesting.ThreadLeakControl$StatementRunner.run(ThreadLeakControl.java:365)
	at java.lang.Thread.run(Thread.java:745)




Build Log:
[...truncated 10721 lines...]
   [junit4] Suite: org.apache.solr.cloud.ChaosMonkeySafeLeaderTest
   [junit4]   2> Creating dataDir: /x1/jenkins/jenkins-slave/workspace/Lucene-Solr-Tests-5.x-Java7/solr/build/solr-core/test/J1/temp/solr.cloud.ChaosMonkeySafeLeaderTest_2B6CE069A5DB5A50-001/init-core-data-001
   [junit4]   2> 923530 INFO  (SUITE-ChaosMonkeySafeLeaderTest-seed#[2B6CE069A5DB5A50]-worker) [    ] o.a.s.SolrTestCaseJ4 Randomized ssl (false) and clientAuth (true)
   [junit4]   2> 923530 INFO  (SUITE-ChaosMonkeySafeLeaderTest-seed#[2B6CE069A5DB5A50]-worker) [    ] o.a.s.BaseDistributedSearchTestCase Setting hostContext system property: /_t/
   [junit4]   2> 923535 INFO  (TEST-ChaosMonkeySafeLeaderTest.test-seed#[2B6CE069A5DB5A50]) [    ] o.a.s.c.ZkTestServer STARTING ZK TEST SERVER
   [junit4]   2> 923536 INFO  (Thread-3104) [    ] o.a.s.c.ZkTestServer client port:0.0.0.0/0.0.0.0:0
   [junit4]   2> 923536 INFO  (Thread-3104) [    ] o.a.s.c.ZkTestServer Starting server
   [junit4]   2> 923636 INFO  (TEST-ChaosMonkeySafeLeaderTest.test-seed#[2B6CE069A5DB5A50]) [    ] o.a.s.c.ZkTestServer start zk server on port:37484
   [junit4]   2> 923636 INFO  (TEST-ChaosMonkeySafeLeaderTest.test-seed#[2B6CE069A5DB5A50]) [    ] o.a.s.c.c.SolrZkClient Using default ZkCredentialsProvider
   [junit4]   2> 923637 INFO  (TEST-ChaosMonkeySafeLeaderTest.test-seed#[2B6CE069A5DB5A50]) [    ] o.a.s.c.c.ConnectionManager Waiting for client to connect to ZooKeeper
   [junit4]   2> 923639 INFO  (zkCallback-841-thread-1) [    ] o.a.s.c.c.ConnectionManager Watcher org.apache.solr.common.cloud.ConnectionManager@48b7994b name:ZooKeeperConnection Watcher:127.0.0.1:37484 got event WatchedEvent state:SyncConnected type:None path:null path:null type:None
   [junit4]   2> 923639 INFO  (TEST-ChaosMonkeySafeLeaderTest.test-seed#[2B6CE069A5DB5A50]) [    ] o.a.s.c.c.ConnectionManager Client is connected to ZooKeeper
   [junit4]   2> 923640 INFO  (TEST-ChaosMonkeySafeLeaderTest.test-seed#[2B6CE069A5DB5A50]) [    ] o.a.s.c.c.SolrZkClient Using default ZkACLProvider
   [junit4]   2> 923640 INFO  (TEST-ChaosMonkeySafeLeaderTest.test-seed#[2B6CE069A5DB5A50]) [    ] o.a.s.c.c.SolrZkClient makePath: /solr
   [junit4]   2> 923642 INFO  (TEST-ChaosMonkeySafeLeaderTest.test-seed#[2B6CE069A5DB5A50]) [    ] o.a.s.c.c.SolrZkClient Using default ZkCredentialsProvider
   [junit4]   2> 923643 INFO  (TEST-ChaosMonkeySafeLeaderTest.test-seed#[2B6CE069A5DB5A50]) [    ] o.a.s.c.c.ConnectionManager Waiting for client to connect to ZooKeeper
   [junit4]   2> 923645 INFO  (zkCallback-842-thread-1) [    ] o.a.s.c.c.ConnectionManager Watcher org.apache.solr.common.cloud.ConnectionManager@58808767 name:ZooKeeperConnection Watcher:127.0.0.1:37484/solr got event WatchedEvent state:SyncConnected type:None path:null path:null type:None
   [junit4]   2> 923645 INFO  (TEST-ChaosMonkeySafeLeaderTest.test-seed#[2B6CE069A5DB5A50]) [    ] o.a.s.c.c.ConnectionManager Client is connected to ZooKeeper
   [junit4]   2> 923645 INFO  (TEST-ChaosMonkeySafeLeaderTest.test-seed#[2B6CE069A5DB5A50]) [    ] o.a.s.c.c.SolrZkClient Using default ZkACLProvider
   [junit4]   2> 923645 INFO  (TEST-ChaosMonkeySafeLeaderTest.test-seed#[2B6CE069A5DB5A50]) [    ] o.a.s.c.c.SolrZkClient makePath: /collections/collection1
   [junit4]   2> 923647 INFO  (TEST-ChaosMonkeySafeLeaderTest.test-seed#[2B6CE069A5DB5A50]) [    ] o.a.s.c.c.SolrZkClient makePath: /collections/collection1/shards
   [junit4]   2> 923648 INFO  (TEST-ChaosMonkeySafeLeaderTest.test-seed#[2B6CE069A5DB5A50]) [    ] o.a.s.c.c.SolrZkClient makePath: /collections/control_collection
   [junit4]   2> 923650 INFO  (TEST-ChaosMonkeySafeLeaderTest.test-seed#[2B6CE069A5DB5A50]) [    ] o.a.s.c.c.SolrZkClient makePath: /collections/control_collection/shards
   [junit4]   2> 923651 INFO  (TEST-ChaosMonkeySafeLeaderTest.test-seed#[2B6CE069A5DB5A50]) [    ] o.a.s.c.AbstractZkTestCase put /x1/jenkins/jenkins-slave/workspace/Lucene-Solr-Tests-5.x-Java7/solr/core/src/test-files/solr/collection1/conf/solrconfig-tlog.xml to /configs/conf1/solrconfig.xml
   [junit4]   2> 923651 INFO  (TEST-ChaosMonkeySafeLeaderTest.test-seed#[2B6CE069A5DB5A50]) [    ] o.a.s.c.c.SolrZkClient makePath: /configs/conf1/solrconfig.xml
   [junit4]   2> 923654 INFO  (TEST-ChaosMonkeySafeLeaderTest.test-seed#[2B6CE069A5DB5A50]) [    ] o.a.s.c.AbstractZkTestCase put /x1/jenkins/jenkins-slave/workspace/Lucene-Solr-Tests-5.x-Java7/solr/core/src/test-files/solr/collection1/conf/schema15.xml to /configs/conf1/schema.xml
   [junit4]   2> 923654 INFO  (TEST-ChaosMonkeySafeLeaderTest.test-seed#[2B6CE069A5DB5A50]) [    ] o.a.s.c.c.SolrZkClient makePath: /configs/conf1/schema.xml
   [junit4]   2> 923656 INFO  (TEST-ChaosMonkeySafeLeaderTest.test-seed#[2B6CE069A5DB5A50]) [    ] o.a.s.c.AbstractZkTestCase put /x1/jenkins/jenkins-slave/workspace/Lucene-Solr-Tests-5.x-Java7/solr/core/src/test-files/solr/collection1/conf/solrconfig.snippet.randomindexconfig.xml to /configs/conf1/solrconfig.snippet.randomindexconfig.xml
   [junit4]   2> 923656 INFO  (TEST-ChaosMonkeySafeLeaderTest.test-seed#[2B6CE069A5DB5A50]) [    ] o.a.s.c.c.SolrZkClient makePath: /configs/conf1/solrconfig.snippet.randomindexconfig.xml
   [junit4]   2> 923658 INFO  (TEST-ChaosMonkeySafeLeaderTest.test-seed#[2B6CE069A5DB5A50]) [    ] o.a.s.c.AbstractZkTestCase put /x1/jenkins/jenkins-slave/workspace/Lucene-Solr-Tests-5.x-Java7/solr/core/src/test-files/solr/collection1/conf/stopwords.txt to /configs/conf1/stopwords.txt
   [junit4]   2> 923658 INFO  (TEST-ChaosMonkeySafeLeaderTest.test-seed#[2B6CE069A5DB5A50]) [    ] o.a.s.c.c.SolrZkClient makePath: /configs/conf1/stopwords.txt
   [junit4]   2> 923662 INFO  (TEST-ChaosMonkeySafeLeaderTest.test-seed#[2B6CE069A5DB5A50]) [    ] o.a.s.c.AbstractZkTestCase put /x1/jenkins/jenkins-slave/workspace/Lucene-Solr-Tests-5.x-Java7/solr/core/src/test-files/solr/collection1/conf/protwords.txt to /configs/conf1/protwords.txt
   [junit4]   2> 923662 INFO  (TEST-ChaosMonkeySafeLeaderTest.test-seed#[2B6CE069A5DB5A50]) [    ] o.a.s.c.c.SolrZkClient makePath: /configs/conf1/protwords.txt
   [junit4]   2> 923664 INFO  (TEST-ChaosMonkeySafeLeaderTest.test-seed#[2B6CE069A5DB5A50]) [    ] o.a.s.c.AbstractZkTestCase put /x1/jenkins/jenkins-slave/workspace/Lucene-Solr-Tests-5.x-Java7/solr/core/src/test-files/solr/collection1/conf/currency.xml to /configs/conf1/currency.xml
   [junit4]   2> 923664 INFO  (TEST-ChaosMonkeySafeLeaderTest.test-seed#[2B6CE069A5DB5A50]) [    ] o.a.s.c.c.SolrZkClient makePath: /configs/conf1/currency.xml
   [junit4]   2> 923665 INFO  (TEST-ChaosMonkeySafeLeaderTest.test-seed#[2B6CE069A5DB5A50]) [    ] o.a.s.c.AbstractZkTestCase put /x1/jenkins/jenkins-slave/workspace/Lucene-Solr-Tests-5.x-Java7/solr/core/src/test-files/solr/collection1/conf/enumsConfig.xml to /configs/conf1/enumsConfig.xml
   [junit4]   2> 923666 INFO  (TEST-ChaosMonkeySafeLeaderTest.test-seed#[2B6CE069A5DB5A50]) [    ] o.a.s.c.c.SolrZkClient makePath: /configs/conf1/enumsConfig.xml
   [junit4]   2> 923667 INFO  (TEST-ChaosMonkeySafeLeaderTest.test-seed#[2B6CE069A5DB5A50]) [    ] o.a.s.c.AbstractZkTestCase put /x1/jenkins/jenkins-slave/workspace/Lucene-Solr-Tests-5.x-Java7/solr/core/src/test-files/solr/collection1/conf/open-exchange-rates.json to /configs/conf1/open-exchange-rates.json
   [junit4]   2> 923667 INFO  (TEST-ChaosMonkeySafeLeaderTest.test-seed#[2B6CE069A5DB5A50]) [    ] o.a.s.c.c.SolrZkClient makePath: /configs/conf1/open-exchange-rates.json
   [junit4]   2> 923669 INFO  (TEST-ChaosMonkeySafeLeaderTest.test-seed#[2B6CE069A5DB5A50]) [    ] o.a.s.c.AbstractZkTestCase put /x1/jenkins/jenkins-slave/workspace/Lucene-Solr-Tests-5.x-Java7/solr/core/src/test-files/solr/collection1/conf/mapping-ISOLatin1Accent.txt to /configs/conf1/mapping-ISOLatin1Accent.txt
   [junit4]   2> 923669 INFO  (TEST-ChaosMonkeySafeLeaderTest.test-seed#[2B6CE069A5DB5A50]) [    ] o.a.s.c.c.SolrZkClient makePath: /configs/conf1/mapping-ISOLatin1Accent.txt
   [junit4]   2> 923671 INFO  (TEST-ChaosMonkeySafeLeaderTest.test-seed#[2B6CE069A5DB5A50]) [    ] o.a.s.c.AbstractZkTestCase put /x1/jenkins/jenkins-slave/workspace/Lucene-Solr-Tests-5.x-Java7/solr/core/src/test-files/solr/collection1/conf/old_synonyms.txt to /configs/conf1/old_synonyms.txt
   [junit4]   2> 923671 INFO  (TEST-ChaosMonkeySafeLeaderTest.test-seed#[2B6CE069A5DB5A50]) [    ] o.a.s.c.c.SolrZkClient makePath: /configs/conf1/old_synonyms.txt
   [junit4]   2> 923673 INFO  (TEST-ChaosMonkeySafeLeaderTest.test-seed#[2B6CE069A5DB5A50]) [    ] o.a.s.c.AbstractZkTestCase put /x1/jenkins/jenkins-slave/workspace/Lucene-Solr-Tests-5.x-Java7/solr/core/src/test-files/solr/collection1/conf/synonyms.txt to /configs/conf1/synonyms.txt
   [junit4]   2> 923673 INFO  (TEST-ChaosMonkeySafeLeaderTest.test-seed#[2B6CE069A5DB5A50]) [    ] o.a.s.c.c.SolrZkClient makePath: /configs/conf1/synonyms.txt
   [junit4]   2> 923966 INFO  (TEST-ChaosMonkeySafeLeaderTest.test-seed#[2B6CE069A5DB5A50]) [    ] o.a.s.SolrTestCaseJ4 Writing core.properties file to /x1/jenkins/jenkins-slave/workspace/Lucene-Solr-Tests-5.x-Java7/solr/build/solr-core/test/J1/temp/solr.cloud.ChaosMonkeySafeLeaderTest_2B6CE069A5DB5A50-001/control-001/cores/collection1
   [junit4]   2> 923967 INFO  (TEST-ChaosMonkeySafeLeaderTest.test-seed#[2B6CE069A5DB5A50]) [    ] o.e.j.s.Server jetty-9.2.11.v20150529
   [junit4]   2> 923969 INFO  (TEST-ChaosMonkeySafeLeaderTest.test-seed#[2B6CE069A5DB5A50]) [    ] o.e.j.s.h.ContextHandler Started o.e.j.s.ServletContextHandler@1a5fe3c6{/_t,null,AVAILABLE}
   [junit4]   2> 923969 INFO  (TEST-ChaosMonkeySafeLeaderTest.test-seed#[2B6CE069A5DB5A50]) [    ] o.e.j.s.ServerConnector Started ServerConnector@58dc6a54{HTTP/1.1}{127.0.0.1:45511}
   [junit4]   2> 923969 INFO  (TEST-ChaosMonkeySafeLeaderTest.test-seed#[2B6CE069A5DB5A50]) [    ] o.e.j.s.Server Started @927296ms
   [junit4]   2> 923970 INFO  (TEST-ChaosMonkeySafeLeaderTest.test-seed#[2B6CE069A5DB5A50]) [    ] o.a.s.c.s.e.JettySolrRunner Jetty properties: {hostContext=/_t, hostPort=45511, coreRootDirectory=/x1/jenkins/jenkins-slave/workspace/Lucene-Solr-Tests-5.x-Java7/solr/build/solr-core/test/J1/temp/solr.cloud.ChaosMonkeySafeLeaderTest_2B6CE069A5DB5A50-001/control-001/cores, solr.data.dir=/x1/jenkins/jenkins-slave/workspace/Lucene-Solr-Tests-5.x-Java7/solr/build/solr-core/test/J1/temp/solr.cloud.ChaosMonkeySafeLeaderTest_2B6CE069A5DB5A50-001/tempDir-001/control/data}
   [junit4]   2> 923970 INFO  (TEST-ChaosMonkeySafeLeaderTest.test-seed#[2B6CE069A5DB5A50]) [    ] o.a.s.s.SolrDispatchFilter SolrDispatchFilter.init(): sun.misc.Launcher$AppClassLoader@6b482747
   [junit4]   2> 923970 INFO  (TEST-ChaosMonkeySafeLeaderTest.test-seed#[2B6CE069A5DB5A50]) [    ] o.a.s.c.SolrResourceLoader new SolrResourceLoader for directory: '/x1/jenkins/jenkins-slave/workspace/Lucene-Solr-Tests-5.x-Java7/solr/build/solr-core/test/J1/temp/solr.cloud.ChaosMonkeySafeLeaderTest_2B6CE069A5DB5A50-001/control-001/'
   [junit4]   2> 923985 INFO  (TEST-ChaosMonkeySafeLeaderTest.test-seed#[2B6CE069A5DB5A50]) [    ] o.a.s.c.c.SolrZkClient Using default ZkCredentialsProvider
   [junit4]   2> 923985 INFO  (TEST-ChaosMonkeySafeLeaderTest.test-seed#[2B6CE069A5DB5A50]) [    ] o.a.s.c.c.ConnectionManager Waiting for client to connect to ZooKeeper
   [junit4]   2> 923986 INFO  (zkCallback-843-thread-1) [    ] o.a.s.c.c.ConnectionManager Watcher org.apache.solr.common.cloud.ConnectionManager@75c8280e name:ZooKeeperConnection Watcher:127.0.0.1:37484/solr got event WatchedEvent state:SyncConnected type:None path:null path:null type:None
   [junit4]   2> 923987 INFO  (TEST-ChaosMonkeySafeLeaderTest.test-seed#[2B6CE069A5DB5A50]) [    ] o.a.s.c.c.ConnectionManager Client is connected to ZooKeeper
   [junit4]   2> 923987 INFO  (TEST-ChaosMonkeySafeLeaderTest.test-seed#[2B6CE069A5DB5A50]) [    ] o.a.s.c.c.SolrZkClient Using default ZkACLProvider
   [junit4]   2> 923988 INFO  (TEST-ChaosMonkeySafeLeaderTest.test-seed#[2B6CE069A5DB5A50]) [    ] o.a.s.s.SolrDispatchFilter Loading solr.xml from SolrHome (not found in ZooKeeper)
   [junit4]   2> 923988 INFO  (TEST-ChaosMonkeySafeLeaderTest.test-seed#[2B6CE069A5DB5A50]) [    ] o.a.s.c.SolrXmlConfig Loading container configuration from /x1/jenkins/jenkins-slave/workspace/Lucene-Solr-Tests-5.x-Java7/solr/build/solr-core/test/J1/temp/solr.cloud.ChaosMonkeySafeLeaderTest_2B6CE069A5DB5A50-001/control-001/solr.xml
   [junit4]   2> 924002 INFO  (TEST-ChaosMonkeySafeLeaderTest.test-seed#[2B6CE069A5DB5A50]) [    ] o.a.s.c.CoresLocator Config-defined core root directory: /x1/jenkins/jenkins-slave/workspace/Lucene-Solr-Tests-5.x-Java7/solr/build/solr-core/test/J1/temp/solr.cloud.ChaosMonkeySafeLeaderTest_2B6CE069A5DB5A50-001/control-001/cores
   [junit4]   2> 924002 INFO  (TEST-ChaosMonkeySafeLeaderTest.test-seed#[2B6CE069A5DB5A50]) [    ] o.a.s.c.CoreContainer New CoreContainer 1154357944
   [junit4]   2> 924002 INFO  (TEST-ChaosMonkeySafeLeaderTest.test-seed#[2B6CE069A5DB5A50]) [    ] o.a.s.c.CoreContainer Loading cores into CoreContainer [instanceDir=/x1/jenkins/jenkins-slave/workspace/Lucene-Solr-Tests-5.x-Java7/solr/build/solr-core/test/J1/temp/solr.cloud.ChaosMonkeySafeLeaderTest_2B6CE069A5DB5A50-001/control-001/]
   [junit4]   2> 924002 INFO  (TEST-ChaosMonkeySafeLeaderTest.test-seed#[2B6CE069A5DB5A50]) [    ] o.a.s.c.CoreContainer loading shared library: /x1/jenkins/jenkins-slave/workspace/Lucene-Solr-Tests-5.x-Java7/solr/build/solr-core/test/J1/temp/solr.cloud.ChaosMonkeySafeLeaderTest_2B6CE069A5DB5A50-001/control-001/lib
   [junit4]   2> 924002 WARN  (TEST-ChaosMonkeySafeLeaderTest.test-seed#[2B6CE069A5DB5A50]) [    ] o.a.s.c.SolrResourceLoader Can't find (or read) directory to add to classloader: lib (resolved as: /x1/jenkins/jenkins-slave/workspace/Lucene-Solr-Tests-5.x-Java7/solr/build/solr-core/test/J1/temp/solr.cloud.ChaosMonkeySafeLeaderTest_2B6CE069A5DB5A50-001/control-001/lib).
   [junit4]   2> 924010 INFO  (TEST-ChaosMonkeySafeLeaderTest.test-seed#[2B6CE069A5DB5A50]) [    ] o.a.s.h.c.HttpShardHandlerFactory created with socketTimeout : 90000,urlScheme : ,connTimeout : 15000,maxConnectionsPerHost : 20,maxConnections : 10000,corePoolSize : 0,maximumPoolSize : 2147483647,maxThreadIdleTime : 5,sizeOfQueue : -1,fairnessPolicy : false,useRetries : false,
   [junit4]   2> 924011 INFO  (TEST-ChaosMonkeySafeLeaderTest.test-seed#[2B6CE069A5DB5A50]) [    ] o.a.s.u.UpdateShardHandler Creating UpdateShardHandler HTTP client with params: socketTimeout=340000&connTimeout=45000&retry=true
   [junit4]   2> 924011 INFO  (TEST-ChaosMonkeySafeLeaderTest.test-seed#[2B6CE069A5DB5A50]) [    ] o.a.s.l.LogWatcher SLF4J impl is org.slf4j.impl.Log4jLoggerFactory
   [junit4]   2> 924012 INFO  (TEST-ChaosMonkeySafeLeaderTest.test-seed#[2B6CE069A5DB5A50]) [    ] o.a.s.l.LogWatcher Registering Log Listener [Log4j (org.slf4j.impl.Log4jLoggerFactory)]
   [junit4]   2> 924012 INFO  (TEST-ChaosMonkeySafeLeaderTest.test-seed#[2B6CE069A5DB5A50]) [    ] o.a.s.c.ZkContainer Zookeeper client=127.0.0.1:37484/solr
   [junit4]   2> 924012 INFO  (TEST-ChaosMonkeySafeLeaderTest.test-seed#[2B6CE069A5DB5A50]) [    ] o.a.s.c.ZkController zkHost includes chroot
   [junit4]   2> 924012 INFO  (TEST-ChaosMonkeySafeLeaderTest.test-seed#[2B6CE069A5DB5A50]) [    ] o.a.s.c.c.SolrZkClient Using default ZkCredentialsProvider
   [junit4]   2> 924013 INFO  (TEST-ChaosMonkeySafeLeaderTest.test-seed#[2B6CE069A5DB5A50]) [    ] o.a.s.c.c.ConnectionManager Waiting for client to connect to ZooKeeper
   [junit4]   2> 924014 INFO  (zkCallback-845-thread-1) [    ] o.a.s.c.c.ConnectionManager Watcher org.apache.solr.common.cloud.ConnectionManager@6e7ccfde name:ZooKeeperConnection Watcher:127.0.0.1:37484 got event WatchedEvent state:SyncConnected type:None path:null path:null type:None
   [junit4]   2> 924014 INFO  (TEST-ChaosMonkeySafeLeaderTest.test-seed#[2B6CE069A5DB5A50]) [    ] o.a.s.c.c.ConnectionManager Client is connected to ZooKeeper
   [junit4]   2> 924014 INFO  (TEST-ChaosMonkeySafeLeaderTest.test-seed#[2B6CE069A5DB5A50]) [    ] o.a.s.c.c.SolrZkClient Using default ZkACLProvider
   [junit4]   2> 924020 INFO  (TEST-ChaosMonkeySafeLeaderTest.test-seed#[2B6CE069A5DB5A50]) [n:127.0.0.1:45511__t    ] o.a.s.c.c.ConnectionManager Waiting for client to connect to ZooKeeper
   [junit4]   2> 924020 INFO  (zkCallback-846-thread-1-processing-n:127.0.0.1:45511__t) [n:127.0.0.1:45511__t    ] o.a.s.c.c.ConnectionManager Watcher org.apache.solr.common.cloud.ConnectionManager@7e54fc3d name:ZooKeeperConnection Watcher:127.0.0.1:37484/solr got event WatchedEvent state:SyncConnected type:None path:null path:null type:None
   [junit4]   2> 924020 INFO  (TEST-ChaosMonkeySafeLeaderTest.test-seed#[2B6CE069A5DB5A50]) [n:127.0.0.1:45511__t    ] o.a.s.c.c.ConnectionManager Client is connected to ZooKeeper
   [junit4]   2> 924021 INFO  (TEST-ChaosMonkeySafeLeaderTest.test-seed#[2B6CE069A5DB5A50]) [n:127.0.0.1:45511__t    ] o.a.s.c.c.SolrZkClient makePath: /overseer/queue
   [junit4]   2> 924023 INFO  (TEST-ChaosMonkeySafeLeaderTest.test-seed#[2B6CE069A5DB5A50]) [n:127.0.0.1:45511__t    ] o.a.s.c.c.SolrZkClient makePath: /overseer/collection-queue-work
   [junit4]   2> 924025 INFO  (TEST-ChaosMonkeySafeLeaderTest.test-seed#[2B6CE069A5DB5A50]) [n:127.0.0.1:45511__t    ] o.a.s.c.c.SolrZkClient makePath: /overseer/collection-map-running
   [junit4]   2> 924027 INFO  (TEST-ChaosMonkeySafeLeaderTest.test-seed#[2B6CE069A5DB5A50]) [n:127.0.0.1:45511__t    ] o.a.s.c.c.SolrZkClient makePath: /overseer/collection-map-completed
   [junit4]   2> 924029 INFO  (TEST-ChaosMonkeySafeLeaderTest.test-seed#[2B6CE069A5DB5A50]) [n:127.0.0.1:45511__t    ] o.a.s.c.c.SolrZkClient makePath: /overseer/collection-map-failure
   [junit4]   2> 924031 INFO  (TEST-ChaosMonkeySafeLeaderTest.test-seed#[2B6CE069A5DB5A50]) [n:127.0.0.1:45511__t    ] o.a.s.c.c.SolrZkClient makePath: /live_nodes
   [junit4]   2> 924032 INFO  (TEST-ChaosMonkeySafeLeaderTest.test-seed#[2B6CE069A5DB5A50]) [n:127.0.0.1:45511__t    ] o.a.s.c.c.SolrZkClient makePath: /aliases.json
   [junit4]   2> 924034 INFO  (TEST-ChaosMonkeySafeLeaderTest.test-seed#[2B6CE069A5DB5A50]) [n:127.0.0.1:45511__t    ] o.a.s.c.c.SolrZkClient makePath: /clusterstate.json
   [junit4]   2> 924035 INFO  (TEST-ChaosMonkeySafeLeaderTest.test-seed#[2B6CE069A5DB5A50]) [n:127.0.0.1:45511__t    ] o.a.s.c.ZkController Register node as live in ZooKeeper:/live_nodes/127.0.0.1:45511__t
   [junit4]   2> 924035 INFO  (TEST-ChaosMonkeySafeLeaderTest.test-seed#[2B6CE069A5DB5A50]) [n:127.0.0.1:45511__t    ] o.a.s.c.c.SolrZkClient makePath: /live_nodes/127.0.0.1:45511__t
   [junit4]   2> 924037 INFO  (TEST-ChaosMonkeySafeLeaderTest.test-seed#[2B6CE069A5DB5A50]) [n:127.0.0.1:45511__t    ] o.a.s.c.c.SolrZkClient makePath: /overseer_elect
   [junit4]   2> 924038 INFO  (TEST-ChaosMonkeySafeLeaderTest.test-seed#[2B6CE069A5DB5A50]) [n:127.0.0.1:45511__t    ] o.a.s.c.c.SolrZkClient makePath: /overseer_elect/election
   [junit4]   2> 924039 INFO  (TEST-ChaosMonkeySafeLeaderTest.test-seed#[2B6CE069A5DB5A50]) [n:127.0.0.1:45511__t    ] o.a.s.c.Overseer Overseer (id=null) closing
   [junit4]   2> 924040 INFO  (TEST-ChaosMonkeySafeLeaderTest.test-seed#[2B6CE069A5DB5A50]) [n:127.0.0.1:45511__t    ] o.a.s.c.LeaderElector Joined leadership election with path: /overseer_elect/election/94281385817276420-127.0.0.1:45511__t-n_0000000000
   [junit4]   2> 924041 INFO  (TEST-ChaosMonkeySafeLeaderTest.test-seed#[2B6CE069A5DB5A50]) [n:127.0.0.1:45511__t    ] o.a.s.c.OverseerElectionContext I am going to be the leader 127.0.0.1:45511__t
   [junit4]   2> 924041 INFO  (TEST-ChaosMonkeySafeLeaderTest.test-seed#[2B6CE069A5DB5A50]) [n:127.0.0.1:45511__t    ] o.a.s.c.c.SolrZkClient makePath: /overseer_elect/leader
   [junit4]   2> 924042 INFO  (TEST-ChaosMonkeySafeLeaderTest.test-seed#[2B6CE069A5DB5A50]) [n:127.0.0.1:45511__t    ] o.a.s.c.Overseer Overseer (id=94281385817276420-127.0.0.1:45511__t-n_0000000000) starting
   [junit4]   2> 924044 INFO  (TEST-ChaosMonkeySafeLeaderTest.test-seed#[2B6CE069A5DB5A50]) [n:127.0.0.1:45511__t    ] o.a.s.c.c.SolrZkClient makePath: /overseer/queue-work
   [junit4]   2> 924050 INFO  (TEST-ChaosMonkeySafeLeaderTest.test-seed#[2B6CE069A5DB5A50]) [n:127.0.0.1:45511__t    ] o.a.s.c.OverseerAutoReplicaFailoverThread Starting OverseerAutoReplicaFailoverThread autoReplicaFailoverWorkLoopDelay=10000 autoReplicaFailoverWaitAfterExpiration=30000 autoReplicaFailoverBadNodeExpiration=60000
   [junit4]   2> 924050 INFO  (OverseerCollectionProcessor-94281385817276420-127.0.0.1:45511__t-n_0000000000) [n:127.0.0.1:45511__t    ] o.a.s.c.OverseerCollectionProcessor Process current queue of collection creations
   [junit4]   2> 924051 INFO  (TEST-ChaosMonkeySafeLeaderTest.test-seed#[2B6CE069A5DB5A50]) [n:127.0.0.1:45511__t    ] o.a.s.c.c.ZkStateReader Updating cluster state from ZooKeeper... 
   [junit4]   2> 924052 INFO  (OverseerStateUpdate-94281385817276420-127.0.0.1:45511__t-n_0000000000) [n:127.0.0.1:45511__t    ] o.a.s.c.Overseer Starting to work on the main queue
   [junit4]   2> 924054 INFO  (TEST-ChaosMonkeySafeLeaderTest.test-seed#[2B6CE069A5DB5A50]) [n:127.0.0.1:45511__t    ] o.a.s.c.CoreContainer No authentication plugin used.
   [junit4]   2> 924055 INFO  (TEST-ChaosMonkeySafeLeaderTest.test-seed#[2B6CE069A5DB5A50]) [n:127.0.0.1:45511__t    ] o.a.s.c.CoreContainer Security conf doesn't exist. Skipping setup for authorization module.
   [junit4]   2> 924056 INFO  (TEST-ChaosMonkeySafeLeaderTest.test-seed#[2B6CE069A5DB5A50]) [n:127.0.0.1:45511__t    ] o.a.s.c.CoresLocator Looking for core definitions underneath /x1/jenkins/jenkins-slave/workspace/Lucene-Solr-Tests-5.x-Java7/solr/build/solr-core/test/J1/temp/solr.cloud.ChaosMonkeySafeLeaderTest_2B6CE069A5DB5A50-001/control-001/cores
   [junit4]   2> 924057 INFO  (TEST-ChaosMonkeySafeLeaderTest.test-seed#[2B6CE069A5DB5A50]) [n:127.0.0.1:45511__t    ] o.a.s.c.SolrCore Created CoreDescriptor: {name=collection1, dataDir=data/, schema=schema.xml, transient=false, loadOnStartup=true, absoluteInstDir=/x1/jenkins/jenkins-slave/workspace/Lucene-Solr-Tests-5.x-Java7/solr/build/solr-core/test/J1/temp/solr.cloud.ChaosMonkeySafeLeaderTest_2B6CE069A5DB5A50-001/control-001/cores/collection1/, instanceDir=/x1/jenkins/jenkins-slave/workspace/Lucene-Solr-Tests-5.x-Java7/solr/build/solr-core/test/J1/temp/solr.cloud.ChaosMonkeySafeLeaderTest_2B6CE069A5DB5A50-001/control-001/cores/collection1, shard=, config=solrconfig.xml, coreNodeName=, configSetProperties=configsetprops.json, collection=control_collection}
   [junit4]   2> 924057 INFO  (TEST-ChaosMonkeySafeLeaderTest.test-seed#[2B6CE069A5DB5A50]) [n:127.0.0.1:45511__t    ] o.a.s.c.CoresLocator Found core collection1 in /x1/jenkins/jenkins-slave/workspace/Lucene-Solr-Tests-5.x-Java7/solr/build/solr-core/test/J1/temp/solr.cloud.ChaosMonkeySafeLeaderTest_2B6CE069A5DB5A50-001/control-001/cores/collection1/
   [junit4]   2> 924057 INFO  (TEST-ChaosMonkeySafeLeaderTest.test-seed#[2B6CE069A5DB5A50]) [n:127.0.0.1:45511__t    ] o.a.s.c.CoresLocator Found 1 core definitions
   [junit4]   2> 924059 INFO  (coreLoadExecutor-3362-thread-1-processing-n:127.0.0.1:45511__t) [n:127.0.0.1:45511__t c:control_collection   x:collection1] o.a.s.c.ZkController publishing state=down
   [junit4]   2> 924059 INFO  (coreLoadExecutor-3362-thread-1-processing-n:127.0.0.1:45511__t) [n:127.0.0.1:45511__t c:control_collection   x:collection1] o.a.s.c.ZkController numShards not found on descriptor - reading it from system property
   [junit4]   2> 924059 INFO  (TEST-ChaosMonkeySafeLeaderTest.test-seed#[2B6CE069A5DB5A50]) [n:127.0.0.1:45511__t    ] o.a.s.s.SolrDispatchFilter user.dir=/x1/jenkins/jenkins-slave/workspace/Lucene-Solr-Tests-5.x-Java7/solr/build/solr-core/test/J1
   [junit4]   2> 924059 INFO  (TEST-ChaosMonkeySafeLeaderTest.test-seed#[2B6CE069A5DB5A50]) [n:127.0.0.1:45511__t    ] o.a.s.s.SolrDispatchFilter SolrDispatchFilter.init() done
   [junit4]   2> 924060 INFO  (zkCallback-846-thread-1-processing-n:127.0.0.1:45511__t) [n:127.0.0.1:45511__t    ] o.a.s.c.DistributedQueue NodeChildrenChanged fired on path /overseer/queue state SyncConnected
   [junit4]   2> 924060 INFO  (coreLoadExecutor-3362-thread-1-processing-n:127.0.0.1:45511__t) [n:127.0.0.1:45511__t c:control_collection   x:collection1] o.a.s.c.ZkController look for our core node name
   [junit4]   2> 924060 INFO  (OverseerStateUpdate-94281385817276420-127.0.0.1:45511__t-n_0000000000) [n:127.0.0.1:45511__t    ] o.a.s.c.Overseer processMessage: queueSize: 1, message = {
   [junit4]   2>   "collection":"control_collection",
   [junit4]   2>   "base_url":"http://127.0.0.1:45511/_t",
   [junit4]   2>   "shard":null,
   [junit4]   2>   "node_name":"127.0.0.1:45511__t",
   [junit4]   2>   "numShards":"1",
   [junit4]   2>   "roles":null,
   [junit4]   2>   "state":"down",
   [junit4]   2>   "operation":"state",
   [junit4]   2>   "core":"collection1"} current state version: 0
   [junit4]   2> 924061 INFO  (OverseerStateUpdate-94281385817276420-127.0.0.1:45511__t-n_0000000000) [n:127.0.0.1:45511__t    ] o.a.s.c.o.ReplicaMutator Update state numShards=1 message={
   [junit4]   2>   "collection":"control_collection",
   [junit4]   2>   "base_url":"http://127.0.0.1:45511/_t",
   [junit4]   2>   "shard":null,
   [junit4]   2>   "node_name":"127.0.0.1:45511__t",
   [junit4]   2>   "numShards":"1",
   [junit4]   2>   "roles":null,
   [junit4]   2>   "state":"down",
   [junit4]   2>   "operation":"state",
   [junit4]   2>   "core":"collection1"}
   [junit4]   2> 924061 INFO  (OverseerStateUpdate-94281385817276420-127.0.0.1:45511__t-n_0000000000) [n:127.0.0.1:45511__t    ] o.a.s.c.o.ClusterStateMutator building a new cName: control_collection
   [junit4]   2> 924061 INFO  (OverseerStateUpdate-94281385817276420-127.0.0.1:45511__t-n_0000000000) [n:127.0.0.1:45511__t    ] o.a.s.c.o.ReplicaMutator Assigning new node to shard shard=shard1
   [junit4]   2> 924064 INFO  (zkCallback-846-thread-1-processing-n:127.0.0.1:45511__t) [n:127.0.0.1:45511__t    ] o.a.s.c.c.ZkStateReader A cluster state change: WatchedEvent state:SyncConnected type:NodeDataChanged path:/clusterstate.json, has occurred - updating... (live nodes size: 1)
   [junit4]   2> 924065 INFO  (zkCallback-846-thread-1-processing-n:127.0.0.1:45511__t) [n:127.0.0.1:45511__t    ] o.a.s.c.c.ZkStateReader Updated cluster state version to 1
   [junit4]   2> 925060 INFO  (coreLoadExecutor-3362-thread-1-processing-n:127.0.0.1:45511__t) [n:127.0.0.1:45511__t c:control_collection   x:collection1] o.a.s.c.ZkController waiting to find shard id in clusterstate for collection1
   [junit4]   2> 925061 INFO  (coreLoadExecutor-3362-thread-1-processing-n:127.0.0.1:45511__t) [n:127.0.0.1:45511__t c:control_collection   x:collection1] o.a.s.c.ZkController Check for collection zkNode:control_collection
   [junit4]   2> 925061 INFO  (coreLoadExecutor-3362-thread-1-processing-n:127.0.0.1:45511__t) [n:127.0.0.1:45511__t c:control_collection   x:collection1] o.a.s.c.ZkController Collection zkNode exists
   [junit4]   2> 925061 INFO  (coreLoadExecutor-3362-thread-1-processing-n:127.0.0.1:45511__t) [n:127.0.0.1:45511__t c:control_collection   x:collection1] o.a.s.c.c.ZkStateReader Load collection config from:/collections/control_collection
   [junit4]   2> 925062 INFO  (coreLoadExecutor-3362-thread-1-processing-n:127.0.0.1:45511__t) [n:127.0.0.1:45511__t c:control_collection   x:collection1] o.a.s.c.c.ZkStateReader path=/collections/control_collection configName=conf1 specified config exists in ZooKeeper
   [junit4]   2> 925062 INFO  (coreLoadExecutor-3362-thread-1-processing-n:127.0.0.1:45511__t) [n:127.0.0.1:45511__t c:control_collection   x:collection1] o.a.s.c.SolrResourceLoader new SolrResourceLoader for directory: '/x1/jenkins/jenkins-slave/workspace/Lucene-Solr-Tests-5.x-Java7/solr/build/solr-core/test/J1/temp/solr.cloud.ChaosMonkeySafeLeaderTest_2B6CE069A5DB5A50-001/control-001/cores/collection1/'
   [junit4]   2> 925075 INFO  (coreLoadExecutor-3362-thread-1-processing-n:127.0.0.1:45511__t) [n:127.0.0.1:45511__t c:control_collection   x:collection1] o.a.s.c.Config loaded config solrconfig.xml with version 0 
   [junit4]   2> 925081 INFO  (coreLoadExecutor-3362-thread-1-processing-n:127.0.0.1:45511__t) [n:127.0.0.1:45511__t c:control_collection   x:collection1] o.a.s.c.SolrConfig current version of requestparams : -1
   [junit4]   2> 925094 INFO  (coreLoadExecutor-3362-thread-1-processing-n:127.0.0.1:45511__t) [n:127.0.0.1:45511__t c:control_collection   x:collection1] o.a.s.c.SolrConfig Using Lucene MatchVersion: 5.3.0
   [junit4]   2> 925122 INFO  (coreLoadExecutor-3362-thread-1-processing-n:127.0.0.1:45511__t) [n:127.0.0.1:45511__t c:control_collection   x:collection1] o.a.s.c.Config Loaded SolrConfig: solrconfig.xml
   [junit4]   2> 925123 INFO  (coreLoadExecutor-3362-thread-1-processing-n:127.0.0.1:45511__t) [n:127.0.0.1:45511__t c:control_collection   x:collection1] o.a.s.s.IndexSchema Reading Solr Schema from /configs/conf1/schema.xml
   [junit4]   2> 925129 INFO  (coreLoadExecutor-3362-thread-1-processing-n:127.0.0.1:45511__t) [n:127.0.0.1:45511__t c:control_collection   x:collection1] o.a.s.s.IndexSchema [collection1] Schema name=test
   [junit4]   2> 925341 INFO  (coreLoadExecutor-3362-thread-1-processing-n:127.0.0.1:45511__t) [n:127.0.0.1:45511__t c:control_collection   x:collection1] o.a.s.s.IndexSchema default search field in schema is text
   [junit4]   2> 925343 INFO  (coreLoadExecutor-3362-thread-1-processing-n:127.0.0.1:45511__t) [n:127.0.0.1:45511__t c:control_collection   x:collection1] o.a.s.s.IndexSchema unique key field: id
   [junit4]   2> 925344 INFO  (coreLoadExecutor-3362-thread-1-processing-n:127.0.0.1:45511__t) [n:127.0.0.1:45511__t c:control_collection   x:collection1] o.a.s.s.FileExchangeRateProvider Reloading exchange rates from file currency.xml
   [junit4]   2> 925347 INFO  (coreLoadExecutor-3362-thread-1-processing-n:127.0.0.1:45511__t) [n:127.0.0.1:45511__t c:control_collection   x:collection1] o.a.s.s.FileExchangeRateProvider Reloading exchange rates from file currency.xml
   [junit4]   2> 925365 INFO  (coreLoadExecutor-3362-thread-1-processing-n:127.0.0.1:45511__t) [n:127.0.0.1:45511__t c:control_collection   x:collection1] o.a.s.c.ConfigSetProperties Did not find ConfigSet properties, assuming default properties: Can't find resource 'configsetprops.json' in classpath or '/configs/conf1', cwd=/x1/jenkins/jenkins-slave/workspace/Lucene-Solr-Tests-5.x-Java7/solr/build/solr-core/test/J1
   [junit4]   2> 925365 INFO  (coreLoadExecutor-3362-thread-1-processing-n:127.0.0.1:45511__t) [n:127.0.0.1:45511__t c:control_collection   x:collection1] o.a.s.c.CoreContainer Creating SolrCore 'collection1' using configuration from collection control_collection
   [junit4]   2> 925366 INFO  (coreLoadExecutor-3362-thread-1-processing-n:127.0.0.1:45511__t) [n:127.0.0.1:45511__t c:control_collection s:shard1 r:core_node1 x:collection1] o.a.s.c.SolrCore solr.StandardDirectoryFactory
   [junit4]   2> 925366 INFO  (coreLoadExecutor-3362-thread-1-processing-n:127.0.0.1:45511__t) [n:127.0.0.1:45511__t c:control_collection s:shard1 r:core_node1 x:collection1] o.a.s.c.SolrCore [[collection1] ] Opening new SolrCore at [/x1/jenkins/jenkins-slave/workspace/Lucene-Solr-Tests-5.x-Java7/solr/build/solr-core/test/J1/temp/solr.cloud.ChaosMonkeySafeLeaderTest_2B6CE069A5DB5A50-001/control-001/cores/collection1/], dataDir=[null]
   [junit4]   2> 925366 INFO  (coreLoadExecutor-3362-thread-1-processing-n:127.0.0.1:45511__t) [n:127.0.0.1:45511__t c:control_collection s:shard1 r:core_node1 x:collection1] o.a.s.c.JmxMonitoredMap JMX monitoring is enabled. Adding Solr mbeans to JMX Server: com.sun.jmx.mbeanserver.JmxMBeanServer@95f0cd3
   [junit4]   2> 925367 INFO  (coreLoadExecutor-3362-thread-1-processing-n:127.0.0.1:45511__t) [n:127.0.0.1:45511__t c:control_collection s:shard1 r:core_node1 x:collection1] o.a.s.c.CachingDirectoryFactory return new directory for /x1/jenkins/jenkins-slave/workspace/Lucene-Solr-Tests-5.x-Java7/solr/build/solr-core/test/J1/temp/solr.cloud.ChaosMonkeySafeLeaderTest_2B6CE069A5DB5A50-001/control-001/cores/collection1/data
   [junit4]   2> 925367 INFO  (coreLoadExecutor-3362-thread-1-processing-n:127.0.0.1:45511__t) [n:127.0.0.1:45511__t c:control_collection s:shard1 r:core_node1 x:collection1] o.a.s.c.SolrCore New index directory detected: old=null new=/x1/jenkins/jenkins-slave/workspace/Lucene-Solr-Tests-5.x-Java7/solr/build/solr-core/test/J1/temp/solr.cloud.ChaosMonkeySafeLeaderTest_2B6CE069A5DB5A50-001/control-001/cores/collection1/data/index/
   [junit4]   2> 925367 WARN  (coreLoadExecutor-3362-thread-1-processing-n:127.0.0.1:45511__t) [n:127.0.0.1:45511__t c:control_collection s:shard1 r:core_node1 x:collection1] o.a.s.c.SolrCore [collection1] Solr index directory '/x1/jenkins/jenkins-slave/workspace/Lucene-Solr-Tests-5.x-Java7/solr/build/solr-core/test/J1/temp/solr.cloud.ChaosMonkeySafeLeaderTest_2B6CE069A5DB5A50-001/control-001/cores/collection1/data/index' doesn't exist. Creating new index...
   [junit4]   2> 925368 INFO  (coreLoadExecutor-3362-thread-1-processing-n:127.0.0.1:45511__t) [n:127.0.0.1:45511__t c:control_collection s:shard1 r:core_node1 x:collection1] o.a.s.c.CachingDirectoryFactory return new directory for /x1/jenkins/jenkins-slave/workspace/Lucene-Solr-Tests-5.x-Java7/solr/build/solr-core/test/J1/temp/solr.cloud.ChaosMonkeySafeLeaderTest_2B6CE069A5DB5A50-001/control-001/cores/collection1/data/index
   [junit4]   2> 925368 INFO  (coreLoadExecutor-3362-thread-1-processing-n:127.0.0.1:45511__t) [n:127.0.0.1:45511__t c:control_collection s:shard1 r:core_node1 x:collection1] o.a.s.u.RandomMergePolicy RandomMergePolicy wrapping class org.apache.lucene.index.TieredMergePolicy: [TieredMergePolicy: maxMergeAtOnce=34, maxMergeAtOnceExplicit=25, maxMergedSegmentMB=88.5712890625, floorSegmentMB=0.6328125, forceMergeDeletesPctAllowed=16.230325949476573, segmentsPerTier=39.0, maxCFSSegmentSizeMB=8.796093022207999E12, noCFSRatio=0.8300246519299211
   [junit4]   2> 925374 INFO  (coreLoadExecutor-3362-thread-1-processing-n:127.0.0.1:45511__t) [n:127.0.0.1:45511__t c:control_collection s:shard1 r:core_node1 x:collection1] o.a.s.c.SolrCore SolrDeletionPolicy.onCommit: commits: num=1
   [junit4]   2> 	commit{dir=/x1/jenkins/jenkins-slave/workspace/Lucene-Solr-Tests-5.x-Java7/solr/build/solr-core/test/J1/temp/solr.cloud.ChaosMonkeySafeLeaderTest_2B6CE069A5DB5A50-001/control-001/cores/collection1/data/index,segFN=segments_1,generation=1}
   [junit4]   2> 925374 INFO  (coreLoadExecutor-3362-thread-1-processing-n:127.0.0.1:45511__t) [n:127.0.0.1:45511__t c:control_collection s:shard1 r:core_node1 x:collection1] o.a.s.c.SolrCore newest commit generation = 1
   [junit4]   2> 925374 INFO  (OldIndexDirectoryCleanupThreadForCore-collection1) [n:127.0.0.1:45511__t c:control_collection s:shard1 r:core_node1 x:collection1] o.a.s.c.SolrCore Looking for old index directories to cleanup for core collection1 in /x1/jenkins/jenkins-slave/workspace/Lucene-Solr-Tests-5.x-Java7/solr/build/solr-core/test/J1/temp/solr.cloud.ChaosMonkeySafeLeaderTest_2B6CE069A5DB5A50-001/control-001/cores/collection1/data/
   [junit4]   2> 925378 INFO  (coreLoadExecutor-3362-thread-1-processing-n:127.0.0.1:45511__t) [n:127.0.0.1:45511__t c:control_collection s:shard1 r:core_node1 x:collection1] o.a.s.u.p.UpdateRequestProcessorChain creating updateRequestProcessorChain "nodistrib"
   [junit4]   2> 925378 INFO  (coreLoadExecutor-3362-thread-1-processing-n:127.0.0.1:45511__t) [n:127.0.0.1:45511__t c:control_collection s:shard1 r:core_node1 x:collection1] o.a.s.u.p.UpdateRequestProcessorChain creating updateRequestProcessorChain "dedupe"
   [junit4]   2> 925378 INFO  (coreLoadExecutor-3362-thread-1-processing-n:127.0.0.1:45511__t) [n:127.0.0.1:45511__t c:control_collection s:shard1 r:core_node1 x:collection1] o.a.s.u.p.UpdateRequestProcessorChain inserting DistributedUpdateProcessorFactory into updateRequestProcessorChain "dedupe"
   [junit4]   2> 925379 INFO  (coreLoadExecutor-3362-thread-1-processing-n:127.0.0.1:45511__t) [n:127.0.0.1:45511__t c:control_collection s:shard1 r:core_node1 x:collection1] o.a.s.u.p.UpdateRequestProcessorChain creating updateRequestProcessorChain "stored_sig"
   [junit4]   2> 925379 INFO  (coreLoadExecutor-3362-thread-1-processing-n:127.0.0.1:45511__t) [n:127.0.0.1:45511__t c:control_collection s:shard1 r:core_node1 x:collection1] o.a.s.u.p.UpdateRequestProcessorChain inserting DistributedUpdateProcessorFactory into updateRequestProcessorChain "stored_sig"
   [junit4]   2> 925379 INFO  (coreLoadExecutor-3362-thread-1-processing-n:127.0.0.1:45511__t) [n:127.0.0.1:45511__t c:control_collection s:shard1 r:core_node1 x:collection1] o.a.s.u.p.UpdateRequestProcessorChain creating updateRequestProcessorChain "distrib-dup-test-chain-explicit"
   [junit4]   2> 925379 INFO  (coreLoadExecutor-3362-thread-1-processing-n:127.0.0.1:45511__t) [n:127.0.0.1:45511__t c:control_collection s:shard1 r:core_node1 x:collection1] o.a.s.u.p.UpdateRequestProcessorChain creating updateRequestProcessorChain "distrib-dup-test-chain-implicit"
   [junit4]   2> 925379 INFO  (coreLoadExecutor-3362-thread-1-processing-n:127.0.0.1:45511__t) [n:127.0.0.1:45511__t c:control_collection s:shard1 r:core_node1 x:collection1] o.a.s.u.p.UpdateRequestProcessorChain inserting DistributedUpdateProcessorFactory into updateRequestProcessorChain "distrib-dup-test-chain-implicit"
   [junit4]   2> 925380 INFO  (coreLoadExecutor-3362-thread-1-processing-n:127.0.0.1:45511__t) [n:127.0.0.1:45511__t c:control_collection s:shard1 r:core_node1 x:collection1] o.a.s.c.SolrCore no updateRequestProcessorChain defined as default, creating implicit default
   [junit4]   2> 925382 INFO  (coreLoadExecutor-3362-thread-1-processing-n:127.0.0.1:45511__t) [n:127.0.0.1:45511__t c:control_collection s:shard1 r:core_node1 x:collection1] o.a.s.h.l.XMLLoader xsltCacheLifetimeSeconds=60
   [junit4]   2> 925384 INFO  (coreLoadExecutor-3362-thread-1-processing-n:127.0.0.1:45511__t) [n:127.0.0.1:45511__t c:control_collection s:shard1 r:core_node1 x:collection1] o.a.s.h.l.XMLLoader xsltCacheLifetimeSeconds=60
   [junit4]   2> 925385 INFO  (coreLoadExecutor-3362-thread-1-processing-n:127.0.0.1:45511__t) [n:127.0.0.1:45511__t c:control_collection s:shard1 r:core_node1 x:collection1] o.a.s.h.l.XMLLoader xsltCacheLifetimeSeconds=60
   [junit4]   2> 925386 INFO  (coreLoadExecutor-3362-thread-1-processing-n:127.0.0.1:45511__t) [n:127.0.0.1:45511__t c:control_collection s:shard1 r:core_node1 x:collection1] o.a.s.h.l.XMLLoader xsltCacheLifetimeSeconds=60
   [junit4]   2> 925390 INFO  (coreLoadExecutor-3362-thread-1-processing-n:127.0.0.1:45511__t) [n:127.0.0.1:45511__t c:control_collection s:shard1 r:core_node1 x:collection1] o.a.s.c.RequestHandlers Registered paths: /admin/ping,/admin/segments,/replication,/admin/file,standard,/admin/plugins,/config,/admin/luke,/schema,/admin/mbeans,/update/csv,/update,/admin/system,/admin/threads,/update/json,/admin/logging,/update/json/docs,/get,/admin/properties
   [junit4]   2> 925391 INFO  (coreLoadExecutor-3362-thread-1-processing-n:127.0.0.1:45511__t) [n:127.0.0.1:45511__t c:control_collection s:shard1 r:core_node1 x:collection1] o.a.s.c.SolrCore Using default statsCache cache: org.apache.solr.search.stats.LocalStatsCache
   [junit4]   2> 925391 INFO  (coreLoadExecutor-3362-thread-1-processing-n:127.0.0.1:45511__t) [n:127.0.0.1:45511__t c:control_collection s:shard1 r:core_node1 x:collection1] o.a.s.u.UpdateHandler Using UpdateLog implementation: org.apache.solr.update.UpdateLog
   [junit4]   2> 925392 INFO  (coreLoadExecutor-3362-thread-1-processing-n:127.0.0.1:45511__t) [n:127.0.0.1:45511__t c:control_collection s:shard1 r:core_node1 x:collection1] o.a.s.u.UpdateLog Initializing UpdateLog: dataDir= defaultSyncLevel=FLUSH numRecordsToKeep=100 maxNumLogsToKeep=10 numVersionBuckets=65536
   [junit4]   2> 925392 INFO  (coreLoadExecutor-3362-thread-1-processing-n:127.0.0.1:45511__t) [n:127.0.0.1:45511__t c:control_collection s:shard1 r:core_node1 x:collection1] o.a.s.c.SolrCore Hard AutoCommit: disabled
   [junit4]   2> 925392 INFO  (coreLoadExecutor-3362-thread-1-processing-n:127.0.0.1:45511__t) [n:127.0.0.1:45511__t c:control_collection s:shard1 r:core_node1 x:collection1] o.a.s.c.SolrCore Soft AutoCommit: disabled
   [junit4]   2> 925393 INFO  (coreLoadExecutor-3362-thread-1-processing-n:127.0.0.1:45511__t) [n:127.0.0.1:45511__t c:control_collection s:shard1 r:core_node1 x:collection1] o.a.s.u.RandomMergePolicy RandomMergePolicy wrapping class org.apache.lucene.index.TieredMergePolicy: [TieredMergePolicy: maxMergeAtOnce=45, maxMergeAtOnceExplicit=37, maxMergedSegmentMB=32.60546875, floorSegmentMB=0.54296875, forceMergeDeletesPctAllowed=8.061098034578613, segmentsPerTier=11.0, maxCFSSegmentSizeMB=8.796093022207999E12, noCFSRatio=0.7992758856453532
   [junit4]   2> 925394 INFO  (coreLoadExecutor-3362-thread-1-processing-n:127.0.0.1:45511__t) [n:127.0.0.1:45511__t c:control_collection s:shard1 r:core_node1 x:collection1] o.a.s.c.SolrCore SolrDeletionPolicy.onInit: commits: num=1
   [junit4]   2> 	commit{dir=/x1/jenkins/jenkins-slave/workspace/Lucene-Solr-Tests-5.x-Java7/solr/build/solr-core/test/J1/temp/solr.cloud.ChaosMonkeySafeLeaderTest_2B6CE069A5DB5A50-001/control-001/cores/collection1/data/index,segFN=segments_1,generation=1}
   [junit4]   2> 925394 INFO  (coreLoadExecutor-3362-thread-1-processing-n:127.0.0.1:45511__t) [n:127.0.0.1:45511__t c:control_collection s:shard1 r:core_node1 x:collection1] o.a.s.c.SolrCore newest commit generation = 1
   [junit4]   2> 925394 INFO  (coreLoadExecutor-3362-thread-1-processing-n:127.0.0.1:45511__t) [n:127.0.0.1:45511__t c:control_collection s:shard1 r:core_node1 x:collection1] o.a.s.s.SolrIndexSearcher Opening Searcher@1714bb9d[collection1] main
   [junit4]   2> 925395 INFO  (coreLoadExecutor-3362-thread-1-processing-n:127.0.0.1:45511__t) [n:127.0.0.1:45511__t c:control_collection s:shard1 r:core_node1 x:collection1] o.a.s.c.c.ZkStateReader Load collection config from:/collections/control_collection
   [junit4]   2> 925395 INFO  (coreLoadExecutor-3362-thread-1-processing-n:127.0.0.1:45511__t) [n:127.0.0.1:45511__t c:control_collection s:shard1 r:core_node1 x:collection1] o.a.s.c.c.ZkStateReader path=/collections/control_collection configName=conf1 specified config exists in ZooKeeper
   [junit4]   2> 925396 INFO  (coreLoadExecutor-3362-thread-1-processing-n:127.0.0.1:45511__t) [n:127.0.0.1:45511__t c:control_collection s:shard1 r:core_node1 x:collection1] o.a.s.r.ManagedResourceStorage Setting up ZooKeeper-based storage for the RestManager with znodeBase: /configs/conf1
   [junit4]   2> 925396 INFO  (coreLoadExecutor-3362-thread-1-processing-n:127.0.0.1:45511__t) [n:127.0.0.1:45511__t c:control_collection s:shard1 r:core_node1 x:collection1] o.a.s.r.ManagedResourceStorage Configured ZooKeeperStorageIO with znodeBase: /configs/conf1
   [junit4]   2> 925396 INFO  (coreLoadExecutor-3362-thread-1-processing-n:127.0.0.1:45511__t) [n:127.0.0.1:45511__t c:control_collection s:shard1 r:core_node1 x:collection1] o.a.s.r.RestManager Initializing RestManager with initArgs: {}
   [junit4]   2> 925396 INFO  (coreLoadExecutor-3362-thread-1-processing-n:127.0.0.1:45511__t) [n:127.0.0.1:45511__t c:control_collection s:shard1 r:core_node1 x:collection1] o.a.s.r.ManagedResourceStorage Reading _rest_managed.json using ZooKeeperStorageIO:path=/configs/conf1
   [junit4]   2> 925397 INFO  (coreLoadExecutor-3362-thread-1-processing-n:127.0.0.1:45511__t) [n:127.0.0.1:45511__t c:control_collection s:shard1 r:core_node1 x:collection1] o.a.s.r.ManagedResourceStorage No data found for znode /configs/conf1/_rest_managed.json
   [junit4]   2> 925397 INFO  (coreLoadExecutor-3362-thread-1-processing-n:127.0.0.1:45511__t) [n:127.0.0.1:45511__t c:control_collection s:shard1 r:core_node1 x:collection1] o.a.s.r.ManagedResourceStorage Loaded null at path _rest_managed.json using ZooKeeperStorageIO:path=/configs/conf1
   [junit4]   2> 925397 INFO  (coreLoadExecutor-3362-thread-1-processing-n:127.0.0.1:45511__t) [n:127.0.0.1:45511__t c:control_collection s:shard1 r:core_node1 x:collection1] o.a.s.r.RestManager Initializing 0 registered ManagedResources
   [junit4]   2> 925397 INFO  (coreLoadExecutor-3362-thread-1-processing-n:127.0.0.1:45511__t) [n:127.0.0.1:45511__t c:control_collection s:shard1 r:core_node1 x:collection1] o.a.s.h.ReplicationHandler Commits will be reserved for  10000
   [junit4]   2> 925398 INFO  (searcherExecutor-3363-thread-1-processing-c:control_collection s:shard1 n:127.0.0.1:45511__t r:core_node1 x:collection1) [n:127.0.0.1:45511__t c:control_collection s:shard1 r:core_node1 x:collection1] o.a.s.c.SolrCore [collection1] Registered new searcher Searcher@1714bb9d[collection1] main{ExitableDirectoryReader(UninvertingDirectoryReader())}
   [junit4]   2> 925398 INFO  (coreLoadExecutor-3362-thread-1-processing-n:127.0.0.1:45511__t) [n:127.0.0.1:45511__t c:control_collection s:shard1 r:core_node1 x:collection1] o.a.s.u.UpdateLog Looking up max value of version field to seed version buckets
   [junit4]   2> 925398 INFO  (coreLoadExecutor-3362-thread-1-processing-n:127.0.0.1:45511__t) [n:127.0.0.1:45511__t c:control_collection s:shard1 r:core_node1 x:collection1] o.a.s.u.VersionInfo Refreshing highest value of _version_ for 65536 version buckets from index
   [junit4]   2> 925398 INFO  (coreLoadExecutor-3362-thread-1-processing-n:127.0.0.1:45511__t) [n:127.0.0.1:45511__t c:control_collection s:shard1 r:core_node1 x:collection1] o.a.s.u.VersionInfo No terms found for _version_, cannot seed version bucket highest value from index
   [junit4]   2> 925398 INFO  (coreLoadExecutor-3362-thread-1-processing-n:127.0.0.1:45511__t) [n:127.0.0.1:45511__t c:control_collection s:shard1 r:core_node1 x:collection1] o.a.s.u.UpdateLog Could not find max version in index or recent updates, using new clock 1508502175027822592
   [junit4]   2> 925400 INFO  (coreLoadExecutor-3362-thread-1-processing-n:127.0.0.1:45511__t) [n:127.0.0.1:45511__t c:control_collection s:shard1 r:core_node1 x:collection1] o.a.s.u.UpdateLog Took 2 ms to seed version buckets with highest version 1508502175027822592
   [junit4]   2> 925401 INFO  (coreLoadExecutor-3362-thread-1-processing-n:127.0.0.1:45511__t) [n:127.0.0.1:45511__t c:control_collection s:shard1 r:core_node1 x:collection1] o.a.s.c.ZkController watch zkdir /configs/conf1
   [junit4]   2> 925401 INFO  (coreLoadExecutor-3362-thread-1-processing-n:127.0.0.1:45511__t) [n:127.0.0.1:45511__t c:control_collection s:shard1 r:core_node1 x:collection1] o.a.s.c.CoreContainer registering core: collection1
   [junit4]   2> 925402 INFO  (coreZkRegister-3356-thread-1-processing-c:control_collection s:shard1 n:127.0.0.1:45511__t r:core_node1 x:collection1) [n:127.0.0.1:45511__t c:control_collection s:shard1 r:core_node1 x:collection1] o.a.s.c.ZkController Register replica - core:collection1 address:http://127.0.0.1:45511/_t collection:control_collection shard:shard1
   [junit4]   2> 925402 INFO  (coreZkRegister-3356-thread-1-processing-c:control_collection s:shard1 n:127.0.0.1:45511__t r:core_node1 x:collection1) [n:127.0.0.1:45511__t c:control_collection s:shard1 r:core_node1 x:collection1] o.a.s.c.c.SolrZkClient makePath: /collections/control_collection/leader_elect/shard1/election
   [junit4]   2> 925406 INFO  (coreZkRegister-3356-thread-1-processing-c:control_collection s:shard1 n:127.0.0.1:45511__t r:core_node1 x:collection1) [n:127.0.0.1:45511__t c:control_collection s:shard1 r:core_node1 x:collection1] o.a.s.c.LeaderElector Joined leadership election with path: /collections/control_collection/leader_elect/shard1/election/94281385817276420-core_node1-n_0000000000
   [junit4]   2> 925406 INFO  (coreZkRegister-3356-thread-1-processing-c:control_collection s:shard1 n:127.0.0.1:45511__t r:core_node1 x:collection1) [n:127.0.0.1:45511__t c:control_collection s:shard1 r:core_node1 x:collection1] o.a.s.c.ShardLeaderElectionContext Running the leader process for shard shard1
   [junit4]   2> 925408 INFO  (zkCallback-846-thread-1-processing-n:127.0.0.1:45511__t) [n:127.0.0.1:45511__t    ] o.a.s.c.DistributedQueue NodeChildrenChanged fired on path /overseer/queue state SyncConnected
   [junit4]   2> 925408 INFO  (coreZkRegister-3356-thread-1-processing-c:control_collection s:shard1 n:127.0.0.1:45511__t r:core_node1 x:collection1) [n:127.0.0.1:45511__t c:control_collection s:shard1 r:core_node1 x:collection1] o.a.s.c.ShardLeaderElectionContext Enough replicas found to continue.
   [junit4]   2> 925408 INFO  (coreZkRegister-3356-thread-1-processing-c:control_collection s:shard1 n:127.0.0.1:45511__t r:core_node1 x:collection1) [n:127.0.0.1:45511__t c:control_collection s:shard1 r:core_node1 x:collection1] o.a.s.c.ShardLeaderElectionContext I may be the new leader - try and sync
   [junit4]   2> 925408 INFO  (coreZkRegister-3356-thread-1-processing-c:control_collection s:shard1 n:127.0.0.1:45511__t r:core_node1 x:collection1) [n:127.0.0.1:45511__t c:control_collection s:shard1 r:core_node1 x:collection1] o.a.s.c.SyncStrategy Sync replicas to http://127.0.0.1:45511/_t/collection1/
   [junit4]   2> 925408 INFO  (OverseerStateUpdate-94281385817276420-127.0.0.1:45511__t-n_0000000000) [n:127.0.0.1:45511__t    ] o.a.s.c.Overseer processMessage: queueSize: 1, message = {
   [junit4]   2>   "operation":"leader",
   [junit4]   2>   "shard":"shard1",
   [junit4]   2>   "collection":"control_collection"} current state version: 1
   [junit4]   2> 925409 INFO  (coreZkRegister-3356-thread-1-processing-c:control_collection s:shard1 n:127.0.0.1:45511__t r:core_node1 x:collection1) [n:127.0.0.1:45511__t c:control_collection s:shard1 r:core_node1 x:collection1] o.a.s.c.SyncStrategy Sync Success - now sync replicas to me
   [junit4]   2> 925409 INFO  (coreZkRegister-3356-thread-1-processing-c:control_collection s:shard1 n:127.0.0.1:45511__t r:core_node1 x:collection1) [n:127.0.0.1:45511__t c:control_collection s:shard1 r:core_node1 x:collection1] o.a.s.c.SyncStrategy http://127.0.0.1:45511/_t/collection1/ has no replicas
   [junit4]   2> 925409 INFO  (coreZkRegister-3356-thread-1-processing-c:control_collection s:shard1 n:127.0.0.1:45511__t r:core_node1 x:collection1) [n:127.0.0.1:45511__t c:control_collection s:shard1 r:core_node1 x:collection1] o.a.s.c.ShardLeaderElectionContext I am the new leader: http://127.0.0.1:45511/_t/collection1/ shard1
   [junit4]   2> 925409 INFO  (coreZkRegister-3356-thread-1-processing-c:control_collection s:shard1 n:127.0.0.1:45511__t r:core_node1 x:collection1) [n:127.0.0.1:45511__t c:control_collection s:shard1 r:core_node1 x:collection1] o.a.s.c.c.SolrZkClient makePath: /collections/control_collection/leaders/shard1
   [junit4]   2> 925413 INFO  (zkCallback-846-thread-1-processing-n:127.0.0.1:45511__t) [n:127.0.0.1:45511__t    ] o.a.s.c.DistributedQueue NodeChildrenChanged fired on path /overseer/queue state SyncConnected
   [junit4]   2> 925413 INFO  (OverseerStateUpdate-94281385817276420-127.0.0.1:45511__t-n_0000000000) [n:127.0.0.1:45511__t    ] o.a.s.c.Overseer processMessage: queueSize: 1, message = {
   [junit4]   2>   "operation":"leader",
   [junit4]   2>   "shard":"shard1",
   [junit4]   2>   "collection":"control_collection",
   [junit4]   2>   "base_url":"http://127.0.0.1:45511/_t",
   [junit4]   2>   "core":"collection1",
   [junit4]   2>   "state":"active"} current state version: 1
   [junit4]   2> 925516 INFO  (zkCallback-846-thread-1-processing-n:127.0.0.1:45511__t) [n:127.0.0.1:45511__t    ] o.a.s.c.c.ZkStateReader A cluster state change: WatchedEvent state:SyncConnected type:NodeDataChanged path:/clusterstate.json, has occurred - updating... (live nodes size: 1)
   [junit4]   2> 925517 INFO  (zkCallback-846-thread-1-processing-n:127.0.0.1:45511__t) [n:127.0.0.1:45511__t    ] o.a.s.c.c.ZkStateReader Updated cluster state version to 2
   [junit4]   2> 925562 INFO  (TEST-ChaosMonkeySafeLeaderTest.test-seed#[2B6CE069A5DB5A50]) [    ] o.a.s.c.c.SolrZkClient Using default ZkCredentialsProvider
   [junit4]   2> 925562 INFO  (TEST-ChaosMonkeySafeLeaderTest.test-seed#[2B6CE069A5DB5A50]) [    ] o.a.s.c.c.ConnectionManager Waiting for client to connect to ZooKeeper
   [junit4]   2> 925564 INFO  (zkCallback-848-thread-1) [    ] o.a.s.c.c.ConnectionManager Watcher org.apache.solr.common.cloud.ConnectionManager@7505c949 name:ZooKeeperConnection Watcher:127.0.0.1:37484/solr got event WatchedEvent state:SyncConnected type:None path:null path:null type:None
   [junit4]   2> 925564 INFO  (TEST-ChaosMonkeySafeLeaderTest.test-seed#[2B6CE069A5DB5A50]) [    ] o.a.s.c.c.ConnectionManager Client is connected to ZooKeeper
   [junit4]   2> 925564 INFO  (TEST-ChaosMonkeySafeLeaderTest.test-seed#[2B6CE069A5DB5A50]) [    ] o.a.s.c.c.SolrZkClient Using default ZkACLProvider
   [junit4]   2> 925564 INFO  (TEST-ChaosMonkeySafeLeaderTest.test-seed#[2B6CE069A5DB5A50]) [    ] o.a.s.c.c.ZkStateReader Updating cluster state from ZooKeeper... 
   [junit4]   2> 925564 INFO  (coreZkRegister-3356-thread-1-processing-c:control_collection s:shard1 n:127.0.0.1:45511__t r:core_node1 x:collection1) [n:127.0.0.1:45511__t c:control_collection s:shard1 r:core_node1 x:collection1] o.a.s.c.ZkController We are http://127.0.0.1:45511/_t/collection1/ and leader is http://127.0.0.1:45511/_t/collection1/
   [junit4]   2> 925565 INFO  (coreZkRegister-3356-thread-1-processing-c:control_collection s:shard1 n:127.0.0.1:45511__t r:core_node1 x:collection1) [n:127.0.0.1:45511__t c:control_collection s:shard1 r:core_node1 x:collection1] o.a.s.c.ZkController No LogReplay needed for core=collection1 baseURL=http://127.0.0.1:45511/_t
   [junit4]   2> 925565 INFO  (coreZkRegister-3356-thread-1-processing-c:control_collection s:shard1 n:127.0.0.1:45511__t r:core_node1 x:collection1) [n:127.0.0.1:45511__t c:control_collection s:shard1 r:core_node1 x:collection1] o.a.s.c.ZkController I am the leader, no recovery necessary
   [junit4]   2> 925565 INFO  (coreZkRegister-3356-thread-1-processing-c:control_collection s:shard1 n:127.0.0.1:45511__t r:core_node1 x:collection1) [n:127.0.0.1:45511__t c:control_collection s:shard1 r:core_node1 x:collection1] o.a.s.c.ZkController publishing state=active
   [junit4]   2> 925565 INFO  (coreZkRegister-3356-thread-1-processing-c:control_collection s:shard1 n:127.0.0.1:45511__t r:core_node1 x:collection1) [n:127.0.0.1:45511__t c:control_collection s:shard1 r:core_node1 x:collection1] o.a.s.c.ZkController numShards not found on descriptor - reading it from system property
   [junit4]   2> 925566 INFO  (zkCallback-846-thread-1-processing-n:127.0.0.1:45511__t) [n:127.0.0.1:45511__t    ] o.a.s.c.DistributedQueue NodeChildrenChanged fired on path /overseer/queue state SyncConnected
   [junit4]   2> 925567 INFO  (OverseerStateUpdate-94281385817276420-127.0.0.1:45511__t-n_0000000000) [n:127.0.0.1:45511__t    ] o.a.s.c.Overseer processMessage: queueSize: 1, message = {
   [junit4]   2>   "collection":"control_collection",
   [junit4]   2>   "core_node_name":"core_node1",
   [junit4]   2>   "base_url":"http://127.0.0.1:45511/_t",
   [junit4]   2>   "shard":"shard1",
   [junit4]   2>   "node_name":"127.0.0.1:45511__t",
   [junit4]   2>   "numShards":"2",
   [junit4]   2>   "roles":null,
   [junit4]   2>   "state":"active",
   [junit4]   2>   "operation":"state",
   [junit4]   2>   "core":"collection1"} current state version: 2
   [junit4]   2> 925567 INFO  (OverseerStateUpdate-94281385817276420-127.0.0.1:45511__t-n_0000000000) [n:127.0.0.1:45511__t    ] o.a.s.c.o.ReplicaMutator Update state numShards=2 message={
   [junit4]   2>   "collection":"control_collection",
   [junit4]   2>   "core_node_name":"core_node1",
   [junit4]   2>   "base_url":"http://127.0.0.1:45511/_t",
   [junit4]   2>   "shard":"shard1",
   [junit4]   2>   "node_name":"127.0.0.1:45511__t",
   [junit4]   2>   "numShards":"2",
   [junit4]   2>   "roles":null,
   [junit4]   2>   "state":"active",
   [junit4]   2>   "operation":"state",
   [junit4]   2>   "core":"collection1"}
   [junit4]   2> 925568 INFO  (TEST-ChaosMonkeySafeLeaderTest.test-seed#[2B6CE069A5DB5A50]) [    ] o.a.s.c.ChaosMonkey monkey: init - expire sessions:false cause connection loss:false
   [junit4]   2> 925673 INFO  (zkCallback-848-thread-1) [    ] o.a.s.c.c.ZkStateReader A cluster state change: WatchedEvent state:SyncConnected type:NodeDataChanged path:/clusterstate.json, has occurred - updating... (live nodes size: 1)
   [junit4]   2> 925673 INFO  (zkCallback-846-thread-1-processing-n:127.0.0.1:45511__t) [n:127.0.0.1:45511__t    ] o.a.s.c.c.ZkStateReader A cluster state change: WatchedEvent state:SyncConnected type:NodeDataChanged path:/clusterstate.json, has occurred - updating... (live nodes size: 1)
   [junit4]   2> 925676 INFO  (zkCallback-848-thread-1) [    ] o.a.s.c.c.ZkStateReader Updated cluster state version to 3
   [junit4]   2> 925676 INFO  (zkCallback-846-thread-1-processing-n:127.0.0.1:45511__t) [n:127.0.0.1:45511__t    ] o.a.s.c.c.ZkStateReader Updated cluster state version to 3
   [junit4]   2> 925845 INFO  (TEST-ChaosMonkeySafeLeaderTest.test-seed#[2B6CE069A5DB5A50]) [    ] o.a.s.SolrTestCaseJ4 Writing core.properties file to /x1/jenkins/jenkins-slave/workspace/Lucene-Solr-Tests-5.x-Java7/solr/build/solr-core/test/J1/temp/solr.cloud.ChaosMonkeySafeLeaderTest_2B6CE069A5DB5A50-001/shard-1-001/cores/collection1
   [junit4]   2> 925846 INFO  (TEST-ChaosMonkeySafeLeaderTest.test-seed#[2B6CE069A5DB5A50]) [    ] o.a.s.c.AbstractFullDistribZkTestBase create jetty 1 in directory /x1/jenkins/jenkins-slave/workspace/Lucene-Solr-Tests-5.x-Java7/solr/build/solr-core/test/J1/temp/solr.cloud.ChaosMonkeySafeLeaderTest_2B6CE069A5DB5A50-001/shard-1-001
   [junit4]   2> 925847 INFO  (TEST-ChaosMonkeySafeLeaderTest.test-seed#[2B6CE069A5DB5A50]) [    ] o.e.j.s.Server jetty-9.2.11.v20150529
   [junit4]   2> 925852 INFO  (TEST-ChaosMonkeySafeLeaderTest.test-seed#[2B6CE069A5DB5A50]) [    ] o.e.j.s.h.ContextHandler Started o.e.j.s.ServletContextHandler@102b4e31{/_t,null,AVAILABLE}
   [junit4]   2> 925852 INFO  (TEST-ChaosMonkeySafeLeaderTest.test-seed#[2B6CE069A5DB5A50]) [    ] o.e.j.s.ServerConnector Started ServerConnector@77922fbf{HTTP/1.1}{127.0.0.1:50811}
   [junit4]   2> 925853 INFO  (TEST-ChaosMonkeySafeLeaderTest.test-seed#[2B6CE069A5DB5A50]) [    ] o.e.j.s.Server Started @929180ms
   [junit4]   2> 925853 INFO  (TEST-ChaosMonkeySafeLeaderTest.test-seed#[2B6CE069A5DB5A50]) [    ] o.a.s.c.s.e.JettySolrRunner Jetty properties: {solr.data.dir=/x1/jenkins/jenkins-slave/workspace/Lucene-Solr-Tests-5.x-Java7/solr/build/solr-core/test/J1/temp/solr.cloud.ChaosMonkeySafeLeaderTest_2B6CE069A5DB5A50-001/tempDir-001/jetty1, solrconfig=solrconfig.xml, hostContext=/_t, hostPort=50811, coreRootDirectory=/x1/jenkins/jenkins-slave/workspace/Lucene-Solr-Tests-5.x-Java7/solr/build/solr-core/test/J1/temp/solr.cloud.ChaosMonkeySafeLeaderTest_2B6CE069A5DB5A50-001/shard-1-001/cores}
   [junit4]   2> 925853 INFO  (TEST-ChaosMonkeySafeLeaderTest.test-seed#[2B6CE069A5DB5A50]) [    ] o.a.s.s.SolrDispatchFilter SolrDispatchFilter.init(): sun.misc.Launcher$AppClassLoader@6b482747
   [junit4]   2> 925853 INFO  (TEST-ChaosMonkeySafeLeaderTest.test-seed#[2B6CE069A5DB5A50]) [    ] o.a.s.c.SolrResourceLoader new SolrResourceLoader for directory: '/x1/jenkins/jenkins-slave/workspace/Lucene-Solr-Tests-5.x-Java7/solr/build/solr-core/test/J1/temp/solr.cloud.ChaosMonkeySafeLeaderTest_2B6CE069A5DB5A50-001/shard-1-001/'
   [junit4]   2> 925868 INFO  (TEST-ChaosMonkeySafeLeaderTest.test-seed#[2B6CE069A5DB5A50]) [    ] o.a.s.c.c.SolrZkClient Using default ZkCredentialsProvider
   [junit4]   2> 925875 INFO  (TEST-ChaosMonkeySafeLeaderTest.test-seed#[2B6CE069A5DB5A50]) [    ] o.a.s.c.c.ConnectionManager Waiting for client to connect to ZooKeeper
   [junit4]   2> 925876 INFO  (zkCallback-849-thread-1) [    ] o.a.s.c.c.ConnectionManager Watcher org.apache.solr.common.cloud.ConnectionManager@423b40ef name:ZooKeeperConnection Watcher:127.0.0.1:37484/solr got event WatchedEvent state:SyncConnected type:None path:null path:null type:None
   [junit4]   2> 925876 INFO  (TEST-ChaosMonkeySafeLeaderTest.test-seed#[2B6CE069A5DB5A50]) [    ] o.a.s.c.c.ConnectionManager Client is connected to ZooKeeper
   [junit4]   2> 925876 INFO  (TEST-ChaosMonkeySafeLeaderTest.test-seed#[2B6CE069A5DB5A50]) [    ] o.a.s.c.c.SolrZkClient Using default ZkACLProvider
   [junit4]   2> 925877 INFO  (TEST-ChaosMonkeySafeLeaderTest.test-seed#[2B6CE069A5DB5A50]) [    ] o.a.s.s.SolrDispatchFilter Loading solr.xml from SolrHome (not found in ZooKeeper)
   [junit4]   2> 925877 INFO  (TEST-ChaosMonkeySafeLeaderTest.test-seed#[2B6CE069A5DB5A50]) [    ] o.a.s.c.SolrXmlConfig Loading container configuration from /x1/jenkins/jenkins-slave/workspace/Lucene-Solr-Tests-5.x-Java7/solr/build/solr-core/test/J1/temp/solr.cloud.ChaosMonkeySafeLeaderTest_2B6CE069A5DB5A50-001/shard-1-001/solr.xml
   [junit4]   2> 925891 INFO  (TEST-ChaosMonkeySafeLeaderTest.test-seed#[2B6CE069A5DB5A50]) [    ] o.a.s.c.CoresLocator Config-defined core root directory: /x1/jenkins/jenkins-slave/workspace/Lucene-Solr-Tests-5.x-Java7/solr/build/solr-core/test/J1/temp/solr.cloud.ChaosMonkeySafeLeaderTest_2B6CE069A5DB5A50-001/shard-1-001/cores
   [junit4]   2> 925891 INFO  (TEST-ChaosMonkeySafeLeaderTest.test-seed#[2B6CE069A5DB5A50]) [    ] o.a.s.c.CoreContainer New CoreContainer 353331573
   [junit4]   2> 925891 INFO  (TEST-ChaosMonkeySafeLeaderTest.test-seed#[2B6CE069A5DB5A50]) [    ] o.a.s.c.CoreContainer Loading cores into CoreContainer [instanceDir=/x1/jenkins/jenkins-slave/workspace/Lucene-Solr-Tests-5.x-Java7/solr/build/solr-core/test/J1/temp/solr.cloud.ChaosMonkeySafeLeaderTest_2B6CE069A5DB5A50-001/shard-1-001/]
   [junit4]   2> 925891 INFO  (TEST-ChaosMonkeySafeLeaderTest.test-seed#[2B6CE069A5DB5A50]) [    ] o.a.s.c.CoreContainer loading shared library: /x1/jenkins/jenkins-slave/workspace/Lucene-Solr-Tests-5.x-Java7/solr/build/solr-core/test/J1/temp/solr.cloud.ChaosMonkeySafeLeaderTest_2B6CE069A5DB5A50-001/shard-1-001/lib
   [junit4]   2> 925892 WARN  (TEST-ChaosMonkeySafeLeaderTest.test-seed#[2B6CE069A5DB5A50]) [    ] o.a.s.c.SolrResourceLoader Can't find (or read) directory to add to classloader: lib (resolved as: /x1/jenkins/jenkins-slave/workspace/Lucene-Solr-Tests-5.x-Java7/solr/build/solr-core/test/J1/temp/solr.cloud.ChaosMonkeySafeLeaderTest_2B6CE069A5DB5A50-001/shard-1-001/lib).
   [junit4]   2> 925899 INFO  (TEST-ChaosMonkeySafeLeaderTest.test-seed#[2B6CE069A5DB5A50]) [    ] o.a.s.h.c.HttpShardHandlerFactory created with socketTimeout : 90000,urlScheme : ,connTimeout : 15000,maxConnectionsPerHost : 20,maxConnections : 10000,corePoolSize : 0,maximumPoolSize : 2147483647,maxThreadIdleTime : 5,sizeOfQueue : -1,fairnessPolicy : false,useRetries : false,
   [junit4]   2> 925900 INFO  (TEST-ChaosMonkeySafeLeaderTest.test-seed#[2B6CE069A5DB5A50]) [    ] o.a.s.u.UpdateShardHandler Creating UpdateShardHandler HTTP client with params: socketTimeout=340000&connTimeout=45000&retry=true
   [junit4]   2> 925901 INFO  (TEST-ChaosMonkeySafeLeaderTest.test-seed#[2B6CE069A5DB5A50]) [    ] o.a.s.l.LogWatcher SLF4J impl is org.slf4j.impl.Log4jLoggerFactory
   [junit4]   2> 925901 INFO  (TEST-ChaosMonkeySafeLeaderTest.test-seed#[2B6CE069A5DB5A50]) [    ] o.a.s.l.LogWatcher Registering Log Listener [Log4j (org.slf4j.impl.Log4jLoggerFactory)]
   [junit4]   2> 925901 INFO  (TEST-ChaosMonkeySafeLeaderTest.test-seed#[2B6CE069A5DB5A50]) [    ] o.a.s.c.ZkContainer Zookeeper client=127.0.0.1:37484/solr
   [junit4]   2> 925901 INFO  (TEST-ChaosMonkeySafeLeaderTest.test-seed#[2B6CE069A5DB5A50]) [    ] o.a.s.c.ZkController zkHost includes chroot
   [junit4]   2> 925901 INFO  (TEST-ChaosMonkeySafeLeaderTest.test-seed#[2B6CE069A5DB5A50]) [    ] o.a.s.c.c.SolrZkClient Using default ZkCredentialsProvider
   [junit4]   2> 925902 INFO  (TEST-ChaosMonkeySafeLeaderTest.test-seed#[2B6CE069A5DB5A50]) [    ] o.a.s.c.c.ConnectionManager Waiting for client to connect to ZooKeeper
   [junit4]   2> 925904 INFO  (zkCallback-851-thread-1) [    ] o.a.s.c.c.ConnectionManager Watcher org.apache.solr.common.cloud.ConnectionManager@218c5830 name:ZooKeeperConnection Watcher:127.0.0.1:37484 got event WatchedEvent state:SyncConnected type:None path:null path:null type:None
   [junit4]   2> 925904 INFO  (TEST-ChaosMonkeySafeLeaderTest.test-seed#[2B6CE069A5DB5A50]) [    ] o.a.s.c.c.ConnectionManager Client is connected to ZooKeeper
   [junit4]   2> 925904 INFO  (TEST-ChaosMonkeySafeLeaderTest.test-seed#[2B6CE069A5DB5A50]) [    ] o.a.s.c.c.SolrZkClient Using default ZkACLProvider
   [junit4]   2> 925911 INFO  (TEST-ChaosMonkeySafeLeaderTest.test-seed#[2B6CE069A5DB5A50]) [n:127.0.0.1:50811__t    ] o.a.s.c.c.ConnectionManager Waiting for client to connect to ZooKeeper
   [junit4]   2> 925911 INFO  (zkCallback-852-thread-1-processing-n:127.0.0.1:50811__t) [n:127.0.0.1:50811__t    ] o.a.s.c.c.ConnectionManager Watcher org.apache.solr.common.cloud.ConnectionManager@3c44381c name:ZooKeeperConnection Watcher:127.0.0.1:37484/solr got event WatchedEvent state:SyncConnected type:None path:null path:null type:None
   [junit4]   2> 925912 INFO  (TEST-ChaosMonkeySafeLeaderTest.test-seed#[2B6CE069A5DB5A50]) [n:127.0.0.1:50811__t    ] o.a.s.c.c.ConnectionManager Client is connected to ZooKeeper
   [junit4]   2> 925916 INFO  (TEST-ChaosMonkeySafeLeaderTest.test-seed#[2B6CE069A5DB5A50]) [n:127.0.0.1:50811__t    ] o.a.s.c.c.ZkStateReader Updating cluster state from ZooKeeper... 
   [junit4]   2> 926920 INFO  (TEST-ChaosMonkeySafeLeaderTest.test-seed#[2B6CE069A5DB5A50]) [n:127.0.0.1:50811__t    ] o.a.s.c.ZkController Register node as live in ZooKeeper:/live_nodes/127.0.0.1:50811__t
   [junit4]   2> 926920 INFO  (TEST-ChaosMonkeySafeLeaderTest.test-seed#[2B6CE069A5DB5A50]) [n:127.0.0.1:50811__t    ] o.a.s.c.c.SolrZkClient makePath: /live_nodes/127.0.0.1:50811__t
   [junit4]   2> 926923 INFO  (TEST-ChaosMonkeySafeLeaderTest.test-seed#[2B6CE069A5DB5A50]) [n:127.0.0.1:50811__t    ] o.a.s.c.Overseer Overseer (id=null) closing
   [junit4]   2> 926924 INFO  (TEST-ChaosMonkeySafeLeaderTest.test-seed#[2B6CE069A5DB5A50]) [n:127.0.0.1:50811__t    ] o.a.s.c.LeaderElector Joined leadership election with path: /overseer_elect/election/94281385817276424-127.0.0.1:50811__t-n_0000000001
   [junit4]   2> 926925 INFO  (TEST-ChaosMonkeySafeLeaderTest.test-seed#[2B6CE069A5DB5A50]) [n:127.0.0.1:50811__t    ] o.a.s.c.LeaderElector Watching path /overseer_elect/election/94281385817276420-127.0.0.1:45511__t-n_0000000000 to know if I could be the leader
   [junit4]   2> 926925 INFO  (TEST-ChaosMonkeySafeLeaderTest.test-seed#[2B6CE069A5DB5A50]) [n:127.0.0.1:50811__t    ] o.a.s.c.CoreContainer No authentication plugin used.
   [junit4]   2> 926925 INFO  (TEST-ChaosMonkeySafeLeaderTest.test-seed#[2B6CE069A5DB5A50]) [n:127.0.0.1:50811__t    ] o.a.s.c.CoreContainer Security conf doesn't exist. Skipping setup for authorization module.
   [junit4]   2> 926926 INFO  (TEST-ChaosMonkeySafeLeaderTest.test-seed#[2B6CE069A5DB5A50]) [n:127.0.0.1:50811__t    ] o.a.s.c.CoresLocator Looking for core definitions underneath /x1/jenkins/jenkins-slave/workspace/Lucene-Solr-Tests-5.x-Java7/solr/build/solr-core/test/J1/temp/solr.cloud.ChaosMonkeySafeLeaderTest_2B6CE069A5DB5A50-001/shard-1-001/cores
   [junit4]   2> 926927 INFO  (TEST-ChaosMonkeySafeLeaderTest.test-seed#[2B6CE069A5DB5A50]) [n:127.0.0.1:50811__t    ] o.a.s.c.SolrCore Created CoreDescriptor: {schema=schema.xml, name=collection1, coreNodeName=, loadOnStartup=true, collection=collection1, dataDir=data/, config=solrconfig.xml, absoluteInstDir=/x1/jenkins/jenkins-slave/workspace/Lucene-Solr-Tests-5.x-Java7/solr/build/solr-core/test/J1/temp/solr.cloud.ChaosMonkeySafeLeaderTest_2B6CE069A5DB5A50-001/shard-1-001/cores/collection1/, configSetProperties=configsetprops.json, instanceDir=/x1/jenkins/jenkins-slave/workspace/Lucene-Solr-Tests-5.x-Java7/solr/build/solr-core/test/J1/temp/solr.cloud.ChaosMonkeySafeLeaderTest_2B6CE069A5DB5A50-001/shard-1-001/cores/collection1, transient=false, shard=}
   [junit4]   2> 926927 INFO  (TEST-ChaosMonkeySafeLeaderTest.test-seed#[2B6CE069A5DB5A50]) [n:127.0.0.1:50811__t    ] o.a.s.c.CoresLocator Found core collection1 in /x1/jenkins/jenkins-slave/workspace/Lucene-Solr-Tests-5.x-Java7/solr/build/solr-core/test/J1/temp/solr.cloud.ChaosMonkeySafeLeaderTest_2B6CE069A5DB5A50-001/shard-1-001/cores/collection1/
   [junit4]   2> 926927 INFO  (TEST-ChaosMonkeySafeLeaderTest.test-seed#[2B6CE069A5DB5A50]) [n:127.0.0.1:50811__t    ] o.a.s.c.CoresLocator Found 1 core definitions
   [junit4]   2> 926928 INFO  (coreLoadExecutor-3373-thread-1-processing-n:127.0.0.1:50811__t) [n:127.0.0.1:50811__t c:collection1   x:collection1] o.a.s.c.ZkController publishing state=down
   [junit4]   2> 926928 INFO  (coreLoadExecutor-3373-thread-1-processing-n:127.0.0.1:50811__t) [n:127.0.0.1:50811__t c:collection1   x:collection1] o.a.s.c.ZkController numShards not found on descriptor - reading it from system property
   [junit4]   2> 926929 INFO  (coreLoadExecutor-3373-thread-1-processing-n:127.0.0.1:50811__t) [n:127.0.0.1:50811__t c:collection1   x:collection1] o.a.s.c.ZkController look for our core node name
   [junit4]   2> 926931 INFO  (zkCallback-846-thread-1-processing-n:127.0.0.1:45511__t) [n:127.0.0.1:45511__t    ] o.a.s.c.DistributedQueue NodeChildrenChanged fired on path /overseer/queue state SyncConnected
   [junit4]   2> 926932 INFO  (OverseerStateUpdate-94281385817276420-127.0.0.1:45511__t-n_0000000000) [n:127.0.0.1:45511__t    ] o.a.s.c.Overseer processMessage: queueSize: 1, message = {
   [junit4]   2>   "collection":"collection1",
   [junit4]   2>   "base_url":"http://127.0.0.1:50811/_t",
   [junit4]   2>   "shard":null,
   [junit4]   2>   "node_name":"127.0.0.1:50811__t",
   [junit4]   2>   "numShards":"2",
   [junit4]   2>   "roles":null,
   [junit4]   2>   "state":"down",
   [junit4]   2>   "operation":"state",
   [junit4]   2>   "core":"collection1"} current state version: 3
   [junit4]   2> 926932 INFO  (OverseerStateUpdate-94281385817276420-127.0.0.1:45511__t-n_0000000000) [n:127.0.0.1:45511__t    ] o.a.s.c.o.ReplicaMutator Update state numShards=2 message={
   [junit4]   2>   "collection":"collection1",
   [junit4]   2>   "base_url":"http://127.0.0.1:50811/_t",
   [junit4]   2>   "shard":null,
   [junit4]   2>   "node_name":"127.0.0.1:50811__t",
   [junit4]   2>   "numShards":"2",
   [junit4]   2>   "roles":null,
   [junit4]   2>   "state":"down",
   [junit4]   2>   "operation":"state",
   [junit4]   2>   "core":"collection1"}
   [junit4]   2> 926932 INFO  (OverseerStateUpdate-94281385817276420-127.0.0.1:45511__t-n_0000000000) [n:127.0.0.1:45511__t    ] o.a.s.c.o.ClusterStateMutator building a new cName: collection1
   [junit4]   2> 926932 INFO  (OverseerStateUpdate-94281385817276420-127.0.0.1:45511__t-n_0000000000) [n:127.0.0.1:45511__t    ] o.a.s.c.o.ReplicaMutator Assigning new node to shard shard=shard2
   [junit4]   2> 926935 INFO  (TEST-ChaosMonkeySafeLeaderTest.test-seed#[2B6CE069A5DB5A50]) [n:127.0.0.1:50811__t    ] o.a.s.s.SolrDispatchFilter user.dir=/x1/jenkins/jenkins-slave/workspace/Lucene-Solr-Tests-5.x-Java7/solr/build/solr-core/test/J1
   [junit4]   2> 926935 INFO  (TEST-ChaosMonkeySafeLeaderTest.test-seed#[2B6CE069A5DB5A50]) [n:127.0.0.1:50811__t    ] o.a.s.s.SolrDispatchFilter SolrDispatchFilter.init() done
   [junit4]   2> 927037 INFO  (zkCallback-852-thread-1-processing-n:127.0.0.1:50811__t) [n:127.0.0.1:50811__t    ] o.a.s.c.c.ZkStateReader A cluster state change: WatchedEvent state:SyncConnected type:NodeDataChanged path:/clusterstate.json, has occurred - updating... (live nodes size: 2)
   [junit4]   2> 927037 INFO  (zkCallback-848-thread-1) [    ] o.a.s.c.c.ZkStateReader A cluster state change: WatchedEvent state:SyncConnected type:NodeDataChanged path:/clusterstate.json, has occurred - updating... (live nodes size: 2)
   [junit4]   2> 927038 INFO  (zkCallback-846-thread-1-processing-n:127.0.0.1:45511__t) [n:127.0.0.1:45511__t    ] o.a.s.c.c.ZkStateReader A cluster state change: WatchedEvent state:SyncConnected type:NodeDataChanged path:/clusterstate.json, has occurred - updating... (live nodes size: 2)
   [junit4]   2> 927039 INFO  (zkCallback-852-thread-1-processing-n:127.0.0.1:50811__t) [n:127.0.0.1:50811__t    ] o.a.s.c.c.ZkStateReader Updated cluster state version to 4
   [junit4]   2> 927039 INFO  (zkCallback-848-thread-1) [    ] o.a.s.c.c.ZkStateReader Updated cluster state version to 4
   [junit4]   2> 927040 INFO  (zkCallback-846-thread-1-processing-n:127.0.0.1:45511__t) [n:127.0.0.1:45511__t    ] o.a.s.c.c.ZkStateReader Updated cluster state version to 4
   [junit4]   2> 927929 INFO  (coreLoadExecutor-3373-thread-1-processing-n:127.0.0.1:50811__t) [n:127.0.0.1:50811__t c:collection1   x:collection1] o.a.s.c.ZkController waiting to find shard id in clusterstate for collection1
   [junit4]   2> 927930 INFO  (coreLoadExecutor-3373-thread-1-processing-n:127.0.0.1:50811__t) [n:127.0.0.1:50811__t c:collection1   x:collection1] o.a.s.c.ZkController Check for collection zkNode:collection1
   [junit4]   2> 927931 INFO  (coreLoadExecutor-3373-thread-1-processing-n:127.0.0.1:50811__t) [n:127.0.0.1:50811__t c:collection1   x:collection1] o.a.s.c.ZkController Collection zkNode exists
   [junit4]   2> 927931 INFO  (coreLoadExecutor-3373-thread-1-processing-n:127.0.0.1:50811__t) [n:127.0.0.1:50811__t c:collection1   x:collection1] o.a.s.c.c.ZkStateReader Load collection config from:/collections/collection1
   [junit4]   2> 927931 INFO  (coreLoadExecutor-3373-thread-1-processing-n:127.0.0.1:50811__t) [n:127.0.0.1:50811__t c:collection1   x:collection1] o.a.s.c.c.ZkStateReader path=/collections/collection1 configName=conf1 specified config exists in ZooKeeper
   [junit4]   2> 927932 INFO  (coreLoadExecutor-3373-thread-1-processing-n:127.0.0.1:50811__t) [n:127.0.0.1:50811__t c:collection1   x:collection1] o.a.s.c.SolrResourceLoader new SolrResourceLoader for directory: '/x1/jenkins/jenkins-slave/workspace/Lucene-Solr-Tests-5.x-Java7/solr/build/solr-core/test/J1/temp/solr.cloud.ChaosMonkeySafeLeaderTest_2B6CE069A5DB5A50-001/shard-1-001/cores/collection1/'
   [junit4]   2> 927945 INFO  (coreLoadExecutor-3373-thread-1-processing-n:127.0.0.1:50811__t) [n:127.0.0.1:50811__t c:collection1   x:collection1] o.a.s.c.Config loaded config solrconfig.xml with version 0 
   [junit4]   2> 927951 INFO  (coreLoadExecutor-3373-thread-1-processing-n:127.0.0.1:50811__t) [n:127.0.0.1:50811__t c:collection1   x:collection1] o.a.s.c.SolrConfig current version of requestparams : -1
   [junit4]   2> 927964 INFO  (coreLoadExecutor-3373-thread-1-processing-n:127.0.0.1:50811__t) [n:127.0.0.1:50811__t c:collection1   x:collection1] o.a.s.c.SolrConfig Using Lucene MatchVersion: 5.3.0
   [junit4]   2> 928014 INFO  (coreLoadExecutor-3373-thread-1-processing-n:127.0.0.1:50811__t) [n:127.0.0.1:50811__t c:collection1   x:collection1] o.a.s.c.Config Loaded SolrConfig: solrconfig.xml
   [junit4]   2> 928015 INFO  (coreLoadExecutor-3373-thread-1-processing-n:127.0.0.1:50811__t) [n:127.0.0.1:50811__t c:collection1   x:collection1] o.a.s.s.IndexSchema Reading Solr Schema from /configs/conf1/schema.xml
   [junit4]   2> 928021 INFO  (coreLoadExecutor-3373-thread-1-processing-n:127.0.0.1:50811__t) [n:127.0.0.1:50811__t c:collection1   x:collection1] o.a.s.s.IndexSchema [collection1] Schema name=test
   [junit4]   2> 928233 INFO  (coreLoadExecutor-3373-thread-1-processing-n:127.0.0.1:50811__t) [n:127.0.0.1:50811__t c:collection1   x:collection1] o.a.s.s.IndexSchema default search field in schema is text
   [junit4]   2> 928235 INFO  (coreLoadExecutor-3373-thread-1-processing-n:127.0.0.1:50811__t) [n:127.0.0.1:50811__t c:collection1   x:collection1] o.a.s.s.IndexSchema unique key field: id
   [junit4]   2> 928236 INFO  (coreLoadExecutor-3373-thread-1-processing-n:127.0.0.1:50811__t) [n:127.0.0.1:50811__t c:collection1   x:collection1] o.a.s.s.FileExchangeRateProvider Reloading exchange rates from file currency.xml
   [junit4]   2> 928239 INFO  (coreLoadExecutor-3373-thread-1-processing-n:127.0.0.1:50811__t) [n:127.0.0.1:50811__t c:collection1   x:collection1] o.a.s.s.FileExchangeRateProvider Reloading exchange rates from file currency.xml
   [junit4]   2> 928255 INFO  (coreLoadExecutor-3373-thread-1-processing-n:127.0.0.1:50811__t) [n:127.0.0.1:50811__t c:collection1   x:collection1] o.a.s.c.ConfigSetProperties Did not find ConfigSet properties, assuming default properties: Can't find resource 'configsetprops.json' in classpath or '/configs/conf1', cwd=/x1/jenkins/jenkins-slave/workspace/Lucene-Solr-Tests-5.x-Java7/solr/build/solr-core/test/J1
   [junit4]   2> 928255 INFO  (coreLoadExecutor-3373-thread-1-processing-n:127.0.0.1:50811__t) [n:127.0.0.1:50811__t c:collection1   x:collection1] o.a.s.c.CoreContainer Creating SolrCore 'collection1' using configuration from collection collection1
   [junit4]   2> 928255 INFO  (coreLoadExecutor-3373-thread-1-processing-n:127.0.0.1:50811__t) [n:127.0.0.1:50811__t c:collection1 s:shard2 r:core_node1 x:collection1] o.a.s.c.SolrCore solr.StandardDirectoryFactory
   [junit4]   2> 928256 INFO  (coreLoadExecutor-3373-thread-1-processing-n:127.0.0.1:50811__t) [n:127.0.0.1:50811__t c:collection1 s:shard2 r:core_node1 x:collection1] o.a.s.c.SolrCore [[collection1] ] Opening new SolrCore at [/x1/jenkins/jenkins-slave/workspace/Lucene-Solr-Tests-5.x-Java7/solr/build/solr-core/test/J1/temp/solr.cloud.ChaosMonkeySafeLeaderTest_2B6CE069A5DB5A50-001/shard-1-001/cores/collection1/], dataDir=[null]
   [junit4]   2> 928256 INFO  (coreLoadExecutor-3373-thread-1-processing-n:127.0.0.1:50811__t) [n:127.0.0.1:50811__t c:collection1 s:shard2 r:core_node1 x:collection1] o.a.s.c.JmxMonitoredMap JMX monitoring is enabled. Adding Solr mbeans to JMX Server: com.sun.jmx.mbeanserver.JmxMBeanServer@95f0cd3
   [junit4]   2> 928256 INFO  (coreLoadExecutor-3373-thread-1-processing-n:127.0.0.1:50811__t) [n:127.0.0.1:50811__t c:collection1 s:shard2 r:core_node1 x:collection1] o.a.s.c.CachingDirectoryFactory return new directory for /x1/jenkins/jenkins-slave/workspace/Lucene-Solr-Tests-5.x-Java7/solr/build/solr-core/test/J1/temp/solr.cloud.ChaosMonkeySafeLeaderTest_2B6CE069A5DB5A50-001/shard-1-001/cores/collection1/data
   [junit4]   2> 928257 INFO  (coreLoadExecutor-3373-thread-1-processing-n:127.0.0.1:50811__t) [n:127.0.0.1:50811__t c:collection1 s:shard2 r:core_node1 x:collection1] o.a.s.c.SolrCore New index directory detected: old=null new=/x1/jenkins/jenkins-slave/workspace/Lucene-Solr-Tests-5.x-Java7/solr/build/solr-core/test/J1/temp/solr.cloud.ChaosMonkeySafeLeaderTest_2B6CE069A5DB5A50-001/shard-1-001/cores/collection1/data/index/
   [junit4]   2> 928257 WARN  (coreLoadExecutor-3373-thread-1-processing-n:127.0.0.1:50811__t) [n:127.0.0.1:50811__t c:collection1 s:shard2 r:core_node1 x:collection1] o.a.s.c.SolrCore [collection1] Solr index directory '/x1/jenkins/jenkins-slave/workspace/Lucene-Solr-Tests-5.x-Java7/solr/build/solr-core/test/J1/temp/solr.cloud.ChaosMonkeySafeLeaderTest_2B6CE069A5DB5A50-001/shard-1-001/cores/collection1/data/index' doesn't exist. Creating new index...
   [junit4]   2> 928257 INFO  (coreLoadExecutor-3373-thread-1-processing-n:127.0.0.1:50811__t) [n:127.0.0.1:50811__t c:collection1 s:shard2 r:core_node1 x:collection1] o.a.s.c.CachingDirectoryFactory return new directory for /x1/jenkins/jenkins-slave/workspace/Lucene-Solr-Tests-5.x-Java7/solr/build/solr-core/test/J1/temp/solr.cloud.ChaosMonkeySafeLeaderTest_2B6CE069A5DB5A50-001/shard-1-001/cores/collection1/data/index
   [junit4]   2> 928258 INFO  (coreLoadExecutor-3373-thread-1-processing-n:127.0.0.1:50811__t) [n:127.0.0.1:50811__t c:collection1 s:shard2 r:core_node1 x:collection1] o.a.s.u.RandomMergePolicy RandomMergePolicy wrapping class org.apache.lucene.index.TieredMergePolicy: [TieredMergePolicy: maxMergeAtOnce=34, maxMergeAtOnceExplicit=25, maxMergedSegmentMB=88.5712890625, floorSegmentMB=0.6328125, forceMergeDeletesPctAllowed=16.230325949476573, segmentsPerTier=39.0, maxCFSSegmentSizeMB=8.796093022207999E12, noCFSRatio=0.8300246519299211
   [junit4]   2> 928262 INFO  (coreLoadExecutor-3373-thread-1-processing-n:127.0.0.1:50811__t) [n:127.0.0.1:50811__t c:collection1 s:shard2 r:core_node1 x:collection1] o.a.s.c.SolrCore SolrDeletionPolicy.onCommit: commits: num=1
   [junit4]   2> 	commit{dir=/x1/jenkins/jenkins-slave/workspace/Lucene-Solr-Tests-5.x-Java7/solr/build/solr-core/test/J1/temp/solr.cloud.ChaosMonkeySafeLeaderTest_2B6CE069A5DB5A50-001/shard-1-001/cores/collection1/data/index,segFN=segments_1,generation=1}
   [junit4]   2> 928262 INFO  (coreLoadExecutor-3373-thread-1-processing-n:127.0.0.1:50811__t) [n:127.0.0.1:50811__t c:collection1 s:shard2 r:core_node1 x:collection1] o.a.s.c.SolrCore newest commit generation = 1
   [junit4]   2> 928263 INFO  (OldIndexDirectoryCleanupThreadForCore-collection1) [n:127.0.0.1:50811__t c:collection1 s:shard2 r:core_node1 x:collection1] o.a.s.c.SolrCore Looking for old index directories to cleanup for core collection1 in /x1/jenkins/jenkins-slave/workspace/Lucene-Solr-Tests-5.x-Java7/solr/build/solr-core/test/J1/temp/solr.cloud.ChaosMonkeySafeLeaderTest_2B6CE069A5DB5A50-001/shard-1-001/cores/collection1/data/
   [junit4]   2> 928268 INFO  (coreLoadExecutor-3373-thread-1-processing-n:127.0.0.1:50811__t) [n:127.0.0.1:50811__t c:collection1 s:shard2 r:core_node1 x:collection1] o.a.s.u.p.UpdateRequestProcessorChain creating updateRequestProcessorChain "nodistrib"
   [junit4]   2> 928268 INFO  (coreLoadExecutor-3373-thread-1-processing-n:127.0.0.1:50811__t) [n:127.0.0.1:50811__t c:collection1 s:shard2 r:core_node1 x:collection1] o.a.s.u.p.UpdateRequestProcessorChain creating updateRequestProcessorChain "dedupe"
   [junit4]   2> 928268 INFO  (coreLoadExecutor-3373-thread-1-processing-n:127.0.0.1:50811__t) [n:127.0.0.1:50811__t c:collection1 s:shard2 r:core_node1 x:collection1] o.a.s.u.p.UpdateRequestProcessorChain inserting DistributedUpdateProcessorFactory into updateRequestProcessorChain "dedupe"
   [junit4]   2> 928268 INFO  (coreLoadExecutor-3373-thread-1-processing-n:127.0.0.1:50811__t) [n:127.0.0.1:50811__t c:collection1 s:shard2 r:core_node1 x:collection1] o.a.s.u.p.UpdateRequestProcessorChain creating updateRequestProcessorChain "stored_sig"
   [junit4]   2> 928268 INFO  (coreLoadExecutor-3373-thread-1-processing-n:127.0.0.1:50811__t) [n:127.0.0.1:50811__t c:collection1 s:shard2 r:core_node1 x:collection1] o.a.s.u.p.UpdateRequestProcessorChain inserting DistributedUpdateProcessorFactory into updateRequestProcessorChain "stored_sig"
   [junit4]   2> 928268 INFO  (coreLoadExecutor-3373-thread-1-processing-n:127.0.0.1:50811__t) [n:127.0.0.1:50811__t c:collection1 s:shard2 r:core_node1 x:collection1] o.a.s.u.p.UpdateRequestProcessorChain creating updateRequestProcessorChain "distrib-dup-test-chain-explicit"
   [junit4]   2> 928269 INFO  (coreLoadExecutor-3373-thread-1-processing-n:127.0.0.1:50811__t) [n:127.0.0.1:50811__t c:collection1 s:shard2 r:core_node1 x:collection1] o.a.s.u.p.UpdateRequestProcessorChain creating updateRequestProcessorChain "distrib-dup-test-chain-implicit"
   [junit4]   2> 928269 INFO  (coreLoadExecutor-3373-thread-1-processing-n:127.0.0.1:50811__t) [n:127.0.0.1:50811__t c:collection1 s:shard2 r:core_node1 x:collection1] o.a.s.u.p.UpdateRequestProcessorChain inserting DistributedUpdateProcessorFactory into updateRequestProcessorChain "distrib-dup-test-chain-implicit"
   [junit4]   2> 928269 INFO  (coreLoadExecutor-3373-thread-1-processing-n:127.0.0.1:50811__t) [n:127.0.0.1:50811__t c:collection1 s:shard2 r:core_node1 x:collection1] o.a.s.c.SolrCore no updateRequestProcessorChain defined as default, creating implicit default
   [junit4]   2> 928272 INFO  (coreLoadExecutor-3373-thread-1-processing-n:127.0.0.1:50811__t) [n:127.0.0.1:50811__t c:collection1 s:shard2 r:core_node1 x:collection1] o.a.s.h.l.XMLLoader xsltCacheLifetimeSeconds=60
   [junit4]   2> 928273 INFO  (coreLoadExecutor-3373-thread-1-processing-n:127.0.0.1:50811__t) [n:127.0.0.1:50811__t c:collection1 s:shard2 r:core_node1 x:collection1] o.a.s.h.l.XMLLoader xsltCacheLifetimeSeconds=60
   [junit4]   2> 928275 INFO  (coreLoadExecutor-3373-thread-1-processing-n:127.0.0.1:50811__t) [n:127.0.0.1:50811__t c:collection1 s:shard2 r:core_node1 x:collection1] o.a.s.h.l.XMLLoader xsltCacheLifetimeSeconds=60
   [junit4]   2> 928276 INFO  (coreLoadExecutor-3373-thread-1-processing-n:127.0.0.1:50811__t) [n:127.0.0.1:50811__t c:collection1 s:shard2 r:core_node1 x:collection1] o.a.s.h.l.XMLLoader xsltCacheLifetimeSeconds=60
   [junit4]   2> 928281 INFO  (coreLoadExecutor-3373-thread-1-processing-n:127.0.0.1:50811__t) [n:127.0.0.1:50811__t c:collection1 s:shard2 r:core_node1 x:collection1] o.a.s.c.RequestHandlers Registered paths: /admin/ping,/admin/segments,/replication,/admin/file,standard,/admin/plugins,/config,/admin/luke,/schema,/admin/mbeans,/update/csv,/update,/admin/system,/admin/threads,/update/json,/admin/logging,/update/json/docs,/get,/admin/properties
   [junit4]   2> 928283 INFO  (coreLoadExecutor-3373-thread-1-processing-n:127.0.0.1:50811__t) [n:127.0.0.1:

[...truncated too long message...]

.LeaderElector 
   [junit4]   2> java.lang.RuntimeException: org.apache.zookeeper.KeeperException$SessionExpiredException: KeeperErrorCode = Session expired for /overseer
   [junit4]   2> 	at org.apache.solr.cloud.Overseer.createOverseerNode(Overseer.java:938)
   [junit4]   2> 	at org.apache.solr.cloud.Overseer.getInQueue(Overseer.java:889)
   [junit4]   2> 	at org.apache.solr.cloud.Overseer.getInQueue(Overseer.java:885)
   [junit4]   2> 	at org.apache.solr.cloud.ShardLeaderElectionContext.runLeaderProcess(ElectionContext.java:221)
   [junit4]   2> 	at org.apache.solr.cloud.LeaderElector.runIamLeaderProcess(LeaderElector.java:199)
   [junit4]   2> 	at org.apache.solr.cloud.LeaderElector.checkIfIamLeader(LeaderElector.java:159)
   [junit4]   2> 	at org.apache.solr.cloud.LeaderElector.joinElection(LeaderElector.java:348)
   [junit4]   2> 	at org.apache.solr.cloud.LeaderElector.joinElection(LeaderElector.java:257)
   [junit4]   2> 	at org.apache.solr.cloud.ShardLeaderElectionContext.rejoinLeaderElection(ElectionContext.java:481)
   [junit4]   2> 	at org.apache.solr.cloud.ShardLeaderElectionContext.runLeaderProcess(ElectionContext.java:238)
   [junit4]   2> 	at org.apache.solr.cloud.LeaderElector.runIamLeaderProcess(LeaderElector.java:199)
   [junit4]   2> 	at org.apache.solr.cloud.LeaderElector.checkIfIamLeader(LeaderElector.java:159)
   [junit4]   2> 	at org.apache.solr.cloud.LeaderElector.access$200(LeaderElector.java:56)
   [junit4]   2> 	at org.apache.solr.cloud.LeaderElector$ElectionWatcher.process(LeaderElector.java:390)
   [junit4]   2> 	at org.apache.solr.common.cloud.SolrZkClient$3$1.run(SolrZkClient.java:264)
   [junit4]   2> 	at java.util.concurrent.Executors$RunnableAdapter.call(Executors.java:471)
   [junit4]   2> 	at java.util.concurrent.FutureTask.run(FutureTask.java:262)
   [junit4]   2> 	at org.apache.solr.common.util.ExecutorUtil$MDCAwareThreadPoolExecutor$1.run(ExecutorUtil.java:209)
   [junit4]   2> 	at java.util.concurrent.ThreadPoolExecutor.runWorker(ThreadPoolExecutor.java:1145)
   [junit4]   2> 	at java.util.concurrent.ThreadPoolExecutor$Worker.run(ThreadPoolExecutor.java:615)
   [junit4]   2> 	at java.lang.Thread.run(Thread.java:745)
   [junit4]   2> Caused by: org.apache.zookeeper.KeeperException$SessionExpiredException: KeeperErrorCode = Session expired for /overseer
   [junit4]   2> 	at org.apache.zookeeper.KeeperException.create(KeeperException.java:127)
   [junit4]   2> 	at org.apache.zookeeper.KeeperException.create(KeeperException.java:51)
   [junit4]   2> 	at org.apache.zookeeper.ZooKeeper.create(ZooKeeper.java:783)
   [junit4]   2> 	at org.apache.solr.common.cloud.SolrZkClient$9.execute(SolrZkClient.java:380)
   [junit4]   2> 	at org.apache.solr.common.cloud.SolrZkClient$9.execute(SolrZkClient.java:377)
   [junit4]   2> 	at org.apache.solr.common.cloud.ZkCmdExecutor.retryOperation(ZkCmdExecutor.java:61)
   [junit4]   2> 	at org.apache.solr.common.cloud.SolrZkClient.create(SolrZkClient.java:377)
   [junit4]   2> 	at org.apache.solr.cloud.Overseer.createOverseerNode(Overseer.java:929)
   [junit4]   2> 	... 20 more
   [junit4]   2> 944639 INFO  (TEST-ChaosMonkeySafeLeaderTest.test-seed#[2B6CE069A5DB5A50]) [    ] o.e.j.s.ServerConnector Stopped ServerConnector@84a0de8{HTTP/1.1}{127.0.0.1:0}
   [junit4]   2> 944639 INFO  (TEST-ChaosMonkeySafeLeaderTest.test-seed#[2B6CE069A5DB5A50]) [    ] o.e.j.s.h.ContextHandler Stopped o.e.j.s.ServletContextHandler@714b93ac{/_t,null,UNAVAILABLE}
   [junit4]   2> 944641 INFO  (TEST-ChaosMonkeySafeLeaderTest.test-seed#[2B6CE069A5DB5A50]) [n:127.0.0.1:58586__t c:collection1 s:shard2 r:core_node3 x:collection1] o.a.s.c.ZkTestServer connecting to 127.0.0.1:37484 37484
   [junit4]   2> 944830 INFO  (Thread-3104) [    ] o.a.s.c.ZkTestServer connecting to 127.0.0.1:37484 37484
   [junit4]   2> 944832 WARN  (Thread-3104) [    ] o.a.s.c.ZkTestServer Watch limit violations: 
   [junit4]   2> Maximum concurrent create/delete watches above limit:
   [junit4]   2> 
   [junit4]   2> 	5	/solr/clusterstate.json
   [junit4]   2> 	5	/solr/aliases.json
   [junit4]   2> 	4	/solr/configs/conf1
   [junit4]   2> 
   [junit4]   2> Maximum concurrent children watches above limit:
   [junit4]   2> 
   [junit4]   2> 	5	/solr/live_nodes
   [junit4]   2> 	4	/solr/overseer/queue
   [junit4]   2> 	4	/solr/overseer/collection-queue-work
   [junit4]   2> 
   [junit4]   2> NOTE: reproduce with: ant test  -Dtestcase=ChaosMonkeySafeLeaderTest -Dtests.method=test -Dtests.seed=2B6CE069A5DB5A50 -Dtests.multiplier=2 -Dtests.slow=true -Dtests.locale=iw_IL -Dtests.timezone=Asia/Tel_Aviv -Dtests.asserts=true -Dtests.file.encoding=ISO-8859-1
   [junit4] FAILURE 21.3s J1 | ChaosMonkeySafeLeaderTest.test <<<
   [junit4]    > Throwable #1: java.lang.AssertionError: expected:<0> but was:<1>
   [junit4]    > 	at __randomizedtesting.SeedInfo.seed([2B6CE069A5DB5A50:A338DFB30B2737A8]:0)
   [junit4]    > 	at org.apache.solr.cloud.ChaosMonkeySafeLeaderTest.test(ChaosMonkeySafeLeaderTest.java:156)
   [junit4]    > 	at org.apache.solr.BaseDistributedSearchTestCase$ShardsRepeatRule$ShardsFixedStatement.callStatement(BaseDistributedSearchTestCase.java:966)
   [junit4]    > 	at org.apache.solr.BaseDistributedSearchTestCase$ShardsRepeatRule$ShardsStatement.evaluate(BaseDistributedSearchTestCase.java:941)
   [junit4]    > 	at java.lang.Thread.run(Thread.java:745)
   [junit4]   2> 944840 INFO  (SUITE-ChaosMonkeySafeLeaderTest-seed#[2B6CE069A5DB5A50]-worker) [n:127.0.0.1:58586__t c:collection1 s:shard2 r:core_node3 x:collection1] o.a.s.SolrTestCaseJ4 ###deleteCore
   [junit4]   2> NOTE: leaving temporary files on disk at: /x1/jenkins/jenkins-slave/workspace/Lucene-Solr-Tests-5.x-Java7/solr/build/solr-core/test/J1/temp/solr.cloud.ChaosMonkeySafeLeaderTest_2B6CE069A5DB5A50-001
   [junit4]   2> NOTE: test params are: codec=Asserting(Lucene53): {a_t=PostingsFormat(name=LuceneVarGapDocFreqInterval), id=PostingsFormat(name=Direct), _version_=PostingsFormat(name=LuceneVarGapDocFreqInterval), rnd_b=PostingsFormat(name=Direct), a_i=PostingsFormat(name=Direct)}, docValues:{}, sim=DefaultSimilarity, locale=iw_IL, timezone=Asia/Tel_Aviv
   [junit4]   2> NOTE: Linux 3.13.0-52-generic amd64/Oracle Corporation 1.7.0_72 (64-bit)/cpus=4,threads=1,free=256948752,total=504889344
   [junit4]   2> NOTE: All tests run in this JVM: [TestSimpleTrackingShardHandler, FieldAnalysisRequestHandlerTest, TestTrieFacet, TestConfigSetProperties, SystemInfoHandlerTest, LukeRequestHandlerTest, TestDynamicLoading, TestLMJelinekMercerSimilarityFactory, ZkSolrClientTest, AnalysisAfterCoreReloadTest, AnalysisErrorHandlingTest, TestLFUCache, TestReplicationHandlerBackup, TestHighFrequencyDictionaryFactory, RAMDirectoryFactoryTest, RecoveryAfterSoftCommitTest, TestOrdValues, TestRebalanceLeaders, ConvertedLegacyTest, CollectionsAPIDistributedZkTest, DirectSolrConnectionTest, OverseerStatusTest, TestComplexPhraseQParserPlugin, TestRestoreCore, TestSolrCoreProperties, ScriptEngineTest, ClusterStateUpdateTest, TestSchemaManager, TestJettySolrRunner, NoCacheHeaderTest, TestRTGBase, TestRestManager, FileUtilsTest, TestManagedSchemaDynamicFieldResource, TestAnalyzeInfixSuggestions, TestClusterStateMutator, DistanceUnitsTest, OpenCloseCoreStressTest, BasicFunctionalityTest, TestDynamicFieldCollectionResource, TestDistributedGrouping, ZkCLITest, TestFuzzyAnalyzedSuggestions, CacheHeaderTest, TestShortCircuitedRequests, DocumentAnalysisRequestHandlerTest, PreAnalyzedFieldTest, TestElisionMultitermQuery, TestSolrDynamicMBean, FacetPivotSmallTest, DistributedTermsComponentTest, TestCoreContainer, QueryResultKeyTest, BadComponentTest, BufferStoreTest, TestTrackingShardHandlerFactory, TestInitQParser, SpellPossibilityIteratorTest, TestConfigOverlay, ZkControllerTest, CoreAdminCreateDiscoverTest, TestManagedSchemaFieldTypeResource, TestSearchPerf, TestFastWriter, SpellingQueryConverterTest, TestSerializedLuceneMatchVersion, SolrPluginUtilsTest, TestFastLRUCache, TestFoldingMultitermQuery, DistributedQueryComponentOptimizationTest, DistributedSuggestComponentTest, DistributedMLTComponentTest, WordBreakSolrSpellCheckerTest, ResponseHeaderTest, SpatialHeatmapFacetsTest, CustomCollectionTest, HdfsWriteToMultipleCollectionsTest, SolrCmdDistributorTest, TestValueSourceCache, RollingRestartTest, StatelessScriptUpdateProcessorFactoryTest, TestCharFilters, TestFiltering, TestNoOpRegenerator, TestBulkSchemaConcurrent, BasicDistributedZkTest, ChaosMonkeySafeLeaderTest]
   [junit4] Completed [239/522] on J1 in 21.34s, 1 test, 1 failure <<< FAILURES!

[...truncated 882 lines...]
BUILD FAILED
/x1/jenkins/jenkins-slave/workspace/Lucene-Solr-Tests-5.x-Java7/build.xml:726: The following error occurred while executing this line:
/x1/jenkins/jenkins-slave/workspace/Lucene-Solr-Tests-5.x-Java7/build.xml:670: The following error occurred while executing this line:
/x1/jenkins/jenkins-slave/workspace/Lucene-Solr-Tests-5.x-Java7/build.xml:59: The following error occurred while executing this line:
/x1/jenkins/jenkins-slave/workspace/Lucene-Solr-Tests-5.x-Java7/solr/build.xml:230: The following error occurred while executing this line:
/x1/jenkins/jenkins-slave/workspace/Lucene-Solr-Tests-5.x-Java7/solr/common-build.xml:524: The following error occurred while executing this line:
/x1/jenkins/jenkins-slave/workspace/Lucene-Solr-Tests-5.x-Java7/lucene/common-build.xml:1449: The following error occurred while executing this line:
/x1/jenkins/jenkins-slave/workspace/Lucene-Solr-Tests-5.x-Java7/lucene/common-build.xml:1003: There were test failures: 522 suites, 2076 tests, 1 failure, 41 ignored (30 assumptions)

Total time: 56 minutes 27 seconds
Build step 'Invoke Ant' marked build as failure
Archiving artifacts
Sending artifact delta relative to Lucene-Solr-Tests-5.x-Java7 #3389
Archived 4 artifacts
Archive block size is 32768
Received 0 blocks and 337464123 bytes
Compression is 0.0%
Took 1 min 10 sec
Recording test results
Email was triggered for: Failure
Sending email for trigger: Failure



Mime
View raw message