lucene-dev mailing list archives

Site index · List index
Message view « Date » · « Thread »
Top « Date » · « Thread »
From Policeman Jenkins Server <jenk...@thetaphi.de>
Subject [JENKINS-EA] Lucene-Solr-5.3-Linux (32bit/jdk1.8.0_60-ea-b24) - Build # 3 - Failure!
Date Thu, 06 Aug 2015 02:03:21 GMT
Build: http://jenkins.thetaphi.de/job/Lucene-Solr-5.3-Linux/3/
Java: 32bit/jdk1.8.0_60-ea-b24 -server -XX:+UseParallelGC

1 tests failed.
FAILED:  org.apache.solr.cloud.CloudExitableDirectoryReaderTest.test

Error Message:
No live SolrServers available to handle this request:[http://127.0.0.1:56094/collection1]

Stack Trace:
org.apache.solr.client.solrj.SolrServerException: No live SolrServers available to handle this request:[http://127.0.0.1:56094/collection1]
	at __randomizedtesting.SeedInfo.seed([8C03942E2B1BC7F9:457ABF485E7AA01]:0)
	at org.apache.solr.client.solrj.impl.LBHttpSolrClient.request(LBHttpSolrClient.java:355)
	at org.apache.solr.client.solrj.impl.CloudSolrClient.sendRequest(CloudSolrClient.java:1086)
	at org.apache.solr.client.solrj.impl.CloudSolrClient.requestWithRetryOnStaleState(CloudSolrClient.java:856)
	at org.apache.solr.client.solrj.impl.CloudSolrClient.request(CloudSolrClient.java:799)
	at org.apache.solr.client.solrj.SolrRequest.process(SolrRequest.java:135)
	at org.apache.solr.client.solrj.SolrClient.query(SolrClient.java:943)
	at org.apache.solr.client.solrj.SolrClient.query(SolrClient.java:958)
	at org.apache.solr.cloud.AbstractFullDistribZkTestBase.queryServer(AbstractFullDistribZkTestBase.java:1376)
	at org.apache.solr.cloud.CloudExitableDirectoryReaderTest.assertPartialResults(CloudExitableDirectoryReaderTest.java:102)
	at org.apache.solr.cloud.CloudExitableDirectoryReaderTest.doTimeoutTests(CloudExitableDirectoryReaderTest.java:86)
	at org.apache.solr.cloud.CloudExitableDirectoryReaderTest.test(CloudExitableDirectoryReaderTest.java:53)
	at sun.reflect.NativeMethodAccessorImpl.invoke0(Native Method)
	at sun.reflect.NativeMethodAccessorImpl.invoke(NativeMethodAccessorImpl.java:62)
	at sun.reflect.DelegatingMethodAccessorImpl.invoke(DelegatingMethodAccessorImpl.java:43)
	at java.lang.reflect.Method.invoke(Method.java:497)
	at com.carrotsearch.randomizedtesting.RandomizedRunner.invoke(RandomizedRunner.java:1627)
	at com.carrotsearch.randomizedtesting.RandomizedRunner$6.evaluate(RandomizedRunner.java:836)
	at com.carrotsearch.randomizedtesting.RandomizedRunner$7.evaluate(RandomizedRunner.java:872)
	at com.carrotsearch.randomizedtesting.RandomizedRunner$8.evaluate(RandomizedRunner.java:886)
	at org.apache.solr.BaseDistributedSearchTestCase$ShardsRepeatRule$ShardsFixedStatement.callStatement(BaseDistributedSearchTestCase.java:963)
	at org.apache.solr.BaseDistributedSearchTestCase$ShardsRepeatRule$ShardsStatement.evaluate(BaseDistributedSearchTestCase.java:938)
	at com.carrotsearch.randomizedtesting.rules.SystemPropertiesRestoreRule$1.evaluate(SystemPropertiesRestoreRule.java:57)
	at org.apache.lucene.util.TestRuleSetupTeardownChained$1.evaluate(TestRuleSetupTeardownChained.java:50)
	at org.apache.lucene.util.AbstractBeforeAfterRule$1.evaluate(AbstractBeforeAfterRule.java:46)
	at org.apache.lucene.util.TestRuleThreadAndTestName$1.evaluate(TestRuleThreadAndTestName.java:49)
	at org.apache.lucene.util.TestRuleIgnoreAfterMaxFailures$1.evaluate(TestRuleIgnoreAfterMaxFailures.java:65)
	at org.apache.lucene.util.TestRuleMarkFailure$1.evaluate(TestRuleMarkFailure.java:48)
	at com.carrotsearch.randomizedtesting.rules.StatementAdapter.evaluate(StatementAdapter.java:36)
	at com.carrotsearch.randomizedtesting.ThreadLeakControl$StatementRunner.run(ThreadLeakControl.java:365)
	at com.carrotsearch.randomizedtesting.ThreadLeakControl.forkTimeoutingTask(ThreadLeakControl.java:798)
	at com.carrotsearch.randomizedtesting.ThreadLeakControl$3.evaluate(ThreadLeakControl.java:458)
	at com.carrotsearch.randomizedtesting.RandomizedRunner.runSingleTest(RandomizedRunner.java:845)
	at com.carrotsearch.randomizedtesting.RandomizedRunner$3.evaluate(RandomizedRunner.java:747)
	at com.carrotsearch.randomizedtesting.RandomizedRunner$4.evaluate(RandomizedRunner.java:781)
	at com.carrotsearch.randomizedtesting.RandomizedRunner$5.evaluate(RandomizedRunner.java:792)
	at com.carrotsearch.randomizedtesting.rules.StatementAdapter.evaluate(StatementAdapter.java:36)
	at com.carrotsearch.randomizedtesting.rules.SystemPropertiesRestoreRule$1.evaluate(SystemPropertiesRestoreRule.java:57)
	at org.apache.lucene.util.AbstractBeforeAfterRule$1.evaluate(AbstractBeforeAfterRule.java:46)
	at com.carrotsearch.randomizedtesting.rules.StatementAdapter.evaluate(StatementAdapter.java:36)
	at org.apache.lucene.util.TestRuleStoreClassName$1.evaluate(TestRuleStoreClassName.java:42)
	at com.carrotsearch.randomizedtesting.rules.NoShadowingOrOverridesOnMethodsRule$1.evaluate(NoShadowingOrOverridesOnMethodsRule.java:39)
	at com.carrotsearch.randomizedtesting.rules.NoShadowingOrOverridesOnMethodsRule$1.evaluate(NoShadowingOrOverridesOnMethodsRule.java:39)
	at com.carrotsearch.randomizedtesting.rules.StatementAdapter.evaluate(StatementAdapter.java:36)
	at com.carrotsearch.randomizedtesting.rules.StatementAdapter.evaluate(StatementAdapter.java:36)
	at com.carrotsearch.randomizedtesting.rules.StatementAdapter.evaluate(StatementAdapter.java:36)
	at org.apache.lucene.util.TestRuleAssertionsRequired$1.evaluate(TestRuleAssertionsRequired.java:54)
	at org.apache.lucene.util.TestRuleMarkFailure$1.evaluate(TestRuleMarkFailure.java:48)
	at org.apache.lucene.util.TestRuleIgnoreAfterMaxFailures$1.evaluate(TestRuleIgnoreAfterMaxFailures.java:65)
	at org.apache.lucene.util.TestRuleIgnoreTestSuites$1.evaluate(TestRuleIgnoreTestSuites.java:55)
	at com.carrotsearch.randomizedtesting.rules.StatementAdapter.evaluate(StatementAdapter.java:36)
	at com.carrotsearch.randomizedtesting.ThreadLeakControl$StatementRunner.run(ThreadLeakControl.java:365)
	at java.lang.Thread.run(Thread.java:745)
Caused by: org.apache.solr.client.solrj.impl.HttpSolrClient$RemoteSolrException: Error from server at http://127.0.0.1:56094/collection1: org.apache.solr.client.solrj.SolrServerException: No live SolrServers available to handle this request
	at org.apache.solr.client.solrj.impl.HttpSolrClient.executeMethod(HttpSolrClient.java:560)
	at org.apache.solr.client.solrj.impl.HttpSolrClient.request(HttpSolrClient.java:234)
	at org.apache.solr.client.solrj.impl.HttpSolrClient.request(HttpSolrClient.java:226)
	at org.apache.solr.client.solrj.impl.LBHttpSolrClient.doRequest(LBHttpSolrClient.java:376)
	at org.apache.solr.client.solrj.impl.LBHttpSolrClient.request(LBHttpSolrClient.java:328)
	... 51 more




Build Log:
[...truncated 10615 lines...]
   [junit4] Suite: org.apache.solr.cloud.CloudExitableDirectoryReaderTest
   [junit4]   2> Creating dataDir: /home/jenkins/workspace/Lucene-Solr-5.3-Linux/solr/build/solr-core/test/J1/temp/solr.cloud.CloudExitableDirectoryReaderTest_8C03942E2B1BC7F9-001/init-core-data-001
   [junit4]   2> 458343 INFO  (SUITE-CloudExitableDirectoryReaderTest-seed#[8C03942E2B1BC7F9]-worker) [    ] o.a.s.SolrTestCaseJ4 Randomized ssl (false) and clientAuth (false)
   [junit4]   2> 458343 INFO  (SUITE-CloudExitableDirectoryReaderTest-seed#[8C03942E2B1BC7F9]-worker) [    ] o.a.s.BaseDistributedSearchTestCase Setting hostContext system property: /
   [junit4]   2> 458345 INFO  (TEST-CloudExitableDirectoryReaderTest.test-seed#[8C03942E2B1BC7F9]) [    ] o.a.s.c.ZkTestServer STARTING ZK TEST SERVER
   [junit4]   2> 458345 INFO  (Thread-871) [    ] o.a.s.c.ZkTestServer client port:0.0.0.0/0.0.0.0:0
   [junit4]   2> 458345 INFO  (Thread-871) [    ] o.a.s.c.ZkTestServer Starting server
   [junit4]   2> 458446 INFO  (TEST-CloudExitableDirectoryReaderTest.test-seed#[8C03942E2B1BC7F9]) [    ] o.a.s.c.ZkTestServer start zk server on port:48772
   [junit4]   2> 458446 INFO  (TEST-CloudExitableDirectoryReaderTest.test-seed#[8C03942E2B1BC7F9]) [    ] o.a.s.c.c.SolrZkClient Using default ZkCredentialsProvider
   [junit4]   2> 458446 INFO  (TEST-CloudExitableDirectoryReaderTest.test-seed#[8C03942E2B1BC7F9]) [    ] o.a.s.c.c.ConnectionManager Waiting for client to connect to ZooKeeper
   [junit4]   2> 458447 INFO  (zkCallback-252-thread-1) [    ] o.a.s.c.c.ConnectionManager Watcher org.apache.solr.common.cloud.ConnectionManager@15053b2 name:ZooKeeperConnection Watcher:127.0.0.1:48772 got event WatchedEvent state:SyncConnected type:None path:null path:null type:None
   [junit4]   2> 458448 INFO  (TEST-CloudExitableDirectoryReaderTest.test-seed#[8C03942E2B1BC7F9]) [    ] o.a.s.c.c.ConnectionManager Client is connected to ZooKeeper
   [junit4]   2> 458448 INFO  (TEST-CloudExitableDirectoryReaderTest.test-seed#[8C03942E2B1BC7F9]) [    ] o.a.s.c.c.SolrZkClient Using default ZkACLProvider
   [junit4]   2> 458448 INFO  (TEST-CloudExitableDirectoryReaderTest.test-seed#[8C03942E2B1BC7F9]) [    ] o.a.s.c.c.SolrZkClient makePath: /solr
   [junit4]   2> 458449 INFO  (TEST-CloudExitableDirectoryReaderTest.test-seed#[8C03942E2B1BC7F9]) [    ] o.a.s.c.c.SolrZkClient Using default ZkCredentialsProvider
   [junit4]   2> 458449 INFO  (TEST-CloudExitableDirectoryReaderTest.test-seed#[8C03942E2B1BC7F9]) [    ] o.a.s.c.c.ConnectionManager Waiting for client to connect to ZooKeeper
   [junit4]   2> 458450 INFO  (zkCallback-253-thread-1) [    ] o.a.s.c.c.ConnectionManager Watcher org.apache.solr.common.cloud.ConnectionManager@18ed469 name:ZooKeeperConnection Watcher:127.0.0.1:48772/solr got event WatchedEvent state:SyncConnected type:None path:null path:null type:None
   [junit4]   2> 458450 INFO  (TEST-CloudExitableDirectoryReaderTest.test-seed#[8C03942E2B1BC7F9]) [    ] o.a.s.c.c.ConnectionManager Client is connected to ZooKeeper
   [junit4]   2> 458450 INFO  (TEST-CloudExitableDirectoryReaderTest.test-seed#[8C03942E2B1BC7F9]) [    ] o.a.s.c.c.SolrZkClient Using default ZkACLProvider
   [junit4]   2> 458450 INFO  (TEST-CloudExitableDirectoryReaderTest.test-seed#[8C03942E2B1BC7F9]) [    ] o.a.s.c.c.SolrZkClient makePath: /collections/collection1
   [junit4]   2> 458451 INFO  (TEST-CloudExitableDirectoryReaderTest.test-seed#[8C03942E2B1BC7F9]) [    ] o.a.s.c.c.SolrZkClient makePath: /collections/collection1/shards
   [junit4]   2> 458451 INFO  (TEST-CloudExitableDirectoryReaderTest.test-seed#[8C03942E2B1BC7F9]) [    ] o.a.s.c.c.SolrZkClient makePath: /collections/control_collection
   [junit4]   2> 458452 INFO  (TEST-CloudExitableDirectoryReaderTest.test-seed#[8C03942E2B1BC7F9]) [    ] o.a.s.c.c.SolrZkClient makePath: /collections/control_collection/shards
   [junit4]   2> 458452 INFO  (TEST-CloudExitableDirectoryReaderTest.test-seed#[8C03942E2B1BC7F9]) [    ] o.a.s.c.AbstractZkTestCase put /home/jenkins/workspace/Lucene-Solr-5.3-Linux/solr/core/src/test-files/solr/collection1/conf/solrconfig-tlog-with-delayingcomponent.xml to /configs/conf1/solrconfig.xml
   [junit4]   2> 458452 INFO  (TEST-CloudExitableDirectoryReaderTest.test-seed#[8C03942E2B1BC7F9]) [    ] o.a.s.c.c.SolrZkClient makePath: /configs/conf1/solrconfig.xml
   [junit4]   2> 458453 INFO  (TEST-CloudExitableDirectoryReaderTest.test-seed#[8C03942E2B1BC7F9]) [    ] o.a.s.c.AbstractZkTestCase put /home/jenkins/workspace/Lucene-Solr-5.3-Linux/solr/core/src/test-files/solr/collection1/conf/schema.xml to /configs/conf1/schema.xml
   [junit4]   2> 458454 INFO  (TEST-CloudExitableDirectoryReaderTest.test-seed#[8C03942E2B1BC7F9]) [    ] o.a.s.c.c.SolrZkClient makePath: /configs/conf1/schema.xml
   [junit4]   2> 458454 INFO  (TEST-CloudExitableDirectoryReaderTest.test-seed#[8C03942E2B1BC7F9]) [    ] o.a.s.c.AbstractZkTestCase put /home/jenkins/workspace/Lucene-Solr-5.3-Linux/solr/core/src/test-files/solr/collection1/conf/solrconfig.snippet.randomindexconfig.xml to /configs/conf1/solrconfig.snippet.randomindexconfig.xml
   [junit4]   2> 458455 INFO  (TEST-CloudExitableDirectoryReaderTest.test-seed#[8C03942E2B1BC7F9]) [    ] o.a.s.c.c.SolrZkClient makePath: /configs/conf1/solrconfig.snippet.randomindexconfig.xml
   [junit4]   2> 458455 INFO  (TEST-CloudExitableDirectoryReaderTest.test-seed#[8C03942E2B1BC7F9]) [    ] o.a.s.c.AbstractZkTestCase put /home/jenkins/workspace/Lucene-Solr-5.3-Linux/solr/core/src/test-files/solr/collection1/conf/stopwords.txt to /configs/conf1/stopwords.txt
   [junit4]   2> 458455 INFO  (TEST-CloudExitableDirectoryReaderTest.test-seed#[8C03942E2B1BC7F9]) [    ] o.a.s.c.c.SolrZkClient makePath: /configs/conf1/stopwords.txt
   [junit4]   2> 458456 INFO  (TEST-CloudExitableDirectoryReaderTest.test-seed#[8C03942E2B1BC7F9]) [    ] o.a.s.c.AbstractZkTestCase put /home/jenkins/workspace/Lucene-Solr-5.3-Linux/solr/core/src/test-files/solr/collection1/conf/protwords.txt to /configs/conf1/protwords.txt
   [junit4]   2> 458456 INFO  (TEST-CloudExitableDirectoryReaderTest.test-seed#[8C03942E2B1BC7F9]) [    ] o.a.s.c.c.SolrZkClient makePath: /configs/conf1/protwords.txt
   [junit4]   2> 458457 INFO  (TEST-CloudExitableDirectoryReaderTest.test-seed#[8C03942E2B1BC7F9]) [    ] o.a.s.c.AbstractZkTestCase put /home/jenkins/workspace/Lucene-Solr-5.3-Linux/solr/core/src/test-files/solr/collection1/conf/currency.xml to /configs/conf1/currency.xml
   [junit4]   2> 458457 INFO  (TEST-CloudExitableDirectoryReaderTest.test-seed#[8C03942E2B1BC7F9]) [    ] o.a.s.c.c.SolrZkClient makePath: /configs/conf1/currency.xml
   [junit4]   2> 458457 INFO  (TEST-CloudExitableDirectoryReaderTest.test-seed#[8C03942E2B1BC7F9]) [    ] o.a.s.c.AbstractZkTestCase put /home/jenkins/workspace/Lucene-Solr-5.3-Linux/solr/core/src/test-files/solr/collection1/conf/enumsConfig.xml to /configs/conf1/enumsConfig.xml
   [junit4]   2> 458457 INFO  (TEST-CloudExitableDirectoryReaderTest.test-seed#[8C03942E2B1BC7F9]) [    ] o.a.s.c.c.SolrZkClient makePath: /configs/conf1/enumsConfig.xml
   [junit4]   2> 458458 INFO  (TEST-CloudExitableDirectoryReaderTest.test-seed#[8C03942E2B1BC7F9]) [    ] o.a.s.c.AbstractZkTestCase put /home/jenkins/workspace/Lucene-Solr-5.3-Linux/solr/core/src/test-files/solr/collection1/conf/open-exchange-rates.json to /configs/conf1/open-exchange-rates.json
   [junit4]   2> 458458 INFO  (TEST-CloudExitableDirectoryReaderTest.test-seed#[8C03942E2B1BC7F9]) [    ] o.a.s.c.c.SolrZkClient makePath: /configs/conf1/open-exchange-rates.json
   [junit4]   2> 458459 INFO  (TEST-CloudExitableDirectoryReaderTest.test-seed#[8C03942E2B1BC7F9]) [    ] o.a.s.c.AbstractZkTestCase put /home/jenkins/workspace/Lucene-Solr-5.3-Linux/solr/core/src/test-files/solr/collection1/conf/mapping-ISOLatin1Accent.txt to /configs/conf1/mapping-ISOLatin1Accent.txt
   [junit4]   2> 458467 INFO  (TEST-CloudExitableDirectoryReaderTest.test-seed#[8C03942E2B1BC7F9]) [    ] o.a.s.c.c.SolrZkClient makePath: /configs/conf1/mapping-ISOLatin1Accent.txt
   [junit4]   2> 458467 INFO  (TEST-CloudExitableDirectoryReaderTest.test-seed#[8C03942E2B1BC7F9]) [    ] o.a.s.c.AbstractZkTestCase put /home/jenkins/workspace/Lucene-Solr-5.3-Linux/solr/core/src/test-files/solr/collection1/conf/old_synonyms.txt to /configs/conf1/old_synonyms.txt
   [junit4]   2> 458467 INFO  (TEST-CloudExitableDirectoryReaderTest.test-seed#[8C03942E2B1BC7F9]) [    ] o.a.s.c.c.SolrZkClient makePath: /configs/conf1/old_synonyms.txt
   [junit4]   2> 458468 INFO  (TEST-CloudExitableDirectoryReaderTest.test-seed#[8C03942E2B1BC7F9]) [    ] o.a.s.c.AbstractZkTestCase put /home/jenkins/workspace/Lucene-Solr-5.3-Linux/solr/core/src/test-files/solr/collection1/conf/synonyms.txt to /configs/conf1/synonyms.txt
   [junit4]   2> 458468 INFO  (TEST-CloudExitableDirectoryReaderTest.test-seed#[8C03942E2B1BC7F9]) [    ] o.a.s.c.c.SolrZkClient makePath: /configs/conf1/synonyms.txt
   [junit4]   2> 458564 INFO  (TEST-CloudExitableDirectoryReaderTest.test-seed#[8C03942E2B1BC7F9]) [    ] o.a.s.SolrTestCaseJ4 Writing core.properties file to /home/jenkins/workspace/Lucene-Solr-5.3-Linux/solr/build/solr-core/test/J1/temp/solr.cloud.CloudExitableDirectoryReaderTest_8C03942E2B1BC7F9-001/control-001/cores/collection1
   [junit4]   2> 458565 INFO  (TEST-CloudExitableDirectoryReaderTest.test-seed#[8C03942E2B1BC7F9]) [    ] o.e.j.s.Server jetty-9.2.11.v20150529
   [junit4]   2> 458566 INFO  (TEST-CloudExitableDirectoryReaderTest.test-seed#[8C03942E2B1BC7F9]) [    ] o.e.j.s.h.ContextHandler Started o.e.j.s.ServletContextHandler@cabe32{/,null,AVAILABLE}
   [junit4]   2> 458567 INFO  (TEST-CloudExitableDirectoryReaderTest.test-seed#[8C03942E2B1BC7F9]) [    ] o.e.j.s.ServerConnector Started ServerConnector@843c4c{HTTP/1.1}{127.0.0.1:53975}
   [junit4]   2> 458567 INFO  (TEST-CloudExitableDirectoryReaderTest.test-seed#[8C03942E2B1BC7F9]) [    ] o.e.j.s.Server Started @460410ms
   [junit4]   2> 458567 INFO  (TEST-CloudExitableDirectoryReaderTest.test-seed#[8C03942E2B1BC7F9]) [    ] o.a.s.c.s.e.JettySolrRunner Jetty properties: {solr.data.dir=/home/jenkins/workspace/Lucene-Solr-5.3-Linux/solr/build/solr-core/test/J1/temp/solr.cloud.CloudExitableDirectoryReaderTest_8C03942E2B1BC7F9-001/tempDir-001/control/data, hostContext=/, hostPort=53975, coreRootDirectory=/home/jenkins/workspace/Lucene-Solr-5.3-Linux/solr/build/solr-core/test/J1/temp/solr.cloud.CloudExitableDirectoryReaderTest_8C03942E2B1BC7F9-001/control-001/cores}
   [junit4]   2> 458568 INFO  (TEST-CloudExitableDirectoryReaderTest.test-seed#[8C03942E2B1BC7F9]) [    ] o.a.s.s.SolrDispatchFilter SolrDispatchFilter.init(): sun.misc.Launcher$AppClassLoader@e2f2a
   [junit4]   2> 458568 INFO  (TEST-CloudExitableDirectoryReaderTest.test-seed#[8C03942E2B1BC7F9]) [    ] o.a.s.c.SolrResourceLoader new SolrResourceLoader for directory: '/home/jenkins/workspace/Lucene-Solr-5.3-Linux/solr/build/solr-core/test/J1/temp/solr.cloud.CloudExitableDirectoryReaderTest_8C03942E2B1BC7F9-001/control-001/'
   [junit4]   2> 458578 INFO  (TEST-CloudExitableDirectoryReaderTest.test-seed#[8C03942E2B1BC7F9]) [    ] o.a.s.c.c.SolrZkClient Using default ZkCredentialsProvider
   [junit4]   2> 458578 INFO  (TEST-CloudExitableDirectoryReaderTest.test-seed#[8C03942E2B1BC7F9]) [    ] o.a.s.c.c.ConnectionManager Waiting for client to connect to ZooKeeper
   [junit4]   2> 458583 INFO  (zkCallback-254-thread-1) [    ] o.a.s.c.c.ConnectionManager Watcher org.apache.solr.common.cloud.ConnectionManager@1a95cb3 name:ZooKeeperConnection Watcher:127.0.0.1:48772/solr got event WatchedEvent state:SyncConnected type:None path:null path:null type:None
   [junit4]   2> 458584 INFO  (TEST-CloudExitableDirectoryReaderTest.test-seed#[8C03942E2B1BC7F9]) [    ] o.a.s.c.c.ConnectionManager Client is connected to ZooKeeper
   [junit4]   2> 458584 INFO  (TEST-CloudExitableDirectoryReaderTest.test-seed#[8C03942E2B1BC7F9]) [    ] o.a.s.c.c.SolrZkClient Using default ZkACLProvider
   [junit4]   2> 458584 INFO  (TEST-CloudExitableDirectoryReaderTest.test-seed#[8C03942E2B1BC7F9]) [    ] o.a.s.s.SolrDispatchFilter Loading solr.xml from SolrHome (not found in ZooKeeper)
   [junit4]   2> 458584 INFO  (TEST-CloudExitableDirectoryReaderTest.test-seed#[8C03942E2B1BC7F9]) [    ] o.a.s.c.SolrXmlConfig Loading container configuration from /home/jenkins/workspace/Lucene-Solr-5.3-Linux/solr/build/solr-core/test/J1/temp/solr.cloud.CloudExitableDirectoryReaderTest_8C03942E2B1BC7F9-001/control-001/solr.xml
   [junit4]   2> 458588 INFO  (TEST-CloudExitableDirectoryReaderTest.test-seed#[8C03942E2B1BC7F9]) [    ] o.a.s.c.CoresLocator Config-defined core root directory: /home/jenkins/workspace/Lucene-Solr-5.3-Linux/solr/build/solr-core/test/J1/temp/solr.cloud.CloudExitableDirectoryReaderTest_8C03942E2B1BC7F9-001/control-001/cores
   [junit4]   2> 458588 INFO  (TEST-CloudExitableDirectoryReaderTest.test-seed#[8C03942E2B1BC7F9]) [    ] o.a.s.c.CoreContainer New CoreContainer 19928000
   [junit4]   2> 458588 INFO  (TEST-CloudExitableDirectoryReaderTest.test-seed#[8C03942E2B1BC7F9]) [    ] o.a.s.c.CoreContainer Loading cores into CoreContainer [instanceDir=/home/jenkins/workspace/Lucene-Solr-5.3-Linux/solr/build/solr-core/test/J1/temp/solr.cloud.CloudExitableDirectoryReaderTest_8C03942E2B1BC7F9-001/control-001/]
   [junit4]   2> 458588 INFO  (TEST-CloudExitableDirectoryReaderTest.test-seed#[8C03942E2B1BC7F9]) [    ] o.a.s.c.CoreContainer loading shared library: /home/jenkins/workspace/Lucene-Solr-5.3-Linux/solr/build/solr-core/test/J1/temp/solr.cloud.CloudExitableDirectoryReaderTest_8C03942E2B1BC7F9-001/control-001/lib
   [junit4]   2> 458588 WARN  (TEST-CloudExitableDirectoryReaderTest.test-seed#[8C03942E2B1BC7F9]) [    ] o.a.s.c.SolrResourceLoader Can't find (or read) directory to add to classloader: lib (resolved as: /home/jenkins/workspace/Lucene-Solr-5.3-Linux/solr/build/solr-core/test/J1/temp/solr.cloud.CloudExitableDirectoryReaderTest_8C03942E2B1BC7F9-001/control-001/lib).
   [junit4]   2> 458593 INFO  (TEST-CloudExitableDirectoryReaderTest.test-seed#[8C03942E2B1BC7F9]) [    ] o.a.s.h.c.HttpShardHandlerFactory created with socketTimeout : 90000,urlScheme : ,connTimeout : 15000,maxConnectionsPerHost : 20,maxConnections : 10000,corePoolSize : 0,maximumPoolSize : 2147483647,maxThreadIdleTime : 5,sizeOfQueue : -1,fairnessPolicy : false,useRetries : false,
   [junit4]   2> 458594 INFO  (TEST-CloudExitableDirectoryReaderTest.test-seed#[8C03942E2B1BC7F9]) [    ] o.a.s.u.UpdateShardHandler Creating UpdateShardHandler HTTP client with params: socketTimeout=340000&connTimeout=45000&retry=true
   [junit4]   2> 458594 INFO  (TEST-CloudExitableDirectoryReaderTest.test-seed#[8C03942E2B1BC7F9]) [    ] o.a.s.l.LogWatcher SLF4J impl is org.slf4j.impl.Log4jLoggerFactory
   [junit4]   2> 458594 INFO  (TEST-CloudExitableDirectoryReaderTest.test-seed#[8C03942E2B1BC7F9]) [    ] o.a.s.l.LogWatcher Registering Log Listener [Log4j (org.slf4j.impl.Log4jLoggerFactory)]
   [junit4]   2> 458594 INFO  (TEST-CloudExitableDirectoryReaderTest.test-seed#[8C03942E2B1BC7F9]) [    ] o.a.s.c.ZkContainer Zookeeper client=127.0.0.1:48772/solr
   [junit4]   2> 458594 INFO  (TEST-CloudExitableDirectoryReaderTest.test-seed#[8C03942E2B1BC7F9]) [    ] o.a.s.c.ZkController zkHost includes chroot
   [junit4]   2> 458594 INFO  (TEST-CloudExitableDirectoryReaderTest.test-seed#[8C03942E2B1BC7F9]) [    ] o.a.s.c.c.SolrZkClient Using default ZkCredentialsProvider
   [junit4]   2> 458595 INFO  (TEST-CloudExitableDirectoryReaderTest.test-seed#[8C03942E2B1BC7F9]) [    ] o.a.s.c.c.ConnectionManager Waiting for client to connect to ZooKeeper
   [junit4]   2> 458605 INFO  (zkCallback-256-thread-1) [    ] o.a.s.c.c.ConnectionManager Watcher org.apache.solr.common.cloud.ConnectionManager@103cce7 name:ZooKeeperConnection Watcher:127.0.0.1:48772 got event WatchedEvent state:SyncConnected type:None path:null path:null type:None
   [junit4]   2> 458605 INFO  (TEST-CloudExitableDirectoryReaderTest.test-seed#[8C03942E2B1BC7F9]) [    ] o.a.s.c.c.ConnectionManager Client is connected to ZooKeeper
   [junit4]   2> 458606 INFO  (TEST-CloudExitableDirectoryReaderTest.test-seed#[8C03942E2B1BC7F9]) [    ] o.a.s.c.c.SolrZkClient Using default ZkACLProvider
   [junit4]   2> 458606 INFO  (TEST-CloudExitableDirectoryReaderTest.test-seed#[8C03942E2B1BC7F9]) [n:127.0.0.1:53975_    ] o.a.s.c.c.ConnectionManager Waiting for client to connect to ZooKeeper
   [junit4]   2> 458607 INFO  (zkCallback-257-thread-1-processing-n:127.0.0.1:53975_) [n:127.0.0.1:53975_    ] o.a.s.c.c.ConnectionManager Watcher org.apache.solr.common.cloud.ConnectionManager@1309138 name:ZooKeeperConnection Watcher:127.0.0.1:48772/solr got event WatchedEvent state:SyncConnected type:None path:null path:null type:None
   [junit4]   2> 458607 INFO  (TEST-CloudExitableDirectoryReaderTest.test-seed#[8C03942E2B1BC7F9]) [n:127.0.0.1:53975_    ] o.a.s.c.c.ConnectionManager Client is connected to ZooKeeper
   [junit4]   2> 458608 INFO  (TEST-CloudExitableDirectoryReaderTest.test-seed#[8C03942E2B1BC7F9]) [n:127.0.0.1:53975_    ] o.a.s.c.c.SolrZkClient makePath: /overseer/queue
   [junit4]   2> 458608 INFO  (TEST-CloudExitableDirectoryReaderTest.test-seed#[8C03942E2B1BC7F9]) [n:127.0.0.1:53975_    ] o.a.s.c.c.SolrZkClient makePath: /overseer/collection-queue-work
   [junit4]   2> 458609 INFO  (TEST-CloudExitableDirectoryReaderTest.test-seed#[8C03942E2B1BC7F9]) [n:127.0.0.1:53975_    ] o.a.s.c.c.SolrZkClient makePath: /overseer/collection-map-running
   [junit4]   2> 458610 INFO  (TEST-CloudExitableDirectoryReaderTest.test-seed#[8C03942E2B1BC7F9]) [n:127.0.0.1:53975_    ] o.a.s.c.c.SolrZkClient makePath: /overseer/collection-map-completed
   [junit4]   2> 458610 INFO  (TEST-CloudExitableDirectoryReaderTest.test-seed#[8C03942E2B1BC7F9]) [n:127.0.0.1:53975_    ] o.a.s.c.c.SolrZkClient makePath: /overseer/collection-map-failure
   [junit4]   2> 458611 INFO  (TEST-CloudExitableDirectoryReaderTest.test-seed#[8C03942E2B1BC7F9]) [n:127.0.0.1:53975_    ] o.a.s.c.c.SolrZkClient makePath: /live_nodes
   [junit4]   2> 458611 INFO  (TEST-CloudExitableDirectoryReaderTest.test-seed#[8C03942E2B1BC7F9]) [n:127.0.0.1:53975_    ] o.a.s.c.c.SolrZkClient makePath: /aliases.json
   [junit4]   2> 458612 INFO  (TEST-CloudExitableDirectoryReaderTest.test-seed#[8C03942E2B1BC7F9]) [n:127.0.0.1:53975_    ] o.a.s.c.c.SolrZkClient makePath: /clusterstate.json
   [junit4]   2> 458612 INFO  (TEST-CloudExitableDirectoryReaderTest.test-seed#[8C03942E2B1BC7F9]) [n:127.0.0.1:53975_    ] o.a.s.c.ZkController Register node as live in ZooKeeper:/live_nodes/127.0.0.1:53975_
   [junit4]   2> 458612 INFO  (TEST-CloudExitableDirectoryReaderTest.test-seed#[8C03942E2B1BC7F9]) [n:127.0.0.1:53975_    ] o.a.s.c.c.SolrZkClient makePath: /live_nodes/127.0.0.1:53975_
   [junit4]   2> 458613 INFO  (TEST-CloudExitableDirectoryReaderTest.test-seed#[8C03942E2B1BC7F9]) [n:127.0.0.1:53975_    ] o.a.s.c.c.SolrZkClient makePath: /overseer_elect
   [junit4]   2> 458613 INFO  (TEST-CloudExitableDirectoryReaderTest.test-seed#[8C03942E2B1BC7F9]) [n:127.0.0.1:53975_    ] o.a.s.c.c.SolrZkClient makePath: /overseer_elect/election
   [junit4]   2> 458614 INFO  (TEST-CloudExitableDirectoryReaderTest.test-seed#[8C03942E2B1BC7F9]) [n:127.0.0.1:53975_    ] o.a.s.c.Overseer Overseer (id=null) closing
   [junit4]   2> 458614 INFO  (TEST-CloudExitableDirectoryReaderTest.test-seed#[8C03942E2B1BC7F9]) [n:127.0.0.1:53975_    ] o.a.s.c.LeaderElector Joined leadership election with path: /overseer_elect/election/94294866791170052-127.0.0.1:53975_-n_0000000000
   [junit4]   2> 458614 INFO  (TEST-CloudExitableDirectoryReaderTest.test-seed#[8C03942E2B1BC7F9]) [n:127.0.0.1:53975_    ] o.a.s.c.OverseerElectionContext I am going to be the leader 127.0.0.1:53975_
   [junit4]   2> 458614 INFO  (TEST-CloudExitableDirectoryReaderTest.test-seed#[8C03942E2B1BC7F9]) [n:127.0.0.1:53975_    ] o.a.s.c.c.SolrZkClient makePath: /overseer_elect/leader
   [junit4]   2> 458615 INFO  (TEST-CloudExitableDirectoryReaderTest.test-seed#[8C03942E2B1BC7F9]) [n:127.0.0.1:53975_    ] o.a.s.c.Overseer Overseer (id=94294866791170052-127.0.0.1:53975_-n_0000000000) starting
   [junit4]   2> 458616 INFO  (TEST-CloudExitableDirectoryReaderTest.test-seed#[8C03942E2B1BC7F9]) [n:127.0.0.1:53975_    ] o.a.s.c.c.SolrZkClient makePath: /overseer/queue-work
   [junit4]   2> 458617 INFO  (TEST-CloudExitableDirectoryReaderTest.test-seed#[8C03942E2B1BC7F9]) [n:127.0.0.1:53975_    ] o.a.s.c.OverseerAutoReplicaFailoverThread Starting OverseerAutoReplicaFailoverThread autoReplicaFailoverWorkLoopDelay=10000 autoReplicaFailoverWaitAfterExpiration=30000 autoReplicaFailoverBadNodeExpiration=60000
   [junit4]   2> 458618 INFO  (OverseerCollectionProcessor-94294866791170052-127.0.0.1:53975_-n_0000000000) [n:127.0.0.1:53975_    ] o.a.s.c.OverseerCollectionProcessor Process current queue of collection creations
   [junit4]   2> 458618 INFO  (TEST-CloudExitableDirectoryReaderTest.test-seed#[8C03942E2B1BC7F9]) [n:127.0.0.1:53975_    ] o.a.s.c.c.ZkStateReader Updating cluster state from ZooKeeper... 
   [junit4]   2> 458618 INFO  (OverseerStateUpdate-94294866791170052-127.0.0.1:53975_-n_0000000000) [n:127.0.0.1:53975_    ] o.a.s.c.Overseer Starting to work on the main queue
   [junit4]   2> 458632 INFO  (TEST-CloudExitableDirectoryReaderTest.test-seed#[8C03942E2B1BC7F9]) [n:127.0.0.1:53975_    ] o.a.s.c.CoreContainer No authentication plugin used.
   [junit4]   2> 458632 INFO  (TEST-CloudExitableDirectoryReaderTest.test-seed#[8C03942E2B1BC7F9]) [n:127.0.0.1:53975_    ] o.a.s.c.CoreContainer Security conf doesn't exist. Skipping setup for authorization module.
   [junit4]   2> 458632 INFO  (TEST-CloudExitableDirectoryReaderTest.test-seed#[8C03942E2B1BC7F9]) [n:127.0.0.1:53975_    ] o.a.s.c.CoresLocator Looking for core definitions underneath /home/jenkins/workspace/Lucene-Solr-5.3-Linux/solr/build/solr-core/test/J1/temp/solr.cloud.CloudExitableDirectoryReaderTest_8C03942E2B1BC7F9-001/control-001/cores
   [junit4]   2> 458633 INFO  (TEST-CloudExitableDirectoryReaderTest.test-seed#[8C03942E2B1BC7F9]) [n:127.0.0.1:53975_    ] o.a.s.c.SolrCore Created CoreDescriptor: {name=collection1, config=solrconfig.xml, transient=false, schema=schema.xml, loadOnStartup=true, configSetProperties=configsetprops.json, instanceDir=/home/jenkins/workspace/Lucene-Solr-5.3-Linux/solr/build/solr-core/test/J1/temp/solr.cloud.CloudExitableDirectoryReaderTest_8C03942E2B1BC7F9-001/control-001/cores/collection1, collection=control_collection, absoluteInstDir=/home/jenkins/workspace/Lucene-Solr-5.3-Linux/solr/build/solr-core/test/J1/temp/solr.cloud.CloudExitableDirectoryReaderTest_8C03942E2B1BC7F9-001/control-001/cores/collection1/, coreNodeName=, dataDir=data/, shard=}
   [junit4]   2> 458633 INFO  (TEST-CloudExitableDirectoryReaderTest.test-seed#[8C03942E2B1BC7F9]) [n:127.0.0.1:53975_    ] o.a.s.c.CoresLocator Found core collection1 in /home/jenkins/workspace/Lucene-Solr-5.3-Linux/solr/build/solr-core/test/J1/temp/solr.cloud.CloudExitableDirectoryReaderTest_8C03942E2B1BC7F9-001/control-001/cores/collection1/
   [junit4]   2> 458633 INFO  (TEST-CloudExitableDirectoryReaderTest.test-seed#[8C03942E2B1BC7F9]) [n:127.0.0.1:53975_    ] o.a.s.c.CoresLocator Found 1 core definitions
   [junit4]   2> 458634 INFO  (coreLoadExecutor-995-thread-1-processing-n:127.0.0.1:53975_) [n:127.0.0.1:53975_ c:control_collection   x:collection1] o.a.s.c.ZkController publishing state=down
   [junit4]   2> 458634 INFO  (coreLoadExecutor-995-thread-1-processing-n:127.0.0.1:53975_) [n:127.0.0.1:53975_ c:control_collection   x:collection1] o.a.s.c.ZkController numShards not found on descriptor - reading it from system property
   [junit4]   2> 458634 INFO  (TEST-CloudExitableDirectoryReaderTest.test-seed#[8C03942E2B1BC7F9]) [n:127.0.0.1:53975_    ] o.a.s.s.SolrDispatchFilter user.dir=/home/jenkins/workspace/Lucene-Solr-5.3-Linux/solr/build/solr-core/test/J1
   [junit4]   2> 458634 INFO  (TEST-CloudExitableDirectoryReaderTest.test-seed#[8C03942E2B1BC7F9]) [n:127.0.0.1:53975_    ] o.a.s.s.SolrDispatchFilter SolrDispatchFilter.init() done
   [junit4]   2> 458634 INFO  (zkCallback-257-thread-1-processing-n:127.0.0.1:53975_) [n:127.0.0.1:53975_    ] o.a.s.c.DistributedQueue NodeChildrenChanged fired on path /overseer/queue state SyncConnected
   [junit4]   2> 458634 INFO  (coreLoadExecutor-995-thread-1-processing-n:127.0.0.1:53975_) [n:127.0.0.1:53975_ c:control_collection   x:collection1] o.a.s.c.ZkController look for our core node name
   [junit4]   2> 458634 INFO  (OverseerStateUpdate-94294866791170052-127.0.0.1:53975_-n_0000000000) [n:127.0.0.1:53975_    ] o.a.s.c.Overseer processMessage: queueSize: 1, message = {
   [junit4]   2>   "core":"collection1",
   [junit4]   2>   "roles":null,
   [junit4]   2>   "base_url":"http://127.0.0.1:53975",
   [junit4]   2>   "node_name":"127.0.0.1:53975_",
   [junit4]   2>   "numShards":"1",
   [junit4]   2>   "state":"down",
   [junit4]   2>   "shard":null,
   [junit4]   2>   "collection":"control_collection",
   [junit4]   2>   "operation":"state"} current state version: 0
   [junit4]   2> 458635 INFO  (OverseerStateUpdate-94294866791170052-127.0.0.1:53975_-n_0000000000) [n:127.0.0.1:53975_    ] o.a.s.c.o.ReplicaMutator Update state numShards=1 message={
   [junit4]   2>   "core":"collection1",
   [junit4]   2>   "roles":null,
   [junit4]   2>   "base_url":"http://127.0.0.1:53975",
   [junit4]   2>   "node_name":"127.0.0.1:53975_",
   [junit4]   2>   "numShards":"1",
   [junit4]   2>   "state":"down",
   [junit4]   2>   "shard":null,
   [junit4]   2>   "collection":"control_collection",
   [junit4]   2>   "operation":"state"}
   [junit4]   2> 458635 INFO  (OverseerStateUpdate-94294866791170052-127.0.0.1:53975_-n_0000000000) [n:127.0.0.1:53975_    ] o.a.s.c.o.ClusterStateMutator building a new cName: control_collection
   [junit4]   2> 458635 INFO  (OverseerStateUpdate-94294866791170052-127.0.0.1:53975_-n_0000000000) [n:127.0.0.1:53975_    ] o.a.s.c.o.ReplicaMutator Assigning new node to shard shard=shard1
   [junit4]   2> 458635 INFO  (zkCallback-257-thread-1-processing-n:127.0.0.1:53975_) [n:127.0.0.1:53975_    ] o.a.s.c.c.ZkStateReader A cluster state change: WatchedEvent state:SyncConnected type:NodeDataChanged path:/clusterstate.json, has occurred - updating... (live nodes size: 1)
   [junit4]   2> 458636 INFO  (zkCallback-257-thread-1-processing-n:127.0.0.1:53975_) [n:127.0.0.1:53975_    ] o.a.s.c.c.ZkStateReader Updated cluster state version to 1
   [junit4]   2> 459634 INFO  (coreLoadExecutor-995-thread-1-processing-n:127.0.0.1:53975_) [n:127.0.0.1:53975_ c:control_collection   x:collection1] o.a.s.c.ZkController waiting to find shard id in clusterstate for collection1
   [junit4]   2> 459634 INFO  (coreLoadExecutor-995-thread-1-processing-n:127.0.0.1:53975_) [n:127.0.0.1:53975_ c:control_collection   x:collection1] o.a.s.c.ZkController Check for collection zkNode:control_collection
   [junit4]   2> 459635 INFO  (coreLoadExecutor-995-thread-1-processing-n:127.0.0.1:53975_) [n:127.0.0.1:53975_ c:control_collection   x:collection1] o.a.s.c.ZkController Collection zkNode exists
   [junit4]   2> 459635 INFO  (coreLoadExecutor-995-thread-1-processing-n:127.0.0.1:53975_) [n:127.0.0.1:53975_ c:control_collection   x:collection1] o.a.s.c.c.ZkStateReader Load collection config from:/collections/control_collection
   [junit4]   2> 459635 INFO  (coreLoadExecutor-995-thread-1-processing-n:127.0.0.1:53975_) [n:127.0.0.1:53975_ c:control_collection   x:collection1] o.a.s.c.c.ZkStateReader path=/collections/control_collection configName=conf1 specified config exists in ZooKeeper
   [junit4]   2> 459635 INFO  (coreLoadExecutor-995-thread-1-processing-n:127.0.0.1:53975_) [n:127.0.0.1:53975_ c:control_collection   x:collection1] o.a.s.c.SolrResourceLoader new SolrResourceLoader for directory: '/home/jenkins/workspace/Lucene-Solr-5.3-Linux/solr/build/solr-core/test/J1/temp/solr.cloud.CloudExitableDirectoryReaderTest_8C03942E2B1BC7F9-001/control-001/cores/collection1/'
   [junit4]   2> 459643 INFO  (coreLoadExecutor-995-thread-1-processing-n:127.0.0.1:53975_) [n:127.0.0.1:53975_ c:control_collection   x:collection1] o.a.s.c.Config loaded config solrconfig.xml with version 0 
   [junit4]   2> 459646 INFO  (coreLoadExecutor-995-thread-1-processing-n:127.0.0.1:53975_) [n:127.0.0.1:53975_ c:control_collection   x:collection1] o.a.s.c.SolrConfig current version of requestparams : -1
   [junit4]   2> 459648 INFO  (coreLoadExecutor-995-thread-1-processing-n:127.0.0.1:53975_) [n:127.0.0.1:53975_ c:control_collection   x:collection1] o.a.s.c.SolrConfig Using Lucene MatchVersion: 5.3.0
   [junit4]   2> 459659 INFO  (coreLoadExecutor-995-thread-1-processing-n:127.0.0.1:53975_) [n:127.0.0.1:53975_ c:control_collection   x:collection1] o.a.s.c.Config Loaded SolrConfig: solrconfig.xml
   [junit4]   2> 459659 INFO  (coreLoadExecutor-995-thread-1-processing-n:127.0.0.1:53975_) [n:127.0.0.1:53975_ c:control_collection   x:collection1] o.a.s.s.IndexSchema Reading Solr Schema from /configs/conf1/schema.xml
   [junit4]   2> 459662 INFO  (coreLoadExecutor-995-thread-1-processing-n:127.0.0.1:53975_) [n:127.0.0.1:53975_ c:control_collection   x:collection1] o.a.s.s.IndexSchema [collection1] Schema name=test
   [junit4]   2> 459712 INFO  (coreLoadExecutor-995-thread-1-processing-n:127.0.0.1:53975_) [n:127.0.0.1:53975_ c:control_collection   x:collection1] o.a.s.s.OpenExchangeRatesOrgProvider Initialized with rates=open-exchange-rates.json, refreshInterval=1440.
   [junit4]   2> 459716 INFO  (coreLoadExecutor-995-thread-1-processing-n:127.0.0.1:53975_) [n:127.0.0.1:53975_ c:control_collection   x:collection1] o.a.s.s.IndexSchema default search field in schema is text
   [junit4]   2> 459716 INFO  (coreLoadExecutor-995-thread-1-processing-n:127.0.0.1:53975_) [n:127.0.0.1:53975_ c:control_collection   x:collection1] o.a.s.s.IndexSchema unique key field: id
   [junit4]   2> 459720 INFO  (coreLoadExecutor-995-thread-1-processing-n:127.0.0.1:53975_) [n:127.0.0.1:53975_ c:control_collection   x:collection1] o.a.s.s.FileExchangeRateProvider Reloading exchange rates from file currency.xml
   [junit4]   2> 459721 INFO  (coreLoadExecutor-995-thread-1-processing-n:127.0.0.1:53975_) [n:127.0.0.1:53975_ c:control_collection   x:collection1] o.a.s.s.FileExchangeRateProvider Reloading exchange rates from file currency.xml
   [junit4]   2> 459723 INFO  (coreLoadExecutor-995-thread-1-processing-n:127.0.0.1:53975_) [n:127.0.0.1:53975_ c:control_collection   x:collection1] o.a.s.s.OpenExchangeRatesOrgProvider Reloading exchange rates from open-exchange-rates.json
   [junit4]   2> 459723 WARN  (coreLoadExecutor-995-thread-1-processing-n:127.0.0.1:53975_) [n:127.0.0.1:53975_ c:control_collection   x:collection1] o.a.s.s.OpenExchangeRatesOrgProvider Unknown key IMPORTANT NOTE
   [junit4]   2> 459723 WARN  (coreLoadExecutor-995-thread-1-processing-n:127.0.0.1:53975_) [n:127.0.0.1:53975_ c:control_collection   x:collection1] o.a.s.s.OpenExchangeRatesOrgProvider Expected key, got STRING
   [junit4]   2> 459723 INFO  (coreLoadExecutor-995-thread-1-processing-n:127.0.0.1:53975_) [n:127.0.0.1:53975_ c:control_collection   x:collection1] o.a.s.s.OpenExchangeRatesOrgProvider Reloading exchange rates from open-exchange-rates.json
   [junit4]   2> 459723 WARN  (coreLoadExecutor-995-thread-1-processing-n:127.0.0.1:53975_) [n:127.0.0.1:53975_ c:control_collection   x:collection1] o.a.s.s.OpenExchangeRatesOrgProvider Unknown key IMPORTANT NOTE
   [junit4]   2> 459723 WARN  (coreLoadExecutor-995-thread-1-processing-n:127.0.0.1:53975_) [n:127.0.0.1:53975_ c:control_collection   x:collection1] o.a.s.s.OpenExchangeRatesOrgProvider Expected key, got STRING
   [junit4]   2> 459724 INFO  (coreLoadExecutor-995-thread-1-processing-n:127.0.0.1:53975_) [n:127.0.0.1:53975_ c:control_collection   x:collection1] o.a.s.c.ConfigSetProperties Did not find ConfigSet properties, assuming default properties: Can't find resource 'configsetprops.json' in classpath or '/configs/conf1', cwd=/home/jenkins/workspace/Lucene-Solr-5.3-Linux/solr/build/solr-core/test/J1
   [junit4]   2> 459724 INFO  (coreLoadExecutor-995-thread-1-processing-n:127.0.0.1:53975_) [n:127.0.0.1:53975_ c:control_collection   x:collection1] o.a.s.c.CoreContainer Creating SolrCore 'collection1' using configuration from collection control_collection
   [junit4]   2> 459724 INFO  (coreLoadExecutor-995-thread-1-processing-n:127.0.0.1:53975_) [n:127.0.0.1:53975_ c:control_collection s:shard1 r:core_node1 x:collection1] o.a.s.c.SolrCore org.apache.solr.core.MockDirectoryFactory
   [junit4]   2> 459724 INFO  (coreLoadExecutor-995-thread-1-processing-n:127.0.0.1:53975_) [n:127.0.0.1:53975_ c:control_collection s:shard1 r:core_node1 x:collection1] o.a.s.c.SolrCore [[collection1] ] Opening new SolrCore at [/home/jenkins/workspace/Lucene-Solr-5.3-Linux/solr/build/solr-core/test/J1/temp/solr.cloud.CloudExitableDirectoryReaderTest_8C03942E2B1BC7F9-001/control-001/cores/collection1/], dataDir=[null]
   [junit4]   2> 459724 INFO  (coreLoadExecutor-995-thread-1-processing-n:127.0.0.1:53975_) [n:127.0.0.1:53975_ c:control_collection s:shard1 r:core_node1 x:collection1] o.a.s.c.JmxMonitoredMap JMX monitoring is enabled. Adding Solr mbeans to JMX Server: com.sun.jmx.mbeanserver.JmxMBeanServer@450d98
   [junit4]   2> 459725 INFO  (coreLoadExecutor-995-thread-1-processing-n:127.0.0.1:53975_) [n:127.0.0.1:53975_ c:control_collection s:shard1 r:core_node1 x:collection1] o.a.s.c.CachingDirectoryFactory return new directory for /home/jenkins/workspace/Lucene-Solr-5.3-Linux/solr/build/solr-core/test/J1/temp/solr.cloud.CloudExitableDirectoryReaderTest_8C03942E2B1BC7F9-001/control-001/cores/collection1/data
   [junit4]   2> 459725 INFO  (coreLoadExecutor-995-thread-1-processing-n:127.0.0.1:53975_) [n:127.0.0.1:53975_ c:control_collection s:shard1 r:core_node1 x:collection1] o.a.s.c.SolrCore New index directory detected: old=null new=/home/jenkins/workspace/Lucene-Solr-5.3-Linux/solr/build/solr-core/test/J1/temp/solr.cloud.CloudExitableDirectoryReaderTest_8C03942E2B1BC7F9-001/control-001/cores/collection1/data/index/
   [junit4]   2> 459725 WARN  (coreLoadExecutor-995-thread-1-processing-n:127.0.0.1:53975_) [n:127.0.0.1:53975_ c:control_collection s:shard1 r:core_node1 x:collection1] o.a.s.c.SolrCore [collection1] Solr index directory '/home/jenkins/workspace/Lucene-Solr-5.3-Linux/solr/build/solr-core/test/J1/temp/solr.cloud.CloudExitableDirectoryReaderTest_8C03942E2B1BC7F9-001/control-001/cores/collection1/data/index' doesn't exist. Creating new index...
   [junit4]   2> 459725 INFO  (coreLoadExecutor-995-thread-1-processing-n:127.0.0.1:53975_) [n:127.0.0.1:53975_ c:control_collection s:shard1 r:core_node1 x:collection1] o.a.s.c.CachingDirectoryFactory return new directory for /home/jenkins/workspace/Lucene-Solr-5.3-Linux/solr/build/solr-core/test/J1/temp/solr.cloud.CloudExitableDirectoryReaderTest_8C03942E2B1BC7F9-001/control-001/cores/collection1/data/index
   [junit4]   2> 459725 INFO  (coreLoadExecutor-995-thread-1-processing-n:127.0.0.1:53975_) [n:127.0.0.1:53975_ c:control_collection s:shard1 r:core_node1 x:collection1] o.a.s.u.RandomMergePolicy RandomMergePolicy wrapping class org.apache.lucene.index.TieredMergePolicy: [TieredMergePolicy: maxMergeAtOnce=37, maxMergeAtOnceExplicit=24, maxMergedSegmentMB=67.9091796875, floorSegmentMB=1.9951171875, forceMergeDeletesPctAllowed=20.03602134687799, segmentsPerTier=49.0, maxCFSSegmentSizeMB=8.796093022207999E12, noCFSRatio=0.6719410688715178
   [junit4]   2> 459726 INFO  (coreLoadExecutor-995-thread-1-processing-n:127.0.0.1:53975_) [n:127.0.0.1:53975_ c:control_collection s:shard1 r:core_node1 x:collection1] o.a.s.c.SolrCore SolrDeletionPolicy.onCommit: commits: num=1
   [junit4]   2> 	commit{dir=MockDirectoryWrapper(RAMDirectory@2116b1 lockFactory=org.apache.lucene.store.SingleInstanceLockFactory@30fa4f),segFN=segments_1,generation=1}
   [junit4]   2> 459726 INFO  (coreLoadExecutor-995-thread-1-processing-n:127.0.0.1:53975_) [n:127.0.0.1:53975_ c:control_collection s:shard1 r:core_node1 x:collection1] o.a.s.c.SolrCore newest commit generation = 1
   [junit4]   2> 459726 INFO  (OldIndexDirectoryCleanupThreadForCore-collection1) [n:127.0.0.1:53975_ c:control_collection s:shard1 r:core_node1 x:collection1] o.a.s.c.SolrCore Looking for old index directories to cleanup for core collection1 in /home/jenkins/workspace/Lucene-Solr-5.3-Linux/solr/build/solr-core/test/J1/temp/solr.cloud.CloudExitableDirectoryReaderTest_8C03942E2B1BC7F9-001/control-001/cores/collection1/data/
   [junit4]   2> 459726 WARN  (OldIndexDirectoryCleanupThreadForCore-collection1) [n:127.0.0.1:53975_ c:control_collection s:shard1 r:core_node1 x:collection1] o.a.s.c.DirectoryFactory /home/jenkins/workspace/Lucene-Solr-5.3-Linux/solr/build/solr-core/test/J1/temp/solr.cloud.CloudExitableDirectoryReaderTest_8C03942E2B1BC7F9-001/control-001/cores/collection1/data/ does not point to a valid data directory; skipping clean-up of old index directories.
   [junit4]   2> 459728 INFO  (coreLoadExecutor-995-thread-1-processing-n:127.0.0.1:53975_) [n:127.0.0.1:53975_ c:control_collection s:shard1 r:core_node1 x:collection1] o.a.s.u.p.UpdateRequestProcessorChain creating updateRequestProcessorChain "nodistrib"
   [junit4]   2> 459729 INFO  (coreLoadExecutor-995-thread-1-processing-n:127.0.0.1:53975_) [n:127.0.0.1:53975_ c:control_collection s:shard1 r:core_node1 x:collection1] o.a.s.u.p.UpdateRequestProcessorChain creating updateRequestProcessorChain "dedupe"
   [junit4]   2> 459729 INFO  (coreLoadExecutor-995-thread-1-processing-n:127.0.0.1:53975_) [n:127.0.0.1:53975_ c:control_collection s:shard1 r:core_node1 x:collection1] o.a.s.u.p.UpdateRequestProcessorChain inserting DistributedUpdateProcessorFactory into updateRequestProcessorChain "dedupe"
   [junit4]   2> 459729 INFO  (coreLoadExecutor-995-thread-1-processing-n:127.0.0.1:53975_) [n:127.0.0.1:53975_ c:control_collection s:shard1 r:core_node1 x:collection1] o.a.s.u.p.UpdateRequestProcessorChain creating updateRequestProcessorChain "stored_sig"
   [junit4]   2> 459729 INFO  (coreLoadExecutor-995-thread-1-processing-n:127.0.0.1:53975_) [n:127.0.0.1:53975_ c:control_collection s:shard1 r:core_node1 x:collection1] o.a.s.u.p.UpdateRequestProcessorChain inserting DistributedUpdateProcessorFactory into updateRequestProcessorChain "stored_sig"
   [junit4]   2> 459729 INFO  (coreLoadExecutor-995-thread-1-processing-n:127.0.0.1:53975_) [n:127.0.0.1:53975_ c:control_collection s:shard1 r:core_node1 x:collection1] o.a.s.u.p.UpdateRequestProcessorChain creating updateRequestProcessorChain "distrib-dup-test-chain-explicit"
   [junit4]   2> 459729 INFO  (coreLoadExecutor-995-thread-1-processing-n:127.0.0.1:53975_) [n:127.0.0.1:53975_ c:control_collection s:shard1 r:core_node1 x:collection1] o.a.s.u.p.UpdateRequestProcessorChain creating updateRequestProcessorChain "distrib-dup-test-chain-implicit"
   [junit4]   2> 459730 INFO  (coreLoadExecutor-995-thread-1-processing-n:127.0.0.1:53975_) [n:127.0.0.1:53975_ c:control_collection s:shard1 r:core_node1 x:collection1] o.a.s.u.p.UpdateRequestProcessorChain inserting DistributedUpdateProcessorFactory into updateRequestProcessorChain "distrib-dup-test-chain-implicit"
   [junit4]   2> 459730 INFO  (coreLoadExecutor-995-thread-1-processing-n:127.0.0.1:53975_) [n:127.0.0.1:53975_ c:control_collection s:shard1 r:core_node1 x:collection1] o.a.s.c.SolrCore no updateRequestProcessorChain defined as default, creating implicit default
   [junit4]   2> 459731 INFO  (coreLoadExecutor-995-thread-1-processing-n:127.0.0.1:53975_) [n:127.0.0.1:53975_ c:control_collection s:shard1 r:core_node1 x:collection1] o.a.s.h.l.XMLLoader xsltCacheLifetimeSeconds=60
   [junit4]   2> 459731 INFO  (coreLoadExecutor-995-thread-1-processing-n:127.0.0.1:53975_) [n:127.0.0.1:53975_ c:control_collection s:shard1 r:core_node1 x:collection1] o.a.s.h.l.XMLLoader xsltCacheLifetimeSeconds=60
   [junit4]   2> 459732 INFO  (coreLoadExecutor-995-thread-1-processing-n:127.0.0.1:53975_) [n:127.0.0.1:53975_ c:control_collection s:shard1 r:core_node1 x:collection1] o.a.s.h.l.XMLLoader xsltCacheLifetimeSeconds=60
   [junit4]   2> 459732 INFO  (coreLoadExecutor-995-thread-1-processing-n:127.0.0.1:53975_) [n:127.0.0.1:53975_ c:control_collection s:shard1 r:core_node1 x:collection1] o.a.s.h.l.XMLLoader xsltCacheLifetimeSeconds=60
   [junit4]   2> 459734 INFO  (coreLoadExecutor-995-thread-1-processing-n:127.0.0.1:53975_) [n:127.0.0.1:53975_ c:control_collection s:shard1 r:core_node1 x:collection1] o.a.s.c.RequestHandlers Registered paths: /admin/mbeans,standard,/update/csv,/update/json/docs,/admin/luke,/select,/admin/segments,/get,/admin/system,/replication,/admin/properties,/config,/schema,/admin/plugins,/admin/logging,/update/json,/admin/threads,/admin/ping,/update,/admin/file
   [junit4]   2> 459734 INFO  (coreLoadExecutor-995-thread-1-processing-n:127.0.0.1:53975_) [n:127.0.0.1:53975_ c:control_collection s:shard1 r:core_node1 x:collection1] o.a.s.c.SolrCore Using default statsCache cache: org.apache.solr.search.stats.LocalStatsCache
   [junit4]   2> 459735 INFO  (coreLoadExecutor-995-thread-1-processing-n:127.0.0.1:53975_) [n:127.0.0.1:53975_ c:control_collection s:shard1 r:core_node1 x:collection1] o.a.s.u.UpdateHandler Using UpdateLog implementation: org.apache.solr.update.UpdateLog
   [junit4]   2> 459735 INFO  (coreLoadExecutor-995-thread-1-processing-n:127.0.0.1:53975_) [n:127.0.0.1:53975_ c:control_collection s:shard1 r:core_node1 x:collection1] o.a.s.u.UpdateLog Initializing UpdateLog: dataDir= defaultSyncLevel=FLUSH numRecordsToKeep=100 maxNumLogsToKeep=10 numVersionBuckets=65536
   [junit4]   2> 459741 INFO  (coreLoadExecutor-995-thread-1-processing-n:127.0.0.1:53975_) [n:127.0.0.1:53975_ c:control_collection s:shard1 r:core_node1 x:collection1] o.a.s.c.SolrCore Hard AutoCommit: disabled
   [junit4]   2> 459741 INFO  (coreLoadExecutor-995-thread-1-processing-n:127.0.0.1:53975_) [n:127.0.0.1:53975_ c:control_collection s:shard1 r:core_node1 x:collection1] o.a.s.c.SolrCore Soft AutoCommit: disabled
   [junit4]   2> 459741 INFO  (coreLoadExecutor-995-thread-1-processing-n:127.0.0.1:53975_) [n:127.0.0.1:53975_ c:control_collection s:shard1 r:core_node1 x:collection1] o.a.s.u.RandomMergePolicy RandomMergePolicy wrapping class org.apache.lucene.index.AlcoholicMergePolicy: [AlcoholicMergePolicy: minMergeSize=0, mergeFactor=10, maxMergeSize=363194526, maxMergeSizeForForcedMerge=9223372036854775807, calibrateSizeByDeletes=true, maxMergeDocs=2147483647, maxCFSSegmentSizeMB=8.796093022207999E12, noCFSRatio=0.1]
   [junit4]   2> 459742 INFO  (coreLoadExecutor-995-thread-1-processing-n:127.0.0.1:53975_) [n:127.0.0.1:53975_ c:control_collection s:shard1 r:core_node1 x:collection1] o.a.s.c.SolrCore SolrDeletionPolicy.onInit: commits: num=1
   [junit4]   2> 	commit{dir=MockDirectoryWrapper(RAMDirectory@2116b1 lockFactory=org.apache.lucene.store.SingleInstanceLockFactory@30fa4f),segFN=segments_1,generation=1}
   [junit4]   2> 459742 INFO  (coreLoadExecutor-995-thread-1-processing-n:127.0.0.1:53975_) [n:127.0.0.1:53975_ c:control_collection s:shard1 r:core_node1 x:collection1] o.a.s.c.SolrCore newest commit generation = 1
   [junit4]   2> 459742 INFO  (coreLoadExecutor-995-thread-1-processing-n:127.0.0.1:53975_) [n:127.0.0.1:53975_ c:control_collection s:shard1 r:core_node1 x:collection1] o.a.s.s.SolrIndexSearcher Opening Searcher@1cad151[collection1] main
   [junit4]   2> 459742 INFO  (coreLoadExecutor-995-thread-1-processing-n:127.0.0.1:53975_) [n:127.0.0.1:53975_ c:control_collection s:shard1 r:core_node1 x:collection1] o.a.s.c.c.ZkStateReader Load collection config from:/collections/control_collection
   [junit4]   2> 459742 INFO  (coreLoadExecutor-995-thread-1-processing-n:127.0.0.1:53975_) [n:127.0.0.1:53975_ c:control_collection s:shard1 r:core_node1 x:collection1] o.a.s.c.c.ZkStateReader path=/collections/control_collection configName=conf1 specified config exists in ZooKeeper
   [junit4]   2> 459742 INFO  (coreLoadExecutor-995-thread-1-processing-n:127.0.0.1:53975_) [n:127.0.0.1:53975_ c:control_collection s:shard1 r:core_node1 x:collection1] o.a.s.r.ManagedResourceStorage Setting up ZooKeeper-based storage for the RestManager with znodeBase: /configs/conf1
   [junit4]   2> 459743 INFO  (coreLoadExecutor-995-thread-1-processing-n:127.0.0.1:53975_) [n:127.0.0.1:53975_ c:control_collection s:shard1 r:core_node1 x:collection1] o.a.s.r.ManagedResourceStorage Configured ZooKeeperStorageIO with znodeBase: /configs/conf1
   [junit4]   2> 459743 INFO  (coreLoadExecutor-995-thread-1-processing-n:127.0.0.1:53975_) [n:127.0.0.1:53975_ c:control_collection s:shard1 r:core_node1 x:collection1] o.a.s.r.RestManager Initializing RestManager with initArgs: {}
   [junit4]   2> 459743 INFO  (coreLoadExecutor-995-thread-1-processing-n:127.0.0.1:53975_) [n:127.0.0.1:53975_ c:control_collection s:shard1 r:core_node1 x:collection1] o.a.s.r.ManagedResourceStorage Reading _rest_managed.json using ZooKeeperStorageIO:path=/configs/conf1
   [junit4]   2> 459743 INFO  (coreLoadExecutor-995-thread-1-processing-n:127.0.0.1:53975_) [n:127.0.0.1:53975_ c:control_collection s:shard1 r:core_node1 x:collection1] o.a.s.r.ManagedResourceStorage No data found for znode /configs/conf1/_rest_managed.json
   [junit4]   2> 459743 INFO  (coreLoadExecutor-995-thread-1-processing-n:127.0.0.1:53975_) [n:127.0.0.1:53975_ c:control_collection s:shard1 r:core_node1 x:collection1] o.a.s.r.ManagedResourceStorage Loaded null at path _rest_managed.json using ZooKeeperStorageIO:path=/configs/conf1
   [junit4]   2> 459743 INFO  (coreLoadExecutor-995-thread-1-processing-n:127.0.0.1:53975_) [n:127.0.0.1:53975_ c:control_collection s:shard1 r:core_node1 x:collection1] o.a.s.r.RestManager Initializing 0 registered ManagedResources
   [junit4]   2> 459743 INFO  (coreLoadExecutor-995-thread-1-processing-n:127.0.0.1:53975_) [n:127.0.0.1:53975_ c:control_collection s:shard1 r:core_node1 x:collection1] o.a.s.h.ReplicationHandler Commits will be reserved for  10000
   [junit4]   2> 459744 INFO  (searcherExecutor-996-thread-1-processing-n:127.0.0.1:53975_ x:collection1 s:shard1 c:control_collection r:core_node1) [n:127.0.0.1:53975_ c:control_collection s:shard1 r:core_node1 x:collection1] o.a.s.c.SolrCore [collection1] Registered new searcher Searcher@1cad151[collection1] main{ExitableDirectoryReader(UninvertingDirectoryReader())}
   [junit4]   2> 459744 INFO  (coreLoadExecutor-995-thread-1-processing-n:127.0.0.1:53975_) [n:127.0.0.1:53975_ c:control_collection s:shard1 r:core_node1 x:collection1] o.a.s.u.UpdateLog Looking up max value of version field to seed version buckets
   [junit4]   2> 459744 INFO  (coreLoadExecutor-995-thread-1-processing-n:127.0.0.1:53975_) [n:127.0.0.1:53975_ c:control_collection s:shard1 r:core_node1 x:collection1] o.a.s.u.VersionInfo Refreshing highest value of _version_ for 65536 version buckets from index
   [junit4]   2> 459744 INFO  (coreLoadExecutor-995-thread-1-processing-n:127.0.0.1:53975_) [n:127.0.0.1:53975_ c:control_collection s:shard1 r:core_node1 x:collection1] o.a.s.u.VersionInfo No terms found for _version_, cannot seed version bucket highest value from index
   [junit4]   2> 459744 INFO  (coreLoadExecutor-995-thread-1-processing-n:127.0.0.1:53975_) [n:127.0.0.1:53975_ c:control_collection s:shard1 r:core_node1 x:collection1] o.a.s.u.UpdateLog Could not find max version in index or recent updates, using new clock 1508717870124630016
   [junit4]   2> 459745 INFO  (coreLoadExecutor-995-thread-1-processing-n:127.0.0.1:53975_) [n:127.0.0.1:53975_ c:control_collection s:shard1 r:core_node1 x:collection1] o.a.s.u.UpdateLog Took 1 ms to seed version buckets with highest version 1508717870124630016
   [junit4]   2> 459746 INFO  (coreLoadExecutor-995-thread-1-processing-n:127.0.0.1:53975_) [n:127.0.0.1:53975_ c:control_collection s:shard1 r:core_node1 x:collection1] o.a.s.c.ZkController watch zkdir /configs/conf1
   [junit4]   2> 459746 INFO  (coreLoadExecutor-995-thread-1-processing-n:127.0.0.1:53975_) [n:127.0.0.1:53975_ c:control_collection s:shard1 r:core_node1 x:collection1] o.a.s.c.CoreContainer registering core: collection1
   [junit4]   2> 459746 INFO  (coreZkRegister-989-thread-1-processing-n:127.0.0.1:53975_ x:collection1 s:shard1 c:control_collection r:core_node1) [n:127.0.0.1:53975_ c:control_collection s:shard1 r:core_node1 x:collection1] o.a.s.c.ZkController Register replica - core:collection1 address:http://127.0.0.1:53975 collection:control_collection shard:shard1
   [junit4]   2> 459746 INFO  (coreZkRegister-989-thread-1-processing-n:127.0.0.1:53975_ x:collection1 s:shard1 c:control_collection r:core_node1) [n:127.0.0.1:53975_ c:control_collection s:shard1 r:core_node1 x:collection1] o.a.s.c.c.SolrZkClient makePath: /collections/control_collection/leader_elect/shard1/election
   [junit4]   2> 459747 INFO  (coreZkRegister-989-thread-1-processing-n:127.0.0.1:53975_ x:collection1 s:shard1 c:control_collection r:core_node1) [n:127.0.0.1:53975_ c:control_collection s:shard1 r:core_node1 x:collection1] o.a.s.c.LeaderElector Joined leadership election with path: /collections/control_collection/leader_elect/shard1/election/94294866791170052-core_node1-n_0000000000
   [junit4]   2> 459748 INFO  (coreZkRegister-989-thread-1-processing-n:127.0.0.1:53975_ x:collection1 s:shard1 c:control_collection r:core_node1) [n:127.0.0.1:53975_ c:control_collection s:shard1 r:core_node1 x:collection1] o.a.s.c.ShardLeaderElectionContext Running the leader process for shard shard1
   [junit4]   2> 459748 INFO  (zkCallback-257-thread-1-processing-n:127.0.0.1:53975_) [n:127.0.0.1:53975_    ] o.a.s.c.DistributedQueue NodeChildrenChanged fired on path /overseer/queue state SyncConnected
   [junit4]   2> 459748 INFO  (coreZkRegister-989-thread-1-processing-n:127.0.0.1:53975_ x:collection1 s:shard1 c:control_collection r:core_node1) [n:127.0.0.1:53975_ c:control_collection s:shard1 r:core_node1 x:collection1] o.a.s.c.ShardLeaderElectionContext Enough replicas found to continue.
   [junit4]   2> 459748 INFO  (coreZkRegister-989-thread-1-processing-n:127.0.0.1:53975_ x:collection1 s:shard1 c:control_collection r:core_node1) [n:127.0.0.1:53975_ c:control_collection s:shard1 r:core_node1 x:collection1] o.a.s.c.ShardLeaderElectionContext I may be the new leader - try and sync
   [junit4]   2> 459749 INFO  (coreZkRegister-989-thread-1-processing-n:127.0.0.1:53975_ x:collection1 s:shard1 c:control_collection r:core_node1) [n:127.0.0.1:53975_ c:control_collection s:shard1 r:core_node1 x:collection1] o.a.s.c.SyncStrategy Sync replicas to http://127.0.0.1:53975/collection1/
   [junit4]   2> 459749 INFO  (OverseerStateUpdate-94294866791170052-127.0.0.1:53975_-n_0000000000) [n:127.0.0.1:53975_    ] o.a.s.c.Overseer processMessage: queueSize: 1, message = {
   [junit4]   2>   "operation":"leader",
   [junit4]   2>   "shard":"shard1",
   [junit4]   2>   "collection":"control_collection"} current state version: 1
   [junit4]   2> 459749 INFO  (coreZkRegister-989-thread-1-processing-n:127.0.0.1:53975_ x:collection1 s:shard1 c:control_collection r:core_node1) [n:127.0.0.1:53975_ c:control_collection s:shard1 r:core_node1 x:collection1] o.a.s.c.SyncStrategy Sync Success - now sync replicas to me
   [junit4]   2> 459749 INFO  (coreZkRegister-989-thread-1-processing-n:127.0.0.1:53975_ x:collection1 s:shard1 c:control_collection r:core_node1) [n:127.0.0.1:53975_ c:control_collection s:shard1 r:core_node1 x:collection1] o.a.s.c.SyncStrategy http://127.0.0.1:53975/collection1/ has no replicas
   [junit4]   2> 459749 INFO  (coreZkRegister-989-thread-1-processing-n:127.0.0.1:53975_ x:collection1 s:shard1 c:control_collection r:core_node1) [n:127.0.0.1:53975_ c:control_collection s:shard1 r:core_node1 x:collection1] o.a.s.c.ShardLeaderElectionContext I am the new leader: http://127.0.0.1:53975/collection1/ shard1
   [junit4]   2> 459749 INFO  (coreZkRegister-989-thread-1-processing-n:127.0.0.1:53975_ x:collection1 s:shard1 c:control_collection r:core_node1) [n:127.0.0.1:53975_ c:control_collection s:shard1 r:core_node1 x:collection1] o.a.s.c.c.SolrZkClient makePath: /collections/control_collection/leaders/shard1
   [junit4]   2> 459750 INFO  (zkCallback-257-thread-1-processing-n:127.0.0.1:53975_) [n:127.0.0.1:53975_    ] o.a.s.c.DistributedQueue NodeChildrenChanged fired on path /overseer/queue state SyncConnected
   [junit4]   2> 459750 INFO  (OverseerStateUpdate-94294866791170052-127.0.0.1:53975_-n_0000000000) [n:127.0.0.1:53975_    ] o.a.s.c.Overseer processMessage: queueSize: 1, message = {
   [junit4]   2>   "operation":"leader",
   [junit4]   2>   "shard":"shard1",
   [junit4]   2>   "collection":"control_collection",
   [junit4]   2>   "base_url":"http://127.0.0.1:53975",
   [junit4]   2>   "core":"collection1",
   [junit4]   2>   "state":"active"} current state version: 1
   [junit4]   2> 459852 INFO  (zkCallback-257-thread-1-processing-n:127.0.0.1:53975_) [n:127.0.0.1:53975_    ] o.a.s.c.c.ZkStateReader A cluster state change: WatchedEvent state:SyncConnected type:NodeDataChanged path:/clusterstate.json, has occurred - updating... (live nodes size: 1)
   [junit4]   2> 459852 INFO  (zkCallback-257-thread-1-processing-n:127.0.0.1:53975_) [n:127.0.0.1:53975_    ] o.a.s.c.c.ZkStateReader Updated cluster state version to 2
   [junit4]   2> 459901 INFO  (coreZkRegister-989-thread-1-processing-n:127.0.0.1:53975_ x:collection1 s:shard1 c:control_collection r:core_node1) [n:127.0.0.1:53975_ c:control_collection s:shard1 r:core_node1 x:collection1] o.a.s.c.ZkController We are http://127.0.0.1:53975/collection1/ and leader is http://127.0.0.1:53975/collection1/
   [junit4]   2> 459901 INFO  (coreZkRegister-989-thread-1-processing-n:127.0.0.1:53975_ x:collection1 s:shard1 c:control_collection r:core_node1) [n:127.0.0.1:53975_ c:control_collection s:shard1 r:core_node1 x:collection1] o.a.s.c.ZkController No LogReplay needed for core=collection1 baseURL=http://127.0.0.1:53975
   [junit4]   2> 459901 INFO  (coreZkRegister-989-thread-1-processing-n:127.0.0.1:53975_ x:collection1 s:shard1 c:control_collection r:core_node1) [n:127.0.0.1:53975_ c:control_collection s:shard1 r:core_node1 x:collection1] o.a.s.c.ZkController I am the leader, no recovery necessary
   [junit4]   2> 459901 INFO  (coreZkRegister-989-thread-1-processing-n:127.0.0.1:53975_ x:collection1 s:shard1 c:control_collection r:core_node1) [n:127.0.0.1:53975_ c:control_collection s:shard1 r:core_node1 x:collection1] o.a.s.c.ZkController publishing state=active
   [junit4]   2> 459901 INFO  (coreZkRegister-989-thread-1-processing-n:127.0.0.1:53975_ x:collection1 s:shard1 c:control_collection r:core_node1) [n:127.0.0.1:53975_ c:control_collection s:shard1 r:core_node1 x:collection1] o.a.s.c.ZkController numShards not found on descriptor - reading it from system property
   [junit4]   2> 459902 INFO  (zkCallback-257-thread-1-processing-n:127.0.0.1:53975_) [n:127.0.0.1:53975_    ] o.a.s.c.DistributedQueue NodeChildrenChanged fired on path /overseer/queue state SyncConnected
   [junit4]   2> 459902 INFO  (OverseerStateUpdate-94294866791170052-127.0.0.1:53975_-n_0000000000) [n:127.0.0.1:53975_    ] o.a.s.c.Overseer processMessage: queueSize: 1, message = {
   [junit4]   2>   "core":"collection1",
   [junit4]   2>   "core_node_name":"core_node1",
   [junit4]   2>   "roles":null,
   [junit4]   2>   "base_url":"http://127.0.0.1:53975",
   [junit4]   2>   "node_name":"127.0.0.1:53975_",
   [junit4]   2>   "numShards":"1",
   [junit4]   2>   "state":"active",
   [junit4]   2>   "shard":"shard1",
   [junit4]   2>   "collection":"control_collection",
   [junit4]   2>   "operation":"state"} current state version: 2
   [junit4]   2> 459902 INFO  (OverseerStateUpdate-94294866791170052-127.0.0.1:53975_-n_0000000000) [n:127.0.0.1:53975_    ] o.a.s.c.o.ReplicaMutator Update state numShards=1 message={
   [junit4]   2>   "core":"collection1",
   [junit4]   2>   "core_node_name":"core_node1",
   [junit4]   2>   "roles":null,
   [junit4]   2>   "base_url":"http://127.0.0.1:53975",
   [junit4]   2>   "node_name":"127.0.0.1:53975_",
   [junit4]   2>   "numShards":"1",
   [junit4]   2>   "state":"active",
   [junit4]   2>   "shard":"shard1",
   [junit4]   2>   "collection":"control_collection",
   [junit4]   2>   "operation":"state"}
   [junit4]   2> 460003 INFO  (zkCallback-257-thread-1-processing-n:127.0.0.1:53975_) [n:127.0.0.1:53975_    ] o.a.s.c.c.ZkStateReader A cluster state change: WatchedEvent state:SyncConnected type:NodeDataChanged path:/clusterstate.json, has occurred - updating... (live nodes size: 1)
   [junit4]   2> 460004 INFO  (zkCallback-257-thread-1-processing-n:127.0.0.1:53975_) [n:127.0.0.1:53975_    ] o.a.s.c.c.ZkStateReader Updated cluster state version to 3
   [junit4]   2> 460135 INFO  (TEST-CloudExitableDirectoryReaderTest.test-seed#[8C03942E2B1BC7F9]) [    ] o.a.s.c.c.SolrZkClient Using default ZkCredentialsProvider
   [junit4]   2> 460135 INFO  (TEST-CloudExitableDirectoryReaderTest.test-seed#[8C03942E2B1BC7F9]) [    ] o.a.s.c.c.ConnectionManager Waiting for client to connect to ZooKeeper
   [junit4]   2> 460136 INFO  (zkCallback-259-thread-1) [    ] o.a.s.c.c.ConnectionManager Watcher org.apache.solr.common.cloud.ConnectionManager@222546 name:ZooKeeperConnection Watcher:127.0.0.1:48772/solr got event WatchedEvent state:SyncConnected type:None path:null path:null type:None
   [junit4]   2> 460136 INFO  (TEST-CloudExitableDirectoryReaderTest.test-seed#[8C03942E2B1BC7F9]) [    ] o.a.s.c.c.ConnectionManager Client is connected to ZooKeeper
   [junit4]   2> 460137 INFO  (TEST-CloudExitableDirectoryReaderTest.test-seed#[8C03942E2B1BC7F9]) [    ] o.a.s.c.c.SolrZkClient Using default ZkACLProvider
   [junit4]   2> 460137 INFO  (TEST-CloudExitableDirectoryReaderTest.test-seed#[8C03942E2B1BC7F9]) [    ] o.a.s.c.c.ZkStateReader Updating cluster state from ZooKeeper... 
   [junit4]   2> 460138 INFO  (TEST-CloudExitableDirectoryReaderTest.test-seed#[8C03942E2B1BC7F9]) [    ] o.a.s.c.ChaosMonkey monkey: init - expire sessions:false cause connection loss:false
   [junit4]   2> 460211 INFO  (TEST-CloudExitableDirectoryReaderTest.test-seed#[8C03942E2B1BC7F9]) [    ] o.a.s.SolrTestCaseJ4 Writing core.properties file to /home/jenkins/workspace/Lucene-Solr-5.3-Linux/solr/build/solr-core/test/J1/temp/solr.cloud.CloudExitableDirectoryReaderTest_8C03942E2B1BC7F9-001/shard-1-001/cores/collection1
   [junit4]   2> 460211 INFO  (TEST-CloudExitableDirectoryReaderTest.test-seed#[8C03942E2B1BC7F9]) [    ] o.a.s.c.AbstractFullDistribZkTestBase create jetty 1 in directory /home/jenkins/workspace/Lucene-Solr-5.3-Linux/solr/build/solr-core/test/J1/temp/solr.cloud.CloudExitableDirectoryReaderTest_8C03942E2B1BC7F9-001/shard-1-001
   [junit4]   2> 460212 INFO  (TEST-CloudExitableDirectoryReaderTest.test-seed#[8C03942E2B1BC7F9]) [    ] o.e.j.s.Server jetty-9.2.11.v20150529
   [junit4]   2> 460213 INFO  (TEST-CloudExitableDirectoryReaderTest.test-seed#[8C03942E2B1BC7F9]) [    ] o.e.j.s.h.ContextHandler Started o.e.j.s.ServletContextHandler@1f036f5{/,null,AVAILABLE}
   [junit4]   2> 460213 INFO  (TEST-CloudExitableDirectoryReaderTest.test-seed#[8C03942E2B1BC7F9]) [    ] o.e.j.s.ServerConnector Started ServerConnector@3504c7{HTTP/1.1}{127.0.0.1:56094}
   [junit4]   2> 460213 INFO  (TEST-CloudExitableDirectoryReaderTest.test-seed#[8C03942E2B1BC7F9]) [    ] o.e.j.s.Server Started @462056ms
   [junit4]   2> 460213 INFO  (TEST-CloudExitableDirectoryReaderTest.test-seed#[8C03942E2B1BC7F9]) [    ] o.a.s.c.s.e.JettySolrRunner Jetty properties: {solr.data.dir=/home/jenkins/workspace/Lucene-Solr-5.3-Linux/solr/build/solr-core/test/J1/temp/solr.cloud.CloudExitableDirectoryReaderTest_8C03942E2B1BC7F9-001/tempDir-001/jetty1, solrconfig=solrconfig.xml, hostContext=/, hostPort=56094, coreRootDirectory=/home/jenkins/workspace/Lucene-Solr-5.3-Linux/solr/build/solr-core/test/J1/temp/solr.cloud.CloudExitableDirectoryReaderTest_8C03942E2B1BC7F9-001/shard-1-001/cores}
   [junit4]   2> 460214 INFO  (TEST-CloudExitableDirectoryReaderTest.test-seed#[8C03942E2B1BC7F9]) [    ] o.a.s.s.SolrDispatchFilter SolrDispatchFilter.init(): sun.misc.Launcher$AppClassLoader@e2f2a
   [junit4]   2> 460214 INFO  (TEST-CloudExitableDirectoryReaderTest.test-seed#[8C03942E2B1BC7F9]) [    ] o.a.s.c.SolrResourceLoader new SolrResourceLoader for directory: '/home/jenkins/workspace/Lucene-Solr-5.3-Linux/solr/build/solr-core/test/J1/temp/solr.cloud.CloudExitableDirectoryReaderTest_8C03942E2B1BC7F9-001/shard-1-001/'
   [junit4]   2> 460222 INFO  (TEST-CloudExitableDirectoryReaderTest.test-seed#[8C03942E2B1BC7F9]) [    ] o.a.s.c.c.SolrZkClient Using default ZkCredentialsProvider
   [junit4]   2> 460222 INFO  (TEST-CloudExitableDirectoryReaderTest.test-seed#[8C03942E2B1BC7F9]) [    ] o.a.s.c.c.ConnectionManager Waiting for client to connect to ZooKeeper
   [junit4]   2> 460223 INFO  (zkCallback-260-thread-1) [    ] o.a.s.c.c.ConnectionManager Watcher org.apache.solr.common.cloud.ConnectionManager@63ec02 name:ZooKeeperConnection Watcher:127.0.0.1:48772/solr got event WatchedEvent state:SyncConnected type:None path:null path:null type:None
   [junit4]   2> 460223 INFO  (TEST-CloudExitableDirectoryReaderTest.test-seed#[8C03942E2B1BC7F9]) [    ] o.a.s.c.c.ConnectionManager Client is connected to ZooKeeper
   [junit4]   2> 460224 INFO  (TEST-CloudExitableDirectoryReaderTest.test-seed#[8C03942E2B1BC7F9]) [    ] o.a.s.c.c.SolrZkClient Using default ZkACLProvider
   [junit4]   2> 460224 INFO  (TEST-CloudExitableDirectoryReaderTest.test-seed#[8C03942E2B1BC7F9]) [    ] o.a.s.s.SolrDispatchFilter Loading solr.xml from SolrHome (not found in ZooKeeper)
   [junit4]   2> 460224 INFO  (TEST-CloudExitableDirectoryReaderTest.test-seed#[8C03942E2B1BC7F9]) [    ] o.a.s.c.SolrXmlConfig Loading container configuration from /home/jenkins/workspace/Lucene-Solr-5.3-Linux/solr/build/solr-core/test/J1/temp/solr.cloud.CloudExitableDirectoryReaderTest_8C03942E2B1BC7F9-001/shard-1-001/solr.xml
   [junit4]   2> 460227 INFO  (TEST-CloudExitableDirectoryReaderTest.test-seed#[8C03942E2B1BC7F9]) [    ] o.a.s.c.CoresLocator Config-defined core root directory: /home/jenkins/workspace/Lucene-Solr-5.3-Linux/solr/build/solr-core/test/J1/temp/solr.cloud.CloudExitableDirectoryReaderTest_8C03942E2B1BC7F9-001/shard-1-001/cores
   [junit4]   2> 460227 INFO  (TEST-CloudExitableDirectoryReaderTest.test-seed#[8C03942E2B1BC7F9]) [    ] o.a.s.c.CoreContainer New CoreContainer 14440548
   [junit4]   2> 460227 INFO  (TEST-CloudExitableDirectoryReaderTest.test-seed#[8C03942E2B1BC7F9]) [    ] o.a.s.c.CoreContainer Loading cores into CoreContainer [instanceDir=/home/jenkins/workspace/Lucene-Solr-5.3-Linux/solr/build/solr-core/test/J1/temp/solr.cloud.CloudExitableDirectoryReaderTest_8C03942E2B1BC7F9-001/shard-1-001/]
   [junit4]   2> 460227 INFO  (TEST-CloudExitableDirectoryReaderTest.test-seed#[8C03942E2B1BC7F9]) [    ] o.a.s.c.CoreContainer loading shared library: /home/jenkins/workspace/Lucene-Solr-5.3-Linux/solr/build/solr-core/test/J1/temp/solr.cloud.CloudExitableDirectoryReaderTest_8C03942E2B1BC7F9-001/shard-1-001/lib
   [junit4]   2> 460227 WARN  (TEST-CloudExitableDirectoryReaderTest.test-seed#[8C03942E2B1BC7F9]) [    ] o.a.s.c.SolrResourceLoader Can't find (or read) directory to add to classloader: lib (resolved as: /home/jenkins/workspace/Lucene-Solr-5.3-Linux/solr/build/solr-core/test/J1/temp/solr.cloud.CloudExitableDirectoryReaderTest_8C03942E2B1BC7F9-001/shard-1-001/lib).
   [junit4]   2> 460232 INFO  (TEST-CloudExitableDirectoryReaderTest.test-seed#[8C03942E2B1BC7F9]) [    ] o.a.s.h.c.HttpShardHandlerFactory created with socketTimeout : 90000,urlScheme : ,connTimeout : 15000,maxConnectionsPerHost : 20,maxConnections : 10000,corePoolSize : 0,maximumPoolSize : 2147483647,maxThreadIdleTime : 5,sizeOfQueue : -1,fairnessPolicy : false,useRetries : false,
   [junit4]   2> 460232 INFO  (TEST-CloudExitableDirectoryReaderTest.test-seed#[8C03942E2B1BC7F9]) [    ] o.a.s.u.UpdateShardHandler Creating UpdateShardHandler HTTP client with params: socketTimeout=340000&connTimeout=45000&retry=true
   [junit4]   2> 460233 INFO  (TEST-CloudExitableDirectoryReaderTest.test-seed#[8C03942E2B1BC7F9]) [    ] o.a.s.l.LogWatcher SLF4J impl is org.slf4j.impl.Log4jLoggerFactory
   [junit4]   2> 460233 INFO  (TEST-CloudExitableDirectoryReaderTest.test-seed#[8C03942E2B1BC7F9]) [    ] o.a.s.l.LogWatcher Registering Log Listener [Log4j (org.slf4j.impl.Log4jLoggerFactory)]
   [junit4]   2> 460233 INFO  (TEST-CloudExitableDirectoryReaderTest.test-seed#[8C03942E2B1BC7F9]) [    ] o.a.s.c.ZkContainer Zookeeper client=127.0.0.1:48772/solr
   [junit4]   2> 460233 INFO  (TEST-CloudExitableDirectoryReaderTest.test-seed#[8C03942E2B1BC7F9]) [    ] o.a.s.c.ZkController zkHost includes chroot
   [junit4]   2> 460233 INFO  (TEST-CloudExitableDirectoryReaderTest.test-seed#[8C03942E2B1BC7F9]) [    ] o.a.s.c.c.SolrZkClient Using default ZkCredentialsProvider
   [junit4]   2> 460233 INFO  (TEST-CloudExitableDirectoryReaderTest.test-seed#[8C03942E2B1BC7F9]) [    ] o.a.s.c.c.ConnectionManager Waiting for client to connect to ZooKeeper
   [junit4]   2> 460234 INFO  (zkCallback-262-thread-1) [    ] o.a.s.c.c.ConnectionManager Watcher org.apache.solr.common.cloud.ConnectionManager@1e4f669 name:ZooKeeperConnection Watcher:127.0.0.1:48772 got event WatchedEvent state:SyncConnected type:None path:null path:null type:None
   [junit4]   2> 460235 INFO  (TEST-CloudExitableDirectoryReaderTest.test-seed#[8C03942E2B1BC7F9]) [    ] o.a.s.c.c.ConnectionManager Client is connected to ZooKeeper
   [junit4]   2> 460235 INFO  (TEST-CloudExitableDirectoryReaderTest.test-seed#[8C03942E2B1BC7F9]) [    ] o.a.s.c.c.SolrZkClient Using default ZkACLProvider
   [junit4]   2> 460236 INFO  (TEST-CloudExitableDirectoryReaderTest.test-seed#[8C03942E2B1BC7F9]) [n:127.0.0.1:56094_    ] o.a.s.c.c.ConnectionManager Waiting for client to connect to ZooKeeper
   [junit4]   2> 460236 INFO  (zkCallback-263-thread-1-processing-n:127.0.0.1:56094_) [n:127.0.0.1:56094_    ] o.a.s.c.c.ConnectionManager Watcher org.apache.solr.common.cloud.ConnectionManager@168d0d1 name:ZooKeeperConnection Watcher:127.0.0.1:48772/solr got event WatchedEvent state:SyncConnected type:None path:null path:null type:None
   [junit4]   2> 460252 INFO  (TEST-CloudExitableDirectoryReaderTest.test-seed#[8C03942E2B1BC7F9]) [n:127.0.0.1:56094_    ] o.a.s.c.c.ConnectionManager Client is connected to ZooKeeper
   [junit4]   2> 460254 INFO  (TEST-CloudExitableDirectoryReaderTest.test-seed#[8C03942E2B1BC7F9]) [n:127.0.0.1:56094_    ] o.a.s.c.c.ZkStateReader Updating cluster state from ZooKeeper... 
   [junit4]   2> 461255 INFO  (TEST-CloudExitableDirectoryReaderTest.test-seed#[8C03942E2B1BC7F9]) [n:127.0.0.1:56094_    ] o.a.s.c.ZkController Register node as live in ZooKeeper:/live_nodes/127.0.0.1:56094_
   [junit4]   2> 461255 INFO  (TEST-CloudExitableDirectoryReaderTest.test-seed#[8C03942E2B1BC7F9]) [n:127.0.0.1:56094_    ] o.a.s.c.c.SolrZkClient makePath: /live_nodes/127.0.0.1:56094_
   [junit4]   2> 461257 INFO  (TEST-CloudExitableDirectoryReaderTest.test-seed#[8C03942E2B1BC7F9]) [n:127.0.0.1:56094_    ] o.a.s.c.Overseer Overseer (id=null) closing
   [junit4]   2> 461257 INFO  (TEST-CloudExitableDirectoryReaderTest.test-seed#[8C03942E2B1BC7F9]) [n:127.0.0.1:56094_    ] o.a.s.c.LeaderElector Joined leadership election with path: /overseer_elect/election/94294866791170056-127.0.0.1:56094_-n_0000000001
   [junit4]   2> 461257 INFO  (TEST-CloudExitableDirectoryReaderTest.test-seed#[8C03942E2B1BC7F9]) [n:127.0.0.1:56094_    ] o.a.s.c.LeaderElector Watching path /overseer_elect/election/94294866791170052-127.0.0.1:53975_-n_0000000000 to know if I could be the leader
   [junit4]   2> 461267 INFO  (TEST-CloudExitableDirectoryReaderTest.test-seed#[8C03942E2B1BC7F9]) [n:127.0.0.1:56094_    ] o.a.s.c.CoreContainer No authentication plugin used.
   [junit4]   2> 461268 INFO  (TEST-CloudExitableDirectoryReaderTest.test-seed#[8C03942E2B1BC7F9]) [n:127.0.0.1:56094_    ] o.a.s.c.CoreContainer Security conf doesn't exist. Skipping setup for authorization module.
   [junit4]   2> 461268 INFO  (TEST-CloudExitableDirectoryReaderTest.test-seed#[8C03942E2B1BC7F9]) [n:127.0.0.1:56094_    ] o.a.s.c.CoresLocator Looking for core definitions underneath /home/jenkins/workspace/Lucene-Solr-5.3-Linux/solr/build/solr-core/test/J1/temp/solr.cloud.CloudExitableDirectoryReaderTest_8C03942E2B1BC7F9-001/shard-1-001/cores
   [junit4]   2> 461268 INFO  (TEST-CloudExitableDirectoryReaderTest.test-seed#[8C03942E2B1BC7F9]) [n:127.0.0.1:56094_    ] o.a.s.c.SolrCore Created CoreDescriptor: {name=collection1, config=solrconfig.xml, transient=false, schema=schema.xml, loadOnStartup=true, configSetProperties=configsetprops.json, instanceDir=/home/jenkins/workspace/Lucene-Solr-5.3-Linux/solr/build/solr-core/test/J1/temp/solr.cloud.CloudExitableDirectoryReaderTest_8C03942E2B1BC7F9-001/shard-1-001/cores/collection1, collection=collection1, absoluteInstDir=/home/jenkins/workspace/Lucene-Solr-5.3-Linux/solr/build/solr-core/test/J1/temp/solr.cloud.CloudExitableDirectoryReaderTest_8C03942E2B1BC7F9-001/shard-1-001/cores/collection1/, coreNodeName=, dataDir=data/, shard=}
   [junit4]   2> 461269 INFO  (TEST-CloudExitableDirectoryReaderTest.test-seed#[8C03942E2B1BC7F9]) [n:127.0.0.1:56094_    ] o.a.s.c.CoresLocator Found core collection1 in /home/jenkins/workspace/Lucene-Solr-5.3-Linux/solr/build/solr-core/test/J1/temp/solr.cloud.CloudExitableDirectoryReaderTest_8C03942E2B1BC7F9-001/shard-1-001/cores/collection1/
   [junit4]   2> 461269 INFO  (TEST-CloudExitableDirectoryReaderTest.test-seed#[8C03942E2B1BC7F9]) [n:127.0.0.1:56094_    ] o.a.s.c.CoresLocator Found 1 core definitions
   [junit4]   2> 461269 INFO  (coreLoadExecutor-1006-thread-1-processing-n:127.0.0.1:56094_) [n:127.0.0.1:56094_ c:collection1   x:collection1] o.a.s.c.ZkController publishing state=down
   [junit4]   2> 461269 INFO  (TEST-CloudExitableDirectoryReaderTest.test-seed#[8C03942E2B1BC7F9]) [n:127.0.0.1:56094_    ] o.a.s.s.SolrDispatchFilter user.dir=/home/jenkins/workspace/Lucene-Solr-5.3-Linux/solr/build/solr-core/test/J1
   [junit4]   2> 461269 INFO  (TEST-CloudExitableDirectoryReaderTest.test-seed#[8C03942E2B1BC7F9]) [n:127.0.0.1:56094_    ] o.a.s.s.SolrDispatchFilter SolrDispatchFilter.init() done
   [junit4]   2> 461269 INFO  (coreLoadExecutor-1006-thread-1-processing-n:127.0.0.1:56094_) [n:127.0.0.1:56094_ c:collection1   x:collection1] o.a.s.c.ZkController numShards not found on descriptor - reading it from system property
   [junit4]   2> 461272 INFO  (coreLoadExecutor-1006-thread-1-processing-n:127.0.0.1:56094_) [n:127.0.0.1:56094_ c:collection1   x:collection1] o.a.s.c.ZkController look for our core node name
   [junit4]   2> 461272 INFO  (zkCallback-257-thread-1-processing-n:127.0.0.1:53975_) [n:127.0.0.1:53975_    ] o.a.s.c.DistributedQueue NodeChildrenChanged fired on path /overseer/queue state SyncConnected
   [junit4]   2> 461272 INFO  (OverseerStateUpdate-94294866791170052-127.0.0.1:53975_-n_0000000000) [n:127.0.0.1:53975_    ] o.a.s.c.Overseer processMessage: queueSize: 1, message = {
   [junit4]   2>   "core":"collection1",
   [junit4]   2>   "roles":null,
   [junit4]   2>   "base_url":"http://127.0.0.1:56094",
   [junit4]   2>   "node_name":"127.0.0.1:56094_",
   [junit4]   2>   "numShards":"2",
   [junit4]   2>   "state":"down",
   [junit4]   2>   "shard":null,
   [junit4]   2>   "collection":"collection1",
   [junit4]   2>   "operation":"state"} current state version: 3
   [junit4]   2> 461273 INFO  (OverseerStateUpdate-94294866791170052-127.0.0.1:53975_-n_0000000000) [n:127.0.0.1:53975_    ] o.a.s.c.o.ReplicaMutator Update state numShards=2 message={
   [junit4]   2>   "core":"collection1",
   [junit4]   2>   "roles":null,
   [junit4]   2>   "base_url":"http://127.0.0.1:56094",
   [junit4]   2>   "node_name":"127.0.0.1:56094_",
   [junit4]   2>   "numShards":"2",
   [junit4]   2>   "state":"down",
   [junit4]   2>   "shard":null,
   [junit4]   2>   "collection":"collection1",
   [junit4]   2>   "operation":"state"}
   [junit4]   2> 461273 INFO  (OverseerStateUpdate-94294866791170052-127.0.0.1:53975_-n_0000000000) [n:127.0.0.1:53975_    ] o.a.s.c.o.ClusterStateMutator building a new cName: collection1
   [junit4]   2> 461273 INFO  (OverseerStateUpdate-94294866791170052-127.0.0.1:53975_-n_0000000000) [n:127.0.0.1:53975_    ] o.a.s.c.o.ReplicaMutator Assigning new node to shard shard=shard2
   [junit4]   2> 461374 INFO  (zkCallback-259-thread-1) [    ] o.a.s.c.c.ZkStateReader A cluster state change: WatchedEvent state:SyncConnected type:NodeDataChanged path:/clusterstate.json, has occurred - updating... (live nodes size: 2)
   [junit4]   2> 461374 INFO  (zkCallback-263-thread-1-processing-n:127.0.0.1:56094_) [n:127.0.0.1:56094_    ] o.a.s.c.c.ZkStateReader A cluster state change: WatchedEvent state:SyncConnected type:NodeDataChanged path:/clusterstate.json, has occurred - updating... (live nodes size: 2)
   [junit4]   2> 461374 INFO  (zkCallback-257-thread-1-processing-n:127.0.0.1:53975_) [n:127.0.0.1:53975_    ] o.a.s.c.c.ZkStateReader A cluster state change: WatchedEvent state:SyncConnected type:NodeDataChanged path:/clusterstate.json, has occurred - updating... (live nodes size: 2)
   [junit4]   2> 461375 INFO  (zkCallback-259-thread-1) [    ] o.a.s.c.c.ZkStateReader Updated cluster state version to 4
   [junit4]   2> 461375 INFO  (zkCallback-263-thread-1-processing-n:127.0.0.1:56094_) [n:127.0.0.1:56094_    ] o.a.s.c.c.ZkStateReader Updated cluster state version to 4
   [junit4]   2> 461377 INFO  (zkCallback-257-thread-1-processing-n:127.0.0.1:53975_) [n:127.0.0.1:53975_    ] o.a.s.c.c.ZkStateReader Updated cluster state version to 4
   [junit4]   2> 462272 INFO  (coreLoadExecutor-1006-thread-1-processing-n:127.0.0.1:56094_) [n:127.0.0.1:56094_ c:collection1   x:collection1] o.a.s.c.ZkController waiting to find shard id in clusterstate for collection1
   [junit4]   2> 462272 INFO  (coreLoadExecutor-1006-thread-1-processing-n:127.0.0.1:56094_) [n:127.0.0.1:56094_ c:collection1   x:collection1] o.a.s.c.ZkController Check for collection zkNode:collection1
   [junit4]   2> 462273 INFO  (coreLoadExecutor-1006-thread-1-processing-n:127.0.0.1:56094_) [n:127.0.0.1:56094_ c:collection1   x:collection1] o.a.s.c.ZkController Collection zkNode exists
   [junit4]   2> 462273 INFO  (coreLoadExecutor-1006-thread-1-processing-n:127.0.0.1:56094_) [n:127.0.0.1:56094_ c:collection1   x:collection1] o.a.s.c.c.ZkStateReader Load collection config from:/collections/collection1
   [junit4]   2> 462273 INFO  (coreLoadExecutor-1006-thread-1-processing-n:127.0.0.1:56094_) [n:127.0.0.1:56094_ c:collection1   x:collection1] o.a.s.c.c.ZkStateReader path=/collections/collection1 configName=conf1 specified config exists in ZooKeeper
   [junit4]   2> 462273 INFO  (coreLoadExecutor-1006-thread-1-processing-n:127.0.0.1:56094_) [n:127.0.0.1:56094_ c:collection1   x:collection1] o.a.s.c.SolrResourceLoader new SolrResourceLoader for directory: '/home/jenkins/workspace/Lucene-Solr-5.3-Linux/solr/build/solr-core/test/J1/temp/solr.cloud.CloudExitableDirectoryReaderTest_8C03942E2B1BC7F9-001/shard-1-001/cores/collection1/'
   [junit4]   2> 462280 INFO  (coreLoadExecutor-1006-thread-1-processing-n:127.0.0.1:56094_) [n:127.0.0.1:56094_ c:collection1   x:collection1] o.a.s.c.Config loaded config solrconfig.xml with version 0 
   [junit4]   2> 462283 INFO  (coreLoadExecutor-1006-thread-1-processing-n:127.0.0.1:56094_) [n:127.0.0.1:56094_ c:collection1   x:collection1] o.a.s.c.SolrConfig current version of requestparams : -1
   [junit4]   2> 462285 INFO  (coreLoadExecutor-1006-thread-1-processing-n:127.0.0.1:56094_) [n:127.0.0.1:56094_ c:collection1   x:collection1] o.a.s.c.SolrConfig Using Lucene MatchVersion: 5.3.0
   [junit4]   2> 462290 INFO  (coreLoadExecutor-1006-thread-1-processing-n:127.0.0.1:56094_) [n:127.0.0.1:56094_ c:collection1   x:collection1] o.a.s.c.Config Loaded SolrConfig: solrconfig.xml
   [junit4]   2> 462290 INFO  (coreLoadExecutor-1006-thread-1-processing-n:127.0.0.1:56094_) [n:127.0.0.1:56094_ c:collection1   x:collection1] o.a.s.s.IndexSchema Reading Solr Schema from /configs/conf1/schema.xml
   [junit4]   2> 462294 INFO  (coreLoadExecutor-1006-thread-1-processing-n:127.0.0.1:56094_) [n:127.0.0.1:56094_ c:collection1   x:collection1] o.a.s.s.IndexSchema [collection1] Schema name=test
   [junit4]   2> 462351 INFO  (coreLoadExecutor-1006-thread-1-processing-n:127.0.0.1:56094_) [n:127.0.0.1:56094_ c:collection1   x:collection1] o.a.s.s.OpenExchangeRatesOrgProvider Initialized with rates=open-exchange-rates.json, refreshInterval=1440.
   [junit4]   2> 462355 INFO  (coreLoadExecutor-1006-thread-1-processing-n:127.0.0.1:56094_) [n:127.0.0.1:56094_ c:collection1   x:collection1] o.a.s.s.IndexSchema default search field in schema is text
   [junit4]   2> 462355 INFO  (coreLoadExecutor-1006-thread-1-processing-n:127.0.0.1:56094_) [n:127.0.0.1:56094_ c:collection1   x:collection1] o.a.s.s.IndexSchema unique key field: id
   [junit4]   2> 462359 INFO  (coreLoadExecutor-1006-thread-1-processing-n:127.0.0.1:56094_) [n:127.0.0.1:56094_ c:collection1   x:collection1] o.a.s.s.FileExchangeRateProvider Reloading exchange rates from file currency.xml
   [junit4]   2> 462360 INFO  (coreLoadExecutor-1006-thread-1-processing-n:127.0.0.1:56094_) [n:127.0.0.1:56094_ c:collection1   x:collection1] o.a.s.s.FileExchangeRateProvider Reloading exchange rates from file currency.xml
   [junit4]   2> 462361 INFO  (coreLoadExecutor-1006-thread-1-processing-n:127.0.0.1:56094_) [n:127.0.0.1:56094_ c:collection1   x:collection1] o.a.s.s.OpenExchangeRatesOrgProvider Reloading exchange rates from open-exchange-rates.json
   [junit4]   2> 462361 WARN  (coreLoadExecutor-1006-thread-1-processing-n:127.0.0.1:56094_) [n:127.0.0.1:56094_ c:collection1   x:collection1] o.a.s.s.OpenExchangeRatesOrgProvider Unknown key IMPORTANT NOTE
   [junit4]   2> 462362 WARN  (coreLoadExecutor-1006-thread-1-processing-n:127.0.0.1:56094_) [n:127.0.0.1:56094_ c:collection1   x:collection1] o.a.s.s.OpenExchangeRatesOrgProvider Expected key, got STRING
   [junit4]   2> 462362 INFO  (coreLoadExecutor-1006-thread-1-processing-n:127.0.0.1:56094_) [n:127.0.0.1:56094_ c:collection1   x:collection1] o.a.s.s.OpenExchangeRatesOrgProvider Reloading exchange rates from open-exchange-rates.json
   [junit4]   2> 462362 WARN  (coreLoadExecutor-1006-thread-1-processing-n:127.0.0.1:56094_) [n:127.0.0.1:56094_ c:collection1   x:collection1] o.a.s.s.OpenExchangeRatesOrgProvider Unknown key IMPORTANT NOTE
   [junit4]   2> 462362 WARN  (coreLoadExecutor-1006-thread-1-processing-n:127.0.0.1:56094_) [n:127.0.0.1:56094_ c:collection1   x:collection1] o.a.s.s.OpenExchangeRatesOrgProvider Expected key, got STRING
   [junit4]   2> 462363 INFO  (coreLoadExecutor-1006-thread-1-processing-n:127.0.0.1:56094_) [n:127.0.0.1:56094_ c:collection1   x:collection1] o.a.s.c.ConfigSetProperties Did not find ConfigSet properties, assuming default properties: Can't find resource 'configsetprops.json' in classpath or '/configs/conf1', cwd=/home/jenkins/workspace/Lucene-Solr-5.3-Linux/solr/build/solr-core/test/J1
   [junit4]   2> 462363 INFO  (coreLoadExecutor-1006-thread-1-processing-n:127.0.0.1:56094_) [n:127.0.0.1:56094_ c:collection1   x:collection1] o.a.s.c.CoreContainer Creating SolrCore 'collection1' using configuration from collection collection1
   [junit4]   2> 462363 INFO  (coreLoadExecutor-1006-thread-1-processing-n:127.0.0.1:56094_) [n:127.0.0.1:56094_ c:collection1 s:shard2 r:core_node1 x:collection1] o.a.s.c.SolrCore org.apache.solr.core.MockDirectoryFactory
   [junit4]   2> 462363 INFO  (coreLoadExecutor-1006-thread-1-processing-n:127.0.0.1:56094_) [n:127.0.0.1:56094_ c:collection1 s:shard2 r:core_node1 x:collection1] o.a.s.c.SolrCore [[collection1] ] Opening new SolrCore at [/home/jenkins/workspace/Lucene-Solr-5.3-Linux/solr/build/solr-core/test/J1/temp/solr.cloud.CloudExitableDirectoryReaderTest_8C03942E2B1BC7F9-001/shard-1-001/cores/collection1/], dataDir=[null]
   [junit4]   2> 462363 INFO  (coreLoadExecutor-1006-thread-1-processing-n:127.0.0.1:56094_) [n:127.0.0.1:56094_ c:collection1 s:shard2 r:core_node1 x:collection1] o.a.s.c.JmxMonitoredMap JMX monitoring is enabled. Adding Solr mbeans to JMX Server: com.sun.jmx.mbeanserver.JmxMBeanServer@450d98
   [junit4]   2> 462363 INFO  (coreLoadExecutor-1006-thread-1-processing-n:127.0.0.1:56094_) [n:127.0.0.1:56094_ c:collection1 s:shard2 r:core_node1 x:collection1] o.a.s.c.CachingDirectoryFactory return new directory for /home/jenkins/workspace/Lucene-Solr-5.3-Linux/solr/build/solr-core/test/J1/temp/solr.cloud.CloudExitableDirectoryReaderTest_8C03942E2B1BC7F9-001/shard-1-001/cores/collection1/data
   [junit4]   2> 462364 INFO  (coreLoadExecutor-1006-thread-1-processing-n:127.0.0.1:56094_) [n:127.0.0.1:56094_ c:collection1 s:shard2 r:core_node1 x:collection1] o.a.s.c.SolrCore New index directory detected: old=null new=/home/jenkins/workspace/Lucene-Solr-5.3-Linux/solr/build/solr-core/test/J1/temp/solr.cloud.CloudExitableDirectoryReaderTest_8C03942E2B1BC7F9-001/shard-1-001/cores/collection1/data/index/
   [junit4]   2> 462364 WARN  (coreLoadExecutor-1006-thread-1-processing-n:127.0.0.1:56094_) [n:127.0.0.1:56094_ c:collection1 s:shard2 r:core_node1 x:collection1] o.a.s.c.SolrCore [collection1] Solr index directory '/home/jenkins/workspace/Lucene-Solr-5.3-Linux/solr/build/solr-core/test/J1/temp/solr.cloud.CloudExitableDirectoryReaderTest_8C03942E2B1BC7F9-001/shard-1-001/cores/collection1/data/index' doesn't exist. Creating new index...
   [junit4]   2> 462364 INFO  (coreLoadExecutor-1006-thread-1-processing-n:127.0.0.1:56094_) [n:127.0.0.1:56094_ c:collection1 s:shard2 r:core_node1 x:collection1] o.a.s.c.CachingDirectoryFactory return new directory for /home/jenkins/workspace/Lucene-Solr-5.3-Linux/solr/build/solr-core/test/J1/temp/solr.cloud.CloudExitableDirectoryReaderTest_8C03942E2B1BC7F9-001/shard-1-001/cores/collection1/data/index
   [junit4]   2> 462364 INFO  (coreLoadExecutor-1006-thread-1-processing-n:127.0.0.1:56094_) [n:127.0.0.1:56094_ c:collection1 s:shard2 r:core_node1 x:collection1] o.a.s.u.RandomMergePolicy RandomMergePolicy wrapping class org.apache.lucene.index.TieredMergePolicy: [TieredMergePolicy: maxMergeAtOnce=37, maxMergeAtOnceExplicit=24, maxMergedSegmentMB=67.9091796875, floorSegmentMB=1.9951171875, forceMergeDeletesPctAllowed=20.03602134687799, segmentsPerTier=49.0, maxCFSSegmentSizeMB=8.796093022207999E12, noCFSRatio=0.6719410688715178
   [junit4]   2> 462364 INFO  (coreLoadExecutor-1006-thread-1-processing-n:127.0.0.1:56094_) [n:127.0.0.1:56094_ c:collection1 s:shard2 r:core_node1 x:collection1] o.a.s.c.SolrCore SolrDeletionPolicy.onCommit: commits: num=1
   [junit4]   2> 	commit{dir=MockDirectoryWrapper(RAMDirectory@2d80e0 lockFactory=org.apache.lucene.store.SingleInstanceLockFactory@1123b01),segFN=segments_1,generation=1}
   [junit4]   2> 462364 INFO  (coreLoadExecutor-1006-thread-1-processing-n:127.0.0.1:56094_) [n:127.0.0.1:56094_ c:collection1 s:shard2 r:core_node1 x:collection1] o.a.s.c.SolrCore newest commit generation = 1
   [junit4]   2> 462365 INFO  (OldIndexDirectoryCleanupThreadForCore-collection1) [n:127.0.0.1:56094_ c:collection1 s:shard2 r:core_node1 x:collection1] o.a.s.c.SolrCore Looking for old index directories to cleanup for core collection1 in /home/jenkins/workspa

[...truncated too long message...]

derTest_8C03942E2B1BC7F9-001/shard-4-001/cores/collection1/data/index [CachedDir<<refCount=0;path=/home/jenkins/workspace/Lucene-Solr-5.3-Linux/solr/build/solr-core/test/J1/temp/solr.cloud.CloudExitableDirectoryReaderTest_8C03942E2B1BC7F9-001/shard-4-001/cores/collection1/data/index;done=false>>]
   [junit4]   2> 487561 INFO  (zkCallback-276-thread-1-processing-n:127.0.0.1:58942_) [n:127.0.0.1:58942_ c:collection1 s:shard1 r:core_node4 x:collection1] o.a.s.c.CachingDirectoryFactory Closing directory: /home/jenkins/workspace/Lucene-Solr-5.3-Linux/solr/build/solr-core/test/J1/temp/solr.cloud.CloudExitableDirectoryReaderTest_8C03942E2B1BC7F9-001/shard-4-001/cores/collection1/data/index
   [junit4]   2> 487561 INFO  (zkCallback-276-thread-1-processing-n:127.0.0.1:58942_) [n:127.0.0.1:58942_ c:collection1 s:shard1 r:core_node4 x:collection1] o.a.s.c.CachingDirectoryFactory looking to close /home/jenkins/workspace/Lucene-Solr-5.3-Linux/solr/build/solr-core/test/J1/temp/solr.cloud.CloudExitableDirectoryReaderTest_8C03942E2B1BC7F9-001/shard-4-001/cores/collection1/data [CachedDir<<refCount=0;path=/home/jenkins/workspace/Lucene-Solr-5.3-Linux/solr/build/solr-core/test/J1/temp/solr.cloud.CloudExitableDirectoryReaderTest_8C03942E2B1BC7F9-001/shard-4-001/cores/collection1/data;done=false>>]
   [junit4]   2> 487561 INFO  (zkCallback-276-thread-1-processing-n:127.0.0.1:58942_) [n:127.0.0.1:58942_ c:collection1 s:shard1 r:core_node4 x:collection1] o.a.s.c.CachingDirectoryFactory Closing directory: /home/jenkins/workspace/Lucene-Solr-5.3-Linux/solr/build/solr-core/test/J1/temp/solr.cloud.CloudExitableDirectoryReaderTest_8C03942E2B1BC7F9-001/shard-4-001/cores/collection1/data
   [junit4]   2> 488076 WARN  (zkCallback-276-thread-2-processing-n:127.0.0.1:58942_) [n:127.0.0.1:58942_    ] o.a.s.c.c.ZkStateReader ZooKeeper watch triggered, but Solr cannot talk to ZK
   [junit4]   2> 488076 INFO  (TEST-CloudExitableDirectoryReaderTest.test-seed#[8C03942E2B1BC7F9]) [    ] o.e.j.s.ServerConnector Stopped ServerConnector@6e68bd{HTTP/1.1}{127.0.0.1:0}
   [junit4]   2> 488076 INFO  (TEST-CloudExitableDirectoryReaderTest.test-seed#[8C03942E2B1BC7F9]) [    ] o.e.j.s.h.ContextHandler Stopped o.e.j.s.ServletContextHandler@a4dfeb{/,null,UNAVAILABLE}
   [junit4]   2> 488077 INFO  (TEST-CloudExitableDirectoryReaderTest.test-seed#[8C03942E2B1BC7F9]) [n:127.0.0.1:58942_ c:collection1 s:shard1 r:core_node4 x:collection1] o.a.s.c.ZkTestServer connecting to 127.0.0.1:48772 48772
   [junit4]   2> 488187 INFO  (Thread-871) [    ] o.a.s.c.ZkTestServer connecting to 127.0.0.1:48772 48772
   [junit4]   2> 488188 WARN  (Thread-871) [    ] o.a.s.c.ZkTestServer Watch limit violations: 
   [junit4]   2> Maximum concurrent create/delete watches above limit:
   [junit4]   2> 
   [junit4]   2> 	6	/solr/aliases.json
   [junit4]   2> 	6	/solr/clusterstate.json
   [junit4]   2> 	5	/solr/configs/conf1
   [junit4]   2> 
   [junit4]   2> Maximum concurrent children watches above limit:
   [junit4]   2> 
   [junit4]   2> 	6	/solr/live_nodes
   [junit4]   2> 	4	/solr/overseer/queue
   [junit4]   2> 	4	/solr/overseer/collection-queue-work
   [junit4]   2> 
   [junit4]   2> NOTE: reproduce with: ant test  -Dtestcase=CloudExitableDirectoryReaderTest -Dtests.method=test -Dtests.seed=8C03942E2B1BC7F9 -Dtests.multiplier=3 -Dtests.slow=true -Dtests.locale=ar_BH -Dtests.timezone=America/Dominica -Dtests.asserts=true -Dtests.file.encoding=ISO-8859-1
   [junit4] ERROR   29.9s J1 | CloudExitableDirectoryReaderTest.test <<<
   [junit4]    > Throwable #1: org.apache.solr.client.solrj.SolrServerException: No live SolrServers available to handle this request:[http://127.0.0.1:56094/collection1]
   [junit4]    > 	at __randomizedtesting.SeedInfo.seed([8C03942E2B1BC7F9:457ABF485E7AA01]:0)
   [junit4]    > 	at org.apache.solr.client.solrj.impl.LBHttpSolrClient.request(LBHttpSolrClient.java:355)
   [junit4]    > 	at org.apache.solr.client.solrj.impl.CloudSolrClient.sendRequest(CloudSolrClient.java:1086)
   [junit4]    > 	at org.apache.solr.client.solrj.impl.CloudSolrClient.requestWithRetryOnStaleState(CloudSolrClient.java:856)
   [junit4]    > 	at org.apache.solr.client.solrj.impl.CloudSolrClient.request(CloudSolrClient.java:799)
   [junit4]    > 	at org.apache.solr.client.solrj.SolrRequest.process(SolrRequest.java:135)
   [junit4]    > 	at org.apache.solr.client.solrj.SolrClient.query(SolrClient.java:943)
   [junit4]    > 	at org.apache.solr.client.solrj.SolrClient.query(SolrClient.java:958)
   [junit4]    > 	at org.apache.solr.cloud.AbstractFullDistribZkTestBase.queryServer(AbstractFullDistribZkTestBase.java:1376)
   [junit4]    > 	at org.apache.solr.cloud.CloudExitableDirectoryReaderTest.assertPartialResults(CloudExitableDirectoryReaderTest.java:102)
   [junit4]    > 	at org.apache.solr.cloud.CloudExitableDirectoryReaderTest.doTimeoutTests(CloudExitableDirectoryReaderTest.java:86)
   [junit4]    > 	at org.apache.solr.cloud.CloudExitableDirectoryReaderTest.test(CloudExitableDirectoryReaderTest.java:53)
   [junit4]    > 	at org.apache.solr.BaseDistributedSearchTestCase$ShardsRepeatRule$ShardsFixedStatement.callStatement(BaseDistributedSearchTestCase.java:963)
   [junit4]    > 	at org.apache.solr.BaseDistributedSearchTestCase$ShardsRepeatRule$ShardsStatement.evaluate(BaseDistributedSearchTestCase.java:938)
   [junit4]    > 	at java.lang.Thread.run(Thread.java:745)
   [junit4]    > Caused by: org.apache.solr.client.solrj.impl.HttpSolrClient$RemoteSolrException: Error from server at http://127.0.0.1:56094/collection1: org.apache.solr.client.solrj.SolrServerException: No live SolrServers available to handle this request
   [junit4]    > 	at org.apache.solr.client.solrj.impl.HttpSolrClient.executeMethod(HttpSolrClient.java:560)
   [junit4]    > 	at org.apache.solr.client.solrj.impl.HttpSolrClient.request(HttpSolrClient.java:234)
   [junit4]    > 	at org.apache.solr.client.solrj.impl.HttpSolrClient.request(HttpSolrClient.java:226)
   [junit4]    > 	at org.apache.solr.client.solrj.impl.LBHttpSolrClient.doRequest(LBHttpSolrClient.java:376)
   [junit4]    > 	at org.apache.solr.client.solrj.impl.LBHttpSolrClient.request(LBHttpSolrClient.java:328)
   [junit4]    > 	... 51 more
   [junit4]   2> 488195 INFO  (SUITE-CloudExitableDirectoryReaderTest-seed#[8C03942E2B1BC7F9]-worker) [n:127.0.0.1:58942_ c:collection1 s:shard1 r:core_node4 x:collection1] o.a.s.SolrTestCaseJ4 ###deleteCore
   [junit4]   2> NOTE: leaving temporary files on disk at: /home/jenkins/workspace/Lucene-Solr-5.3-Linux/solr/build/solr-core/test/J1/temp/solr.cloud.CloudExitableDirectoryReaderTest_8C03942E2B1BC7F9-001
   [junit4]   2> Aug 06, 2015 1:45:11 AM com.carrotsearch.randomizedtesting.ThreadLeakControl checkThreadLeaks
   [junit4]   2> WARNING: Will linger awaiting termination of 1 leaked thread(s).
   [junit4]   2> NOTE: test params are: codec=Asserting(Lucene53): {range_facet_l_dv=PostingsFormat(name=Memory doPackFST= true), _version_=BlockTreeOrds(blocksize=128), multiDefault=PostingsFormat(name=LuceneVarGapDocFreqInterval), name=PostingsFormat(name=Memory doPackFST= true), intDefault=BlockTreeOrds(blocksize=128), id=PostingsFormat(name=Memory doPackFST= true), range_facet_i_dv=BlockTreeOrds(blocksize=128), range_facet_l=BlockTreeOrds(blocksize=128), timestamp=BlockTreeOrds(blocksize=128)}, docValues:{range_facet_l_dv=DocValuesFormat(name=Lucene50), range_facet_i_dv=DocValuesFormat(name=Asserting), timestamp=DocValuesFormat(name=Asserting)}, sim=DefaultSimilarity, locale=ar_BH, timezone=America/Dominica
   [junit4]   2> NOTE: Linux 3.16.0-44-generic i386/Oracle Corporation 1.8.0_60-ea (32-bit)/cpus=12,threads=2,free=76401960,total=293863424
   [junit4]   2> NOTE: All tests run in this JVM: [CollectionsAPIDistributedZkTest, TestStandardQParsers, HdfsDirectoryFactoryTest, TestFastWriter, BasicFunctionalityTest, TestAddFieldRealTimeGet, ShardRoutingTest, TestReRankQParserPlugin, DistributedQueueTest, TestLMJelinekMercerSimilarityFactory, TestSearchPerf, PreAnalyzedFieldTest, BigEndianAscendingWordDeserializerTest, ChaosMonkeySafeLeaderTest, FacetPivotSmallTest, CoreAdminHandlerTest, DistanceFunctionTest, SpellingQueryConverterTest, DistributedMLTComponentTest, HdfsCollectionsAPIDistributedZkTest, TestCharFilters, TestDistributedStatsComponentCardinality, ShardRoutingCustomTest, DistribCursorPagingTest, TestReloadAndDeleteDocs, HdfsChaosMonkeySafeLeaderTest, TestSortByMinMaxFunction, OpenCloseCoreStressTest, DistributedFacetPivotLongTailTest, TestManagedResourceStorage, SuggesterTSTTest, TestLFUCache, TestSearcherReuse, TestFieldSortValues, ClusterStateUpdateTest, IndexSchemaRuntimeFieldTest, ResourceLoaderTest, SSLMigrationTest, InfoHandlerTest, TestMissingGroups, TestDistribDocBasedVersion, CloudExitableDirectoryReaderTest]
   [junit4] Completed [177/527] on J1 in 30.12s, 1 test, 1 error <<< FAILURES!

[...truncated 1079 lines...]
BUILD FAILED
/home/jenkins/workspace/Lucene-Solr-5.3-Linux/build.xml:726: The following error occurred while executing this line:
/home/jenkins/workspace/Lucene-Solr-5.3-Linux/build.xml:670: The following error occurred while executing this line:
/home/jenkins/workspace/Lucene-Solr-5.3-Linux/build.xml:59: The following error occurred while executing this line:
/home/jenkins/workspace/Lucene-Solr-5.3-Linux/solr/build.xml:230: The following error occurred while executing this line:
/home/jenkins/workspace/Lucene-Solr-5.3-Linux/solr/common-build.xml:524: The following error occurred while executing this line:
/home/jenkins/workspace/Lucene-Solr-5.3-Linux/lucene/common-build.xml:1449: The following error occurred while executing this line:
/home/jenkins/workspace/Lucene-Solr-5.3-Linux/lucene/common-build.xml:1003: There were test failures: 527 suites, 2091 tests, 1 error, 66 ignored (30 assumptions)

Total time: 50 minutes 15 seconds
Build step 'Invoke Ant' marked build as failure
Archiving artifacts
Recording test results
Email was triggered for: Failure - Any
Sending email for trigger: Failure - Any



Mime
View raw message