lucene-dev mailing list archives

Site index · List index
Message view « Date » · « Thread »
Top « Date » · « Thread »
From Apache Jenkins Server <jenk...@builds.apache.org>
Subject [JENKINS] Lucene-Solr-Tests-trunk-Java8 - Build # 261 - Failure
Date Wed, 05 Aug 2015 18:29:47 GMT
Build: https://builds.apache.org/job/Lucene-Solr-Tests-trunk-Java8/261/

1 tests failed.
FAILED:  junit.framework.TestSuite.org.apache.solr.update.HardAutoCommitTest

Error Message:
ObjectTracker found 2 object(s) that were not released!!! [TransactionLog]

Stack Trace:
java.lang.AssertionError: ObjectTracker found 2 object(s) that were not released!!! [TransactionLog]
	at __randomizedtesting.SeedInfo.seed([21987850F5B91097]:0)
	at org.junit.Assert.fail(Assert.java:93)
	at org.junit.Assert.assertTrue(Assert.java:43)
	at org.junit.Assert.assertNull(Assert.java:551)
	at org.apache.solr.SolrTestCaseJ4.afterClass(SolrTestCaseJ4.java:236)
	at sun.reflect.GeneratedMethodAccessor39.invoke(Unknown Source)
	at sun.reflect.DelegatingMethodAccessorImpl.invoke(DelegatingMethodAccessorImpl.java:43)
	at java.lang.reflect.Method.invoke(Method.java:497)
	at com.carrotsearch.randomizedtesting.RandomizedRunner.invoke(RandomizedRunner.java:1627)
	at com.carrotsearch.randomizedtesting.RandomizedRunner$5.evaluate(RandomizedRunner.java:799)
	at com.carrotsearch.randomizedtesting.rules.StatementAdapter.evaluate(StatementAdapter.java:36)
	at com.carrotsearch.randomizedtesting.rules.SystemPropertiesRestoreRule$1.evaluate(SystemPropertiesRestoreRule.java:57)
	at org.apache.lucene.util.AbstractBeforeAfterRule$1.evaluate(AbstractBeforeAfterRule.java:46)
	at com.carrotsearch.randomizedtesting.rules.StatementAdapter.evaluate(StatementAdapter.java:36)
	at org.apache.lucene.util.TestRuleStoreClassName$1.evaluate(TestRuleStoreClassName.java:42)
	at com.carrotsearch.randomizedtesting.rules.NoShadowingOrOverridesOnMethodsRule$1.evaluate(NoShadowingOrOverridesOnMethodsRule.java:39)
	at com.carrotsearch.randomizedtesting.rules.NoShadowingOrOverridesOnMethodsRule$1.evaluate(NoShadowingOrOverridesOnMethodsRule.java:39)
	at com.carrotsearch.randomizedtesting.rules.StatementAdapter.evaluate(StatementAdapter.java:36)
	at com.carrotsearch.randomizedtesting.rules.StatementAdapter.evaluate(StatementAdapter.java:36)
	at com.carrotsearch.randomizedtesting.rules.StatementAdapter.evaluate(StatementAdapter.java:36)
	at org.apache.lucene.util.TestRuleAssertionsRequired$1.evaluate(TestRuleAssertionsRequired.java:54)
	at org.apache.lucene.util.TestRuleMarkFailure$1.evaluate(TestRuleMarkFailure.java:48)
	at org.apache.lucene.util.TestRuleIgnoreAfterMaxFailures$1.evaluate(TestRuleIgnoreAfterMaxFailures.java:65)
	at org.apache.lucene.util.TestRuleIgnoreTestSuites$1.evaluate(TestRuleIgnoreTestSuites.java:55)
	at com.carrotsearch.randomizedtesting.rules.StatementAdapter.evaluate(StatementAdapter.java:36)
	at com.carrotsearch.randomizedtesting.ThreadLeakControl$StatementRunner.run(ThreadLeakControl.java:365)
	at java.lang.Thread.run(Thread.java:745)




Build Log:
[...truncated 10598 lines...]
   [junit4] Suite: org.apache.solr.update.HardAutoCommitTest
   [junit4]   2> Creating dataDir: /x1/jenkins/jenkins-slave/workspace/Lucene-Solr-Tests-trunk-Java8/solr/build/solr-core/test/J1/temp/solr.update.HardAutoCommitTest_21987850F5B91097-001/init-core-data-001
   [junit4]   2> 1395809 INFO  (SUITE-HardAutoCommitTest-seed#[21987850F5B91097]-worker) [    ] o.a.s.SolrTestCaseJ4 Randomized ssl (false) and clientAuth (false)
   [junit4]   2> 1395810 INFO  (SUITE-HardAutoCommitTest-seed#[21987850F5B91097]-worker) [    ] o.a.s.SolrTestCaseJ4 ####initCore
   [junit4]   2> 1395810 INFO  (SUITE-HardAutoCommitTest-seed#[21987850F5B91097]-worker) [    ] o.a.s.c.SolrResourceLoader new SolrResourceLoader for directory: '/x1/jenkins/jenkins-slave/workspace/Lucene-Solr-Tests-trunk-Java8/solr/core/src/test-files/solr/collection1/'
   [junit4]   2> 1395810 INFO  (SUITE-HardAutoCommitTest-seed#[21987850F5B91097]-worker) [    ] o.a.s.c.SolrResourceLoader Adding 'file:/x1/jenkins/jenkins-slave/workspace/Lucene-Solr-Tests-trunk-Java8/solr/core/src/test-files/solr/collection1/lib/.svn/' to classloader
   [junit4]   2> 1395811 INFO  (SUITE-HardAutoCommitTest-seed#[21987850F5B91097]-worker) [    ] o.a.s.c.SolrResourceLoader Adding 'file:/x1/jenkins/jenkins-slave/workspace/Lucene-Solr-Tests-trunk-Java8/solr/core/src/test-files/solr/collection1/lib/classes/' to classloader
   [junit4]   2> 1395811 INFO  (SUITE-HardAutoCommitTest-seed#[21987850F5B91097]-worker) [    ] o.a.s.c.SolrResourceLoader Adding 'file:/x1/jenkins/jenkins-slave/workspace/Lucene-Solr-Tests-trunk-Java8/solr/core/src/test-files/solr/collection1/lib/README' to classloader
   [junit4]   2> 1395923 INFO  (SUITE-HardAutoCommitTest-seed#[21987850F5B91097]-worker) [    ] o.a.s.c.SolrConfig current version of requestparams : -1
   [junit4]   2> 1395948 INFO  (SUITE-HardAutoCommitTest-seed#[21987850F5B91097]-worker) [    ] o.a.s.c.SolrConfig Using Lucene MatchVersion: 6.0.0
   [junit4]   2> 1396072 INFO  (SUITE-HardAutoCommitTest-seed#[21987850F5B91097]-worker) [    ] o.a.s.c.Config Loaded SolrConfig: solrconfig.xml
   [junit4]   2> 1396073 INFO  (SUITE-HardAutoCommitTest-seed#[21987850F5B91097]-worker) [    ] o.a.s.s.IndexSchema Reading Solr Schema from /x1/jenkins/jenkins-slave/workspace/Lucene-Solr-Tests-trunk-Java8/solr/core/src/test-files/solr/collection1/conf/schema.xml
   [junit4]   2> 1396077 INFO  (SUITE-HardAutoCommitTest-seed#[21987850F5B91097]-worker) [    ] o.a.s.s.IndexSchema [null] Schema name=test
   [junit4]   2> 1396216 INFO  (SUITE-HardAutoCommitTest-seed#[21987850F5B91097]-worker) [    ] o.a.s.s.OpenExchangeRatesOrgProvider Initialized with rates=open-exchange-rates.json, refreshInterval=1440.
   [junit4]   2> 1396222 INFO  (SUITE-HardAutoCommitTest-seed#[21987850F5B91097]-worker) [    ] o.a.s.s.IndexSchema default search field in schema is text
   [junit4]   2> 1396223 INFO  (SUITE-HardAutoCommitTest-seed#[21987850F5B91097]-worker) [    ] o.a.s.s.IndexSchema unique key field: id
   [junit4]   2> 1396231 INFO  (SUITE-HardAutoCommitTest-seed#[21987850F5B91097]-worker) [    ] o.a.s.s.FileExchangeRateProvider Reloading exchange rates from file currency.xml
   [junit4]   2> 1396233 INFO  (SUITE-HardAutoCommitTest-seed#[21987850F5B91097]-worker) [    ] o.a.s.s.FileExchangeRateProvider Reloading exchange rates from file currency.xml
   [junit4]   2> 1396234 INFO  (SUITE-HardAutoCommitTest-seed#[21987850F5B91097]-worker) [    ] o.a.s.s.OpenExchangeRatesOrgProvider Reloading exchange rates from open-exchange-rates.json
   [junit4]   2> 1396234 WARN  (SUITE-HardAutoCommitTest-seed#[21987850F5B91097]-worker) [    ] o.a.s.s.OpenExchangeRatesOrgProvider Unknown key IMPORTANT NOTE
   [junit4]   2> 1396235 WARN  (SUITE-HardAutoCommitTest-seed#[21987850F5B91097]-worker) [    ] o.a.s.s.OpenExchangeRatesOrgProvider Expected key, got STRING
   [junit4]   2> 1396235 INFO  (SUITE-HardAutoCommitTest-seed#[21987850F5B91097]-worker) [    ] o.a.s.s.OpenExchangeRatesOrgProvider Reloading exchange rates from open-exchange-rates.json
   [junit4]   2> 1396235 WARN  (SUITE-HardAutoCommitTest-seed#[21987850F5B91097]-worker) [    ] o.a.s.s.OpenExchangeRatesOrgProvider Unknown key IMPORTANT NOTE
   [junit4]   2> 1396235 WARN  (SUITE-HardAutoCommitTest-seed#[21987850F5B91097]-worker) [    ] o.a.s.s.OpenExchangeRatesOrgProvider Expected key, got STRING
   [junit4]   2> 1396235 INFO  (SUITE-HardAutoCommitTest-seed#[21987850F5B91097]-worker) [    ] o.a.s.c.SolrResourceLoader JNDI not configured for solr (NoInitialContextEx)
   [junit4]   2> 1396235 INFO  (SUITE-HardAutoCommitTest-seed#[21987850F5B91097]-worker) [    ] o.a.s.c.SolrResourceLoader using system property solr.solr.home: /x1/jenkins/jenkins-slave/workspace/Lucene-Solr-Tests-trunk-Java8/solr/core/src/test-files/solr
   [junit4]   2> 1396236 INFO  (SUITE-HardAutoCommitTest-seed#[21987850F5B91097]-worker) [    ] o.a.s.c.SolrResourceLoader new SolrResourceLoader for directory: '/x1/jenkins/jenkins-slave/workspace/Lucene-Solr-Tests-trunk-Java8/solr/core/src/test-files/solr/'
   [junit4]   2> 1396249 INFO  (SUITE-HardAutoCommitTest-seed#[21987850F5B91097]-worker) [    ] o.a.s.c.CoreContainer New CoreContainer 282652001
   [junit4]   2> 1396249 INFO  (SUITE-HardAutoCommitTest-seed#[21987850F5B91097]-worker) [    ] o.a.s.c.CoreContainer Loading cores into CoreContainer [instanceDir=/x1/jenkins/jenkins-slave/workspace/Lucene-Solr-Tests-trunk-Java8/solr/core/src/test-files/solr/]
   [junit4]   2> 1396249 INFO  (SUITE-HardAutoCommitTest-seed#[21987850F5B91097]-worker) [    ] o.a.s.c.CoreContainer loading shared library: /x1/jenkins/jenkins-slave/workspace/Lucene-Solr-Tests-trunk-Java8/solr/core/src/test-files/solr/lib
   [junit4]   2> 1396249 WARN  (SUITE-HardAutoCommitTest-seed#[21987850F5B91097]-worker) [    ] o.a.s.c.SolrResourceLoader Can't find (or read) directory to add to classloader: lib (resolved as: /x1/jenkins/jenkins-slave/workspace/Lucene-Solr-Tests-trunk-Java8/solr/core/src/test-files/solr/lib).
   [junit4]   2> 1396260 INFO  (SUITE-HardAutoCommitTest-seed#[21987850F5B91097]-worker) [    ] o.a.s.h.c.HttpShardHandlerFactory created with socketTimeout : 600000,connTimeout : 60000,maxConnectionsPerHost : 20,maxConnections : 10000,corePoolSize : 0,maximumPoolSize : 2147483647,maxThreadIdleTime : 5,sizeOfQueue : -1,fairnessPolicy : false,useRetries : false,
   [junit4]   2> 1396262 INFO  (SUITE-HardAutoCommitTest-seed#[21987850F5B91097]-worker) [    ] o.a.s.u.UpdateShardHandler Creating UpdateShardHandler HTTP client with params: socketTimeout=30000&connTimeout=30000&retry=true
   [junit4]   2> 1396262 INFO  (SUITE-HardAutoCommitTest-seed#[21987850F5B91097]-worker) [    ] o.a.s.l.LogWatcher SLF4J impl is org.slf4j.impl.Log4jLoggerFactory
   [junit4]   2> 1396262 INFO  (SUITE-HardAutoCommitTest-seed#[21987850F5B91097]-worker) [    ] o.a.s.l.LogWatcher Registering Log Listener [Log4j (org.slf4j.impl.Log4jLoggerFactory)]
   [junit4]   2> 1396262 INFO  (SUITE-HardAutoCommitTest-seed#[21987850F5B91097]-worker) [    ] o.a.s.c.CoreContainer No authentication plugin used.
   [junit4]   2> 1396263 INFO  (SUITE-HardAutoCommitTest-seed#[21987850F5B91097]-worker) [    ] o.a.s.c.SolrCore Created CoreDescriptor: {name=collection1, config=solrconfig.xml, transient=false, schema=schema.xml, loadOnStartup=true, configSetProperties=configsetprops.json, instanceDir=collection1, collection=collection1, absoluteInstDir=/x1/jenkins/jenkins-slave/workspace/Lucene-Solr-Tests-trunk-Java8/solr/core/src/test-files/solr/collection1/, dataDir=/x1/jenkins/jenkins-slave/workspace/Lucene-Solr-Tests-trunk-Java8/solr/build/solr-core/test/J1/temp/solr.update.HardAutoCommitTest_21987850F5B91097-001/init-core-data-001, shard=shard1}
   [junit4]   2> 1396264 INFO  (coreLoadExecutor-3216-thread-1) [    ] o.a.s.c.SolrResourceLoader new SolrResourceLoader for directory: '/x1/jenkins/jenkins-slave/workspace/Lucene-Solr-Tests-trunk-Java8/solr/core/src/test-files/solr/collection1/'
   [junit4]   2> 1396271 INFO  (coreLoadExecutor-3216-thread-1) [    ] o.a.s.c.SolrResourceLoader Adding 'file:/x1/jenkins/jenkins-slave/workspace/Lucene-Solr-Tests-trunk-Java8/solr/core/src/test-files/solr/collection1/lib/.svn/' to classloader
   [junit4]   2> 1396271 INFO  (coreLoadExecutor-3216-thread-1) [    ] o.a.s.c.SolrResourceLoader Adding 'file:/x1/jenkins/jenkins-slave/workspace/Lucene-Solr-Tests-trunk-Java8/solr/core/src/test-files/solr/collection1/lib/classes/' to classloader
   [junit4]   2> 1396271 INFO  (coreLoadExecutor-3216-thread-1) [    ] o.a.s.c.SolrResourceLoader Adding 'file:/x1/jenkins/jenkins-slave/workspace/Lucene-Solr-Tests-trunk-Java8/solr/core/src/test-files/solr/collection1/lib/README' to classloader
   [junit4]   2> 1396290 INFO  (coreLoadExecutor-3216-thread-1) [    ] o.a.s.c.SolrConfig current version of requestparams : -1
   [junit4]   2> 1396299 INFO  (coreLoadExecutor-3216-thread-1) [    ] o.a.s.c.SolrConfig Using Lucene MatchVersion: 6.0.0
   [junit4]   2> 1396319 INFO  (coreLoadExecutor-3216-thread-1) [    ] o.a.s.c.Config Loaded SolrConfig: solrconfig.xml
   [junit4]   2> 1396319 INFO  (coreLoadExecutor-3216-thread-1) [    ] o.a.s.s.IndexSchema Reading Solr Schema from /x1/jenkins/jenkins-slave/workspace/Lucene-Solr-Tests-trunk-Java8/solr/core/src/test-files/solr/collection1/conf/schema.xml
   [junit4]   2> 1396323 INFO  (coreLoadExecutor-3216-thread-1) [    ] o.a.s.s.IndexSchema [collection1] Schema name=test
   [junit4]   2> 1396514 INFO  (coreLoadExecutor-3216-thread-1) [    ] o.a.s.s.OpenExchangeRatesOrgProvider Initialized with rates=open-exchange-rates.json, refreshInterval=1440.
   [junit4]   2> 1396519 INFO  (coreLoadExecutor-3216-thread-1) [    ] o.a.s.s.IndexSchema default search field in schema is text
   [junit4]   2> 1396520 INFO  (coreLoadExecutor-3216-thread-1) [    ] o.a.s.s.IndexSchema unique key field: id
   [junit4]   2> 1396525 INFO  (coreLoadExecutor-3216-thread-1) [    ] o.a.s.s.FileExchangeRateProvider Reloading exchange rates from file currency.xml
   [junit4]   2> 1396527 INFO  (coreLoadExecutor-3216-thread-1) [    ] o.a.s.s.FileExchangeRateProvider Reloading exchange rates from file currency.xml
   [junit4]   2> 1396529 INFO  (coreLoadExecutor-3216-thread-1) [    ] o.a.s.s.OpenExchangeRatesOrgProvider Reloading exchange rates from open-exchange-rates.json
   [junit4]   2> 1396529 WARN  (coreLoadExecutor-3216-thread-1) [    ] o.a.s.s.OpenExchangeRatesOrgProvider Unknown key IMPORTANT NOTE
   [junit4]   2> 1396530 WARN  (coreLoadExecutor-3216-thread-1) [    ] o.a.s.s.OpenExchangeRatesOrgProvider Expected key, got STRING
   [junit4]   2> 1396530 INFO  (coreLoadExecutor-3216-thread-1) [    ] o.a.s.s.OpenExchangeRatesOrgProvider Reloading exchange rates from open-exchange-rates.json
   [junit4]   2> 1396530 WARN  (coreLoadExecutor-3216-thread-1) [    ] o.a.s.s.OpenExchangeRatesOrgProvider Unknown key IMPORTANT NOTE
   [junit4]   2> 1396530 WARN  (coreLoadExecutor-3216-thread-1) [    ] o.a.s.s.OpenExchangeRatesOrgProvider Expected key, got STRING
   [junit4]   2> 1396532 INFO  (coreLoadExecutor-3216-thread-1) [    ] o.a.s.c.ConfigSetProperties Did not find ConfigSet properties, assuming default properties: Can't find resource 'configsetprops.json' in classpath or '/x1/jenkins/jenkins-slave/workspace/Lucene-Solr-Tests-trunk-Java8/solr/core/src/test-files/solr/collection1/conf'
   [junit4]   2> 1396532 INFO  (coreLoadExecutor-3216-thread-1) [    ] o.a.s.c.CoreContainer Creating SolrCore 'collection1' using configuration from instancedir /x1/jenkins/jenkins-slave/workspace/Lucene-Solr-Tests-trunk-Java8/solr/core/src/test-files/solr/collection1/
   [junit4]   2> 1396532 INFO  (coreLoadExecutor-3216-thread-1) [    x:collection1] o.a.s.c.SolrCore org.apache.solr.core.MockDirectoryFactory
   [junit4]   2> 1396532 INFO  (coreLoadExecutor-3216-thread-1) [    x:collection1] o.a.s.c.SolrCore [[collection1] ] Opening new SolrCore at [/x1/jenkins/jenkins-slave/workspace/Lucene-Solr-Tests-trunk-Java8/solr/core/src/test-files/solr/collection1/], dataDir=[null]
   [junit4]   2> 1396532 INFO  (coreLoadExecutor-3216-thread-1) [    x:collection1] o.a.s.c.JmxMonitoredMap JMX monitoring is enabled. Adding Solr mbeans to JMX Server: com.sun.jmx.mbeanserver.JmxMBeanServer@6647fe60
   [junit4]   2> 1396533 INFO  (coreLoadExecutor-3216-thread-1) [    x:collection1] o.a.s.c.CachingDirectoryFactory return new directory for /x1/jenkins/jenkins-slave/workspace/Lucene-Solr-Tests-trunk-Java8/solr/build/solr-core/test/J1/temp/solr.update.HardAutoCommitTest_21987850F5B91097-001/init-core-data-001
   [junit4]   2> 1396533 INFO  (coreLoadExecutor-3216-thread-1) [    x:collection1] o.a.s.c.SolrCore New index directory detected: old=null new=/x1/jenkins/jenkins-slave/workspace/Lucene-Solr-Tests-trunk-Java8/solr/build/solr-core/test/J1/temp/solr.update.HardAutoCommitTest_21987850F5B91097-001/init-core-data-001/index/
   [junit4]   2> 1396533 WARN  (coreLoadExecutor-3216-thread-1) [    x:collection1] o.a.s.c.SolrCore [collection1] Solr index directory '/x1/jenkins/jenkins-slave/workspace/Lucene-Solr-Tests-trunk-Java8/solr/build/solr-core/test/J1/temp/solr.update.HardAutoCommitTest_21987850F5B91097-001/init-core-data-001/index' doesn't exist. Creating new index...
   [junit4]   2> 1396534 INFO  (coreLoadExecutor-3216-thread-1) [    x:collection1] o.a.s.c.CachingDirectoryFactory return new directory for /x1/jenkins/jenkins-slave/workspace/Lucene-Solr-Tests-trunk-Java8/solr/build/solr-core/test/J1/temp/solr.update.HardAutoCommitTest_21987850F5B91097-001/init-core-data-001/index
   [junit4]   2> 1396534 INFO  (coreLoadExecutor-3216-thread-1) [    x:collection1] o.a.s.u.RandomMergePolicy RandomMergePolicy wrapping class org.apache.lucene.index.AlcoholicMergePolicy: [AlcoholicMergePolicy: minMergeSize=0, mergeFactor=10, maxMergeSize=1497964137, maxMergeSizeForForcedMerge=9223372036854775807, calibrateSizeByDeletes=true, maxMergeDocs=2147483647, maxCFSSegmentSizeMB=8.796093022207999E12, noCFSRatio=0.1]
   [junit4]   2> 1396535 INFO  (coreLoadExecutor-3216-thread-1) [    x:collection1] o.a.s.c.SolrCore SolrDeletionPolicy.onCommit: commits: num=1
   [junit4]   2> 	commit{dir=MockDirectoryWrapper(RAMDirectory@6e1881f lockFactory=org.apache.lucene.store.SingleInstanceLockFactory@67f9975e),segFN=segments_1,generation=1}
   [junit4]   2> 1396535 INFO  (coreLoadExecutor-3216-thread-1) [    x:collection1] o.a.s.c.SolrCore newest commit generation = 1
   [junit4]   2> 1396544 INFO  (coreLoadExecutor-3216-thread-1) [    x:collection1] o.a.s.u.p.UpdateRequestProcessorChain creating updateRequestProcessorChain "dedupe"
   [junit4]   2> 1396544 INFO  (coreLoadExecutor-3216-thread-1) [    x:collection1] o.a.s.u.p.UpdateRequestProcessorChain inserting DistributedUpdateProcessorFactory into updateRequestProcessorChain "dedupe"
   [junit4]   2> 1396544 INFO  (coreLoadExecutor-3216-thread-1) [    x:collection1] o.a.s.u.p.UpdateRequestProcessorChain creating updateRequestProcessorChain "dedupe-allfields"
   [junit4]   2> 1396544 INFO  (coreLoadExecutor-3216-thread-1) [    x:collection1] o.a.s.u.p.UpdateRequestProcessorChain inserting DistributedUpdateProcessorFactory into updateRequestProcessorChain "dedupe-allfields"
   [junit4]   2> 1396544 INFO  (coreLoadExecutor-3216-thread-1) [    x:collection1] o.a.s.u.p.UpdateRequestProcessorChain creating updateRequestProcessorChain "stored_sig"
   [junit4]   2> 1396544 INFO  (coreLoadExecutor-3216-thread-1) [    x:collection1] o.a.s.u.p.UpdateRequestProcessorChain inserting DistributedUpdateProcessorFactory into updateRequestProcessorChain "stored_sig"
   [junit4]   2> 1396545 INFO  (coreLoadExecutor-3216-thread-1) [    x:collection1] o.a.s.u.p.UpdateRequestProcessorChain creating updateRequestProcessorChain "uniq-fields"
   [junit4]   2> 1396545 INFO  (coreLoadExecutor-3216-thread-1) [    x:collection1] o.a.s.u.p.UpdateRequestProcessorChain inserting DistributedUpdateProcessorFactory into updateRequestProcessorChain "uniq-fields"
   [junit4]   2> 1396545 INFO  (coreLoadExecutor-3216-thread-1) [    x:collection1] o.a.s.u.p.UpdateRequestProcessorChain creating updateRequestProcessorChain "distrib-dup-test-chain-explicit"
   [junit4]   2> 1396545 INFO  (coreLoadExecutor-3216-thread-1) [    x:collection1] o.a.s.u.p.UpdateRequestProcessorChain creating updateRequestProcessorChain "distrib-dup-test-chain-implicit"
   [junit4]   2> 1396545 INFO  (coreLoadExecutor-3216-thread-1) [    x:collection1] o.a.s.u.p.UpdateRequestProcessorChain inserting DistributedUpdateProcessorFactory into updateRequestProcessorChain "distrib-dup-test-chain-implicit"
   [junit4]   2> 1396545 INFO  (coreLoadExecutor-3216-thread-1) [    x:collection1] o.a.s.c.SolrCore no updateRequestProcessorChain defined as default, creating implicit default
   [junit4]   2> 1396551 INFO  (coreLoadExecutor-3216-thread-1) [    x:collection1] o.a.s.h.l.XMLLoader xsltCacheLifetimeSeconds=60
   [junit4]   2> 1396552 INFO  (coreLoadExecutor-3216-thread-1) [    x:collection1] o.a.s.h.l.XMLLoader xsltCacheLifetimeSeconds=60
   [junit4]   2> 1396553 INFO  (coreLoadExecutor-3216-thread-1) [    x:collection1] o.a.s.h.l.XMLLoader xsltCacheLifetimeSeconds=60
   [junit4]   2> 1396554 INFO  (OldIndexDirectoryCleanupThreadForCore-collection1) [    x:collection1] o.a.s.c.SolrCore Looking for old index directories to cleanup for core collection1 in /x1/jenkins/jenkins-slave/workspace/Lucene-Solr-Tests-trunk-Java8/solr/build/solr-core/test/J1/temp/solr.update.HardAutoCommitTest_21987850F5B91097-001/init-core-data-001/
   [junit4]   2> 1396555 INFO  (coreLoadExecutor-3216-thread-1) [    x:collection1] o.a.s.h.l.XMLLoader xsltCacheLifetimeSeconds=60
   [junit4]   2> 1396563 INFO  (coreLoadExecutor-3216-thread-1) [    x:collection1] o.a.s.c.PluginBag requestHandler : 'lazy' created with startup=lazy 
   [junit4]   2> 1396565 INFO  (coreLoadExecutor-3216-thread-1) [    x:collection1] o.a.s.c.RequestHandlers Registered paths: /admin/mbeans,standard,spellCheckCompRH,lazy,/update/json/docs,/admin/luke,spellCheckWithWordbreak_Direct,tvrh,/get,/admin/properties,/update/json,mltrh,/admin/threads,/search-facet-def,/update/csv,/search-facet-invariants,/admin/segments,spellCheckCompRH1,/mlt,/admin/system,/replication,dismax,defaults,/config,/schema,/admin/plugins,/admin/logging,spellCheckWithWordbreak,mock,/admin/ping,/update,/admin/file,/terms,spellCheckCompRH_Direct,/debug/dump
   [junit4]   2> 1396568 WARN  (coreLoadExecutor-3216-thread-1) [    x:collection1] o.a.s.c.SolrCore solrconfig.xml uses deprecated <admin/gettableFiles>, Please update your config to use the ShowFileRequestHandler.
   [junit4]   2> 1396569 INFO  (coreLoadExecutor-3216-thread-1) [    x:collection1] o.a.s.c.SolrCore Using default statsCache cache: org.apache.solr.search.stats.LocalStatsCache
   [junit4]   2> 1396578 INFO  (coreLoadExecutor-3216-thread-1) [    x:collection1] o.a.s.u.UpdateHandler Using UpdateLog implementation: org.apache.solr.update.UpdateLog
   [junit4]   2> 1396578 INFO  (coreLoadExecutor-3216-thread-1) [    x:collection1] o.a.s.u.UpdateLog Initializing UpdateLog: dataDir= defaultSyncLevel=FLUSH numRecordsToKeep=100 maxNumLogsToKeep=10 numVersionBuckets=65536
   [junit4]   2> 1396579 INFO  (coreLoadExecutor-3216-thread-1) [    x:collection1] o.a.s.c.SolrCore Hard AutoCommit: disabled
   [junit4]   2> 1396579 INFO  (coreLoadExecutor-3216-thread-1) [    x:collection1] o.a.s.c.SolrCore Soft AutoCommit: disabled
   [junit4]   2> 1396582 INFO  (coreLoadExecutor-3216-thread-1) [    x:collection1] o.a.s.u.RandomMergePolicy RandomMergePolicy wrapping class org.apache.lucene.index.TieredMergePolicy: [TieredMergePolicy: maxMergeAtOnce=24, maxMergeAtOnceExplicit=39, maxMergedSegmentMB=48.90234375, floorSegmentMB=0.33984375, forceMergeDeletesPctAllowed=11.412207595076682, segmentsPerTier=28.0, maxCFSSegmentSizeMB=8.796093022207999E12, noCFSRatio=0.3260340643726847
   [junit4]   2> 1396586 INFO  (coreLoadExecutor-3216-thread-1) [    x:collection1] o.a.s.c.SolrCore SolrDeletionPolicy.onInit: commits: num=1
   [junit4]   2> 	commit{dir=MockDirectoryWrapper(RAMDirectory@6e1881f lockFactory=org.apache.lucene.store.SingleInstanceLockFactory@67f9975e),segFN=segments_1,generation=1}
   [junit4]   2> 1396586 INFO  (coreLoadExecutor-3216-thread-1) [    x:collection1] o.a.s.c.SolrCore newest commit generation = 1
   [junit4]   2> 1396586 INFO  (coreLoadExecutor-3216-thread-1) [    x:collection1] o.a.s.s.SolrIndexSearcher Opening Searcher@4e6410ef[collection1] main
   [junit4]   2> 1396587 INFO  (coreLoadExecutor-3216-thread-1) [    x:collection1] o.a.s.r.RestManager Initializing RestManager with initArgs: {storageIO=org.apache.solr.rest.ManagedResourceStorage$InMemoryStorageIO}
   [junit4]   2> 1396594 INFO  (coreLoadExecutor-3216-thread-1) [    x:collection1] o.a.s.r.ManagedResourceStorage Reading _rest_managed.json using InMemoryStorage
   [junit4]   2> 1396595 INFO  (coreLoadExecutor-3216-thread-1) [    x:collection1] o.a.s.r.RestManager Initializing 0 registered ManagedResources
   [junit4]   2> 1396595 INFO  (coreLoadExecutor-3216-thread-1) [    x:collection1] o.a.s.h.c.SpellCheckComponent Initializing spell checkers
   [junit4]   2> 1396610 INFO  (coreLoadExecutor-3216-thread-1) [    x:collection1] o.a.s.s.DirectSolrSpellChecker init: {name=direct,classname=DirectSolrSpellChecker,field=lowerfilt,minQueryLength=3}
   [junit4]   2> 1396678 INFO  (coreLoadExecutor-3216-thread-1) [    x:collection1] o.a.s.h.ReplicationHandler Commits will be reserved for  10000
   [junit4]   2> 1396678 INFO  (searcherExecutor-3217-thread-1-processing-x:collection1) [    x:collection1] o.a.s.h.c.SpellCheckComponent Loading spell index for spellchecker: default
   [junit4]   2> 1396679 INFO  (searcherExecutor-3217-thread-1-processing-x:collection1) [    x:collection1] o.a.s.h.c.SpellCheckComponent Loading spell index for spellchecker: direct
   [junit4]   2> 1396679 INFO  (searcherExecutor-3217-thread-1-processing-x:collection1) [    x:collection1] o.a.s.h.c.SpellCheckComponent Loading spell index for spellchecker: wordbreak
   [junit4]   2> 1396679 INFO  (searcherExecutor-3217-thread-1-processing-x:collection1) [    x:collection1] o.a.s.h.c.SpellCheckComponent Loading spell index for spellchecker: multipleFields
   [junit4]   2> 1396680 INFO  (searcherExecutor-3217-thread-1-processing-x:collection1) [    x:collection1] o.a.s.h.c.SpellCheckComponent Loading spell index for spellchecker: jarowinkler
   [junit4]   2> 1396680 INFO  (searcherExecutor-3217-thread-1-processing-x:collection1) [    x:collection1] o.a.s.h.c.SpellCheckComponent Loading spell index for spellchecker: external
   [junit4]   2> 1396681 INFO  (searcherExecutor-3217-thread-1-processing-x:collection1) [    x:collection1] o.a.s.h.c.SpellCheckComponent Loading spell index for spellchecker: freq
   [junit4]   2> 1396681 INFO  (searcherExecutor-3217-thread-1-processing-x:collection1) [    x:collection1] o.a.s.h.c.SpellCheckComponent Loading spell index for spellchecker: fqcn
   [junit4]   2> 1396682 INFO  (searcherExecutor-3217-thread-1-processing-x:collection1) [    x:collection1] o.a.s.h.c.SpellCheckComponent Loading spell index for spellchecker: perDict
   [junit4]   2> 1396683 INFO  (coreLoadExecutor-3216-thread-1) [    x:collection1] o.a.s.u.UpdateLog Looking up max value of version field to seed version buckets
   [junit4]   2> 1396683 INFO  (coreLoadExecutor-3216-thread-1) [    x:collection1] o.a.s.u.VersionInfo Refreshing highest value of _version_ for 65536 version buckets from index
   [junit4]   2> 1396683 INFO  (coreLoadExecutor-3216-thread-1) [    x:collection1] o.a.s.u.VersionInfo No terms found for _version_, cannot seed version bucket highest value from index
   [junit4]   2> 1396684 INFO  (coreLoadExecutor-3216-thread-1) [    x:collection1] o.a.s.u.UpdateLog Could not find max version in index or recent updates, using new clock 1508689767949139968
   [junit4]   2> 1396686 INFO  (coreLoadExecutor-3216-thread-1) [    x:collection1] o.a.s.u.UpdateLog Took 3 ms to seed version buckets with highest version 1508689767949139968
   [junit4]   2> 1396687 INFO  (coreLoadExecutor-3216-thread-1) [    x:collection1] o.a.s.c.CoreContainer registering core: collection1
   [junit4]   2> 1396686 INFO  (searcherExecutor-3217-thread-1-processing-x:collection1) [    x:collection1] o.a.s.c.SolrCore [collection1] Registered new searcher Searcher@4e6410ef[collection1] main{ExitableDirectoryReader(UninvertingDirectoryReader())}
   [junit4]   2> 1396688 INFO  (SUITE-HardAutoCommitTest-seed#[21987850F5B91097]-worker) [    ] o.a.s.SolrTestCaseJ4 ####initCore end
   [junit4]   2> 1396690 INFO  (TEST-HardAutoCommitTest.testCommitWithin-seed#[21987850F5B91097]) [    ] o.a.s.SolrTestCaseJ4 ###Starting testCommitWithin
   [junit4]   2> 1396693 INFO  (TEST-HardAutoCommitTest.testCommitWithin-seed#[21987850F5B91097]) [    ] o.a.s.u.p.LogUpdateProcessor [collection1] webapp=null path=null params={} {deleteByQuery=*:* (-1508689767956480000)} 0 2
   [junit4]   2> 1396695 INFO  (TEST-HardAutoCommitTest.testCommitWithin-seed#[21987850F5B91097]) [    ] o.a.s.c.SolrResourceLoader new SolrResourceLoader for directory: '/x1/jenkins/jenkins-slave/workspace/Lucene-Solr-Tests-trunk-Java8/solr/core/src/test-files/solr/collection1/'
   [junit4]   2> 1396695 INFO  (TEST-HardAutoCommitTest.testCommitWithin-seed#[21987850F5B91097]) [    ] o.a.s.c.SolrResourceLoader Adding 'file:/x1/jenkins/jenkins-slave/workspace/Lucene-Solr-Tests-trunk-Java8/solr/core/src/test-files/solr/collection1/lib/.svn/' to classloader
   [junit4]   2> 1396695 INFO  (TEST-HardAutoCommitTest.testCommitWithin-seed#[21987850F5B91097]) [    ] o.a.s.c.SolrResourceLoader Adding 'file:/x1/jenkins/jenkins-slave/workspace/Lucene-Solr-Tests-trunk-Java8/solr/core/src/test-files/solr/collection1/lib/classes/' to classloader
   [junit4]   2> 1396695 INFO  (TEST-HardAutoCommitTest.testCommitWithin-seed#[21987850F5B91097]) [    ] o.a.s.c.SolrResourceLoader Adding 'file:/x1/jenkins/jenkins-slave/workspace/Lucene-Solr-Tests-trunk-Java8/solr/core/src/test-files/solr/collection1/lib/README' to classloader
   [junit4]   2> 1396755 INFO  (TEST-HardAutoCommitTest.testCommitWithin-seed#[21987850F5B91097]) [    ] o.a.s.c.SolrConfig current version of requestparams : -1
   [junit4]   2> 1396803 INFO  (TEST-HardAutoCommitTest.testCommitWithin-seed#[21987850F5B91097]) [    ] o.a.s.c.SolrConfig Using Lucene MatchVersion: 6.0.0
   [junit4]   2> 1396849 INFO  (TEST-HardAutoCommitTest.testCommitWithin-seed#[21987850F5B91097]) [    ] o.a.s.c.Config Loaded SolrConfig: solrconfig.xml
   [junit4]   2> 1396850 INFO  (TEST-HardAutoCommitTest.testCommitWithin-seed#[21987850F5B91097]) [    ] o.a.s.s.IndexSchema Reading Solr Schema from /x1/jenkins/jenkins-slave/workspace/Lucene-Solr-Tests-trunk-Java8/solr/core/src/test-files/solr/collection1/conf/schema.xml
   [junit4]   2> 1396855 INFO  (TEST-HardAutoCommitTest.testCommitWithin-seed#[21987850F5B91097]) [    ] o.a.s.s.IndexSchema [collection1] Schema name=test
   [junit4]   2> 1397124 INFO  (TEST-HardAutoCommitTest.testCommitWithin-seed#[21987850F5B91097]) [    ] o.a.s.s.OpenExchangeRatesOrgProvider Initialized with rates=open-exchange-rates.json, refreshInterval=1440.
   [junit4]   2> 1397145 INFO  (TEST-HardAutoCommitTest.testCommitWithin-seed#[21987850F5B91097]) [    ] o.a.s.s.IndexSchema default search field in schema is text
   [junit4]   2> 1397153 INFO  (TEST-HardAutoCommitTest.testCommitWithin-seed#[21987850F5B91097]) [    ] o.a.s.s.IndexSchema unique key field: id
   [junit4]   2> 1397158 INFO  (TEST-HardAutoCommitTest.testCommitWithin-seed#[21987850F5B91097]) [    ] o.a.s.s.FileExchangeRateProvider Reloading exchange rates from file currency.xml
   [junit4]   2> 1397160 INFO  (TEST-HardAutoCommitTest.testCommitWithin-seed#[21987850F5B91097]) [    ] o.a.s.s.FileExchangeRateProvider Reloading exchange rates from file currency.xml
   [junit4]   2> 1397161 INFO  (TEST-HardAutoCommitTest.testCommitWithin-seed#[21987850F5B91097]) [    ] o.a.s.s.OpenExchangeRatesOrgProvider Reloading exchange rates from open-exchange-rates.json
   [junit4]   2> 1397161 WARN  (TEST-HardAutoCommitTest.testCommitWithin-seed#[21987850F5B91097]) [    ] o.a.s.s.OpenExchangeRatesOrgProvider Unknown key IMPORTANT NOTE
   [junit4]   2> 1397166 WARN  (TEST-HardAutoCommitTest.testCommitWithin-seed#[21987850F5B91097]) [    ] o.a.s.s.OpenExchangeRatesOrgProvider Expected key, got STRING
   [junit4]   2> 1397166 INFO  (TEST-HardAutoCommitTest.testCommitWithin-seed#[21987850F5B91097]) [    ] o.a.s.s.OpenExchangeRatesOrgProvider Reloading exchange rates from open-exchange-rates.json
   [junit4]   2> 1397167 WARN  (TEST-HardAutoCommitTest.testCommitWithin-seed#[21987850F5B91097]) [    ] o.a.s.s.OpenExchangeRatesOrgProvider Unknown key IMPORTANT NOTE
   [junit4]   2> 1397167 WARN  (TEST-HardAutoCommitTest.testCommitWithin-seed#[21987850F5B91097]) [    ] o.a.s.s.OpenExchangeRatesOrgProvider Expected key, got STRING
   [junit4]   2> 1397168 INFO  (TEST-HardAutoCommitTest.testCommitWithin-seed#[21987850F5B91097]) [    ] o.a.s.c.ConfigSetProperties Did not find ConfigSet properties, assuming default properties: Can't find resource 'configsetprops.json' in classpath or '/x1/jenkins/jenkins-slave/workspace/Lucene-Solr-Tests-trunk-Java8/solr/core/src/test-files/solr/collection1/conf'
   [junit4]   2> 1397168 INFO  (TEST-HardAutoCommitTest.testCommitWithin-seed#[21987850F5B91097]) [    ] o.a.s.c.CoreContainer Reloading SolrCore 'collection1' using configuration from instancedir /x1/jenkins/jenkins-slave/workspace/Lucene-Solr-Tests-trunk-Java8/solr/core/src/test-files/solr/collection1/
   [junit4]   2> 1397174 INFO  (TEST-HardAutoCommitTest.testCommitWithin-seed#[21987850F5B91097]) [    x:collection1] o.a.s.c.SolrCore [[collection1] ] Opening new SolrCore at [/x1/jenkins/jenkins-slave/workspace/Lucene-Solr-Tests-trunk-Java8/solr/core/src/test-files/solr/collection1/], dataDir=[/x1/jenkins/jenkins-slave/workspace/Lucene-Solr-Tests-trunk-Java8/solr/build/solr-core/test/J1/temp/solr.update.HardAutoCommitTest_21987850F5B91097-001/init-core-data-001/]
   [junit4]   2> 1397174 INFO  (TEST-HardAutoCommitTest.testCommitWithin-seed#[21987850F5B91097]) [    x:collection1] o.a.s.c.JmxMonitoredMap JMX monitoring is enabled. Adding Solr mbeans to JMX Server: com.sun.jmx.mbeanserver.JmxMBeanServer@6647fe60
   [junit4]   2> 1397178 INFO  (TEST-HardAutoCommitTest.testCommitWithin-seed#[21987850F5B91097]) [    x:collection1] o.a.s.c.SolrCore New index directory detected: old=null new=/x1/jenkins/jenkins-slave/workspace/Lucene-Solr-Tests-trunk-Java8/solr/build/solr-core/test/J1/temp/solr.update.HardAutoCommitTest_21987850F5B91097-001/init-core-data-001/index/
   [junit4]   2> 1397187 INFO  (TEST-HardAutoCommitTest.testCommitWithin-seed#[21987850F5B91097]) [    x:collection1] o.a.s.u.p.UpdateRequestProcessorChain creating updateRequestProcessorChain "dedupe"
   [junit4]   2> 1397187 INFO  (TEST-HardAutoCommitTest.testCommitWithin-seed#[21987850F5B91097]) [    x:collection1] o.a.s.u.p.UpdateRequestProcessorChain inserting DistributedUpdateProcessorFactory into updateRequestProcessorChain "dedupe"
   [junit4]   2> 1397187 INFO  (TEST-HardAutoCommitTest.testCommitWithin-seed#[21987850F5B91097]) [    x:collection1] o.a.s.u.p.UpdateRequestProcessorChain creating updateRequestProcessorChain "dedupe-allfields"
   [junit4]   2> 1397187 INFO  (TEST-HardAutoCommitTest.testCommitWithin-seed#[21987850F5B91097]) [    x:collection1] o.a.s.u.p.UpdateRequestProcessorChain inserting DistributedUpdateProcessorFactory into updateRequestProcessorChain "dedupe-allfields"
   [junit4]   2> 1397188 INFO  (TEST-HardAutoCommitTest.testCommitWithin-seed#[21987850F5B91097]) [    x:collection1] o.a.s.u.p.UpdateRequestProcessorChain creating updateRequestProcessorChain "stored_sig"
   [junit4]   2> 1397188 INFO  (TEST-HardAutoCommitTest.testCommitWithin-seed#[21987850F5B91097]) [    x:collection1] o.a.s.u.p.UpdateRequestProcessorChain inserting DistributedUpdateProcessorFactory into updateRequestProcessorChain "stored_sig"
   [junit4]   2> 1397188 INFO  (TEST-HardAutoCommitTest.testCommitWithin-seed#[21987850F5B91097]) [    x:collection1] o.a.s.u.p.UpdateRequestProcessorChain creating updateRequestProcessorChain "uniq-fields"
   [junit4]   2> 1397188 INFO  (TEST-HardAutoCommitTest.testCommitWithin-seed#[21987850F5B91097]) [    x:collection1] o.a.s.u.p.UpdateRequestProcessorChain inserting DistributedUpdateProcessorFactory into updateRequestProcessorChain "uniq-fields"
   [junit4]   2> 1397188 INFO  (TEST-HardAutoCommitTest.testCommitWithin-seed#[21987850F5B91097]) [    x:collection1] o.a.s.u.p.UpdateRequestProcessorChain creating updateRequestProcessorChain "distrib-dup-test-chain-explicit"
   [junit4]   2> 1397188 INFO  (TEST-HardAutoCommitTest.testCommitWithin-seed#[21987850F5B91097]) [    x:collection1] o.a.s.u.p.UpdateRequestProcessorChain creating updateRequestProcessorChain "distrib-dup-test-chain-implicit"
   [junit4]   2> 1397189 INFO  (TEST-HardAutoCommitTest.testCommitWithin-seed#[21987850F5B91097]) [    x:collection1] o.a.s.u.p.UpdateRequestProcessorChain inserting DistributedUpdateProcessorFactory into updateRequestProcessorChain "distrib-dup-test-chain-implicit"
   [junit4]   2> 1397189 INFO  (TEST-HardAutoCommitTest.testCommitWithin-seed#[21987850F5B91097]) [    x:collection1] o.a.s.c.SolrCore no updateRequestProcessorChain defined as default, creating implicit default
   [junit4]   2> 1397191 INFO  (TEST-HardAutoCommitTest.testCommitWithin-seed#[21987850F5B91097]) [    x:collection1] o.a.s.h.l.XMLLoader xsltCacheLifetimeSeconds=60
   [junit4]   2> 1397192 INFO  (TEST-HardAutoCommitTest.testCommitWithin-seed#[21987850F5B91097]) [    x:collection1] o.a.s.h.l.XMLLoader xsltCacheLifetimeSeconds=60
   [junit4]   2> 1397193 INFO  (TEST-HardAutoCommitTest.testCommitWithin-seed#[21987850F5B91097]) [    x:collection1] o.a.s.h.l.XMLLoader xsltCacheLifetimeSeconds=60
   [junit4]   2> 1397194 INFO  (OldIndexDirectoryCleanupThreadForCore-collection1) [    x:collection1] o.a.s.c.SolrCore Looking for old index directories to cleanup for core collection1 in /x1/jenkins/jenkins-slave/workspace/Lucene-Solr-Tests-trunk-Java8/solr/build/solr-core/test/J1/temp/solr.update.HardAutoCommitTest_21987850F5B91097-001/init-core-data-001/
   [junit4]   2> 1397198 INFO  (TEST-HardAutoCommitTest.testCommitWithin-seed#[21987850F5B91097]) [    x:collection1] o.a.s.h.l.XMLLoader xsltCacheLifetimeSeconds=60
   [junit4]   2> 1397207 INFO  (TEST-HardAutoCommitTest.testCommitWithin-seed#[21987850F5B91097]) [    x:collection1] o.a.s.c.PluginBag requestHandler : 'lazy' created with startup=lazy 
   [junit4]   2> 1397214 INFO  (TEST-HardAutoCommitTest.testCommitWithin-seed#[21987850F5B91097]) [    x:collection1] o.a.s.c.RequestHandlers Registered paths: /admin/mbeans,standard,spellCheckCompRH,lazy,/update/json/docs,/admin/luke,spellCheckWithWordbreak_Direct,tvrh,/get,/admin/properties,/update/json,mltrh,/admin/threads,/search-facet-def,/update/csv,/search-facet-invariants,/admin/segments,spellCheckCompRH1,/mlt,/admin/system,/replication,dismax,defaults,/config,/schema,/admin/plugins,/admin/logging,spellCheckWithWordbreak,mock,/admin/ping,/update,/admin/file,/terms,spellCheckCompRH_Direct,/debug/dump
   [junit4]   2> 1397216 WARN  (TEST-HardAutoCommitTest.testCommitWithin-seed#[21987850F5B91097]) [    x:collection1] o.a.s.c.SolrCore solrconfig.xml uses deprecated <admin/gettableFiles>, Please update your config to use the ShowFileRequestHandler.
   [junit4]   2> 1397217 INFO  (TEST-HardAutoCommitTest.testCommitWithin-seed#[21987850F5B91097]) [    x:collection1] o.a.s.c.SolrCore Using default statsCache cache: org.apache.solr.search.stats.LocalStatsCache
   [junit4]   2> 1397228 INFO  (TEST-HardAutoCommitTest.testCommitWithin-seed#[21987850F5B91097]) [    x:collection1] o.a.s.c.SolrCore Hard AutoCommit: disabled
   [junit4]   2> 1397228 INFO  (TEST-HardAutoCommitTest.testCommitWithin-seed#[21987850F5B91097]) [    x:collection1] o.a.s.c.SolrCore Soft AutoCommit: disabled
   [junit4]   2> 1397229 INFO  (TEST-HardAutoCommitTest.testCommitWithin-seed#[21987850F5B91097]) [    x:collection1] o.a.s.s.SolrIndexSearcher Opening Searcher@4b9f3e56[collection1] main
   [junit4]   2> 1397229 INFO  (TEST-HardAutoCommitTest.testCommitWithin-seed#[21987850F5B91097]) [    x:collection1] o.a.s.r.RestManager Initializing RestManager with initArgs: {storageIO=org.apache.solr.rest.ManagedResourceStorage$InMemoryStorageIO}
   [junit4]   2> 1397229 INFO  (TEST-HardAutoCommitTest.testCommitWithin-seed#[21987850F5B91097]) [    x:collection1] o.a.s.r.ManagedResourceStorage Reading _rest_managed.json using InMemoryStorage
   [junit4]   2> 1397229 INFO  (TEST-HardAutoCommitTest.testCommitWithin-seed#[21987850F5B91097]) [    x:collection1] o.a.s.r.RestManager Initializing 0 registered ManagedResources
   [junit4]   2> 1397229 INFO  (TEST-HardAutoCommitTest.testCommitWithin-seed#[21987850F5B91097]) [    x:collection1] o.a.s.h.c.SpellCheckComponent Initializing spell checkers
   [junit4]   2> 1397230 INFO  (TEST-HardAutoCommitTest.testCommitWithin-seed#[21987850F5B91097]) [    x:collection1] o.a.s.s.DirectSolrSpellChecker init: {name=direct,classname=DirectSolrSpellChecker,field=lowerfilt,minQueryLength=3}
   [junit4]   2> 1397234 INFO  (TEST-HardAutoCommitTest.testCommitWithin-seed#[21987850F5B91097]) [    x:collection1] o.a.s.h.ReplicationHandler Commits will be reserved for  10000
   [junit4]   2> 1397234 INFO  (searcherExecutor-3222-thread-1-processing-x:collection1) [    x:collection1] o.a.s.h.c.SpellCheckComponent Loading spell index for spellchecker: default
   [junit4]   2> 1397242 INFO  (searcherExecutor-3222-thread-1-processing-x:collection1) [    x:collection1] o.a.s.h.c.SpellCheckComponent Loading spell index for spellchecker: direct
   [junit4]   2> 1397242 INFO  (searcherExecutor-3222-thread-1-processing-x:collection1) [    x:collection1] o.a.s.h.c.SpellCheckComponent Loading spell index for spellchecker: wordbreak
   [junit4]   2> 1397242 INFO  (searcherExecutor-3222-thread-1-processing-x:collection1) [    x:collection1] o.a.s.h.c.SpellCheckComponent Loading spell index for spellchecker: multipleFields
   [junit4]   2> 1397242 INFO  (searcherExecutor-3222-thread-1-processing-x:collection1) [    x:collection1] o.a.s.h.c.SpellCheckComponent Loading spell index for spellchecker: jarowinkler
   [junit4]   2> 1397243 INFO  (searcherExecutor-3222-thread-1-processing-x:collection1) [    x:collection1] o.a.s.h.c.SpellCheckComponent Loading spell index for spellchecker: external
   [junit4]   2> 1397243 INFO  (searcherExecutor-3222-thread-1-processing-x:collection1) [    x:collection1] o.a.s.h.c.SpellCheckComponent Loading spell index for spellchecker: freq
   [junit4]   2> 1397243 INFO  (searcherExecutor-3222-thread-1-processing-x:collection1) [    x:collection1] o.a.s.h.c.SpellCheckComponent Loading spell index for spellchecker: fqcn
   [junit4]   2> 1397244 INFO  (searcherExecutor-3222-thread-1-processing-x:collection1) [    x:collection1] o.a.s.h.c.SpellCheckComponent Loading spell index for spellchecker: perDict
   [junit4]   2> 1397245 INFO  (TEST-HardAutoCommitTest.testCommitWithin-seed#[21987850F5B91097]) [    x:collection1] o.a.s.u.UpdateLog Looking up max value of version field to seed version buckets
   [junit4]   2> 1397245 INFO  (TEST-HardAutoCommitTest.testCommitWithin-seed#[21987850F5B91097]) [    x:collection1] o.a.s.u.VersionInfo Refreshing highest value of _version_ for 65536 version buckets from index
   [junit4]   2> 1397245 INFO  (TEST-HardAutoCommitTest.testCommitWithin-seed#[21987850F5B91097]) [    x:collection1] o.a.s.u.VersionInfo No terms found for _version_, cannot seed version bucket highest value from index
   [junit4]   2> 1397247 INFO  (searcherExecutor-3222-thread-1-processing-x:collection1) [    x:collection1] o.a.s.c.SolrCore [collection1] Registered new searcher Searcher@4b9f3e56[collection1] main{ExitableDirectoryReader(UninvertingDirectoryReader())}
   [junit4]   2> 1397249 INFO  (TEST-HardAutoCommitTest.testCommitWithin-seed#[21987850F5B91097]) [    x:collection1] o.a.s.u.UpdateLog Took 4 ms to seed version buckets with highest version 1508689767956480000
   [junit4]   2> 1397249 INFO  (TEST-HardAutoCommitTest.testCommitWithin-seed#[21987850F5B91097]) [    x:collection1] o.a.s.u.DefaultSolrCoreState Creating new IndexWriter...
   [junit4]   2> 1397249 INFO  (TEST-HardAutoCommitTest.testCommitWithin-seed#[21987850F5B91097]) [    x:collection1] o.a.s.u.DefaultSolrCoreState Waiting until IndexWriter is unused... core=collection1
   [junit4]   2> 1397249 INFO  (TEST-HardAutoCommitTest.testCommitWithin-seed#[21987850F5B91097]) [    x:collection1] o.a.s.u.DefaultSolrCoreState Closing old IndexWriter... core=collection1
   [junit4]   2> 1397250 INFO  (TEST-HardAutoCommitTest.testCommitWithin-seed#[21987850F5B91097]) [    x:collection1] o.a.s.u.RandomMergePolicy RandomMergePolicy wrapping class org.apache.lucene.index.TieredMergePolicy: [TieredMergePolicy: maxMergeAtOnce=21, maxMergeAtOnceExplicit=24, maxMergedSegmentMB=51.998046875, floorSegmentMB=0.37890625, forceMergeDeletesPctAllowed=6.404714441968316, segmentsPerTier=30.0, maxCFSSegmentSizeMB=8.796093022207999E12, noCFSRatio=0.46302470687733166
   [junit4]   2> 1397253 INFO  (TEST-HardAutoCommitTest.testCommitWithin-seed#[21987850F5B91097]) [    x:collection1] o.a.s.c.SolrCore SolrDeletionPolicy.onInit: commits: num=1
   [junit4]   2> 	commit{dir=MockDirectoryWrapper(RAMDirectory@6e1881f lockFactory=org.apache.lucene.store.SingleInstanceLockFactory@67f9975e),segFN=segments_1,generation=1}
   [junit4]   2> 1397254 INFO  (TEST-HardAutoCommitTest.testCommitWithin-seed#[21987850F5B91097]) [    x:collection1] o.a.s.c.SolrCore newest commit generation = 1
   [junit4]   2> 1397254 INFO  (TEST-HardAutoCommitTest.testCommitWithin-seed#[21987850F5B91097]) [    x:collection1] o.a.s.u.DefaultSolrCoreState New IndexWriter is ready to be used.
   [junit4]   2> 1397255 INFO  (TEST-HardAutoCommitTest.testCommitWithin-seed#[21987850F5B91097]) [    x:collection1] o.a.s.s.SolrIndexSearcher Opening Searcher@747d2070[collection1] main
   [junit4]   2> 1397257 INFO  (searcherExecutor-3222-thread-1-processing-x:collection1) [    x:collection1] o.a.s.c.SolrCore [collection1] Registered new searcher Searcher@747d2070[collection1] main{ExitableDirectoryReader(UninvertingDirectoryReader())}
   [junit4]   2> 1397257 INFO  (TEST-HardAutoCommitTest.testCommitWithin-seed#[21987850F5B91097]) [    x:collection1] o.a.s.c.CoreContainer replacing core: collection1
   [junit4]   2> 1397257 INFO  (TEST-HardAutoCommitTest.testCommitWithin-seed#[21987850F5B91097]) [    x:collection1] o.a.s.c.SolrCore [collection1]  CLOSING SolrCore org.apache.solr.core.SolrCore@279ce6fc
   [junit4]   2> 1397257 INFO  (TEST-HardAutoCommitTest.testCommitWithin-seed#[21987850F5B91097]) [    x:collection1] o.a.s.u.UpdateHandler closing DirectUpdateHandler2{commits=0,autocommits=0,soft autocommits=0,optimizes=0,rollbacks=0,expungeDeletes=0,docsPending=0,adds=0,deletesById=0,deletesByQuery=1,errors=0,cumulative_adds=0,cumulative_deletesById=0,cumulative_deletesByQuery=1,cumulative_errors=0,transaction_logs_total_size=0,transaction_logs_total_number=0}
   [junit4]   2> 1397258 INFO  (TEST-HardAutoCommitTest.testCommitWithin-seed#[21987850F5B91097]) [    x:collection1] o.a.s.c.SolrCore [collection1] Closing main searcher on request.
   [junit4]   2> 1397322 INFO  (TEST-HardAutoCommitTest.testCommitWithin-seed#[21987850F5B91097]) [    x:collection1] o.a.s.u.p.LogUpdateProcessor [collection1] {add=[529 (1508689768579334144)]} 0 37
   [junit4]   2> 1397322 INFO  (TEST-HardAutoCommitTest.testCommitWithin-seed#[21987850F5B91097]) [    x:collection1] o.a.s.c.S.Request [collection1] webapp=null path=null params={q=id:529&qt=standard&start=0&rows=20&version=2.2} hits=0 status=0 QTime=0 
   [junit4]   2> 1399291 INFO  (commitScheduler-3224-thread-1) [    x:collection1] o.a.s.u.UpdateHandler start commit{,optimize=false,openSearcher=true,waitSearcher=true,expungeDeletes=false,softCommit=false,prepareCommit=false}
   [junit4]   2> 1399306 INFO  (commitScheduler-3224-thread-1) [    x:collection1] o.a.s.c.SolrCore SolrDeletionPolicy.onCommit: commits: num=2
   [junit4]   2> 	commit{dir=MockDirectoryWrapper(RAMDirectory@6e1881f lockFactory=org.apache.lucene.store.SingleInstanceLockFactory@67f9975e),segFN=segments_1,generation=1}
   [junit4]   2> 	commit{dir=MockDirectoryWrapper(RAMDirectory@6e1881f lockFactory=org.apache.lucene.store.SingleInstanceLockFactory@67f9975e),segFN=segments_2,generation=2}
   [junit4]   2> 1399307 INFO  (commitScheduler-3224-thread-1) [    x:collection1] o.a.s.c.SolrCore newest commit generation = 2
   [junit4]   2> 1399309 INFO  (commitScheduler-3224-thread-1) [    x:collection1] o.a.s.s.SolrIndexSearcher Opening Searcher@1a4465d9[collection1] main
   [junit4]   2> 1399310 INFO  (commitScheduler-3224-thread-1) [    x:collection1] o.a.s.u.UpdateHandler end_commit_flush
   [junit4]   2> 1399311 INFO  (searcherExecutor-3222-thread-1-processing-x:collection1) [    x:collection1] o.a.s.c.SolrCore [collection1] Registered new searcher Searcher@1a4465d9[collection1] main{ExitableDirectoryReader(UninvertingDirectoryReader(Uninverting(_0(6.0.0):c1)))}
   [junit4]   2> 1399327 INFO  (TEST-HardAutoCommitTest.testCommitWithin-seed#[21987850F5B91097]) [    x:collection1] o.a.s.u.p.LogUpdateProcessor [collection1] {add=[530 (1508689770719477760)]} 0 2042
   [junit4]   2> 1399328 INFO  (TEST-HardAutoCommitTest.testCommitWithin-seed#[21987850F5B91097]) [    x:collection1] o.a.s.c.S.Request [collection1] webapp=null path=null params={q=id:530&qt=standard&start=0&rows=20&version=2.2} hits=0 status=0 QTime=0 
   [junit4]   2> 1399329 INFO  (TEST-HardAutoCommitTest.testCommitWithin-seed#[21987850F5B91097]) [    x:collection1] o.a.s.u.p.LogUpdateProcessor [collection1] {delete=[529 (-1508689770721574912)]} 0 2043
   [junit4]   2> 1399329 INFO  (TEST-HardAutoCommitTest.testCommitWithin-seed#[21987850F5B91097]) [    x:collection1] o.a.s.c.S.Request [collection1] webapp=null path=null params={q=id:529&qt=standard&start=0&rows=20&version=2.2} hits=1 status=0 QTime=0 
   [junit4]   2> 1400329 INFO  (commitScheduler-3224-thread-1) [    x:collection1] o.a.s.u.UpdateHandler start commit{,optimize=false,openSearcher=true,waitSearcher=true,expungeDeletes=false,softCommit=false,prepareCommit=false}
   [junit4]   2> 1400333 INFO  (commitScheduler-3224-thread-1) [    x:collection1] o.a.s.c.SolrCore SolrDeletionPolicy.onCommit: commits: num=2
   [junit4]   2> 	commit{dir=MockDirectoryWrapper(RAMDirectory@6e1881f lockFactory=org.apache.lucene.store.SingleInstanceLockFactory@67f9975e),segFN=segments_2,generation=2}
   [junit4]   2> 	commit{dir=MockDirectoryWrapper(RAMDirectory@6e1881f lockFactory=org.apache.lucene.store.SingleInstanceLockFactory@67f9975e),segFN=segments_3,generation=3}
   [junit4]   2> 1400333 INFO  (commitScheduler-3224-thread-1) [    x:collection1] o.a.s.c.SolrCore newest commit generation = 3
   [junit4]   2> 1400333 INFO  (commitScheduler-3224-thread-1) [    x:collection1] o.a.s.s.SolrIndexSearcher Opening Searcher@8e80557[collection1] main
   [junit4]   2> 1400335 INFO  (searcherExecutor-3222-thread-1-processing-x:collection1) [    x:collection1] o.a.s.c.SolrCore [collection1] Registered new searcher Searcher@8e80557[collection1] main{ExitableDirectoryReader(UninvertingDirectoryReader(Uninverting(_1(6.0.0):c1)))}
   [junit4]   2> 1400335 INFO  (commitScheduler-3224-thread-1) [    x:collection1] o.a.s.u.UpdateHandler end_commit_flush
   [junit4]   2> 1400581 INFO  (TEST-HardAutoCommitTest.testCommitWithin-seed#[21987850F5B91097]) [    x:collection1] o.a.s.c.S.Request [collection1] webapp=null path=null params={q=id:529&qt=standard&start=0&rows=20&version=2.2} hits=0 status=0 QTime=0 
   [junit4]   2> 1400581 INFO  (TEST-HardAutoCommitTest.testCommitWithin-seed#[21987850F5B91097]) [    x:collection1] o.a.s.c.S.Request [collection1] webapp=null path=null params={q=id:530&qt=standard&start=0&rows=20&version=2.2} hits=1 status=0 QTime=0 
   [junit4]   2> 1400583 INFO  (TEST-HardAutoCommitTest.testCommitWithin-seed#[21987850F5B91097]) [    x:collection1] o.a.s.u.p.LogUpdateProcessor [collection1] {add=[500 (1508689772036489216)]} 0 3298
   [junit4]   2> 1400583 INFO  (TEST-HardAutoCommitTest.testCommitWithin-seed#[21987850F5B91097]) [    x:collection1] o.a.s.u.p.LogUpdateProcessor [collection1] {add=[500 (1508689772037537792)]} 0 3298
   [junit4]   2> 1400584 INFO  (TEST-HardAutoCommitTest.testCommitWithin-seed#[21987850F5B91097]) [    x:collection1] o.a.s.u.p.LogUpdateProcessor [collection1] {add=[500 (1508689772038586368)]} 0 3298
   [junit4]   2> 1400584 INFO  (TEST-HardAutoCommitTest.testCommitWithin-seed#[21987850F5B91097]) [    x:collection1] o.a.s.u.p.LogUpdateProcessor [collection1] {add=[500 (1508689772038586369)]} 0 3299
   [junit4]   2> 1400584 INFO  (TEST-HardAutoCommitTest.testCommitWithin-seed#[21987850F5B91097]) [    x:collection1] o.a.s.u.p.LogUpdateProcessor [collection1] {add=[500 (1508689772038586370)]} 0 3299
   [junit4]   2> 1400584 INFO  (TEST-HardAutoCommitTest.testCommitWithin-seed#[21987850F5B91097]) [    x:collection1] o.a.s.u.p.LogUpdateProcessor [collection1] {add=[500 (1508689772038586371)]} 0 3299
   [junit4]   2> 1400585 INFO  (TEST-HardAutoCommitTest.testCommitWithin-seed#[21987850F5B91097]) [    x:collection1] o.a.s.u.p.LogUpdateProcessor [collection1] {add=[500 (1508689772039634944)]} 0 3299
   [junit4]   2> 1400585 INFO  (TEST-HardAutoCommitTest.testCommitWithin-seed#[21987850F5B91097]) [    x:collection1] o.a.s.u.p.LogUpdateProcessor [collection1] {add=[500 (1508689772039634945)]} 0 3300
   [junit4]   2> 1400585 INFO  (TEST-HardAutoCommitTest.testCommitWithin-seed#[21987850F5B91097]) [    x:collection1] o.a.s.u.p.LogUpdateProcessor [collection1] {add=[500 (1508689772039634946)]} 0 3300
   [junit4]   2> 1400585 INFO  (TEST-HardAutoCommitTest.testCommitWithin-seed#[21987850F5B91097]) [    x:collection1] o.a.s.u.p.LogUpdateProcessor [collection1] {add=[500 (1508689772039634947)]} 0 3300
   [junit4]   2> 1400586 INFO  (TEST-HardAutoCommitTest.testCommitWithin-seed#[21987850F5B91097]) [    x:collection1] o.a.s.c.S.Request [collection1] webapp=null path=null params={q=id:500&qt=standard&start=0&rows=20&version=2.2} hits=0 status=0 QTime=0 
   [junit4]   2> 1400586 INFO  (TEST-HardAutoCommitTest.testCommitWithin-seed#[21987850F5B91097]) [    x:collection1] o.a.s.u.p.LogUpdateProcessor [collection1] {delete=[530 (-1508689772040683520)]} 0 3301
   [junit4]   2> 1400587 INFO  (TEST-HardAutoCommitTest.testCommitWithin-seed#[21987850F5B91097]) [    x:collection1] o.a.s.u.p.LogUpdateProcessor [collection1] {delete=[530 (-1508689772041732096)]} 0 3301
   [junit4]   2> 1400587 INFO  (TEST-HardAutoCommitTest.testCommitWithin-seed#[21987850F5B91097]) [    x:collection1] o.a.s.u.p.LogUpdateProcessor [collection1] {delete=[530 (-1508689772041732097)]} 0 3302
   [junit4]   2> 1400587 INFO  (TEST-HardAutoCommitTest.testCommitWithin-seed#[21987850F5B91097]) [    x:collection1] o.a.s.u.p.LogUpdateProcessor [collection1] {delete=[530 (-1508689772041732098)]} 0 3302
   [junit4]   2> 1400587 INFO  (TEST-HardAutoCommitTest.testCommitWithin-seed#[21987850F5B91097]) [    x:collection1] o.a.s.u.p.LogUpdateProcessor [collection1] {delete=[530 (-1508689772041732099)]} 0 3302
   [junit4]   2> 1400588 INFO  (TEST-HardAutoCommitTest.testCommitWithin-seed#[21987850F5B91097]) [    x:collection1] o.a.s.u.p.LogUpdateProcessor [collection1] {delete=[530 (-1508689772042780672)]} 0 3302
   [junit4]   2> 1400588 INFO  (TEST-HardAutoCommitTest.testCommitWithin-seed#[21987850F5B91097]) [    x:collection1] o.a.s.u.p.LogUpdateProcessor [collection1] {delete=[530 (-1508689772042780673)]} 0 3302
   [junit4]   2> 1400588 INFO  (TEST-HardAutoCommitTest.testCommitWithin-seed#[21987850F5B91097]) [    x:collection1] o.a.s.u.p.LogUpdateProcessor [collection1] {delete=[530 (-1508689772042780674)]} 0 3303
   [junit4]   2> 1400588 INFO  (TEST-HardAutoCommitTest.testCommitWithin-seed#[21987850F5B91097]) [    x:collection1] o.a.s.u.p.LogUpdateProcessor [collection1] {delete=[530 (-1508689772042780675)]} 0 3303
   [junit4]   2> 1400588 INFO  (TEST-HardAutoCommitTest.testCommitWithin-seed#[21987850F5B91097]) [    x:collection1] o.a.s.u.p.LogUpdateProcessor [collection1] {delete=[530 (-1508689772042780676)]} 0 3303
   [junit4]   2> 1400589 INFO  (TEST-HardAutoCommitTest.testCommitWithin-seed#[21987850F5B91097]) [    x:collection1] o.a.s.c.S.Request [collection1] webapp=null path=null params={q=id:530&qt=standard&start=0&rows=20&version=2.2} hits=1 status=0 QTime=0 
   [junit4]   2> 1401586 INFO  (commitScheduler-3224-thread-1) [    x:collection1] o.a.s.u.UpdateHandler start commit{,optimize=false,openSearcher=true,waitSearcher=true,expungeDeletes=false,softCommit=false,prepareCommit=false}
   [junit4]   2> 1401598 INFO  (commitScheduler-3224-thread-1) [    x:collection1] o.a.s.c.SolrCore SolrDeletionPolicy.onCommit: commits: num=2
   [junit4]   2> 	commit{dir=MockDirectoryWrapper(RAMDirectory@6e1881f lockFactory=org.apache.lucene.store.SingleInstanceLockFactory@67f9975e),segFN=segments_3,generation=3}
   [junit4]   2> 	commit{dir=MockDirectoryWrapper(RAMDirectory@6e1881f lockFactory=org.apache.lucene.store.SingleInstanceLockFactory@67f9975e),segFN=segments_4,generation=4}
   [junit4]   2> 1401599 INFO  (commitScheduler-3224-thread-1) [    x:collection1] o.a.s.c.SolrCore newest commit generation = 4
   [junit4]   2> 1401599 INFO  (commitScheduler-3224-thread-1) [    x:collection1] o.a.s.s.SolrIndexSearcher Opening Searcher@f42abc6[collection1] main
   [junit4]   2> 1401600 INFO  (searcherExecutor-3222-thread-1-processing-x:collection1) [    x:collection1] o.a.s.c.SolrCore [collection1] Registered new searcher Searcher@f42abc6[collection1] main{ExitableDirectoryReader(UninvertingDirectoryReader(Uninverting(_2(6.0.0):c10/9:delGen=1)))}
   [junit4]   2> 1401601 INFO  (TEST-HardAutoCommitTest.testCommitWithin-seed#[21987850F5B91097]) [    x:collection1] o.a.s.c.S.Request [collection1] webapp=null path=null params={q=id:500&qt=standard&start=0&rows=20&version=2.2} hits=1 status=0 QTime=0 
   [junit4]   2> 1401602 INFO  (TEST-HardAutoCommitTest.testCommitWithin-seed#[21987850F5B91097]) [    x:collection1] o.a.s.c.S.Request [collection1] webapp=null path=null params={q=id:530&qt=standard&start=0&rows=20&version=2.2} hits=0 status=0 QTime=0 
   [junit4]   2> 1401602 INFO  (TEST-HardAutoCommitTest.testCommitWithin-seed#[21987850F5B91097]) [    x:collection1] o.a.s.SolrTestCaseJ4 ###Ending testCommitWithin
   [junit4]   2> 1401603 INFO  (SUITE-HardAutoCommitTest-seed#[21987850F5B91097]-worker) [    x:collection1] o.a.s.SolrTestCaseJ4 ###deleteCore
   [junit4]   2> 1401603 INFO  (SUITE-HardAutoCommitTest-seed#[21987850F5B91097]-worker) [    x:collection1] o.a.s.c.CoreContainer Shutting down CoreContainer instance=282652001
   [junit4]   2> 1401603 INFO  (SUITE-HardAutoCommitTest-seed#[21987850F5B91097]-worker) [    x:collection1] o.a.s.c.SolrCore [collection1]  CLOSING SolrCore org.apache.solr.core.SolrCore@59183bbd
   [junit4]   2> 1401603 INFO  (SUITE-HardAutoCommitTest-seed#[21987850F5B91097]-worker) [    x:collection1] o.a.s.u.UpdateHandler closing DirectUpdateHandler2{commits=3,autocommits=3,soft autocommits=0,optimizes=0,rollbacks=0,expungeDeletes=0,docsPending=0,adds=10,deletesById=10,deletesByQuery=0,errors=0,cumulative_adds=12,cumulative_deletesById=11,cumulative_deletesByQuery=0,cumulative_errors=0,transaction_logs_total_size=310,transaction_logs_total_number=2}
   [junit4]   2> 1401605 INFO  (SUITE-HardAutoCommitTest-seed#[21987850F5B91097]-worker) [    x:collection1] o.a.s.u.SolrCoreState Closing SolrCoreState
   [junit4]   2> 1401605 INFO  (SUITE-HardAutoCommitTest-seed#[21987850F5B91097]-worker) [    x:collection1] o.a.s.u.DefaultSolrCoreState SolrCoreState ref count has reached 0 - closing IndexWriter
   [junit4]   2> 1401605 INFO  (SUITE-HardAutoCommitTest-seed#[21987850F5B91097]-worker) [    x:collection1] o.a.s.u.DefaultSolrCoreState closing IndexWriter with IndexWriterCloser
   [junit4]   2> 1401606 ERROR (commitScheduler-3224-thread-1) [    x:collection1] o.a.s.u.CommitTracker auto commit error...:org.apache.solr.common.SolrException: java.nio.channels.ClosedByInterruptException
   [junit4]   2> 	at org.apache.solr.update.TransactionLog.writeCommit(TransactionLog.java:463)
   [junit4]   2> 	at org.apache.solr.update.UpdateLog.postCommit(UpdateLog.java:668)
   [junit4]   2> 	at org.apache.solr.update.DirectUpdateHandler2.commit(DirectUpdateHandler2.java:625)
   [junit4]   2> 	at org.apache.solr.update.CommitTracker.run(CommitTracker.java:216)
   [junit4]   2> 	at java.util.concurrent.Executors$RunnableAdapter.call(Executors.java:511)
   [junit4]   2> 	at java.util.concurrent.FutureTask.run(FutureTask.java:266)
   [junit4]   2> 	at java.util.concurrent.ScheduledThreadPoolExecutor$ScheduledFutureTask.access$201(ScheduledThreadPoolExecutor.java:180)
   [junit4]   2> 	at java.util.concurrent.ScheduledThreadPoolExecutor$ScheduledFutureTask.run(ScheduledThreadPoolExecutor.java:293)
   [junit4]   2> 	at java.util.concurrent.ThreadPoolExecutor.runWorker(ThreadPoolExecutor.java:1142)
   [junit4]   2> 	at java.util.concurrent.ThreadPoolExecutor$Worker.run(ThreadPoolExecutor.java:617)
   [junit4]   2> 	at java.lang.Thread.run(Thread.java:745)
   [junit4]   2> Caused by: java.nio.channels.ClosedByInterruptException
   [junit4]   2> 	at java.nio.channels.spi.AbstractInterruptibleChannel.end(AbstractInterruptibleChannel.java:202)
   [junit4]   2> 	at sun.nio.ch.FileChannelImpl.write(FileChannelImpl.java:215)
   [junit4]   2> 	at java.nio.channels.Channels.writeFullyImpl(Channels.java:78)
   [junit4]   2> 	at java.nio.channels.Channels.writeFully(Channels.java:101)
   [junit4]   2> 	at java.nio.channels.Channels.access$000(Channels.java:61)
   [junit4]   2> 	at java.nio.channels.Channels$1.write(Channels.java:174)
   [junit4]   2> 	at org.apache.solr.common.util.FastOutputStream.flush(FastOutputStream.java:214)
   [junit4]   2> 	at org.apache.solr.common.util.FastOutputStream.flushBuffer(FastOutputStream.java:207)
   [junit4]   2> 	at org.apache.solr.common.util.FastOutputStream.flush(FastOutputStream.java:191)
   [junit4]   2> 	at org.apache.solr.update.TransactionLog.writeCommit(TransactionLog.java:458)
   [junit4]   2> 	... 10 more
   [junit4]   2> 
   [junit4]   2> 1401607 ERROR (SUITE-HardAutoCommitTest-seed#[21987850F5B91097]-worker) [    x:collection1] o.a.s.u.UpdateHandler Error closing log files
   [junit4]   2> org.apache.solr.common.SolrException: java.nio.channels.ClosedChannelException
   [junit4]   2> 	at org.apache.solr.update.TransactionLog.close(TransactionLog.java:559)
   [junit4]   2> 	at org.apache.solr.update.TransactionLog.decref(TransactionLog.java:509)
   [junit4]   2> 	at org.apache.solr.update.UpdateLog.doClose(UpdateLog.java:882)
   [junit4]   2> 	at org.apache.solr.update.UpdateLog.close(UpdateLog.java:897)
   [junit4]   2> 	at org.apache.solr.update.UpdateLog.close(UpdateLog.java:888)
   [junit4]   2> 	at org.apache.solr.update.DirectUpdateHandler2.closeWriter(DirectUpdateHandler2.java:789)
   [junit4]   2> 	at org.apache.solr.update.DefaultSolrCoreState.closeIndexWriter(DefaultSolrCoreState.java:75)
   [junit4]   2> 	at org.apache.solr.update.DefaultSolrCoreState.close(DefaultSolrCoreState.java:374)
   [junit4]   2> 	at org.apache.solr.update.SolrCoreState.decrefSolrCoreState(SolrCoreState.java:73)
   [junit4]   2> 	at org.apache.solr.core.SolrCore.close(SolrCore.java:1208)
   [junit4]   2> 	at org.apache.solr.core.SolrCores.close(SolrCores.java:124)
   [junit4]   2> 	at org.apache.solr.core.CoreContainer.shutdown(CoreContainer.java:525)
   [junit4]   2> 	at org.apache.solr.util.TestHarness.close(TestHarness.java:359)
   [junit4]   2> 	at org.apache.solr.SolrTestCaseJ4.deleteCore(SolrTestCaseJ4.java:675)
   [junit4]   2> 	at org.apache.solr.SolrTestCaseJ4.afterClass(SolrTestCaseJ4.java:228)
   [junit4]   2> 	at sun.reflect.GeneratedMethodAccessor39.invoke(Unknown Source)
   [junit4]   2> 	at sun.reflect.DelegatingMethodAccessorImpl.invoke(DelegatingMethodAccessorImpl.java:43)
   [junit4]   2> 	at java.lang.reflect.Method.invoke(Method.java:497)
   [junit4]   2> 	at com.carrotsearch.randomizedtesting.RandomizedRunner.invoke(RandomizedRunner.java:1627)
   [junit4]   2> 	at com.carrotsearch.randomizedtesting.RandomizedRunner$5.evaluate(RandomizedRunner.java:799)
   [junit4]   2> 	at com.carrotsearch.randomizedtesting.rules.StatementAdapter.evaluate(StatementAdapter.java:36)
   [junit4]   2> 	at com.carrotsearch.randomizedtesting.rules.SystemPropertiesRestoreRule$1.evaluate(SystemPropertiesRestoreRule.java:57)
   [junit4]   2> 	at org.apache.lucene.util.AbstractBeforeAfterRule$1.evaluate(AbstractBeforeAfterRule.java:46)
   [junit4]   2> 	at com.carrotsearch.randomizedtesting.rules.StatementAdapter.evaluate(StatementAdapter.java:36)
   [junit4]   2> 	at org.apache.lucene.util.TestRuleStoreClassName$1.evaluate(TestRuleStoreClassName.java:42)
   [junit4]   2> 	at com.carrotsearch.randomizedtesting.rules.NoShadowingOrOverridesOnMethodsRule$1.evaluate(NoShadowingOrOverridesOnMethodsRule.java:39)
   [junit4]   2> 	at com.carrotsearch.randomizedtesting.rules.NoShadowingOrOverridesOnMethodsRule$1.evaluate(NoShadowingOrOverridesOnMethodsRule.java:39)
   [junit4]   2> 	at com.carrotsearch.randomizedtesting.rules.StatementAdapter.evaluate(StatementAdapter.java:36)
   [junit4]   2> 	at com.carrotsearch.randomizedtesting.rules.StatementAdapter.evaluate(StatementAdapter.java:36)
   [junit4]   2> 	at com.carrotsearch.randomizedtesting.rules.StatementAdapter.evaluate(StatementAdapter.java:36)
   [junit4]   2> 	at org.apache.lucene.util.TestRuleAssertionsRequired$1.evaluate(TestRuleAssertionsRequired.java:54)
   [junit4]   2> 	at org.apache.lucene.util.TestRuleMarkFailure$1.evaluate(TestRuleMarkFailure.java:48)
   [junit4]   2> 	at org.apache.lucene.util.TestRuleIgnoreAfterMaxFailures$1.evaluate(TestRuleIgnoreAfterMaxFailures.java:65)
   [junit4]   2> 	at org.apache.lucene.util.TestRuleIgnoreTestSuites$1.evaluate(TestRuleIgnoreTestSuites.java:55)
   [junit4]   2> 	at com.carrotsearch.randomizedtesting.rules.StatementAdapter.evaluate(StatementAdapter.java:36)
   [junit4]   2> 	at com.carrotsearch.randomizedtesting.ThreadLeakControl$StatementRunner.run(ThreadLeakControl.java:365)
   [junit4]   2> 	at java.lang.Thread.run(Thread.java:745)
   [junit4]   2> Caused by: java.nio.channels.ClosedChannelException
   [junit4]   2> 	at sun.nio.ch.FileChannelImpl.ensureOpen(FileChannelImpl.java:109)
   [junit4]   2> 	at sun.nio.ch.FileChannelImpl.write(FileChannelImpl.java:198)
   [junit4]   2> 	at java.nio.channels.Channels.writeFullyImpl(Channels.java:78)
   [junit4]   2> 	at java.nio.channels.Channels.writeFully(Channels.java:101)
   [junit4]   2> 	at java.nio.channels.Channels.access$000(Channels.java:61)
   [junit4]   2> 	at java.nio.channels.Channels$1.write(Channels.java:174)
   [junit4]   2> 	at org.apache.solr.common.util.FastOutputStream.flush(FastOutputStream.java:214)
   [junit4]   2> 	at org.apache.solr.common.util.FastOutputStream.flushBuffer(FastOutputStream.java:207)
   [junit4]   2> 	at org.apache.solr.common.util.FastOutputStream.flush(FastOutputStream.java:191)
   [junit4]   2> 	at org.apache.solr.update.TransactionLog.close(TransactionLog.java:546)
   [junit4]   2> 	... 36 more
   [junit4]   2> 1401613 INFO  (SUITE-HardAutoCommitTest-seed#[21987850F5B91097]-worker) [    x:collection1] o.a.s.c.SolrCore [collection1] Closing main searcher on request.
   [junit4]   2> 1401658 INFO  (SUITE-HardAutoCommitTest-seed#[21987850F5B91097]-worker) [    x:collection1] o.a.s.c.CachingDirectoryFactory Closing MockDirectoryFactory - 2 directories currently being tracked
   [junit4]   2> 1401658 INFO  (SUITE-HardAutoCommitTest-seed#[21987850F5B91097]-worker) [    x:collection1] o.a.s.c.CachingDirectoryFactory looking to close /x1/jenkins/jenkins-slave/workspace/Lucene-Solr-Tests-trunk-Java8/solr/build/solr-core/test/J1/temp/solr.update.HardAutoCommitTest_21987850F5B91097-001/init-core-data-001 [CachedDir<<refCount=0;path=/x1/jenkins/jenkins-slave/workspace/Lucene-Solr-Tests-trunk-Java8/solr/build/solr-core/test/J1/temp/solr.update.HardAutoCommitTest_21987850F5B91097-001/init-core-data-001;done=false>>]
   [junit4]   2> 1401658 INFO  (SUITE-HardAutoCommitTest-seed#[21987850F5B91097]-worker) [    x:collection1] o.a.s.c.CachingDirectoryFactory Closing directory: /x1/jenkins/jenkins-slave/workspace/Lucene-Solr-Tests-trunk-Java8/solr/build/solr-core/test/J1/temp/solr.update.HardAutoCommitTest_21987850F5B91097-001/init-core-data-001
   [junit4]   2> 1401658 INFO  (SUITE-HardAutoCommitTest-seed#[21987850F5B91097]-worker) [    x:collection1] o.a.s.c.CachingDirectoryFactory looking to close /x1/jenkins/jenkins-slave/workspace/Lucene-Solr-Tests-trunk-Java8/solr/build/solr-core/test/J1/temp/solr.update.HardAutoCommitTest_21987850F5B91097-001/init-core-data-001/index [CachedDir<<refCount=0;path=/x1/jenkins/jenkins-slave/workspace/Lucene-Solr-Tests-trunk-Java8/solr/build/solr-core/test/J1/temp/solr.update.HardAutoCommitTest_21987850F5B91097-001/init-core-data-001/index;done=false>>]
   [junit4]   2> 1401658 INFO  (SUITE-HardAutoCommitTest-seed#[21987850F5B91097]-worker) [    x:collection1] o.a.s.c.CachingDirectoryFactory Closing directory: /x1/jenkins/jenkins-slave/workspace/Lucene-Solr-Tests-trunk-Java8/solr/build/solr-core/test/J1/temp/solr.update.HardAutoCommitTest_21987850F5B91097-001/init-core-data-001/index
   [junit4]   2> ObjectTracker found 2 object(s) that were not released!!! [TransactionLog]
   [junit4]   2> org.apache.solr.common.util.ObjectReleaseTracker$ObjectTrackerException
   [junit4]   2> 	at org.apache.solr.common.util.ObjectReleaseTracker.track(ObjectReleaseTracker.java:34)
   [junit4]   2> 	at org.apache.solr.update.TransactionLog.<init>(TransactionLog.java:185)
   [junit4]   2> 	at org.apache.solr.update.UpdateLog.newTransactionLog(UpdateLog.java:344)
   [junit4]   2> 	at org.apache.solr.update.UpdateLog.ensureLog(UpdateLog.java:867)
   [junit4]   2> 	at org.apache.solr.update.UpdateLog.add(UpdateLog.java:428)
   [junit4]   2> 	at org.apache.solr.update.UpdateLog.add(UpdateLog.java:415)
   [junit4]   2> 	at org.apache.solr.update.DirectUpdateHandler2.addDoc0(DirectUpdateHandler2.java:258)
   [junit4]   2> 	at org.apache.solr.update.DirectUpdateHandler2.addDoc(DirectUpdateHandler2.java:163)
   [junit4]   2> 	at org.apache.solr.update.processor.RunUpdateProcessor.processAdd(RunUpdateProcessorFactory.java:69)
   [junit4]   2> 	at org.apache.solr.update.processor.UpdateRequestProcessor.processAdd(UpdateRequestProcessor.java:51)
   [junit4]   2> 	at org.apache.solr.update.processor.DistributedUpdateProcessor.doLocalAdd(DistributedUpdateProcessor.java:955)
   [junit4]   2> 	at org.apache.solr.update.processor.DistributedUpdateProcessor.versionAdd(DistributedUpdateProcessor.java:1110)
   [junit4]   2> 	at org.apache.solr.update.processor.DistributedUpdateProcessor.processAdd(DistributedUpdateProcessor.java:706)
   [junit4]   2> 	at org.apache.solr.update.processor.LogUpdateProcessor.processAdd(LogUpdateProcessorFactory.java:104)
   [junit4]   2> 	at org.apache.solr.handler.loader.XMLLoader.processUpdate(XMLLoader.java:250)
   [junit4]   2> 	at org.apache.solr.handler.loader.XMLLoader.load(XMLLoader.java:177)
   [junit4]   2> 	at org.apache.solr.handler.UpdateRequestHandler$1.load(UpdateRequestHandler.java:98)
   [junit4]   2> 	at org.apache.solr.handler.ContentStreamHandlerBase.handleRequestBody(ContentStreamHandlerBase.java:74)
   [junit4]   2> 	at org.apache.solr.handler.RequestHandlerBase.handleRequest(RequestHandlerBase.java:143)
   [junit4]   2> 	at org.apache.solr.update.HardAutoCommitTest.testCommitWithin(HardAutoCommitTest.java:88)
   [junit4]   2> 	at sun.reflect.NativeMethodAccessorImpl.invoke0(Native Method)
   [junit4]   2> 	at sun.reflect.NativeMethodAccessorImpl.invoke(NativeMethodAccessorImpl.java:62)
   [junit4]   2> 	at sun.reflect.DelegatingMethodAccessorImpl.invoke(DelegatingMethodAccessorImpl.java:43)
   [junit4]   2> 	at java.lang.reflect.Method.invoke(Method.java:497)
   [junit4]   2> 	at com.carrotsearch.randomizedtesting.RandomizedRunner.invoke(RandomizedRunner.java:1627)
   [junit4]   2> 	at com.carrotsearch.randomizedtesting.RandomizedRunner$6.evaluate(RandomizedRunner.java:836)
   [junit4]   2> 	at com.carrotsearch.randomizedtesting.RandomizedRunner$7.evaluate(RandomizedRunner.java:872)
   [junit4]   2> 	at com.carrotsearch.randomizedtesting.RandomizedRunner$8.evaluate(RandomizedRunner.java:886)
   [junit4]   2> 	at com.carrotsearch.randomizedtesting.rules.SystemPropertiesRestoreRule$1.evaluate(SystemPropertiesRestoreRule.java:57)
   [junit4]   2> 	at org.apache.lucene.util.TestRuleSetupTeardownChained$1.evaluate(TestRuleSetupTeardownChained.java:50)
   [junit4]   2> 	at org.apache.lucene.util.AbstractBeforeAfterRule$1.evaluate(AbstractBeforeAfterRule.java:46)
   [junit4]   2> 	at org.apache.lucene.util.TestRuleThreadAndTestName$1.evaluate(TestRuleThreadAndTestName.java:49)
   [junit4]   2> 	at org.apache.lucene.util.TestRuleIgnoreAfterMaxFailures$1.evaluate(TestRuleIgnoreAfterMaxFailures.java:65)
   [junit4]   2> 	at org.apache.lucene.util.TestRuleMarkFailure$1.evaluate(TestRuleMarkFailure.java:48)
   [junit4]   2> 	at com.carrotsearch.randomizedtesting.rules.StatementAdapter.evaluate(StatementAdapter.java:36)
   [junit4]   2> 	at com.carrotsearch.randomizedtesting.ThreadLeakControl$StatementRunner.run(ThreadLeakControl.java:365)
   [junit4]   2> 	at com.carrotsearch.randomizedtesting.ThreadLeakControl.forkTimeoutingTask(ThreadLeakControl.java:798)
   [junit4]   2> 	at com.carrotsearch.randomizedtesting.ThreadLeakControl$3.evaluate(ThreadLeakControl.java:458)
   [junit4]   2> 	at com.carrotsearch.randomizedtesting.RandomizedRunner.runSingleTest(RandomizedRunner.java:845)
   [junit4]   2> 	at com.carrotsearch.randomizedtesting.RandomizedRunner$3.evaluate(RandomizedRunner.java:747)
   [junit4]   2> 	at com.carrotsearch.randomizedtesting.RandomizedRunner$4.evaluate(RandomizedRunner.java:781)
   [junit4]   2> 	at com.carrotsearch.randomizedtesting.RandomizedRunner$5.evaluate(RandomizedRunner.java:792)
   [junit4]   2> 	at com.carrotsearch.randomizedtesting.rules.StatementAdapter.evaluate(StatementAdapter.java:36)
   [junit4]   2> 	at com.carrotsearch.randomizedtesting.rules.SystemPropertiesRestoreRule$1.evaluate(SystemPropertiesRestoreRule.java:57)
   [junit4]   2> 	at org.apache.lucene.util.AbstractBeforeAfterRule$1.evaluate(AbstractBeforeAfterRule.java:46)
   [junit4]   2> 	at com.carrotsearch.randomizedtesting.rules.StatementAdapter.evaluate(StatementAdapter.java:36)
   [junit4]   2> 	at org.apache.lucene.util.TestRuleStoreClassName$1.evaluate(TestRuleStoreClassName.java:42)
   [junit4]   2> 	at com.carrotsearch.randomizedtesting.rules.NoShadowingOrOverridesOnMethodsRule$1.evaluate(NoShadowingOrOverridesOnMethodsRule.java:39)
   [junit4]   2> 	at com.carrotsearch.randomizedtesting.rules.NoShadowingOrOverridesOnMethodsRule$1.evaluate(NoShadowingOrOverridesOnMethodsRule.java:39)
   [junit4]   2> 	at com.carrotsearch.randomizedtesting.rules.StatementAdapter.evaluate(StatementAdapter.java:36)
   [junit4]   2> 	at com.carrotsearch.randomizedtesting.rules.StatementAdapter.evaluate(StatementAdapter.java:36)
   [junit4]   2> 	at com.carrotsearch.randomizedtesting.rules.StatementAdapter.evaluate(StatementAdapter.java:36)
   [junit4]   2> 	at org.apache.lucene.util.TestRuleAssertionsRequired$1.evaluate(TestRuleAssertionsRequired.java:54)
   [junit4]   2> 	at org.apache.lucene.util.TestRuleMarkFailure$1.evaluate(TestRuleMarkFailure.java:48)
   [junit4]   2> 	at org.apache.lucene.util.TestRuleIgnoreAfterMaxFailures$1.evaluate(TestRuleIgnoreAfterMaxFailures.java:65)
   [junit4]   2> 	at org.apache.lucene.util.TestRuleIgnoreTestSuites$1.evaluate(TestRuleIgnoreTestSuites.java:55)
   [junit4]   2> 	at com.carrotsearch.randomizedtesting.rules.StatementAdapter.evaluate(StatementAdapter.java:36)
   [junit4]   2> 	at com.carrotsearch.randomizedtesting.ThreadLeakControl$StatementRunner.run(ThreadLeakControl.java:365)
   [junit4]   2> 	at java.lang.Thread.run(Thread.java:745)
   [junit4]   2> 
   [junit4]   2> org.apache.solr.common.util.ObjectReleaseTracker$ObjectTrackerException
   [junit4]   2> 	at org.apache.solr.common.util.ObjectReleaseTracker.track(ObjectReleaseTracker.java:34)
   [junit4]   2> 	at org.apache.solr.update.TransactionLog.<init>(TransactionLog.java:185)
   [junit4]   2> 	at org.apache.solr.update.UpdateLog.newTransactionLog(UpdateLog.java:344)
   [junit4]   2> 	at org.apache.solr.update.UpdateLog.ensureLog(UpdateLog.java:867)
   [junit4]   2> 	at org.apache.solr.update.UpdateLog.deleteByQuery(UpdateLog.java:503)
   [junit4]   2> 	at org.apache.solr.update.DirectUpdateHandler2.deleteByQuery(DirectUpdateHandler2.java:414)
   [junit4]   2> 	at org.apache.solr.update.processor.RunUpdateProcessor.processDelete(RunUpdateProcessorFactory.java:80)
   [junit4]   2> 	at org.apache.solr.update.processor.UpdateRequestProcessor.processDelete(UpdateRequestProcessor.java:55)
   [junit4]   2> 	at org.apache.solr.update.processor.DistributedUpdateProcessor.doLocalDelete(DistributedUpdateProcessor.java:960)
   [junit4]   2> 	at org.apache.solr.update.processor.DistributedUpdateProcessor.versionDeleteByQuery(DistributedUpdateProcessor.java:1434)
   [junit4]   2> 	at org.apache.solr.update.processor.DistributedUpdateProcessor.doDeleteByQuery(DistributedUpdateProcessor.java:1339)
   [junit4]   2> 	at org.apache.solr.update.processor.DistributedUpdateProcessor.processDelete(DistributedUpdateProcessor.java:1154)
   [junit4]   2> 	at org.apache.solr.update.processor.LogUpdateProcessor.processDelete(LogUpdateProcessorFactory.java:125)
   [junit4]   2> 	at org.apache.solr.handler.loader.XMLLoader.processDelete(XMLLoader.java:355)
   [junit4]   2> 	at org.apache.solr.handler.loader.XMLLoader.processUpdate(XMLLoader.java:281)
   [junit4]   2> 	at org.apache.solr.handler.loader.XMLLoader.load(XMLLoader.java:177)
   [junit4]   2> 	at org.apache.solr.handler.UpdateRequestHandler$1.load(UpdateRequestHandler.java:98)
   [junit4]   2> 	at org.apache.solr.handler.ContentStreamHandlerBase.handleRequestBody(ContentStreamHandlerBase.java:74)
   [junit4]   2> 	at org.apache.solr.handler.RequestHandlerBase.handleRequest(RequestHandlerBase.java:143)
   [junit4]   2> 	at org.apache.solr.core.SolrCore.execute(SolrCore.java:2068)
   [junit4]   2> 	at org.apache.solr.servlet.DirectSolrConnection.request(DirectSolrConnection.java:131)
   [junit4]   2> 	at org.apache.solr.util.TestHarness.update(TestHarness.java:267)
   [junit4]   2> 	at org.apache.solr.util.BaseTestHarness.checkUpdateStatus(BaseTestHarness.java:283)
   [junit4]   2> 	at org.apache.solr.util.BaseTestHarness.validateUpdate(BaseTestHarness.java:253)
   [junit4]   2> 	at org.apache.solr.SolrTestCaseJ4.checkUpdateU(SolrTestCaseJ4.java:719)
   [junit4]   2> 	at org.apache.solr.SolrTestCaseJ4.assertU(SolrTestCaseJ4.java:698)
   [junit4]   2> 	at org.apache.solr.SolrTestCaseJ4.assertU(SolrTestCaseJ4.java:692)
   [junit4]   2> 	at org.apache.solr.SolrTestCaseJ4.clearIndex(SolrTestCaseJ4.java:1084)
   [junit4]   2> 	at org.apache.solr.update.HardAutoCommitTest.setUp(HardAutoCommitTest.java:49)
   [junit4]   2> 	at sun.reflect.GeneratedMethodAccessor11.invoke(Unknown Source)
   [junit4]   2> 	at sun.reflect.DelegatingMethodAccessorImpl.invoke(DelegatingMethodAccessorImpl.java:43)
   [junit4]   2> 	at java.lang.reflect.Method.invoke(Method.java:497)
   [junit4]   2> 	at com.carrotsearch.randomizedtesting.RandomizedRunner.invoke(RandomizedRunner.java:1627)
   [junit4]   2> 	at com.carrotsearch.randomizedtesting.RandomizedRunner$7.evaluate(RandomizedRunner.java:870)
   [junit4]   2> 	at com.carrotsearch.randomizedtesting.RandomizedRunner$8.evaluate(RandomizedRunner.java:886)
   [junit4]   2> 	at com.carrotsearch.randomizedtesting.rules.SystemPropertiesRestoreRule$1.evaluate(SystemPropertiesRestoreRule.java:57)
   [junit4]   2> 	at org.apache.lucene.util.TestRuleSetupTeardownChained$1.evaluate(TestRuleSetupTeardownChained.java:50)
   [junit4]   2> 	at org.apache.lucene.util.AbstractBeforeAfterRule$1.evaluate(AbstractBeforeAfterRule.java:46)
   [junit4]   2> 	at org.apache.lucene.util.TestRuleThreadAndTestName$1.evaluate(TestRuleThreadAndTestName.java:49)
   [junit4]   2> 	at org.apache.lucene.util.TestRuleIgnoreAfterMaxFailures$1.evaluate(TestRuleIgnoreAfterMaxFailures.java:65)
   [junit4]   2> 	at org.apache.lucene.util.TestRuleMarkFailure$1.evaluate(TestRuleMarkFailure.java:48)
   [junit4]   2> 	at com.carrotsearch.randomizedtesting.rules.StatementAdapter.evaluate(StatementAdapter.java:36)
   [junit4]   2> 	at com.carrotsearch.randomizedtesting.ThreadLeakControl$StatementRunner.run(ThreadLeakControl.java:365)
   [junit4]   2> 	at com.carrotsearch.randomizedtesting.ThreadLeakControl.forkTimeoutingTask(ThreadLeakControl.java:798)
   [junit4]   2> 	at com.carrotsearch.randomizedtesting.ThreadLeakControl$3.evaluate(ThreadLeakControl.java:458)
   [junit4]   2> 	at com.carrotsearch.randomizedtesting.RandomizedRunner.runSingleTest(RandomizedRunner.java:845)
   [junit4]   2> 	at com.carrotsearch.randomizedtesting.RandomizedRunner$3.evaluate(RandomizedRunner.java:747)
   [junit4]   2> 	at com.carrotsearch.randomizedtesting.RandomizedRunner$4.evaluate(RandomizedRunner.java:781)
   [junit4]   2> 	at com.carrotsearch.randomizedtesting.RandomizedRunner$5.evaluate(RandomizedRunner.java:792)
   [junit4]   2> 	at com.carrotsearch.randomizedtesting.rules.StatementAdapter.evaluate(StatementAdapter.java:36)
   [junit4]   2> 	at com.carrotsearch.randomizedtesting.rules.SystemPropertiesRestoreRule$1.evaluate(SystemPropertiesRestoreRule.java:57)
   [junit4]   2> 	at org.apache.lucene.util.AbstractBeforeAfterRule$1.evaluate(AbstractBeforeAfterRule.java:46)
   [junit4]   2> 	at com.carrotsearch.randomizedtesting.rules.StatementAdapter.evaluate(StatementAdapter.java:36)
   [junit4]   2> 	at org.apache.lucene.util.TestRuleStoreClassName$1.evaluate(TestRuleStoreClassName.java:42)
   [junit4]   2> 	at com.carrotsearch.randomizedtesting.rules.NoShadowingOrOverridesOnMethodsRule$1.evaluate(NoShadowingOrOverridesOnMethodsRule.java:39)
   [junit4]   2> 	at com.carrotsearch.randomizedtesting.rules.NoShadowingOrOverridesOnMethodsRule$1.evaluate(NoShadowingOrOverridesOnMethodsRule.java:39)
   [junit4]   2> 	at com.carrotsearch.randomizedtesting.rules.StatementAdapter.evaluate(StatementAdapter.java:36)
   [junit4]   2> 	at com.carrotsearch.randomizedtesting.rules.StatementAdapter.evaluate(StatementAdapter.java:36)
   [junit4]   2> 	at com.carrotsearch.randomizedtesting.rules.StatementAdapter.evaluate(StatementAdapter.java:36)
   [junit4]   2> 	at org.apache.lucene.util.TestRuleAssertionsRequired$1.evaluate(TestRuleAssertionsRequired.java:54)
   [junit4]   2> 	at org.apache.lucene.util.TestRuleMarkFailure$1.evaluate(TestRuleMarkFailure.java:48)
   [junit4]   2> 	at org.apache.lucene.util.TestRuleIgnoreAfterMaxFailures$1.evaluate(TestRuleIgnoreAfterMaxFailures.java:65)
   [junit4]   2> 	at org.apache.lucene.util.TestRuleIgnoreTestSuites$1.evaluate(TestRuleIgnoreTestSuites.java:55)
   [junit4]   2> 	at com.carrotsearch.randomizedtesting.rules.StatementAdapter.evaluate(StatementAdapter.java:36)
   [junit4]   2> 	at com.carrotsearch.randomizedtesting.ThreadLeakControl$StatementRunner.run(ThreadLeakControl.java:365)
   [junit4]   2> 	at java.lang.Thread.run(Thread.java:745)
   [junit4]   2> 
   [junit4]   2> NOTE: test params are: codec=Asserting(Lucene53): {range_facet_l_dv=PostingsFormat(name=Asserting), _version_=FST50, field_t=Lucene50(blocksize=128), multiDefault=PostingsFormat(name=LuceneFixedGap), subject=PostingsFormat(name=LuceneFixedGap), intDefault=FST50, id=PostingsFormat(name=Asserting), range_facet_i_dv=FST50, text=Lucene50(blocksize=128), range_facet_l=FST50, timestamp=FST50}, docValues:{range_facet_l_dv=DocValuesFormat(name=Asserting), range_facet_i_dv=DocValuesFormat(name=Lucene50), timestamp=DocValuesFormat(name=Lucene50)}, sim=RandomSimilarityProvider(queryNorm=true,coord=yes): {}, locale=nl, timezone=Asia/Urumqi
   [junit4]   2> NOTE: Linux 3.13.0-52-generic amd64/Oracle Corporation 1.8.0_45 (64-bit)/cpus=4,threads=1,free=285194656,total=522190848
   [junit4]   2> NOTE: All tests run in this JVM: [TestCollectionAPI, BasicFunctionalityTest, TestCharFilters, AlternateDirectoryTest, TestSolrCoreProperties, FileUtilsTest, TestSolrDeletionPolicy2, TestSolrConfigHandlerConcurrent, BigEndianAscendingWordSerializerTest, TestSchemaManager, TestSuggestSpellingConverter, DistributedFacetPivotLargeTest, TestDownShardTolerantSearch, TestIntervalFaceting, OutOfBoxZkACLAndCredentialsProvidersTest, SpatialFilterTest, TestSolrCloudWithKerberosAlt, BufferStoreTest, TestObjectReleaseTracker, TestDynamicFieldResource, SolrPluginUtilsTest, ConnectionManagerTest, CoreAdminHandlerTest, DeleteShardTest, OpenCloseCoreStressTest, HdfsNNFailoverTest, DistanceFunctionTest, TestJsonFacets, WordBreakSolrSpellCheckerTest, SpellingQueryConverterTest, TestCustomSort, DocumentAnalysisRequestHandlerTest, PreAnalyzedFieldTest, TestExpandComponent, CollectionsAPIAsyncDistributedZkTest, AsyncCallRequestStatusResponseTest, HdfsThreadLeakTest, TestJsonRequest, DistributedMLTComponentTest, JSONWriterTest, ZkControllerTest, DocValuesMultiTest, CacheHeaderTest, TestCloudManagedSchemaConcurrent, HdfsRecoverLeaseTest, TestReplicationHandlerBackup, CdcrReplicationHandlerTest, TestHighlightDedupGrouping, TestFiltering, AnalysisAfterCoreReloadTest, TestLeaderElectionZkExpiry, TestOmitPositions, HdfsChaosMonkeySafeLeaderTest, TestComplexPhraseQParserPlugin, TestStressVersions, FieldAnalysisRequestHandlerTest, ZkSolrClientTest, ShowFileRequestHandlerTest, HdfsUnloadDistributedZkTest, ScriptEngineTest, TestInitQParser, TestSimpleTrackingShardHandler, TestFoldingMultitermQuery, AsyncMigrateRouteKeyTest, SolrCloudExampleTest, BadComponentTest, TestElisionMultitermQuery, TestFuzzyAnalyzedSuggestions, TestWriterPerf, HLLUtilTest, TestRecoveryHdfs, DistribCursorPagingTest, CopyFieldTest, TestRestManager, CurrencyFieldOpenExchangeTest, TestShortCircuitedRequests, RAMDirectoryFactoryTest, TestDistribIDF, TestSerializedLuceneMatchVersion, FieldMutatingUpdateProcessorTest, HttpPartitionTest, TestPivotHelperCode, TestManagedSchemaFieldResource, TestFastLRUCache, SliceStateTest, TestCloudPivotFacet, TestValueSourceCache, HighlighterMaxOffsetTest, DocumentBuilderTest, CollectionsAPIDistributedZkTest, LeaderElectionIntegrationTest, FullSolrCloudDistribCmdsTest, ZkCLITest, AutoCommitTest, TestHashPartitioner, TestRealTimeGet, HardAutoCommitTest]
   [junit4]   2> NOTE: reproduce with: ant test  -Dtestcase=HardAutoCommitTest -Dtests.seed=21987850F5B91097 -Dtests.multiplier=2 -Dtests.slow=true -Dtests.locale=nl -Dtests.timezone=Asia/Urumqi -Dtests.asserts=true -Dtests.file.encoding=UTF-8
   [junit4] ERROR   0.00s J1 | HardAutoCommitTest (suite) <<<
   [junit4]    > Throwable #1: java.lang.AssertionError: ObjectTracker found 2 object(s) that were not released!!! [TransactionLog]
   [junit4]    > 	at __randomizedtesting.SeedInfo.seed([21987850F5B91097]:0)
   [junit4]    > 	at org.apache.solr.SolrTestCaseJ4.afterClass(SolrTestCaseJ4.java:236)
   [junit4]    > 	at java.lang.Thread.run(Thread.java:745)
   [junit4] Completed [290/534] on J1 in 6.02s, 1 test, 1 failure <<< FAILURES!

[...truncated 753 lines...]
BUILD FAILED
/x1/jenkins/jenkins-slave/workspace/Lucene-Solr-Tests-trunk-Java8/build.xml:716: The following error occurred while executing this line:
/x1/jenkins/jenkins-slave/workspace/Lucene-Solr-Tests-trunk-Java8/build.xml:660: The following error occurred while executing this line:
/x1/jenkins/jenkins-slave/workspace/Lucene-Solr-Tests-trunk-Java8/build.xml:59: The following error occurred while executing this line:
/x1/jenkins/jenkins-slave/workspace/Lucene-Solr-Tests-trunk-Java8/solr/build.xml:230: The following error occurred while executing this line:
/x1/jenkins/jenkins-slave/workspace/Lucene-Solr-Tests-trunk-Java8/solr/common-build.xml:514: The following error occurred while executing this line:
/x1/jenkins/jenkins-slave/workspace/Lucene-Solr-Tests-trunk-Java8/lucene/common-build.xml:1429: The following error occurred while executing this line:
/x1/jenkins/jenkins-slave/workspace/Lucene-Solr-Tests-trunk-Java8/lucene/common-build.xml:984: There were test failures: 534 suites, 2110 tests, 1 suite-level error, 42 ignored (30 assumptions)

Total time: 56 minutes 49 seconds
Build step 'Invoke Ant' marked build as failure
Archiving artifacts
Sending artifact delta relative to Lucene-Solr-Tests-trunk-Java8 #260
Archived 4 artifacts
Archive block size is 32768
Received 0 blocks and 305677420 bytes
Compression is 0.0%
Took 53 sec
Recording test results
Email was triggered for: Failure
Sending email for trigger: Failure



Mime
View raw message