lucene-dev mailing list archives

Site index · List index
Message view « Date » · « Thread »
Top « Date » · « Thread »
From Policeman Jenkins Server <jenk...@thetaphi.de>
Subject [JENKINS-EA] Lucene-Solr-trunk-Linux (32bit/jdk1.8.0_60-ea-b25) - Build # 13931 - Failure!
Date Thu, 20 Aug 2015 12:37:29 GMT
Build: http://jenkins.thetaphi.de/job/Lucene-Solr-trunk-Linux/13931/
Java: 32bit/jdk1.8.0_60-ea-b25 -server -XX:+UseParallelGC

1 tests failed.
FAILED:  junit.framework.TestSuite.org.apache.solr.cloud.HttpPartitionTest

Error Message:
ObjectTracker found 1 object(s) that were not released!!! [TransactionLog]

Stack Trace:
java.lang.AssertionError: ObjectTracker found 1 object(s) that were not released!!! [TransactionLog]
	at __randomizedtesting.SeedInfo.seed([5C8A030049025509]:0)
	at org.junit.Assert.fail(Assert.java:93)
	at org.junit.Assert.assertTrue(Assert.java:43)
	at org.junit.Assert.assertNull(Assert.java:551)
	at org.apache.solr.SolrTestCaseJ4.afterClass(SolrTestCaseJ4.java:236)
	at sun.reflect.GeneratedMethodAccessor46.invoke(Unknown Source)
	at sun.reflect.DelegatingMethodAccessorImpl.invoke(DelegatingMethodAccessorImpl.java:43)
	at java.lang.reflect.Method.invoke(Method.java:497)
	at com.carrotsearch.randomizedtesting.RandomizedRunner.invoke(RandomizedRunner.java:1627)
	at com.carrotsearch.randomizedtesting.RandomizedRunner$5.evaluate(RandomizedRunner.java:799)
	at com.carrotsearch.randomizedtesting.rules.StatementAdapter.evaluate(StatementAdapter.java:36)
	at com.carrotsearch.randomizedtesting.rules.SystemPropertiesRestoreRule$1.evaluate(SystemPropertiesRestoreRule.java:57)
	at org.apache.lucene.util.AbstractBeforeAfterRule$1.evaluate(AbstractBeforeAfterRule.java:46)
	at com.carrotsearch.randomizedtesting.rules.StatementAdapter.evaluate(StatementAdapter.java:36)
	at org.apache.lucene.util.TestRuleStoreClassName$1.evaluate(TestRuleStoreClassName.java:42)
	at com.carrotsearch.randomizedtesting.rules.NoShadowingOrOverridesOnMethodsRule$1.evaluate(NoShadowingOrOverridesOnMethodsRule.java:39)
	at com.carrotsearch.randomizedtesting.rules.NoShadowingOrOverridesOnMethodsRule$1.evaluate(NoShadowingOrOverridesOnMethodsRule.java:39)
	at com.carrotsearch.randomizedtesting.rules.StatementAdapter.evaluate(StatementAdapter.java:36)
	at com.carrotsearch.randomizedtesting.rules.StatementAdapter.evaluate(StatementAdapter.java:36)
	at com.carrotsearch.randomizedtesting.rules.StatementAdapter.evaluate(StatementAdapter.java:36)
	at org.apache.lucene.util.TestRuleAssertionsRequired$1.evaluate(TestRuleAssertionsRequired.java:54)
	at org.apache.lucene.util.TestRuleMarkFailure$1.evaluate(TestRuleMarkFailure.java:48)
	at org.apache.lucene.util.TestRuleIgnoreAfterMaxFailures$1.evaluate(TestRuleIgnoreAfterMaxFailures.java:65)
	at org.apache.lucene.util.TestRuleIgnoreTestSuites$1.evaluate(TestRuleIgnoreTestSuites.java:55)
	at com.carrotsearch.randomizedtesting.rules.StatementAdapter.evaluate(StatementAdapter.java:36)
	at com.carrotsearch.randomizedtesting.ThreadLeakControl$StatementRunner.run(ThreadLeakControl.java:365)
	at java.lang.Thread.run(Thread.java:745)




Build Log:
[...truncated 9755 lines...]
   [junit4] Suite: org.apache.solr.cloud.HttpPartitionTest
   [junit4]   2> Creating dataDir: /home/jenkins/workspace/Lucene-Solr-trunk-Linux/solr/build/solr-core/test/J1/temp/solr.cloud.HttpPartitionTest_5C8A030049025509-001/init-core-data-001
   [junit4]   2> 423168 INFO  (SUITE-HttpPartitionTest-seed#[5C8A030049025509]-worker) [    ] o.a.s.BaseDistributedSearchTestCase Setting hostContext system property: /
   [junit4]   2> 423170 INFO  (TEST-HttpPartitionTest.test-seed#[5C8A030049025509]) [    ] o.a.s.c.ZkTestServer STARTING ZK TEST SERVER
   [junit4]   2> 423170 INFO  (Thread-2484) [    ] o.a.s.c.ZkTestServer client port:0.0.0.0/0.0.0.0:0
   [junit4]   2> 423170 INFO  (Thread-2484) [    ] o.a.s.c.ZkTestServer Starting server
   [junit4]   2> 423270 INFO  (TEST-HttpPartitionTest.test-seed#[5C8A030049025509]) [    ] o.a.s.c.ZkTestServer start zk server on port:49703
   [junit4]   2> 423270 INFO  (TEST-HttpPartitionTest.test-seed#[5C8A030049025509]) [    ] o.a.s.c.c.SolrZkClient Using default ZkCredentialsProvider
   [junit4]   2> 423270 INFO  (TEST-HttpPartitionTest.test-seed#[5C8A030049025509]) [    ] o.a.s.c.c.ConnectionManager Waiting for client to connect to ZooKeeper
   [junit4]   2> 423272 INFO  (zkCallback-849-thread-1) [    ] o.a.s.c.c.ConnectionManager Watcher org.apache.solr.common.cloud.ConnectionManager@2b7b2b name:ZooKeeperConnection Watcher:127.0.0.1:49703 got event WatchedEvent state:SyncConnected type:None path:null path:null type:None
   [junit4]   2> 423272 INFO  (TEST-HttpPartitionTest.test-seed#[5C8A030049025509]) [    ] o.a.s.c.c.ConnectionManager Client is connected to ZooKeeper
   [junit4]   2> 423272 INFO  (TEST-HttpPartitionTest.test-seed#[5C8A030049025509]) [    ] o.a.s.c.c.SolrZkClient Using default ZkACLProvider
   [junit4]   2> 423272 INFO  (TEST-HttpPartitionTest.test-seed#[5C8A030049025509]) [    ] o.a.s.c.c.SolrZkClient makePath: /solr
   [junit4]   2> 423273 INFO  (TEST-HttpPartitionTest.test-seed#[5C8A030049025509]) [    ] o.a.s.c.c.SolrZkClient Using default ZkCredentialsProvider
   [junit4]   2> 423274 INFO  (TEST-HttpPartitionTest.test-seed#[5C8A030049025509]) [    ] o.a.s.c.c.ConnectionManager Waiting for client to connect to ZooKeeper
   [junit4]   2> 423274 INFO  (zkCallback-850-thread-1) [    ] o.a.s.c.c.ConnectionManager Watcher org.apache.solr.common.cloud.ConnectionManager@1881ff8 name:ZooKeeperConnection Watcher:127.0.0.1:49703/solr got event WatchedEvent state:SyncConnected type:None path:null path:null type:None
   [junit4]   2> 423274 INFO  (TEST-HttpPartitionTest.test-seed#[5C8A030049025509]) [    ] o.a.s.c.c.ConnectionManager Client is connected to ZooKeeper
   [junit4]   2> 423275 INFO  (TEST-HttpPartitionTest.test-seed#[5C8A030049025509]) [    ] o.a.s.c.c.SolrZkClient Using default ZkACLProvider
   [junit4]   2> 423275 INFO  (TEST-HttpPartitionTest.test-seed#[5C8A030049025509]) [    ] o.a.s.c.c.SolrZkClient makePath: /collections/collection1
   [junit4]   2> 423276 INFO  (TEST-HttpPartitionTest.test-seed#[5C8A030049025509]) [    ] o.a.s.c.c.SolrZkClient makePath: /collections/collection1/shards
   [junit4]   2> 423276 INFO  (TEST-HttpPartitionTest.test-seed#[5C8A030049025509]) [    ] o.a.s.c.c.SolrZkClient makePath: /collections/control_collection
   [junit4]   2> 423276 INFO  (TEST-HttpPartitionTest.test-seed#[5C8A030049025509]) [    ] o.a.s.c.c.SolrZkClient makePath: /collections/control_collection/shards
   [junit4]   2> 423277 INFO  (TEST-HttpPartitionTest.test-seed#[5C8A030049025509]) [    ] o.a.s.c.AbstractZkTestCase put /home/jenkins/workspace/Lucene-Solr-trunk-Linux/solr/core/src/test-files/solr/collection1/conf/solrconfig-tlog.xml to /configs/conf1/solrconfig.xml
   [junit4]   2> 423277 INFO  (TEST-HttpPartitionTest.test-seed#[5C8A030049025509]) [    ] o.a.s.c.c.SolrZkClient makePath: /configs/conf1/solrconfig.xml
   [junit4]   2> 423278 INFO  (TEST-HttpPartitionTest.test-seed#[5C8A030049025509]) [    ] o.a.s.c.AbstractZkTestCase put /home/jenkins/workspace/Lucene-Solr-trunk-Linux/solr/core/src/test-files/solr/collection1/conf/schema.xml to /configs/conf1/schema.xml
   [junit4]   2> 423278 INFO  (TEST-HttpPartitionTest.test-seed#[5C8A030049025509]) [    ] o.a.s.c.c.SolrZkClient makePath: /configs/conf1/schema.xml
   [junit4]   2> 423279 INFO  (TEST-HttpPartitionTest.test-seed#[5C8A030049025509]) [    ] o.a.s.c.AbstractZkTestCase put /home/jenkins/workspace/Lucene-Solr-trunk-Linux/solr/core/src/test-files/solr/collection1/conf/solrconfig.snippet.randomindexconfig.xml to /configs/conf1/solrconfig.snippet.randomindexconfig.xml
   [junit4]   2> 423279 INFO  (TEST-HttpPartitionTest.test-seed#[5C8A030049025509]) [    ] o.a.s.c.c.SolrZkClient makePath: /configs/conf1/solrconfig.snippet.randomindexconfig.xml
   [junit4]   2> 423279 INFO  (TEST-HttpPartitionTest.test-seed#[5C8A030049025509]) [    ] o.a.s.c.AbstractZkTestCase put /home/jenkins/workspace/Lucene-Solr-trunk-Linux/solr/core/src/test-files/solr/collection1/conf/stopwords.txt to /configs/conf1/stopwords.txt
   [junit4]   2> 423279 INFO  (TEST-HttpPartitionTest.test-seed#[5C8A030049025509]) [    ] o.a.s.c.c.SolrZkClient makePath: /configs/conf1/stopwords.txt
   [junit4]   2> 423280 INFO  (TEST-HttpPartitionTest.test-seed#[5C8A030049025509]) [    ] o.a.s.c.AbstractZkTestCase put /home/jenkins/workspace/Lucene-Solr-trunk-Linux/solr/core/src/test-files/solr/collection1/conf/protwords.txt to /configs/conf1/protwords.txt
   [junit4]   2> 423280 INFO  (TEST-HttpPartitionTest.test-seed#[5C8A030049025509]) [    ] o.a.s.c.c.SolrZkClient makePath: /configs/conf1/protwords.txt
   [junit4]   2> 423280 INFO  (TEST-HttpPartitionTest.test-seed#[5C8A030049025509]) [    ] o.a.s.c.AbstractZkTestCase put /home/jenkins/workspace/Lucene-Solr-trunk-Linux/solr/core/src/test-files/solr/collection1/conf/currency.xml to /configs/conf1/currency.xml
   [junit4]   2> 423281 INFO  (TEST-HttpPartitionTest.test-seed#[5C8A030049025509]) [    ] o.a.s.c.c.SolrZkClient makePath: /configs/conf1/currency.xml
   [junit4]   2> 423281 INFO  (TEST-HttpPartitionTest.test-seed#[5C8A030049025509]) [    ] o.a.s.c.AbstractZkTestCase put /home/jenkins/workspace/Lucene-Solr-trunk-Linux/solr/core/src/test-files/solr/collection1/conf/enumsConfig.xml to /configs/conf1/enumsConfig.xml
   [junit4]   2> 423281 INFO  (TEST-HttpPartitionTest.test-seed#[5C8A030049025509]) [    ] o.a.s.c.c.SolrZkClient makePath: /configs/conf1/enumsConfig.xml
   [junit4]   2> 423282 INFO  (TEST-HttpPartitionTest.test-seed#[5C8A030049025509]) [    ] o.a.s.c.AbstractZkTestCase put /home/jenkins/workspace/Lucene-Solr-trunk-Linux/solr/core/src/test-files/solr/collection1/conf/open-exchange-rates.json to /configs/conf1/open-exchange-rates.json
   [junit4]   2> 423282 INFO  (TEST-HttpPartitionTest.test-seed#[5C8A030049025509]) [    ] o.a.s.c.c.SolrZkClient makePath: /configs/conf1/open-exchange-rates.json
   [junit4]   2> 423282 INFO  (TEST-HttpPartitionTest.test-seed#[5C8A030049025509]) [    ] o.a.s.c.AbstractZkTestCase put /home/jenkins/workspace/Lucene-Solr-trunk-Linux/solr/core/src/test-files/solr/collection1/conf/mapping-ISOLatin1Accent.txt to /configs/conf1/mapping-ISOLatin1Accent.txt
   [junit4]   2> 423282 INFO  (TEST-HttpPartitionTest.test-seed#[5C8A030049025509]) [    ] o.a.s.c.c.SolrZkClient makePath: /configs/conf1/mapping-ISOLatin1Accent.txt
   [junit4]   2> 423283 INFO  (TEST-HttpPartitionTest.test-seed#[5C8A030049025509]) [    ] o.a.s.c.AbstractZkTestCase put /home/jenkins/workspace/Lucene-Solr-trunk-Linux/solr/core/src/test-files/solr/collection1/conf/old_synonyms.txt to /configs/conf1/old_synonyms.txt
   [junit4]   2> 423283 INFO  (TEST-HttpPartitionTest.test-seed#[5C8A030049025509]) [    ] o.a.s.c.c.SolrZkClient makePath: /configs/conf1/old_synonyms.txt
   [junit4]   2> 423284 INFO  (TEST-HttpPartitionTest.test-seed#[5C8A030049025509]) [    ] o.a.s.c.AbstractZkTestCase put /home/jenkins/workspace/Lucene-Solr-trunk-Linux/solr/core/src/test-files/solr/collection1/conf/synonyms.txt to /configs/conf1/synonyms.txt
   [junit4]   2> 423284 INFO  (TEST-HttpPartitionTest.test-seed#[5C8A030049025509]) [    ] o.a.s.c.c.SolrZkClient makePath: /configs/conf1/synonyms.txt
   [junit4]   2> 423334 INFO  (TEST-HttpPartitionTest.test-seed#[5C8A030049025509]) [    ] o.a.s.SolrTestCaseJ4 Writing core.properties file to /home/jenkins/workspace/Lucene-Solr-trunk-Linux/solr/build/solr-core/test/J1/temp/solr.cloud.HttpPartitionTest_5C8A030049025509-001/control-001/cores/collection1
   [junit4]   2> 423337 INFO  (TEST-HttpPartitionTest.test-seed#[5C8A030049025509]) [    ] o.e.j.s.Server jetty-9.2.13.v20150730
   [junit4]   2> 423337 INFO  (TEST-HttpPartitionTest.test-seed#[5C8A030049025509]) [    ] o.e.j.s.h.ContextHandler Started o.e.j.s.ServletContextHandler@350fd2{/,null,AVAILABLE}
   [junit4]   2> 423339 INFO  (TEST-HttpPartitionTest.test-seed#[5C8A030049025509]) [    ] o.e.j.s.ServerConnector Started ServerConnector@46ae50{HTTP/1.1}{127.0.0.1:34865}
   [junit4]   2> 423339 INFO  (TEST-HttpPartitionTest.test-seed#[5C8A030049025509]) [    ] o.e.j.s.Server Started @425092ms
   [junit4]   2> 423339 INFO  (TEST-HttpPartitionTest.test-seed#[5C8A030049025509]) [    ] o.a.s.c.s.e.JettySolrRunner Jetty properties: {solr.data.dir=/home/jenkins/workspace/Lucene-Solr-trunk-Linux/solr/build/solr-core/test/J1/temp/solr.cloud.HttpPartitionTest_5C8A030049025509-001/tempDir-001/control/data, hostContext=/, hostPort=45515, coreRootDirectory=/home/jenkins/workspace/Lucene-Solr-trunk-Linux/solr/build/solr-core/test/J1/temp/solr.cloud.HttpPartitionTest_5C8A030049025509-001/control-001/cores}
   [junit4]   2> 423340 INFO  (TEST-HttpPartitionTest.test-seed#[5C8A030049025509]) [    ] o.a.s.s.SolrDispatchFilter SolrDispatchFilter.init(): sun.misc.Launcher$AppClassLoader@e2f2a
   [junit4]   2> 423340 INFO  (TEST-HttpPartitionTest.test-seed#[5C8A030049025509]) [    ] o.a.s.c.SolrResourceLoader new SolrResourceLoader for directory: '/home/jenkins/workspace/Lucene-Solr-trunk-Linux/solr/build/solr-core/test/J1/temp/solr.cloud.HttpPartitionTest_5C8A030049025509-001/control-001/'
   [junit4]   2> 423348 INFO  (TEST-HttpPartitionTest.test-seed#[5C8A030049025509]) [    ] o.a.s.c.c.SolrZkClient Using default ZkCredentialsProvider
   [junit4]   2> 423349 INFO  (TEST-HttpPartitionTest.test-seed#[5C8A030049025509]) [    ] o.a.s.c.c.ConnectionManager Waiting for client to connect to ZooKeeper
   [junit4]   2> 423349 INFO  (zkCallback-851-thread-1) [    ] o.a.s.c.c.ConnectionManager Watcher org.apache.solr.common.cloud.ConnectionManager@1f320f name:ZooKeeperConnection Watcher:127.0.0.1:49703/solr got event WatchedEvent state:SyncConnected type:None path:null path:null type:None
   [junit4]   2> 423349 INFO  (TEST-HttpPartitionTest.test-seed#[5C8A030049025509]) [    ] o.a.s.c.c.ConnectionManager Client is connected to ZooKeeper
   [junit4]   2> 423350 INFO  (TEST-HttpPartitionTest.test-seed#[5C8A030049025509]) [    ] o.a.s.c.c.SolrZkClient Using default ZkACLProvider
   [junit4]   2> 423350 INFO  (TEST-HttpPartitionTest.test-seed#[5C8A030049025509]) [    ] o.a.s.s.SolrDispatchFilter Loading solr.xml from SolrHome (not found in ZooKeeper)
   [junit4]   2> 423350 INFO  (TEST-HttpPartitionTest.test-seed#[5C8A030049025509]) [    ] o.a.s.c.SolrXmlConfig Loading container configuration from /home/jenkins/workspace/Lucene-Solr-trunk-Linux/solr/build/solr-core/test/J1/temp/solr.cloud.HttpPartitionTest_5C8A030049025509-001/control-001/solr.xml
   [junit4]   2> 423353 INFO  (TEST-HttpPartitionTest.test-seed#[5C8A030049025509]) [    ] o.a.s.c.CoresLocator Config-defined core root directory: /home/jenkins/workspace/Lucene-Solr-trunk-Linux/solr/build/solr-core/test/J1/temp/solr.cloud.HttpPartitionTest_5C8A030049025509-001/control-001/cores
   [junit4]   2> 423353 INFO  (TEST-HttpPartitionTest.test-seed#[5C8A030049025509]) [    ] o.a.s.c.CoreContainer New CoreContainer 20897622
   [junit4]   2> 423354 INFO  (TEST-HttpPartitionTest.test-seed#[5C8A030049025509]) [    ] o.a.s.c.CoreContainer Loading cores into CoreContainer [instanceDir=/home/jenkins/workspace/Lucene-Solr-trunk-Linux/solr/build/solr-core/test/J1/temp/solr.cloud.HttpPartitionTest_5C8A030049025509-001/control-001/]
   [junit4]   2> 423354 INFO  (TEST-HttpPartitionTest.test-seed#[5C8A030049025509]) [    ] o.a.s.c.CoreContainer loading shared library: /home/jenkins/workspace/Lucene-Solr-trunk-Linux/solr/build/solr-core/test/J1/temp/solr.cloud.HttpPartitionTest_5C8A030049025509-001/control-001/lib
   [junit4]   2> 423354 WARN  (TEST-HttpPartitionTest.test-seed#[5C8A030049025509]) [    ] o.a.s.c.SolrResourceLoader Can't find (or read) directory to add to classloader: lib (resolved as: /home/jenkins/workspace/Lucene-Solr-trunk-Linux/solr/build/solr-core/test/J1/temp/solr.cloud.HttpPartitionTest_5C8A030049025509-001/control-001/lib).
   [junit4]   2> 423358 INFO  (TEST-HttpPartitionTest.test-seed#[5C8A030049025509]) [    ] o.a.s.h.c.HttpShardHandlerFactory created with socketTimeout : 90000,urlScheme : ,connTimeout : 15000,maxConnectionsPerHost : 20,maxConnections : 10000,corePoolSize : 0,maximumPoolSize : 2147483647,maxThreadIdleTime : 5,sizeOfQueue : -1,fairnessPolicy : false,useRetries : false,
   [junit4]   2> 423359 INFO  (TEST-HttpPartitionTest.test-seed#[5C8A030049025509]) [    ] o.a.s.u.UpdateShardHandler Creating UpdateShardHandler HTTP client with params: socketTimeout=340000&connTimeout=45000&retry=true
   [junit4]   2> 423359 INFO  (TEST-HttpPartitionTest.test-seed#[5C8A030049025509]) [    ] o.a.s.l.LogWatcher SLF4J impl is org.slf4j.impl.Log4jLoggerFactory
   [junit4]   2> 423359 INFO  (TEST-HttpPartitionTest.test-seed#[5C8A030049025509]) [    ] o.a.s.l.LogWatcher Registering Log Listener [Log4j (org.slf4j.impl.Log4jLoggerFactory)]
   [junit4]   2> 423359 INFO  (TEST-HttpPartitionTest.test-seed#[5C8A030049025509]) [    ] o.a.s.c.ZkContainer Zookeeper client=127.0.0.1:49703/solr
   [junit4]   2> 423359 INFO  (TEST-HttpPartitionTest.test-seed#[5C8A030049025509]) [    ] o.a.s.c.ZkController zkHost includes chroot
   [junit4]   2> 423360 INFO  (TEST-HttpPartitionTest.test-seed#[5C8A030049025509]) [    ] o.a.s.c.c.SolrZkClient Using default ZkCredentialsProvider
   [junit4]   2> 423360 INFO  (TEST-HttpPartitionTest.test-seed#[5C8A030049025509]) [    ] o.a.s.c.c.ConnectionManager Waiting for client to connect to ZooKeeper
   [junit4]   2> 423360 INFO  (zkCallback-853-thread-1) [    ] o.a.s.c.c.ConnectionManager Watcher org.apache.solr.common.cloud.ConnectionManager@1ec93f7 name:ZooKeeperConnection Watcher:127.0.0.1:49703 got event WatchedEvent state:SyncConnected type:None path:null path:null type:None
   [junit4]   2> 423361 INFO  (TEST-HttpPartitionTest.test-seed#[5C8A030049025509]) [    ] o.a.s.c.c.ConnectionManager Client is connected to ZooKeeper
   [junit4]   2> 423361 INFO  (TEST-HttpPartitionTest.test-seed#[5C8A030049025509]) [    ] o.a.s.c.c.SolrZkClient Using default ZkACLProvider
   [junit4]   2> 423362 INFO  (TEST-HttpPartitionTest.test-seed#[5C8A030049025509]) [n:127.0.0.1:45515_    ] o.a.s.c.c.ConnectionManager Waiting for client to connect to ZooKeeper
   [junit4]   2> 423362 INFO  (zkCallback-854-thread-1-processing-n:127.0.0.1:45515_) [n:127.0.0.1:45515_    ] o.a.s.c.c.ConnectionManager Watcher org.apache.solr.common.cloud.ConnectionManager@1277e2 name:ZooKeeperConnection Watcher:127.0.0.1:49703/solr got event WatchedEvent state:SyncConnected type:None path:null path:null type:None
   [junit4]   2> 423362 INFO  (TEST-HttpPartitionTest.test-seed#[5C8A030049025509]) [n:127.0.0.1:45515_    ] o.a.s.c.c.ConnectionManager Client is connected to ZooKeeper
   [junit4]   2> 423363 INFO  (TEST-HttpPartitionTest.test-seed#[5C8A030049025509]) [n:127.0.0.1:45515_    ] o.a.s.c.c.SolrZkClient makePath: /overseer/queue
   [junit4]   2> 423364 INFO  (TEST-HttpPartitionTest.test-seed#[5C8A030049025509]) [n:127.0.0.1:45515_    ] o.a.s.c.c.SolrZkClient makePath: /overseer/collection-queue-work
   [junit4]   2> 423364 INFO  (TEST-HttpPartitionTest.test-seed#[5C8A030049025509]) [n:127.0.0.1:45515_    ] o.a.s.c.c.SolrZkClient makePath: /overseer/collection-map-running
   [junit4]   2> 423365 INFO  (TEST-HttpPartitionTest.test-seed#[5C8A030049025509]) [n:127.0.0.1:45515_    ] o.a.s.c.c.SolrZkClient makePath: /overseer/collection-map-completed
   [junit4]   2> 423365 INFO  (TEST-HttpPartitionTest.test-seed#[5C8A030049025509]) [n:127.0.0.1:45515_    ] o.a.s.c.c.SolrZkClient makePath: /overseer/collection-map-failure
   [junit4]   2> 423366 INFO  (TEST-HttpPartitionTest.test-seed#[5C8A030049025509]) [n:127.0.0.1:45515_    ] o.a.s.c.c.SolrZkClient makePath: /live_nodes
   [junit4]   2> 423366 INFO  (TEST-HttpPartitionTest.test-seed#[5C8A030049025509]) [n:127.0.0.1:45515_    ] o.a.s.c.c.SolrZkClient makePath: /aliases.json
   [junit4]   2> 423366 INFO  (TEST-HttpPartitionTest.test-seed#[5C8A030049025509]) [n:127.0.0.1:45515_    ] o.a.s.c.c.SolrZkClient makePath: /clusterstate.json
   [junit4]   2> 423367 INFO  (TEST-HttpPartitionTest.test-seed#[5C8A030049025509]) [n:127.0.0.1:45515_    ] o.a.s.c.c.SolrZkClient makePath: /security.json
   [junit4]   2> 423367 INFO  (TEST-HttpPartitionTest.test-seed#[5C8A030049025509]) [n:127.0.0.1:45515_    ] o.a.s.c.ZkController Register node as live in ZooKeeper:/live_nodes/127.0.0.1:45515_
   [junit4]   2> 423368 INFO  (TEST-HttpPartitionTest.test-seed#[5C8A030049025509]) [n:127.0.0.1:45515_    ] o.a.s.c.c.SolrZkClient makePath: /live_nodes/127.0.0.1:45515_
   [junit4]   2> 423368 INFO  (TEST-HttpPartitionTest.test-seed#[5C8A030049025509]) [n:127.0.0.1:45515_    ] o.a.s.c.c.SolrZkClient makePath: /overseer_elect
   [junit4]   2> 423368 INFO  (TEST-HttpPartitionTest.test-seed#[5C8A030049025509]) [n:127.0.0.1:45515_    ] o.a.s.c.c.SolrZkClient makePath: /overseer_elect/election
   [junit4]   2> 423369 INFO  (TEST-HttpPartitionTest.test-seed#[5C8A030049025509]) [n:127.0.0.1:45515_    ] o.a.s.c.Overseer Overseer (id=null) closing
   [junit4]   2> 423369 INFO  (TEST-HttpPartitionTest.test-seed#[5C8A030049025509]) [n:127.0.0.1:45515_    ] o.a.s.c.LeaderElector Joined leadership election with path: /overseer_elect/election/94376628726398980-127.0.0.1:45515_-n_0000000000
   [junit4]   2> 423369 INFO  (TEST-HttpPartitionTest.test-seed#[5C8A030049025509]) [n:127.0.0.1:45515_    ] o.a.s.c.OverseerElectionContext I am going to be the leader 127.0.0.1:45515_
   [junit4]   2> 423369 INFO  (TEST-HttpPartitionTest.test-seed#[5C8A030049025509]) [n:127.0.0.1:45515_    ] o.a.s.c.c.SolrZkClient makePath: /overseer_elect/leader
   [junit4]   2> 423370 INFO  (TEST-HttpPartitionTest.test-seed#[5C8A030049025509]) [n:127.0.0.1:45515_    ] o.a.s.c.Overseer Overseer (id=94376628726398980-127.0.0.1:45515_-n_0000000000) starting
   [junit4]   2> 423370 INFO  (TEST-HttpPartitionTest.test-seed#[5C8A030049025509]) [n:127.0.0.1:45515_    ] o.a.s.c.c.SolrZkClient makePath: /overseer/queue-work
   [junit4]   2> 423372 INFO  (TEST-HttpPartitionTest.test-seed#[5C8A030049025509]) [n:127.0.0.1:45515_    ] o.a.s.c.OverseerAutoReplicaFailoverThread Starting OverseerAutoReplicaFailoverThread autoReplicaFailoverWorkLoopDelay=10000 autoReplicaFailoverWaitAfterExpiration=30000 autoReplicaFailoverBadNodeExpiration=60000
   [junit4]   2> 423372 INFO  (OverseerCollectionProcessor-94376628726398980-127.0.0.1:45515_-n_0000000000) [n:127.0.0.1:45515_    ] o.a.s.c.OverseerProcessor Process current queue of overseer operations
   [junit4]   2> 423372 INFO  (TEST-HttpPartitionTest.test-seed#[5C8A030049025509]) [n:127.0.0.1:45515_    ] o.a.s.c.c.ZkStateReader Updating cluster state from ZooKeeper... 
   [junit4]   2> 423373 INFO  (OverseerStateUpdate-94376628726398980-127.0.0.1:45515_-n_0000000000) [n:127.0.0.1:45515_    ] o.a.s.c.Overseer Starting to work on the main queue
   [junit4]   2> 423391 INFO  (TEST-HttpPartitionTest.test-seed#[5C8A030049025509]) [n:127.0.0.1:45515_    ] o.a.s.c.CoreContainer Security conf doesn't exist. Skipping setup for authorization module.
   [junit4]   2> 423392 INFO  (TEST-HttpPartitionTest.test-seed#[5C8A030049025509]) [n:127.0.0.1:45515_    ] o.a.s.c.CoreContainer No authentication plugin used.
   [junit4]   2> 423392 INFO  (TEST-HttpPartitionTest.test-seed#[5C8A030049025509]) [n:127.0.0.1:45515_    ] o.a.s.c.CoresLocator Looking for core definitions underneath /home/jenkins/workspace/Lucene-Solr-trunk-Linux/solr/build/solr-core/test/J1/temp/solr.cloud.HttpPartitionTest_5C8A030049025509-001/control-001/cores
   [junit4]   2> 423392 INFO  (TEST-HttpPartitionTest.test-seed#[5C8A030049025509]) [n:127.0.0.1:45515_    ] o.a.s.c.SolrCore Created CoreDescriptor: {name=collection1, config=solrconfig.xml, transient=false, schema=schema.xml, loadOnStartup=true, configSetProperties=configsetprops.json, instanceDir=/home/jenkins/workspace/Lucene-Solr-trunk-Linux/solr/build/solr-core/test/J1/temp/solr.cloud.HttpPartitionTest_5C8A030049025509-001/control-001/cores/collection1, collection=control_collection, absoluteInstDir=/home/jenkins/workspace/Lucene-Solr-trunk-Linux/solr/build/solr-core/test/J1/temp/solr.cloud.HttpPartitionTest_5C8A030049025509-001/control-001/cores/collection1/, coreNodeName=, dataDir=data/, shard=}
   [junit4]   2> 423393 INFO  (TEST-HttpPartitionTest.test-seed#[5C8A030049025509]) [n:127.0.0.1:45515_    ] o.a.s.c.CoresLocator Found core collection1 in /home/jenkins/workspace/Lucene-Solr-trunk-Linux/solr/build/solr-core/test/J1/temp/solr.cloud.HttpPartitionTest_5C8A030049025509-001/control-001/cores/collection1/
   [junit4]   2> 423393 INFO  (TEST-HttpPartitionTest.test-seed#[5C8A030049025509]) [n:127.0.0.1:45515_    ] o.a.s.c.CoresLocator Found 1 core definitions
   [junit4]   2> 423393 INFO  (coreLoadExecutor-2839-thread-1-processing-n:127.0.0.1:45515_) [n:127.0.0.1:45515_ c:control_collection   x:collection1] o.a.s.c.ZkController publishing state=down
   [junit4]   2> 423393 INFO  (TEST-HttpPartitionTest.test-seed#[5C8A030049025509]) [n:127.0.0.1:45515_    ] o.a.s.s.SolrDispatchFilter user.dir=/home/jenkins/workspace/Lucene-Solr-trunk-Linux/solr/build/solr-core/test/J1
   [junit4]   2> 423393 INFO  (TEST-HttpPartitionTest.test-seed#[5C8A030049025509]) [n:127.0.0.1:45515_    ] o.a.s.s.SolrDispatchFilter SolrDispatchFilter.init() done
   [junit4]   2> 423393 INFO  (coreLoadExecutor-2839-thread-1-processing-n:127.0.0.1:45515_) [n:127.0.0.1:45515_ c:control_collection   x:collection1] o.a.s.c.ZkController numShards not found on descriptor - reading it from system property
   [junit4]   2> 423394 INFO  (coreLoadExecutor-2839-thread-1-processing-n:127.0.0.1:45515_) [n:127.0.0.1:45515_ c:control_collection   x:collection1] o.a.s.c.ZkController look for our core node name
   [junit4]   2> 423394 INFO  (OverseerStateUpdate-94376628726398980-127.0.0.1:45515_-n_0000000000) [n:127.0.0.1:45515_    ] o.a.s.c.Overseer processMessage: queueSize: 1, message = {
   [junit4]   2>   "core":"collection1",
   [junit4]   2>   "roles":null,
   [junit4]   2>   "base_url":"http://127.0.0.1:45515",
   [junit4]   2>   "node_name":"127.0.0.1:45515_",
   [junit4]   2>   "numShards":"1",
   [junit4]   2>   "state":"down",
   [junit4]   2>   "shard":null,
   [junit4]   2>   "collection":"control_collection",
   [junit4]   2>   "operation":"state"} current state version: 0
   [junit4]   2> 423394 INFO  (OverseerStateUpdate-94376628726398980-127.0.0.1:45515_-n_0000000000) [n:127.0.0.1:45515_    ] o.a.s.c.o.ReplicaMutator Update state numShards=1 message={
   [junit4]   2>   "core":"collection1",
   [junit4]   2>   "roles":null,
   [junit4]   2>   "base_url":"http://127.0.0.1:45515",
   [junit4]   2>   "node_name":"127.0.0.1:45515_",
   [junit4]   2>   "numShards":"1",
   [junit4]   2>   "state":"down",
   [junit4]   2>   "shard":null,
   [junit4]   2>   "collection":"control_collection",
   [junit4]   2>   "operation":"state"}
   [junit4]   2> 423394 INFO  (OverseerStateUpdate-94376628726398980-127.0.0.1:45515_-n_0000000000) [n:127.0.0.1:45515_    ] o.a.s.c.o.ClusterStateMutator building a new cName: control_collection
   [junit4]   2> 423394 INFO  (OverseerStateUpdate-94376628726398980-127.0.0.1:45515_-n_0000000000) [n:127.0.0.1:45515_    ] o.a.s.c.o.ReplicaMutator Assigning new node to shard shard=shard1
   [junit4]   2> 423395 INFO  (zkCallback-854-thread-1-processing-n:127.0.0.1:45515_) [n:127.0.0.1:45515_    ] o.a.s.c.c.ZkStateReader A cluster state change: WatchedEvent state:SyncConnected type:NodeDataChanged path:/clusterstate.json, has occurred - updating... (live nodes size: 1)
   [junit4]   2> 424394 INFO  (coreLoadExecutor-2839-thread-1-processing-n:127.0.0.1:45515_) [n:127.0.0.1:45515_ c:control_collection   x:collection1] o.a.s.c.ZkController waiting to find shard id in clusterstate for collection1
   [junit4]   2> 424394 INFO  (coreLoadExecutor-2839-thread-1-processing-n:127.0.0.1:45515_) [n:127.0.0.1:45515_ c:control_collection   x:collection1] o.a.s.c.ZkController Check for collection zkNode:control_collection
   [junit4]   2> 424394 INFO  (coreLoadExecutor-2839-thread-1-processing-n:127.0.0.1:45515_) [n:127.0.0.1:45515_ c:control_collection   x:collection1] o.a.s.c.ZkController Collection zkNode exists
   [junit4]   2> 424394 INFO  (coreLoadExecutor-2839-thread-1-processing-n:127.0.0.1:45515_) [n:127.0.0.1:45515_ c:control_collection   x:collection1] o.a.s.c.c.ZkStateReader Load collection config from:/collections/control_collection
   [junit4]   2> 424395 INFO  (coreLoadExecutor-2839-thread-1-processing-n:127.0.0.1:45515_) [n:127.0.0.1:45515_ c:control_collection   x:collection1] o.a.s.c.c.ZkStateReader path=/collections/control_collection configName=conf1 specified config exists in ZooKeeper
   [junit4]   2> 424395 INFO  (coreLoadExecutor-2839-thread-1-processing-n:127.0.0.1:45515_) [n:127.0.0.1:45515_ c:control_collection   x:collection1] o.a.s.c.SolrResourceLoader new SolrResourceLoader for directory: '/home/jenkins/workspace/Lucene-Solr-trunk-Linux/solr/build/solr-core/test/J1/temp/solr.cloud.HttpPartitionTest_5C8A030049025509-001/control-001/cores/collection1/'
   [junit4]   2> 424401 INFO  (coreLoadExecutor-2839-thread-1-processing-n:127.0.0.1:45515_) [n:127.0.0.1:45515_ c:control_collection   x:collection1] o.a.s.c.Config loaded config solrconfig.xml with version 0 
   [junit4]   2> 424404 INFO  (coreLoadExecutor-2839-thread-1-processing-n:127.0.0.1:45515_) [n:127.0.0.1:45515_ c:control_collection   x:collection1] o.a.s.c.SolrConfig current version of requestparams : -1
   [junit4]   2> 424406 INFO  (coreLoadExecutor-2839-thread-1-processing-n:127.0.0.1:45515_) [n:127.0.0.1:45515_ c:control_collection   x:collection1] o.a.s.c.SolrConfig Using Lucene MatchVersion: 6.0.0
   [junit4]   2> 424411 INFO  (coreLoadExecutor-2839-thread-1-processing-n:127.0.0.1:45515_) [n:127.0.0.1:45515_ c:control_collection   x:collection1] o.a.s.c.Config Loaded SolrConfig: solrconfig.xml
   [junit4]   2> 424411 INFO  (coreLoadExecutor-2839-thread-1-processing-n:127.0.0.1:45515_) [n:127.0.0.1:45515_ c:control_collection   x:collection1] o.a.s.s.IndexSchema Reading Solr Schema from /configs/conf1/schema.xml
   [junit4]   2> 424414 INFO  (coreLoadExecutor-2839-thread-1-processing-n:127.0.0.1:45515_) [n:127.0.0.1:45515_ c:control_collection   x:collection1] o.a.s.s.IndexSchema [collection1] Schema name=test
   [junit4]   2> 424465 INFO  (coreLoadExecutor-2839-thread-1-processing-n:127.0.0.1:45515_) [n:127.0.0.1:45515_ c:control_collection   x:collection1] o.a.s.s.OpenExchangeRatesOrgProvider Initialized with rates=open-exchange-rates.json, refreshInterval=1440.
   [junit4]   2> 424468 INFO  (coreLoadExecutor-2839-thread-1-processing-n:127.0.0.1:45515_) [n:127.0.0.1:45515_ c:control_collection   x:collection1] o.a.s.s.IndexSchema default search field in schema is text
   [junit4]   2> 424469 INFO  (coreLoadExecutor-2839-thread-1-processing-n:127.0.0.1:45515_) [n:127.0.0.1:45515_ c:control_collection   x:collection1] o.a.s.s.IndexSchema unique key field: id
   [junit4]   2> 424472 INFO  (coreLoadExecutor-2839-thread-1-processing-n:127.0.0.1:45515_) [n:127.0.0.1:45515_ c:control_collection   x:collection1] o.a.s.s.FileExchangeRateProvider Reloading exchange rates from file currency.xml
   [junit4]   2> 424473 INFO  (coreLoadExecutor-2839-thread-1-processing-n:127.0.0.1:45515_) [n:127.0.0.1:45515_ c:control_collection   x:collection1] o.a.s.s.FileExchangeRateProvider Reloading exchange rates from file currency.xml
   [junit4]   2> 424474 INFO  (coreLoadExecutor-2839-thread-1-processing-n:127.0.0.1:45515_) [n:127.0.0.1:45515_ c:control_collection   x:collection1] o.a.s.s.OpenExchangeRatesOrgProvider Reloading exchange rates from open-exchange-rates.json
   [junit4]   2> 424474 WARN  (coreLoadExecutor-2839-thread-1-processing-n:127.0.0.1:45515_) [n:127.0.0.1:45515_ c:control_collection   x:collection1] o.a.s.s.OpenExchangeRatesOrgProvider Unknown key IMPORTANT NOTE
   [junit4]   2> 424474 WARN  (coreLoadExecutor-2839-thread-1-processing-n:127.0.0.1:45515_) [n:127.0.0.1:45515_ c:control_collection   x:collection1] o.a.s.s.OpenExchangeRatesOrgProvider Expected key, got STRING
   [junit4]   2> 424474 INFO  (coreLoadExecutor-2839-thread-1-processing-n:127.0.0.1:45515_) [n:127.0.0.1:45515_ c:control_collection   x:collection1] o.a.s.s.OpenExchangeRatesOrgProvider Reloading exchange rates from open-exchange-rates.json
   [junit4]   2> 424474 WARN  (coreLoadExecutor-2839-thread-1-processing-n:127.0.0.1:45515_) [n:127.0.0.1:45515_ c:control_collection   x:collection1] o.a.s.s.OpenExchangeRatesOrgProvider Unknown key IMPORTANT NOTE
   [junit4]   2> 424475 WARN  (coreLoadExecutor-2839-thread-1-processing-n:127.0.0.1:45515_) [n:127.0.0.1:45515_ c:control_collection   x:collection1] o.a.s.s.OpenExchangeRatesOrgProvider Expected key, got STRING
   [junit4]   2> 424475 INFO  (coreLoadExecutor-2839-thread-1-processing-n:127.0.0.1:45515_) [n:127.0.0.1:45515_ c:control_collection   x:collection1] o.a.s.c.ConfigSetProperties Did not find ConfigSet properties, assuming default properties: Can't find resource 'configsetprops.json' in classpath or '/configs/conf1', cwd=/home/jenkins/workspace/Lucene-Solr-trunk-Linux/solr/build/solr-core/test/J1
   [junit4]   2> 424475 INFO  (coreLoadExecutor-2839-thread-1-processing-n:127.0.0.1:45515_) [n:127.0.0.1:45515_ c:control_collection   x:collection1] o.a.s.c.CoreContainer Creating SolrCore 'collection1' using configuration from collection control_collection
   [junit4]   2> 424475 INFO  (coreLoadExecutor-2839-thread-1-processing-n:127.0.0.1:45515_) [n:127.0.0.1:45515_ c:control_collection s:shard1 r:core_node1 x:collection1] o.a.s.c.SolrCore org.apache.solr.core.MockDirectoryFactory
   [junit4]   2> 424475 INFO  (coreLoadExecutor-2839-thread-1-processing-n:127.0.0.1:45515_) [n:127.0.0.1:45515_ c:control_collection s:shard1 r:core_node1 x:collection1] o.a.s.c.SolrCore [[collection1] ] Opening new SolrCore at [/home/jenkins/workspace/Lucene-Solr-trunk-Linux/solr/build/solr-core/test/J1/temp/solr.cloud.HttpPartitionTest_5C8A030049025509-001/control-001/cores/collection1/], dataDir=[null]
   [junit4]   2> 424476 INFO  (coreLoadExecutor-2839-thread-1-processing-n:127.0.0.1:45515_) [n:127.0.0.1:45515_ c:control_collection s:shard1 r:core_node1 x:collection1] o.a.s.c.JmxMonitoredMap JMX monitoring is enabled. Adding Solr mbeans to JMX Server: com.sun.jmx.mbeanserver.JmxMBeanServer@1d54704
   [junit4]   2> 424476 INFO  (coreLoadExecutor-2839-thread-1-processing-n:127.0.0.1:45515_) [n:127.0.0.1:45515_ c:control_collection s:shard1 r:core_node1 x:collection1] o.a.s.c.CachingDirectoryFactory return new directory for /home/jenkins/workspace/Lucene-Solr-trunk-Linux/solr/build/solr-core/test/J1/temp/solr.cloud.HttpPartitionTest_5C8A030049025509-001/control-001/cores/collection1/data
   [junit4]   2> 424476 INFO  (coreLoadExecutor-2839-thread-1-processing-n:127.0.0.1:45515_) [n:127.0.0.1:45515_ c:control_collection s:shard1 r:core_node1 x:collection1] o.a.s.c.SolrCore New index directory detected: old=null new=/home/jenkins/workspace/Lucene-Solr-trunk-Linux/solr/build/solr-core/test/J1/temp/solr.cloud.HttpPartitionTest_5C8A030049025509-001/control-001/cores/collection1/data/index/
   [junit4]   2> 424476 WARN  (coreLoadExecutor-2839-thread-1-processing-n:127.0.0.1:45515_) [n:127.0.0.1:45515_ c:control_collection s:shard1 r:core_node1 x:collection1] o.a.s.c.SolrCore [collection1] Solr index directory '/home/jenkins/workspace/Lucene-Solr-trunk-Linux/solr/build/solr-core/test/J1/temp/solr.cloud.HttpPartitionTest_5C8A030049025509-001/control-001/cores/collection1/data/index' doesn't exist. Creating new index...
   [junit4]   2> 424476 INFO  (coreLoadExecutor-2839-thread-1-processing-n:127.0.0.1:45515_) [n:127.0.0.1:45515_ c:control_collection s:shard1 r:core_node1 x:collection1] o.a.s.c.CachingDirectoryFactory return new directory for /home/jenkins/workspace/Lucene-Solr-trunk-Linux/solr/build/solr-core/test/J1/temp/solr.cloud.HttpPartitionTest_5C8A030049025509-001/control-001/cores/collection1/data/index
   [junit4]   2> 424476 INFO  (coreLoadExecutor-2839-thread-1-processing-n:127.0.0.1:45515_) [n:127.0.0.1:45515_ c:control_collection s:shard1 r:core_node1 x:collection1] o.a.s.u.RandomMergePolicy RandomMergePolicy wrapping class org.apache.lucene.index.LogDocMergePolicy: [LogDocMergePolicy: minMergeSize=1000, mergeFactor=38, maxMergeSize=9223372036854775807, maxMergeSizeForForcedMerge=9223372036854775807, calibrateSizeByDeletes=false, maxMergeDocs=2147483647, maxCFSSegmentSizeMB=8.796093022207999E12, noCFSRatio=0.8575282859181104]
   [junit4]   2> 424477 INFO  (coreLoadExecutor-2839-thread-1-processing-n:127.0.0.1:45515_) [n:127.0.0.1:45515_ c:control_collection s:shard1 r:core_node1 x:collection1] o.a.s.c.SolrCore SolrDeletionPolicy.onCommit: commits: num=1
   [junit4]   2> 	commit{dir=MockDirectoryWrapper(RAMDirectory@4c50eb lockFactory=org.apache.lucene.store.SingleInstanceLockFactory@18ead56),segFN=segments_1,generation=1}
   [junit4]   2> 424477 INFO  (coreLoadExecutor-2839-thread-1-processing-n:127.0.0.1:45515_) [n:127.0.0.1:45515_ c:control_collection s:shard1 r:core_node1 x:collection1] o.a.s.c.SolrCore newest commit generation = 1
   [junit4]   2> 424477 INFO  (OldIndexDirectoryCleanupThreadForCore-collection1) [n:127.0.0.1:45515_ c:control_collection s:shard1 r:core_node1 x:collection1] o.a.s.c.SolrCore Looking for old index directories to cleanup for core collection1 in /home/jenkins/workspace/Lucene-Solr-trunk-Linux/solr/build/solr-core/test/J1/temp/solr.cloud.HttpPartitionTest_5C8A030049025509-001/control-001/cores/collection1/data/
   [junit4]   2> 424477 WARN  (OldIndexDirectoryCleanupThreadForCore-collection1) [n:127.0.0.1:45515_ c:control_collection s:shard1 r:core_node1 x:collection1] o.a.s.c.DirectoryFactory /home/jenkins/workspace/Lucene-Solr-trunk-Linux/solr/build/solr-core/test/J1/temp/solr.cloud.HttpPartitionTest_5C8A030049025509-001/control-001/cores/collection1/data/ does not point to a valid data directory; skipping clean-up of old index directories.
   [junit4]   2> 424479 INFO  (coreLoadExecutor-2839-thread-1-processing-n:127.0.0.1:45515_) [n:127.0.0.1:45515_ c:control_collection s:shard1 r:core_node1 x:collection1] o.a.s.u.p.UpdateRequestProcessorChain creating updateRequestProcessorChain "nodistrib"
   [junit4]   2> 424479 INFO  (coreLoadExecutor-2839-thread-1-processing-n:127.0.0.1:45515_) [n:127.0.0.1:45515_ c:control_collection s:shard1 r:core_node1 x:collection1] o.a.s.u.p.UpdateRequestProcessorChain creating updateRequestProcessorChain "dedupe"
   [junit4]   2> 424479 INFO  (coreLoadExecutor-2839-thread-1-processing-n:127.0.0.1:45515_) [n:127.0.0.1:45515_ c:control_collection s:shard1 r:core_node1 x:collection1] o.a.s.u.p.UpdateRequestProcessorChain inserting DistributedUpdateProcessorFactory into updateRequestProcessorChain "dedupe"
   [junit4]   2> 424479 INFO  (coreLoadExecutor-2839-thread-1-processing-n:127.0.0.1:45515_) [n:127.0.0.1:45515_ c:control_collection s:shard1 r:core_node1 x:collection1] o.a.s.u.p.UpdateRequestProcessorChain creating updateRequestProcessorChain "stored_sig"
   [junit4]   2> 424479 INFO  (coreLoadExecutor-2839-thread-1-processing-n:127.0.0.1:45515_) [n:127.0.0.1:45515_ c:control_collection s:shard1 r:core_node1 x:collection1] o.a.s.u.p.UpdateRequestProcessorChain inserting DistributedUpdateProcessorFactory into updateRequestProcessorChain "stored_sig"
   [junit4]   2> 424479 INFO  (coreLoadExecutor-2839-thread-1-processing-n:127.0.0.1:45515_) [n:127.0.0.1:45515_ c:control_collection s:shard1 r:core_node1 x:collection1] o.a.s.u.p.UpdateRequestProcessorChain creating updateRequestProcessorChain "distrib-dup-test-chain-explicit"
   [junit4]   2> 424479 INFO  (coreLoadExecutor-2839-thread-1-processing-n:127.0.0.1:45515_) [n:127.0.0.1:45515_ c:control_collection s:shard1 r:core_node1 x:collection1] o.a.s.u.p.UpdateRequestProcessorChain creating updateRequestProcessorChain "distrib-dup-test-chain-implicit"
   [junit4]   2> 424479 INFO  (coreLoadExecutor-2839-thread-1-processing-n:127.0.0.1:45515_) [n:127.0.0.1:45515_ c:control_collection s:shard1 r:core_node1 x:collection1] o.a.s.u.p.UpdateRequestProcessorChain inserting DistributedUpdateProcessorFactory into updateRequestProcessorChain "distrib-dup-test-chain-implicit"
   [junit4]   2> 424480 INFO  (coreLoadExecutor-2839-thread-1-processing-n:127.0.0.1:45515_) [n:127.0.0.1:45515_ c:control_collection s:shard1 r:core_node1 x:collection1] o.a.s.c.SolrCore no updateRequestProcessorChain defined as default, creating implicit default
   [junit4]   2> 424480 INFO  (coreLoadExecutor-2839-thread-1-processing-n:127.0.0.1:45515_) [n:127.0.0.1:45515_ c:control_collection s:shard1 r:core_node1 x:collection1] o.a.s.h.l.XMLLoader xsltCacheLifetimeSeconds=60
   [junit4]   2> 424481 INFO  (coreLoadExecutor-2839-thread-1-processing-n:127.0.0.1:45515_) [n:127.0.0.1:45515_ c:control_collection s:shard1 r:core_node1 x:collection1] o.a.s.h.l.XMLLoader xsltCacheLifetimeSeconds=60
   [junit4]   2> 424481 INFO  (coreLoadExecutor-2839-thread-1-processing-n:127.0.0.1:45515_) [n:127.0.0.1:45515_ c:control_collection s:shard1 r:core_node1 x:collection1] o.a.s.h.l.XMLLoader xsltCacheLifetimeSeconds=60
   [junit4]   2> 424482 INFO  (coreLoadExecutor-2839-thread-1-processing-n:127.0.0.1:45515_) [n:127.0.0.1:45515_ c:control_collection s:shard1 r:core_node1 x:collection1] o.a.s.h.l.XMLLoader xsltCacheLifetimeSeconds=60
   [junit4]   2> 424483 INFO  (coreLoadExecutor-2839-thread-1-processing-n:127.0.0.1:45515_) [n:127.0.0.1:45515_ c:control_collection s:shard1 r:core_node1 x:collection1] o.a.s.c.RequestHandlers Registered paths: /admin/mbeans,standard,/update/csv,/update/json/docs,/admin/luke,/admin/segments,/get,/admin/system,/replication,/admin/properties,/config,/schema,/admin/plugins,/admin/logging,/update/json,/admin/threads,/admin/ping,/update,/admin/file
   [junit4]   2> 424483 INFO  (coreLoadExecutor-2839-thread-1-processing-n:127.0.0.1:45515_) [n:127.0.0.1:45515_ c:control_collection s:shard1 r:core_node1 x:collection1] o.a.s.c.SolrCore Using default statsCache cache: org.apache.solr.search.stats.LocalStatsCache
   [junit4]   2> 424484 INFO  (coreLoadExecutor-2839-thread-1-processing-n:127.0.0.1:45515_) [n:127.0.0.1:45515_ c:control_collection s:shard1 r:core_node1 x:collection1] o.a.s.u.UpdateHandler Using UpdateLog implementation: org.apache.solr.update.UpdateLog
   [junit4]   2> 424484 INFO  (coreLoadExecutor-2839-thread-1-processing-n:127.0.0.1:45515_) [n:127.0.0.1:45515_ c:control_collection s:shard1 r:core_node1 x:collection1] o.a.s.u.UpdateLog Initializing UpdateLog: dataDir= defaultSyncLevel=FLUSH numRecordsToKeep=100 maxNumLogsToKeep=10 numVersionBuckets=65536
   [junit4]   2> 424484 INFO  (coreLoadExecutor-2839-thread-1-processing-n:127.0.0.1:45515_) [n:127.0.0.1:45515_ c:control_collection s:shard1 r:core_node1 x:collection1] o.a.s.c.SolrCore Hard AutoCommit: disabled
   [junit4]   2> 424484 INFO  (coreLoadExecutor-2839-thread-1-processing-n:127.0.0.1:45515_) [n:127.0.0.1:45515_ c:control_collection s:shard1 r:core_node1 x:collection1] o.a.s.c.SolrCore Soft AutoCommit: disabled
   [junit4]   2> 424484 INFO  (coreLoadExecutor-2839-thread-1-processing-n:127.0.0.1:45515_) [n:127.0.0.1:45515_ c:control_collection s:shard1 r:core_node1 x:collection1] o.a.s.u.RandomMergePolicy RandomMergePolicy wrapping class org.apache.lucene.index.TieredMergePolicy: [TieredMergePolicy: maxMergeAtOnce=33, maxMergeAtOnceExplicit=45, maxMergedSegmentMB=31.3125, floorSegmentMB=0.4013671875, forceMergeDeletesPctAllowed=4.069315149019696, segmentsPerTier=41.0, maxCFSSegmentSizeMB=8.796093022207999E12, noCFSRatio=0.26437376023925296
   [junit4]   2> 424485 INFO  (coreLoadExecutor-2839-thread-1-processing-n:127.0.0.1:45515_) [n:127.0.0.1:45515_ c:control_collection s:shard1 r:core_node1 x:collection1] o.a.s.c.SolrCore SolrDeletionPolicy.onInit: commits: num=1
   [junit4]   2> 	commit{dir=MockDirectoryWrapper(RAMDirectory@4c50eb lockFactory=org.apache.lucene.store.SingleInstanceLockFactory@18ead56),segFN=segments_1,generation=1}
   [junit4]   2> 424485 INFO  (coreLoadExecutor-2839-thread-1-processing-n:127.0.0.1:45515_) [n:127.0.0.1:45515_ c:control_collection s:shard1 r:core_node1 x:collection1] o.a.s.c.SolrCore newest commit generation = 1
   [junit4]   2> 424485 INFO  (coreLoadExecutor-2839-thread-1-processing-n:127.0.0.1:45515_) [n:127.0.0.1:45515_ c:control_collection s:shard1 r:core_node1 x:collection1] o.a.s.s.SolrIndexSearcher Opening Searcher@6cff40[collection1] main
   [junit4]   2> 424485 INFO  (coreLoadExecutor-2839-thread-1-processing-n:127.0.0.1:45515_) [n:127.0.0.1:45515_ c:control_collection s:shard1 r:core_node1 x:collection1] o.a.s.c.c.ZkStateReader Load collection config from:/collections/control_collection
   [junit4]   2> 424485 INFO  (coreLoadExecutor-2839-thread-1-processing-n:127.0.0.1:45515_) [n:127.0.0.1:45515_ c:control_collection s:shard1 r:core_node1 x:collection1] o.a.s.c.c.ZkStateReader path=/collections/control_collection configName=conf1 specified config exists in ZooKeeper
   [junit4]   2> 424485 INFO  (coreLoadExecutor-2839-thread-1-processing-n:127.0.0.1:45515_) [n:127.0.0.1:45515_ c:control_collection s:shard1 r:core_node1 x:collection1] o.a.s.r.ManagedResourceStorage Setting up ZooKeeper-based storage for the RestManager with znodeBase: /configs/conf1
   [junit4]   2> 424485 INFO  (coreLoadExecutor-2839-thread-1-processing-n:127.0.0.1:45515_) [n:127.0.0.1:45515_ c:control_collection s:shard1 r:core_node1 x:collection1] o.a.s.r.ManagedResourceStorage Configured ZooKeeperStorageIO with znodeBase: /configs/conf1
   [junit4]   2> 424486 INFO  (coreLoadExecutor-2839-thread-1-processing-n:127.0.0.1:45515_) [n:127.0.0.1:45515_ c:control_collection s:shard1 r:core_node1 x:collection1] o.a.s.r.RestManager Initializing RestManager with initArgs: {}
   [junit4]   2> 424486 INFO  (coreLoadExecutor-2839-thread-1-processing-n:127.0.0.1:45515_) [n:127.0.0.1:45515_ c:control_collection s:shard1 r:core_node1 x:collection1] o.a.s.r.ManagedResourceStorage Reading _rest_managed.json using ZooKeeperStorageIO:path=/configs/conf1
   [junit4]   2> 424486 INFO  (coreLoadExecutor-2839-thread-1-processing-n:127.0.0.1:45515_) [n:127.0.0.1:45515_ c:control_collection s:shard1 r:core_node1 x:collection1] o.a.s.r.ManagedResourceStorage No data found for znode /configs/conf1/_rest_managed.json
   [junit4]   2> 424486 INFO  (coreLoadExecutor-2839-thread-1-processing-n:127.0.0.1:45515_) [n:127.0.0.1:45515_ c:control_collection s:shard1 r:core_node1 x:collection1] o.a.s.r.ManagedResourceStorage Loaded null at path _rest_managed.json using ZooKeeperStorageIO:path=/configs/conf1
   [junit4]   2> 424486 INFO  (coreLoadExecutor-2839-thread-1-processing-n:127.0.0.1:45515_) [n:127.0.0.1:45515_ c:control_collection s:shard1 r:core_node1 x:collection1] o.a.s.r.RestManager Initializing 0 registered ManagedResources
   [junit4]   2> 424486 INFO  (coreLoadExecutor-2839-thread-1-processing-n:127.0.0.1:45515_) [n:127.0.0.1:45515_ c:control_collection s:shard1 r:core_node1 x:collection1] o.a.s.h.ReplicationHandler Commits will be reserved for  10000
   [junit4]   2> 424486 INFO  (searcherExecutor-2840-thread-1-processing-n:127.0.0.1:45515_ x:collection1 s:shard1 c:control_collection r:core_node1) [n:127.0.0.1:45515_ c:control_collection s:shard1 r:core_node1 x:collection1] o.a.s.c.SolrCore [collection1] Registered new searcher Searcher@6cff40[collection1] main{ExitableDirectoryReader(UninvertingDirectoryReader())}
   [junit4]   2> 424487 INFO  (coreLoadExecutor-2839-thread-1-processing-n:127.0.0.1:45515_) [n:127.0.0.1:45515_ c:control_collection s:shard1 r:core_node1 x:collection1] o.a.s.u.UpdateLog Looking up max value of version field to seed version buckets
   [junit4]   2> 424487 INFO  (coreLoadExecutor-2839-thread-1-processing-n:127.0.0.1:45515_) [n:127.0.0.1:45515_ c:control_collection s:shard1 r:core_node1 x:collection1] o.a.s.u.VersionInfo Refreshing highest value of _version_ for 65536 version buckets from index
   [junit4]   2> 424487 INFO  (coreLoadExecutor-2839-thread-1-processing-n:127.0.0.1:45515_) [n:127.0.0.1:45515_ c:control_collection s:shard1 r:core_node1 x:collection1] o.a.s.u.VersionInfo No terms found for _version_, cannot seed version bucket highest value from index
   [junit4]   2> 424487 INFO  (coreLoadExecutor-2839-thread-1-processing-n:127.0.0.1:45515_) [n:127.0.0.1:45515_ c:control_collection s:shard1 r:core_node1 x:collection1] o.a.s.u.UpdateLog Could not find max version in index or recent updates, using new clock 1510026061002309632
   [junit4]   2> 424489 INFO  (coreLoadExecutor-2839-thread-1-processing-n:127.0.0.1:45515_) [n:127.0.0.1:45515_ c:control_collection s:shard1 r:core_node1 x:collection1] o.a.s.u.UpdateLog Took 1.0ms to seed version buckets with highest version 1510026061002309632
   [junit4]   2> 424489 INFO  (coreLoadExecutor-2839-thread-1-processing-n:127.0.0.1:45515_) [n:127.0.0.1:45515_ c:control_collection s:shard1 r:core_node1 x:collection1] o.a.s.c.ZkController watch zkdir /configs/conf1
   [junit4]   2> 424489 INFO  (coreLoadExecutor-2839-thread-1-processing-n:127.0.0.1:45515_) [n:127.0.0.1:45515_ c:control_collection s:shard1 r:core_node1 x:collection1] o.a.s.c.CoreContainer registering core: collection1
   [junit4]   2> 424489 INFO  (coreZkRegister-2833-thread-1-processing-n:127.0.0.1:45515_ x:collection1 s:shard1 c:control_collection r:core_node1) [n:127.0.0.1:45515_ c:control_collection s:shard1 r:core_node1 x:collection1] o.a.s.c.ZkController Register replica - core:collection1 address:http://127.0.0.1:45515 collection:control_collection shard:shard1
   [junit4]   2> 424490 INFO  (coreZkRegister-2833-thread-1-processing-n:127.0.0.1:45515_ x:collection1 s:shard1 c:control_collection r:core_node1) [n:127.0.0.1:45515_ c:control_collection s:shard1 r:core_node1 x:collection1] o.a.s.c.c.SolrZkClient makePath: /collections/control_collection/leader_elect/shard1/election
   [junit4]   2> 424490 INFO  (coreZkRegister-2833-thread-1-processing-n:127.0.0.1:45515_ x:collection1 s:shard1 c:control_collection r:core_node1) [n:127.0.0.1:45515_ c:control_collection s:shard1 r:core_node1 x:collection1] o.a.s.c.LeaderElector Joined leadership election with path: /collections/control_collection/leader_elect/shard1/election/94376628726398980-core_node1-n_0000000000
   [junit4]   2> 424491 INFO  (coreZkRegister-2833-thread-1-processing-n:127.0.0.1:45515_ x:collection1 s:shard1 c:control_collection r:core_node1) [n:127.0.0.1:45515_ c:control_collection s:shard1 r:core_node1 x:collection1] o.a.s.c.ShardLeaderElectionContext Running the leader process for shard shard1
   [junit4]   2> 424491 INFO  (coreZkRegister-2833-thread-1-processing-n:127.0.0.1:45515_ x:collection1 s:shard1 c:control_collection r:core_node1) [n:127.0.0.1:45515_ c:control_collection s:shard1 r:core_node1 x:collection1] o.a.s.c.ShardLeaderElectionContext Enough replicas found to continue.
   [junit4]   2> 424492 INFO  (coreZkRegister-2833-thread-1-processing-n:127.0.0.1:45515_ x:collection1 s:shard1 c:control_collection r:core_node1) [n:127.0.0.1:45515_ c:control_collection s:shard1 r:core_node1 x:collection1] o.a.s.c.ShardLeaderElectionContext I may be the new leader - try and sync
   [junit4]   2> 424492 INFO  (OverseerStateUpdate-94376628726398980-127.0.0.1:45515_-n_0000000000) [n:127.0.0.1:45515_    ] o.a.s.c.Overseer processMessage: queueSize: 1, message = {
   [junit4]   2>   "operation":"leader",
   [junit4]   2>   "shard":"shard1",
   [junit4]   2>   "collection":"control_collection"} current state version: 1
   [junit4]   2> 424492 INFO  (coreZkRegister-2833-thread-1-processing-n:127.0.0.1:45515_ x:collection1 s:shard1 c:control_collection r:core_node1) [n:127.0.0.1:45515_ c:control_collection s:shard1 r:core_node1 x:collection1] o.a.s.c.SyncStrategy Sync replicas to http://127.0.0.1:45515/collection1/
   [junit4]   2> 424492 INFO  (coreZkRegister-2833-thread-1-processing-n:127.0.0.1:45515_ x:collection1 s:shard1 c:control_collection r:core_node1) [n:127.0.0.1:45515_ c:control_collection s:shard1 r:core_node1 x:collection1] o.a.s.c.SyncStrategy Sync Success - now sync replicas to me
   [junit4]   2> 424492 INFO  (coreZkRegister-2833-thread-1-processing-n:127.0.0.1:45515_ x:collection1 s:shard1 c:control_collection r:core_node1) [n:127.0.0.1:45515_ c:control_collection s:shard1 r:core_node1 x:collection1] o.a.s.c.SyncStrategy http://127.0.0.1:45515/collection1/ has no replicas
   [junit4]   2> 424492 INFO  (coreZkRegister-2833-thread-1-processing-n:127.0.0.1:45515_ x:collection1 s:shard1 c:control_collection r:core_node1) [n:127.0.0.1:45515_ c:control_collection s:shard1 r:core_node1 x:collection1] o.a.s.c.ShardLeaderElectionContext I am the new leader: http://127.0.0.1:45515/collection1/ shard1
   [junit4]   2> 424492 INFO  (coreZkRegister-2833-thread-1-processing-n:127.0.0.1:45515_ x:collection1 s:shard1 c:control_collection r:core_node1) [n:127.0.0.1:45515_ c:control_collection s:shard1 r:core_node1 x:collection1] o.a.s.c.c.SolrZkClient makePath: /collections/control_collection/leaders/shard1
   [junit4]   2> 424493 INFO  (OverseerStateUpdate-94376628726398980-127.0.0.1:45515_-n_0000000000) [n:127.0.0.1:45515_    ] o.a.s.c.Overseer processMessage: queueSize: 1, message = {
   [junit4]   2>   "operation":"leader",
   [junit4]   2>   "shard":"shard1",
   [junit4]   2>   "collection":"control_collection",
   [junit4]   2>   "base_url":"http://127.0.0.1:45515",
   [junit4]   2>   "core":"collection1",
   [junit4]   2>   "state":"active"} current state version: 1
   [junit4]   2> 424594 INFO  (zkCallback-854-thread-1-processing-n:127.0.0.1:45515_) [n:127.0.0.1:45515_    ] o.a.s.c.c.ZkStateReader A cluster state change: WatchedEvent state:SyncConnected type:NodeDataChanged path:/clusterstate.json, has occurred - updating... (live nodes size: 1)
   [junit4]   2> 424643 INFO  (coreZkRegister-2833-thread-1-processing-n:127.0.0.1:45515_ x:collection1 s:shard1 c:control_collection r:core_node1) [n:127.0.0.1:45515_ c:control_collection s:shard1 r:core_node1 x:collection1] o.a.s.c.ZkController We are http://127.0.0.1:45515/collection1/ and leader is http://127.0.0.1:45515/collection1/
   [junit4]   2> 424643 INFO  (coreZkRegister-2833-thread-1-processing-n:127.0.0.1:45515_ x:collection1 s:shard1 c:control_collection r:core_node1) [n:127.0.0.1:45515_ c:control_collection s:shard1 r:core_node1 x:collection1] o.a.s.c.ZkController No LogReplay needed for core=collection1 baseURL=http://127.0.0.1:45515
   [junit4]   2> 424644 INFO  (coreZkRegister-2833-thread-1-processing-n:127.0.0.1:45515_ x:collection1 s:shard1 c:control_collection r:core_node1) [n:127.0.0.1:45515_ c:control_collection s:shard1 r:core_node1 x:collection1] o.a.s.c.ZkController I am the leader, no recovery necessary
   [junit4]   2> 424644 INFO  (coreZkRegister-2833-thread-1-processing-n:127.0.0.1:45515_ x:collection1 s:shard1 c:control_collection r:core_node1) [n:127.0.0.1:45515_ c:control_collection s:shard1 r:core_node1 x:collection1] o.a.s.c.ZkController publishing state=active
   [junit4]   2> 424644 INFO  (coreZkRegister-2833-thread-1-processing-n:127.0.0.1:45515_ x:collection1 s:shard1 c:control_collection r:core_node1) [n:127.0.0.1:45515_ c:control_collection s:shard1 r:core_node1 x:collection1] o.a.s.c.ZkController numShards not found on descriptor - reading it from system property
   [junit4]   2> 424644 INFO  (OverseerStateUpdate-94376628726398980-127.0.0.1:45515_-n_0000000000) [n:127.0.0.1:45515_    ] o.a.s.c.Overseer processMessage: queueSize: 1, message = {
   [junit4]   2>   "core":"collection1",
   [junit4]   2>   "core_node_name":"core_node1",
   [junit4]   2>   "roles":null,
   [junit4]   2>   "base_url":"http://127.0.0.1:45515",
   [junit4]   2>   "node_name":"127.0.0.1:45515_",
   [junit4]   2>   "numShards":"1",
   [junit4]   2>   "state":"active",
   [junit4]   2>   "shard":"shard1",
   [junit4]   2>   "collection":"control_collection",
   [junit4]   2>   "operation":"state"} current state version: 2
   [junit4]   2> 424645 INFO  (OverseerStateUpdate-94376628726398980-127.0.0.1:45515_-n_0000000000) [n:127.0.0.1:45515_    ] o.a.s.c.o.ReplicaMutator Update state numShards=1 message={
   [junit4]   2>   "core":"collection1",
   [junit4]   2>   "core_node_name":"core_node1",
   [junit4]   2>   "roles":null,
   [junit4]   2>   "base_url":"http://127.0.0.1:45515",
   [junit4]   2>   "node_name":"127.0.0.1:45515_",
   [junit4]   2>   "numShards":"1",
   [junit4]   2>   "state":"active",
   [junit4]   2>   "shard":"shard1",
   [junit4]   2>   "collection":"control_collection",
   [junit4]   2>   "operation":"state"}
   [junit4]   2> 424745 INFO  (zkCallback-854-thread-1-processing-n:127.0.0.1:45515_) [n:127.0.0.1:45515_    ] o.a.s.c.c.ZkStateReader A cluster state change: WatchedEvent state:SyncConnected type:NodeDataChanged path:/clusterstate.json, has occurred - updating... (live nodes size: 1)
   [junit4]   2> 424896 INFO  (TEST-HttpPartitionTest.test-seed#[5C8A030049025509]) [    ] o.a.s.c.c.SolrZkClient Using default ZkCredentialsProvider
   [junit4]   2> 424896 INFO  (TEST-HttpPartitionTest.test-seed#[5C8A030049025509]) [    ] o.a.s.c.c.ConnectionManager Waiting for client to connect to ZooKeeper
   [junit4]   2> 424896 INFO  (zkCallback-856-thread-1) [    ] o.a.s.c.c.ConnectionManager Watcher org.apache.solr.common.cloud.ConnectionManager@1fd0cf7 name:ZooKeeperConnection Watcher:127.0.0.1:49703/solr got event WatchedEvent state:SyncConnected type:None path:null path:null type:None
   [junit4]   2> 424897 INFO  (TEST-HttpPartitionTest.test-seed#[5C8A030049025509]) [    ] o.a.s.c.c.ConnectionManager Client is connected to ZooKeeper
   [junit4]   2> 424897 INFO  (TEST-HttpPartitionTest.test-seed#[5C8A030049025509]) [    ] o.a.s.c.c.SolrZkClient Using default ZkACLProvider
   [junit4]   2> 424897 INFO  (TEST-HttpPartitionTest.test-seed#[5C8A030049025509]) [    ] o.a.s.c.c.ZkStateReader Updating cluster state from ZooKeeper... 
   [junit4]   2> 424898 INFO  (TEST-HttpPartitionTest.test-seed#[5C8A030049025509]) [    ] o.a.s.c.ChaosMonkey monkey: init - expire sessions:false cause connection loss:false
   [junit4]   2> 424898 INFO  (TEST-HttpPartitionTest.test-seed#[5C8A030049025509]) [    ] o.a.s.c.AbstractFullDistribZkTestBase Creating collection1 with stateFormat=2
   [junit4]   2> 424898 INFO  (TEST-HttpPartitionTest.test-seed#[5C8A030049025509]) [    ] o.a.s.c.c.SolrZkClient Using default ZkCredentialsProvider
   [junit4]   2> 424898 INFO  (TEST-HttpPartitionTest.test-seed#[5C8A030049025509]) [    ] o.a.s.c.c.ConnectionManager Waiting for client to connect to ZooKeeper
   [junit4]   2> 424898 INFO  (zkCallback-857-thread-1) [    ] o.a.s.c.c.ConnectionManager Watcher org.apache.solr.common.cloud.ConnectionManager@8a2e22 name:ZooKeeperConnection Watcher:127.0.0.1:49703/solr got event WatchedEvent state:SyncConnected type:None path:null path:null type:None
   [junit4]   2> 424899 INFO  (TEST-HttpPartitionTest.test-seed#[5C8A030049025509]) [    ] o.a.s.c.c.ConnectionManager Client is connected to ZooKeeper
   [junit4]   2> 424899 INFO  (TEST-HttpPartitionTest.test-seed#[5C8A030049025509]) [    ] o.a.s.c.c.SolrZkClient Using default ZkACLProvider
   [junit4]   2> 424900 INFO  (OverseerStateUpdate-94376628726398980-127.0.0.1:45515_-n_0000000000) [n:127.0.0.1:45515_    ] o.a.s.c.Overseer processMessage: queueSize: 1, message = {
   [junit4]   2>   "operation":"create",
   [junit4]   2>   "name":"collection1",
   [junit4]   2>   "numShards":"2",
   [junit4]   2>   "stateFormat":"2"} current state version: 3
   [junit4]   2> 424900 INFO  (OverseerStateUpdate-94376628726398980-127.0.0.1:45515_-n_0000000000) [n:127.0.0.1:45515_    ] o.a.s.c.o.ClusterStateMutator building a new cName: collection1
   [junit4]   2> 424948 INFO  (TEST-HttpPartitionTest.test-seed#[5C8A030049025509]) [    ] o.a.s.SolrTestCaseJ4 Writing core.properties file to /home/jenkins/workspace/Lucene-Solr-trunk-Linux/solr/build/solr-core/test/J1/temp/solr.cloud.HttpPartitionTest_5C8A030049025509-001/shard-1-001/cores/collection1
   [junit4]   2> 424949 INFO  (TEST-HttpPartitionTest.test-seed#[5C8A030049025509]) [    ] o.a.s.c.AbstractFullDistribZkTestBase create jetty 1 in directory /home/jenkins/workspace/Lucene-Solr-trunk-Linux/solr/build/solr-core/test/J1/temp/solr.cloud.HttpPartitionTest_5C8A030049025509-001/shard-1-001
   [junit4]   2> 424949 INFO  (TEST-HttpPartitionTest.test-seed#[5C8A030049025509]) [    ] o.e.j.s.Server jetty-9.2.13.v20150730
   [junit4]   2> 424950 INFO  (TEST-HttpPartitionTest.test-seed#[5C8A030049025509]) [    ] o.e.j.s.h.ContextHandler Started o.e.j.s.ServletContextHandler@d9c32d{/,null,AVAILABLE}
   [junit4]   2> 424950 INFO  (TEST-HttpPartitionTest.test-seed#[5C8A030049025509]) [    ] o.e.j.s.ServerConnector Started ServerConnector@1f0621a{HTTP/1.1}{127.0.0.1:38032}
   [junit4]   2> 424950 INFO  (TEST-HttpPartitionTest.test-seed#[5C8A030049025509]) [    ] o.e.j.s.Server Started @426703ms
   [junit4]   2> 424950 INFO  (TEST-HttpPartitionTest.test-seed#[5C8A030049025509]) [    ] o.a.s.c.s.e.JettySolrRunner Jetty properties: {solr.data.dir=/home/jenkins/workspace/Lucene-Solr-trunk-Linux/solr/build/solr-core/test/J1/temp/solr.cloud.HttpPartitionTest_5C8A030049025509-001/tempDir-001/jetty1, solrconfig=solrconfig.xml, hostContext=/, hostPort=45407, coreRootDirectory=/home/jenkins/workspace/Lucene-Solr-trunk-Linux/solr/build/solr-core/test/J1/temp/solr.cloud.HttpPartitionTest_5C8A030049025509-001/shard-1-001/cores}
   [junit4]   2> 424950 INFO  (TEST-HttpPartitionTest.test-seed#[5C8A030049025509]) [    ] o.a.s.s.SolrDispatchFilter SolrDispatchFilter.init(): sun.misc.Launcher$AppClassLoader@e2f2a
   [junit4]   2> 424950 INFO  (TEST-HttpPartitionTest.test-seed#[5C8A030049025509]) [    ] o.a.s.c.SolrResourceLoader new SolrResourceLoader for directory: '/home/jenkins/workspace/Lucene-Solr-trunk-Linux/solr/build/solr-core/test/J1/temp/solr.cloud.HttpPartitionTest_5C8A030049025509-001/shard-1-001/'
   [junit4]   2> 424958 INFO  (TEST-HttpPartitionTest.test-seed#[5C8A030049025509]) [    ] o.a.s.c.c.SolrZkClient Using default ZkCredentialsProvider
   [junit4]   2> 424959 INFO  (TEST-HttpPartitionTest.test-seed#[5C8A030049025509]) [    ] o.a.s.c.c.ConnectionManager Waiting for client to connect to ZooKeeper
   [junit4]   2> 424960 INFO  (zkCallback-858-thread-1) [    ] o.a.s.c.c.ConnectionManager Watcher org.apache.solr.common.cloud.ConnectionManager@17e8c75 name:ZooKeeperConnection Watcher:127.0.0.1:49703/solr got event WatchedEvent state:SyncConnected type:None path:null path:null type:None
   [junit4]   2> 424960 INFO  (TEST-HttpPartitionTest.test-seed#[5C8A030049025509]) [    ] o.a.s.c.c.ConnectionManager Client is connected to ZooKeeper
   [junit4]   2> 424960 INFO  (TEST-HttpPartitionTest.test-seed#[5C8A030049025509]) [    ] o.a.s.c.c.SolrZkClient Using default ZkACLProvider
   [junit4]   2> 424961 INFO  (TEST-HttpPartitionTest.test-seed#[5C8A030049025509]) [    ] o.a.s.s.SolrDispatchFilter Loading solr.xml from SolrHome (not found in ZooKeeper)
   [junit4]   2> 424961 INFO  (TEST-HttpPartitionTest.test-seed#[5C8A030049025509]) [    ] o.a.s.c.SolrXmlConfig Loading container configuration from /home/jenkins/workspace/Lucene-Solr-trunk-Linux/solr/build/solr-core/test/J1/temp/solr.cloud.HttpPartitionTest_5C8A030049025509-001/shard-1-001/solr.xml
   [junit4]   2> 424963 INFO  (TEST-HttpPartitionTest.test-seed#[5C8A030049025509]) [    ] o.a.s.c.CoresLocator Config-defined core root directory: /home/jenkins/workspace/Lucene-Solr-trunk-Linux/solr/build/solr-core/test/J1/temp/solr.cloud.HttpPartitionTest_5C8A030049025509-001/shard-1-001/cores
   [junit4]   2> 424963 INFO  (TEST-HttpPartitionTest.test-seed#[5C8A030049025509]) [    ] o.a.s.c.CoreContainer New CoreContainer 4013289
   [junit4]   2> 424964 INFO  (TEST-HttpPartitionTest.test-seed#[5C8A030049025509]) [    ] o.a.s.c.CoreContainer Loading cores into CoreContainer [instanceDir=/home/jenkins/workspace/Lucene-Solr-trunk-Linux/solr/build/solr-core/test/J1/temp/solr.cloud.HttpPartitionTest_5C8A030049025509-001/shard-1-001/]
   [junit4]   2> 424964 INFO  (TEST-HttpPartitionTest.test-seed#[5C8A030049025509]) [    ] o.a.s.c.CoreContainer loading shared library: /home/jenkins/workspace/Lucene-Solr-trunk-Linux/solr/build/solr-core/test/J1/temp/solr.cloud.HttpPartitionTest_5C8A030049025509-001/shard-1-001/lib
   [junit4]   2> 424964 WARN  (TEST-HttpPartitionTest.test-seed#[5C8A030049025509]) [    ] o.a.s.c.SolrResourceLoader Can't find (or read) directory to add to classloader: lib (resolved as: /home/jenkins/workspace/Lucene-Solr-trunk-Linux/solr/build/solr-core/test/J1/temp/solr.cloud.HttpPartitionTest_5C8A030049025509-001/shard-1-001/lib).
   [junit4]   2> 424968 INFO  (TEST-HttpPartitionTest.test-seed#[5C8A030049025509]) [    ] o.a.s.h.c.HttpShardHandlerFactory created with socketTimeout : 90000,urlScheme : ,connTimeout : 15000,maxConnectionsPerHost : 20,maxConnections : 10000,corePoolSize : 0,maximumPoolSize : 2147483647,maxThreadIdleTime : 5,sizeOfQueue : -1,fairnessPolicy : false,useRetries : false,
   [junit4]   2> 424969 INFO  (TEST-HttpPartitionTest.test-seed#[5C8A030049025509]) [    ] o.a.s.u.UpdateShardHandler Creating UpdateShardHandler HTTP client with params: socketTimeout=340000&connTimeout=45000&retry=true
   [junit4]   2> 424969 INFO  (TEST-HttpPartitionTest.test-seed#[5C8A030049025509]) [    ] o.a.s.l.LogWatcher SLF4J impl is org.slf4j.impl.Log4jLoggerFactory
   [junit4]   2> 424969 INFO  (TEST-HttpPartitionTest.test-seed#[5C8A030049025509]) [    ] o.a.s.l.LogWatcher Registering Log Listener [Log4j (org.slf4j.impl.Log4jLoggerFactory)]
   [junit4]   2> 424969 INFO  (TEST-HttpPartitionTest.test-seed#[5C8A030049025509]) [    ] o.a.s.c.ZkContainer Zookeeper client=127.0.0.1:49703/solr
   [junit4]   2> 424969 INFO  (TEST-HttpPartitionTest.test-seed#[5C8A030049025509]) [    ] o.a.s.c.ZkController zkHost includes chroot
   [junit4]   2> 424969 INFO  (TEST-HttpPartitionTest.test-seed#[5C8A030049025509]) [    ] o.a.s.c.c.SolrZkClient Using default ZkCredentialsProvider
   [junit4]   2> 424970 INFO  (TEST-HttpPartitionTest.test-seed#[5C8A030049025509]) [    ] o.a.s.c.c.ConnectionManager Waiting for client to connect to ZooKeeper
   [junit4]   2> 424970 INFO  (zkCallback-860-thread-1) [    ] o.a.s.c.c.ConnectionManager Watcher org.apache.solr.common.cloud.ConnectionManager@17cf927 name:ZooKeeperConnection Watcher:127.0.0.1:49703 got event WatchedEvent state:SyncConnected type:None path:null path:null type:None
   [junit4]   2> 424970 INFO  (TEST-HttpPartitionTest.test-seed#[5C8A030049025509]) [    ] o.a.s.c.c.ConnectionManager Client is connected to ZooKeeper
   [junit4]   2> 424971 INFO  (TEST-HttpPartitionTest.test-seed#[5C8A030049025509]) [    ] o.a.s.c.c.SolrZkClient Using default ZkACLProvider
   [junit4]   2> 424972 INFO  (TEST-HttpPartitionTest.test-seed#[5C8A030049025509]) [n:127.0.0.1:45407_    ] o.a.s.c.c.ConnectionManager Waiting for client to connect to ZooKeeper
   [junit4]   2> 424972 INFO  (zkCallback-861-thread-1-processing-n:127.0.0.1:45407_) [n:127.0.0.1:45407_    ] o.a.s.c.c.ConnectionManager Watcher org.apache.solr.common.cloud.ConnectionManager@4f2eb4 name:ZooKeeperConnection Watcher:127.0.0.1:49703/solr got event WatchedEvent state:SyncConnected type:None path:null path:null type:None
   [junit4]   2> 424972 INFO  (TEST-HttpPartitionTest.test-seed#[5C8A030049025509]) [n:127.0.0.1:45407_    ] o.a.s.c.c.ConnectionManager Client is connected to ZooKeeper
   [junit4]   2> 424974 INFO  (TEST-HttpPartitionTest.test-seed#[5C8A030049025509]) [n:127.0.0.1:45407_    ] o.a.s.c.c.ZkStateReader Updating cluster state from ZooKeeper... 
   [junit4]   2> 425001 INFO  (OverseerStateUpdate-94376628726398980-127.0.0.1:45515_-n_0000000000) [n:127.0.0.1:45515_    ] o.a.s.c.o.ZkStateWriter going to create_collection /collections/collection1/state.json
   [junit4]   2> 425001 INFO  (zkCallback-854-thread-1-processing-n:127.0.0.1:45515_) [n:127.0.0.1:45515_    ] o.a.s.c.c.ZkStateReader A cluster state change: WatchedEvent state:SyncConnected type:NodeDataChanged path:/clusterstate.json, has occurred - updating... (live nodes size: 1)
   [junit4]   2> 425001 INFO  (zkCallback-856-thread-1) [    ] o.a.s.c.c.ZkStateReader A cluster state change: WatchedEvent state:SyncConnected type:NodeDataChanged path:/clusterstate.json, has occurred - updating... (live nodes size: 1)
   [junit4]   2> 425001 INFO  (zkCallback-861-thread-1-processing-n:127.0.0.1:45407_) [n:127.0.0.1:45407_    ] o.a.s.c.c.ZkStateReader A cluster state change: WatchedEvent state:SyncConnected type:NodeDataChanged path:/clusterstate.json, has occurred - updating... (live nodes size: 1)
   [junit4]   2> 425975 INFO  (TEST-HttpPartitionTest.test-seed#[5C8A030049025509]) [n:127.0.0.1:45407_    ] o.a.s.c.ZkController Register node as live in ZooKeeper:/live_nodes/127.0.0.1:45407_
   [junit4]   2> 425976 INFO  (TEST-HttpPartitionTest.test-seed#[5C8A030049025509]) [n:127.0.0.1:45407_    ] o.a.s.c.c.SolrZkClient makePath: /live_nodes/127.0.0.1:45407_
   [junit4]   2> 425976 INFO  (zkCallback-856-thread-1) [    ] o.a.s.c.c.ZkStateReader A live node change: WatchedEvent state:SyncConnected type:NodeChildrenChanged path:/live_nodes, has occurred - updating... (live nodes size: 1)
   [junit4]   2> 425976 INFO  (zkCallback-861-thread-1-processing-n:127.0.0.1:45407_) [n:127.0.0.1:45407_    ] o.a.s.c.c.ZkStateReader A live node change: WatchedEvent state:SyncConnected type:NodeChildrenChanged path:/live_nodes, has occurred - updating... (live nodes size: 1)
   [junit4]   2> 425976 INFO  (zkCallback-854-thread-1-processing-n:127.0.0.1:45515_) [n:127.0.0.1:45515_    ] o.a.s.c.c.ZkStateReader A live node change: WatchedEvent state:SyncConnected type:NodeChildrenChanged path:/live_nodes, has occurred - updating... (live nodes size: 1)
   [junit4]   2> 425976 INFO  (TEST-HttpPartitionTest.test-seed#[5C8A030049025509]) [n:127.0.0.1:45407_    ] o.a.s.c.Overseer Overseer (id=null) closing
   [junit4]   2> 425977 INFO  (TEST-HttpPartitionTest.test-seed#[5C8A030049025509]) [n:127.0.0.1:45407_    ] o.a.s.c.LeaderElector Joined leadership election with path: /overseer_elect/election/94376628726398985-127.0.0.1:45407_-n_0000000001
   [junit4]   2> 425977 INFO  (TEST-HttpPartitionTest.test-seed#[5C8A030049025509]) [n:127.0.0.1:45407_    ] o.a.s.c.LeaderElector Watching path /overseer_elect/election/94376628726398980-127.0.0.1:45515_-n_0000000000 to know if I could be the leader
   [junit4]   2> 426001 INFO  (TEST-HttpPartitionTest.test-seed#[5C8A030049025509]) [n:127.0.0.1:45407_    ] o.a.s.c.CoreContainer Security conf doesn't exist. Skipping setup for authorization module.
   [junit4]   2> 426001 INFO  (TEST-HttpPartitionTest.test-seed#[5C8A030049025509]) [n:127.0.0.1:45407_    ] o.a.s.c.CoreContainer No authentication plugin used.
   [junit4]   2> 426001 INFO  (TEST-HttpPartitionTest.test-seed#[5C8A030049025509]) [n:127.0.0.1:45407_    ] o.a.s.c.CoresLocator Looking for core definitions underneath /home/jenkins/workspace/Lucene-Solr-trunk-Linux/solr/build/solr-core/test/J1/temp/solr.cloud.HttpPartitionTest_5C8A030049025509-001/shard-1-001/cores
   [junit4]   2> 426002 INFO  (TEST-HttpPartitionTest.test-seed#[5C8A030049025509]) [n:127.0.0.1:45407_    ] o.a.s.c.SolrCore Created CoreDescriptor: {name=collection1, config=solrconfig.xml, transient=false, schema=schema.xml, loadOnStartup=true, configSetProperties=configsetprops.json, instanceDir=/home/jenkins/workspace/Lucene-Solr-trunk-Linux/solr/build/solr-core/test/J1/temp/solr.cloud.HttpPartitionTest_5C8A030049025509-001/shard-1-001/cores/collection1, collection=collection1, absoluteInstDir=/home/jenkins/workspace/Lucene-Solr-trunk-Linux/solr/build/solr-core/test/J1/temp/solr.cloud.HttpPartitionTest_5C8A030049025509-001/shard-1-001/cores/collection1/, coreNodeName=, dataDir=data/, shard=}
   [junit4]   2> 426002 INFO  (TEST-HttpPartitionTest.test-seed#[5C8A030049025509]) [n:127.0.0.1:45407_    ] o.a.s.c.CoresLocator Found core collection1 in /home/jenkins/workspace/Lucene-Solr-trunk-Linux/solr/build/solr-core/test/J1/temp/solr.cloud.HttpPartitionTest_5C8A030049025509-001/shard-1-001/cores/collection1/
   [junit4]   2> 426002 INFO  (TEST-HttpPartitionTest.test-seed#[5C8A030049025509]) [n:127.0.0.1:45407_    ] o.a.s.c.CoresLocator Found 1 core definitions
   [junit4]   2> 426004 INFO  (TEST-HttpPartitionTest.test-seed#[5C8A030049025509]) [n:127.0.0.1:45407_    ] o.a.s.s.SolrDispatchFilter user.dir=/home/jenkins/workspace/Lucene-Solr-trunk-Linux/solr/build/solr-core/test/J1
   [junit4]   2> 426004 INFO  (TEST-HttpPartitionTest.test-seed#[5C8A030049025509]) [n:127.0.0.1:45407_    ] o.a.s.s.SolrDispatchFilter SolrDispatchFilter.init() done
   [junit4]   2> 426004 INFO  (coreLoadExecutor-2850-thread-1-processing-n:127.0.0.1:45407_) [n:127.0.0.1:45407_ c:collection1   x:collection1] o.a.s.c.ZkController publishing state=down
   [junit4]   2> 426004 INFO  (coreLoadExecutor-2850-thread-1-processing-n:127.0.0.1:45407_) [n:127.0.0.1:45407_ c:collection1   x:collection1] o.a.s.c.ZkController numShards not found on descriptor - reading it from system property
   [junit4]   2> 426004 INFO  (coreLoadExecutor-2850-thread-1-processing-n:127.0.0.1:45407_) [n:127.0.0.1:45407_ c:collection1   x:collection1] o.a.s.c.ZkController Registering watch for collection collection1
   [junit4]   2> 426004 INFO  (coreLoadExecutor-2850-thread-1-processing-n:127.0.0.1:45407_) [n:127.0.0.1:45407_ c:collection1   x:collection1] o.a.s.c.c.ZkStateReader addZkWatch collection1
   [junit4]   2> 426004 INFO  (OverseerStateUpdate-94376628726398980-127.0.0.1:45515_-n_0000000000) [n:127.0.0.1:45515_    ] o.a.s.c.Overseer processMessage: queueSize: 1, message = {
   [junit4]   2>   "core":"collection1",
   [junit4]   2>   "roles":null,
   [junit4]   2>   "base_url":"http://127.0.0.1:45407",
   [junit4]   2>   "node_name":"127.0.0.1:45407_",
   [junit4]   2>   "numShards":"2",
   [junit4]   2>   "state":"down",
   [junit4]   2>   "shard":null,
   [junit4]   2>   "collection":"collection1",
   [junit4]   2>   "operation":"state"} current state version: 4
   [junit4]   2> 426005 INFO  (coreLoadExecutor-2850-thread-1-processing-n:127.0.0.1:45407_) [n:127.0.0.1:45407_ c:collection1   x:collection1] o.a.s.c.c.ZkStateReader Add data for collection1 ver 0 
   [junit4]   2> 426005 INFO  (coreLoadExecutor-2850-thread-1-processing-n:127.0.0.1:45407_) [n:127.0.0.1:45407_ c:collection1   x:collection1] o.a.s.c.ZkController look for our core node name
   [junit4]   2> 426005 INFO  (OverseerStateUpdate-94376628726398980-127.0.0.1:45515_-n_0000000000) [n:127.0.0.1:45515_    ] o.a.s.c.o.ReplicaMutator Update state numShards=2 message={
   [junit4]   2>   "core":"collection1",
   [junit4]   2>   "roles":null,
   [junit4]   2>   "base_url":"http://127.0.0.1:45407",
   [junit4]   2>   "node_name":"127.0.0.1:45407_",
   [junit4]   2>   "numShards":"2",
   [junit4]   2>   "state":"down",
   [junit4]   2>   "shard":null,
   [junit4]   2>   "collection":"collection1",
   [junit4]   2>   "operation":"state"}
   [junit4]   2> 426005 INFO  (OverseerStateUpdate-94376628726398980-127.0.0.1:45515_-n_0000000000) [n:127.0.0.1:45515_    ] o.a.s.c.o.ReplicaMutator Collection already exists with numShards=2
   [junit4]   2> 426005 INFO  (OverseerStateUpdate-94376628726398980-127.0.0.1:45515_-n_0000000000) [n:127.0.0.1:45515_    ] o.a.s.c.o.ReplicaMutator Assigning new node to shard shard=shard2
   [junit4]   2> 426106 INFO  (OverseerStateUpdate-94376628726398980-127.0.0.1:45515_-n_0000000000) [n:127.0.0.1:45515_    ] o.a.s.c.o.ZkStateWriter going to update_collection /collections/collection1/state.json version: 0
   [junit4]   2> 426106 INFO  (zkCallback-861-thread-1-processing-n:127.0.0.1:45407_) [n:127.0.0.1:45407_    ] o.a.s.c.c.ZkStateReader A cluster state change: WatchedEvent state:SyncConnected type:NodeDataChanged path:/collections/collection1/state.json for collection collection1 has occurred - updating... (live nodes size: 2)
   [junit4]   2> 426106 INFO  (zkCallback-861-thread-1-processing-n:127.0.0.1:45407_) [n:127.0.0.1:45407_    ] o.a.s.c.c.ZkStateReader Updating data for collection1 from 0 to 1 
   [junit4]   2> 427005 INFO  (coreLoadExecutor-2850-thread-1-processing-n:127.0.0.1:45407_) [n:127.0.0.1:45407_ c:collection1   x:collection1] o.a.s.c.ZkController waiting to find shard id in clusterstate for collection1
   [junit4]   2> 427005 INFO  (coreLoadExecutor-2850-thread-1-processing-n:127.0.0.1:45407_) [n:127.0.0.1:45407_ c:collection1   x:collection1] o.a.s.c.ZkController Check for collection zkNode:collection1
   [junit4]   2> 427005 INFO  (coreLoadExecutor-2850-thread-1-processing-n:127.0.0.1:45407_) [n:127.0.0.1:45407_ c:collection1   x:collection1] o.a.s.c.ZkController Collection zkNode exists
   [junit4]   2> 427005 INFO  (coreLoadExecutor-2850-thread-1-processing-n:127.0.0.1:45407_) [n:127.0.0.1:45407_ c:collection1   x:collection1] o.a.s.c.c.ZkStateReader Load collection config from:/collections/collection1
   [junit4]   2> 427006 INFO  (coreLoadExecutor-2850-thread-1-processing-n:127.0.0.1:45407_) [n:127.0.0.1:45407_ c:collection1   x:collection1] o.a.s.c.c.ZkStateReader path=/collections/collection1 configName=conf1 specified config exists in ZooKeeper
   [junit4]   2> 427006 INFO  (coreLoadExecutor-2850-thread-1-processing-n:127.0.0.1:45407_) [n:127.0.0.1:45407_ c:collection1   x:collection1] o.a.s.c.SolrResourceLoader new SolrResourceLoader for directory: '/home/jenkins/workspace/Lucene-Solr-trunk-Linux/solr/build/solr-core/test/J1/temp/solr.cloud.HttpPartitionTest_5C8A030049025509-001/shard-1-001/cores/collection1/'
   [junit4]   2> 427015 INFO  (coreLoadExecutor-2850-thread-1-processing-n:127.0.0.1:45407_) [n:127.0.0.1:45407_ c:collection1   x:collection1] o.a.s.c.Config loaded config solrconfig.xml with version 0 
   [junit4]   2> 427019 INFO  (coreLoadExecutor-2850-thread-1-processing-n:127.0.0.1:45407_) [n:127.0.0.1:45407_ c:collection1   x:collection1] o.a.s.c.SolrConfig current version of requestparams : -1
   [junit4]   2> 427022 INFO  (coreLoadExecutor-2850-thread-1-processing-n:127.0.0.1:45407_) [n:127.0.0.1:45407_ c:collection1   x:collection1] o.a.s.c.SolrConfig Using Lucene MatchVersion: 6.0.0
   [junit4]   2> 427029 INFO  (coreLoadExecutor-2850-thread-1-processing-n:127.0.0.1:45407_) [n:127.0.0.1:45407_ c:collection1   x:collection1] o.a.s.c.Config Loaded SolrConfig: solrconfig.xml
   [junit4]   2> 427030 INFO  (coreLoadExecutor-2850-thread-1-processing-n:127.0.0.1:45407_) [n:127.0.0.1:45407_ c:collection1   x:collection1] o.a.s.s.IndexSchema Reading Solr Schema from /configs/conf1/schema.xml
   [junit4]   2> 427033 INFO  (coreLoadExecutor-2850-thread-1-processing-n:127.0.0.1:45407_) [n:127.0.0.1:45407_ c:collection1   x:collection1] o.a.s.s.IndexSchema [collection1] Schema name=test
   [junit4]   2> 427121 INFO  (coreLoadExecutor-2850-thread-1-processing-n:127.0.0.1:45407_) [n:127.0.0.1:45407_ c:collection1   x:collection1] o.a.s.s.OpenExchangeRatesOrgProvider Initialized with rates=open-exchange-rates.json, refreshInterval=1440.
   [junit4]   2> 427124 INFO  (coreLoadExecutor-2850-thread-1-processing-n:127.0.0.1:45407_) [n:127.0.0.1:45407_ c:collection1   x:collection1] o.a.s.s.IndexSchema default search field in schema is text
   [junit4]   2> 427125 INFO  (coreLoadExecutor-2850-thread-1-processing-n:127.0.0.1:45407_) [n:127.0.0.1:45407_ c:collection1   x:collection1] o.a.s.s.IndexSchema unique key field: id
   [junit4]   2> 427129 INFO  (coreLoadExecutor-2850-thread-1-processing-n:127.0.0.1:45407_) [n:127.0.0.1:45407_ c:collection1   x:collection1] o.a.s.s.FileExchangeRateProvider Reloading exchange rates from file currency.xml
   [junit4]   2> 427130 INFO  (coreLoadExecutor-2850-thread-1-processing-n:127.0.0.1:45407_) [n:127.0.0.1:45407_ c:collection1   x:collection1] o.a.s.s.FileExchangeRateProvider Reloading exchange rates from file currency.xml
   [junit4]   2> 427132 INFO  (coreLoadExecutor-2850-thread-1-processing-n:127.0.0.1:45407_) [n:127.0.0.1:45407_ c:collection1   x:collection1] o.a.s.s.OpenExchangeRatesOrgProvider Reloading exchange rates from open-exchange-rates.json
   [junit4]   2> 427132 WARN  (coreLoadExecutor-2850-thread-1-processing-n:127.0.0.1:45407_) [n:127.0.0.1:45407_ c:collection1   x:collection1] o.a.s.s.OpenExchangeRatesOrgProvider Unknown key IMPORTANT NOTE
   [junit4]   2> 427132 WARN  (coreLoadExecutor-2850-thread-1-processing-n:127.0.0.1:45407_) [n:127.0.0.1:45407_ c:collection1   x:collection1] o.a.s.s.OpenExchangeRatesOrgProvider Expected key, got STRING
   [junit4]   2> 427132 INFO  (coreLoadExecutor-2850-thread-1-processing-n:127.0.0.1:45407_) [n:127.0.0.1:45407_ c:collection1   x:collection1] o.a.s.s.OpenExchangeRatesOrgProvider Reloading exchange rates from open-exchange-rates.json
   [junit4]   2> 427133 WARN  (coreLoadExecutor-2850-thread-1-processing-n:127.0.0.1:45407_) [n:127.0.0.1:45407_ c:collection1   x:collection1] o.a.s.s.OpenExchangeRatesOrgProvider Unknown key IMPORTANT NOTE
   [junit4]   2> 427133 WARN  (coreLoadExecutor-2850-thread-1-processing-n:127.0.0.1:45407_) [n:127.0.0.1:45407_ c:collection1   x:collection1] o.a.s.s.OpenExchangeRatesOrgProvider Expected key, got STRING
   [junit4]   2> 427133 INFO  (coreLoadExecutor-2850-thread-1-processing-n:127.0.0.1:45407_) [n:127.0.0.1:45407_ c:collection1   x:collection1] o.a.s.c.ConfigSetProperties Did not find ConfigSet properties, assuming default properties: Can't find resource 'configsetprops.json' in classpath or '/configs/conf1', cwd=/home/jenkins/workspace/Lucene-Solr-trunk-Linux/solr/build/solr-core/test/J1
   [junit4]   2> 427134 INFO  (coreLoadExecutor-2850-thread-1-processing-n:127.0.0.1:45407_) [n:127.0.0.1:45407_ c:collection1   x:collection1] o.a.s.c.CoreContainer Creating SolrCore 'collection1' using configuration from collection collection1
   [junit4]   2> 427134 INFO  (coreLoadExecutor-2850-thread-1-processing-n:127.0.0.1:45407_) [n:127.0.0.1:45407_ c:collection1 s:shard2 r:core_node1 x:collection1] o.a.s.c.SolrCore org.apache.solr.core.MockDirectoryFactory
   [junit4]   2> 427134 INFO  (coreLoadExecutor-2850-thread-1-processing-n:127.0.0.1:45407_) [n:127.0.0.1:45407_ c:collection1 s:shard2 r:core_node1 x:collection1] o.a.s.c.SolrCore [[collection1] ] Opening new SolrCore at [/home/jenkins/workspace/Lucene-Solr-trunk-Linux/solr/build/solr-core/test/J1/temp/solr.cloud.HttpPartitionTest_5C8A030049025509-001/shard-1-001/cores/collection1/], dataDir=[null]
   [junit4]   2> 427134 INFO  (coreLoadExecutor-2850-thread-1-processing-n:127.0.0.1:45407_) [n:127.0.0.1:45407_ c:collection1 s:shard2 r:core_node1 x:collection1] o.a.s.c.JmxMonitoredMap JMX monitoring is enabled. Adding Solr mbeans to JMX Server: com.sun.jmx.mbeanserver.JmxMBeanServer@1d54704
   [junit4]   2> 427134 INFO  (coreLoadExecutor-2850-thread-1-processing-n:127.0.0.1:45407_) [n:127.0.0.1:45407_ c:collection1 s:shard2 r:core_node1 x:collection1] o.a.s.c.CachingDirectoryFactory return new directory for /home/jenkins/workspace/Lucene-Solr-trunk-Linux/solr/build/solr-core/test/J1/temp/solr.cloud.HttpPartitionTest_5C8A030049025509-001/shard-1-001/cores/collection1/data
   [junit4]   2> 427134 INFO  (coreLoadExecutor-2850-thread-1-processing-n:127.0.0.1:45407_) [n:127.0.0.1:45407_ c:collection1 s:shard2 r:core_node1 x:collection1] o.a.s.c.SolrCore New index directory detected: old=null new=/home/jenkins/workspace/Lucene-Solr-trunk-Linux/solr/build/solr-core/test/J1/temp/solr.cloud.HttpPartitionTest_5C8A030049025509-001/shard-1-001/cores/collection1/data/index/
   [junit4]   2> 427135 WARN  (coreLoadExecutor-2850-thread-1-processing-n:127.0.0.1:45407_) [n:127.0.0.1:45407_ c:collection1 s:shard2 r:core_node1 x:collection1] o.a.s.c.SolrCore [collection1] Solr index directory '/home/jenkins/workspace/Lucene-Solr-trunk-Linux/solr/build/solr-core/test/J1/temp/solr.cloud.HttpPartitionTest_5C8A030049025509-001/shard-1-001/cores/collection1/data/index' doesn't exist. Creating new index...
   [junit4]   2> 427135 INFO  (coreLoadExecutor-2850-thread-1-processing-n:127.0.0.1:45407_) [n:127.0.0.1:45407_ c:collection1 s:shard2 r:core_node1 x:collection1] o.a.s.c.CachingDirectoryFactory return new directory for /home/jenkins/workspace/Lucene-Solr-trunk-Linux/solr/build/solr-core/test/J1/temp/solr.cloud.HttpPartitionTest_5C8A030049025509-001/shard-1-001/cores/collection1/data/index
   [junit4]   2> 427135 INFO  (coreLoadExecutor-2850-thread-1-processing-n:127.0.0.1:45407_) [n:127.0.0.1:45407_ c:collection1 s:shard2 r:core_node1 x:collection1] o.a.s.u.RandomMergePolicy RandomMergePolicy wrapping class org.apache.lucene.index.LogDocMergePolicy: [LogDocMergePolicy: minMergeSize=1000, mergeFactor=38, maxMergeSize=9223372036854775807, maxMergeSizeForForcedMerge=9223372036854775807, calibrateSizeByDeletes=false, maxMergeDocs=2147483647, maxCFSSegmentSizeMB=8.796093022207999E12, noCFSRatio=0.8575282859181104]
   [junit4]   2> 427135 INFO  (coreLoadExecutor-2850-thread-1-processing-n:127.0.0.1:45407_) [n:127.0.0.1:45407_ c:collection1 s:shard2 r:core_node1 x:collection1] o.a.s.c.SolrCore SolrDeletionPolicy.onCommit: commits: num=1
   [junit4]   2> 	commit{dir=MockDirectoryWrapper(RAMDirectory@58c2f4 lockFactory=org.apache.lucene.store.SingleInstanceLockFactory@462756),segFN=segments_1,generation=1}
   [junit4]   2> 427135 INFO  (coreLoadExecutor-2850-thread-1-processing-n:127.0.0.1:45407_) [n:127.0.0.1:45407_ c:collection1 s:shard2 r:core_node1 x:collection1] o.a.s.c.SolrCore newest commit generation = 1
   [junit4]   2> 427136 INFO  (OldIndexDirectoryCleanupThreadForCore-collection1) [n:127.0.0.1:45407_ c:collection1 s:shard2 r:core_node1 x:collection1] o.a.s.c.SolrCore Looking for old index directories to cleanup for core collection1 in /home/jenkins/workspace/Lucene-Solr-trunk-Linux/solr/build/solr-core/test/J1/temp/solr.cloud.HttpPartitionTest_5C8A030049025509-001/shard-1-001/cores/collection1/data/
   [junit4]   2> 427136 WARN  (OldIndexDirectoryCleanupThreadForCore-collection1) [n:127.0.0.1:45407_ c:collection1 s:shard2 r:core_node1 x:collection1] o.a.s.c.DirectoryFactory /home/jenkins/workspace/Lucene-Solr-trunk-Linux/solr/build/solr-core/test/J1/temp/solr.cloud.HttpPartitionTest_5C8A030049025509-001/shard-1-001/cores/collection1/data/ does not point to a valid data directory; skipping clean-up of old index directories.
   [junit4]   2> 427138 INFO  (coreLoadExecutor-2850-thread-1-processing-n:127.0.0.1:45407_) [n:127.0.0.1:45407_ c:collection1 s:shard2 r:core_node1 x:collection1] o.a.s.u.p.UpdateRequestProcessorChain creating updateRequestProcessorChain "nodistrib"
   [junit4]   2> 427138 INFO  (coreLoadExecutor-2850-thread-1-processing-n:127.0.0.1:45407_) [n:127.0.0.1:45407_ c:collection1 s:shard2 r:core_node1 x:collection1] o.a.s.u.p.UpdateRequestProcessorChain creating updateRequestProcessorChain "dedupe"
   [junit4]   2> 427138 INFO  (coreLoadExecutor-2850-thread-1-processing-n:127.0.0.1:45407_) [n:127.0.0.1:45407_ c:collection1 s:shard2 r:core_node1 x:collection1] o.a.s.u.p.UpdateRequestProcessorChain inserting DistributedUpdateProcessorFactory into updateRequestProcessorChain "dedupe"
   [junit4]   2> 427138 INFO  (coreLoadExecutor-2850-thread-1-processing-n:127.0.0.1:45407_) [n:127.0.0.1:45407_ c:collection1 s:shard2 r:core_node1 x:collection1] o.a.s.u.p.UpdateRequestProcessorChain creating updateRequestProcessorChain "stored_sig"
   [junit4]   2> 427138 INFO  (coreLoadExecutor-2850-thread-1-processing-n:127.0.0.1:45407_) [n:127.0.0.1:45407_ c:collection1 s:shard2 r:core_node1 x:collection1] o.a.s.u.p.UpdateRequestProcessorChain inserting DistributedUpdateProcessorFactory into updateRequestProcessorChain "stored_sig"
   [junit4]   2> 427138 INFO  (coreLoadExecutor-2850-thread-1-processing-n:127.0.0.1:45407_) [n:127.0.0.1:45407_ c:collection1 s:shard2 r:core_node1 x:collection1] o.a.s.u.p.UpdateRequestProcessorChain creating updateRequestProcessorChain "distrib-dup-test-chain-explicit"
   [junit4]   2> 427138 INFO  (coreLoadExecutor-2850-thread-1-processing-n:127.0.0.1:45407_) [n:127.0.0.1:45407_ c:collection1 s:shard2 r:core_node1 x:collection1] o.a.s.u.p.UpdateRequestProcessorChain creating updateRequestProcessorChain "distrib-dup-test-chain-implicit"
   [junit4]   2> 427138 INFO  (coreLoadExecutor-2850-thread-1-processing-n:127.0.0.1:45407_) [n:127.0.0.1:45407_ c:collection1 s:shard2 r:core_node1 x:collection1] o.a.s.u.p.UpdateRequestProcessorChain inserting DistributedUpdateProcessorFactory into updateRequestProcessorChain "distrib-dup-test-chain-implicit"
   [junit4]   2> 427139 INFO  (coreLoadExecutor-2850-thread-1-processing-n:127.0.0.1:45407_) [n:127.0.0.1:45407_ c:collection1 s:shard2 r:core_node1 x:collection1] o.a.s.c.SolrCore no updateRequestProcessorChain defined as default, creating implicit default
   [junit4]   2> 427140 INFO  (coreLoadExecutor-2850-thread-1-processing-n:127.0.0.1:45407_) [n:127.0.0.1:45407_ c:collection1 s:shard2 r:core_node1 x:collection1] o.a.s.h.l.XMLLoader xsltCacheLifetimeSeconds=60
   [junit4]   2> 427141 INFO  (coreLoadExecutor-2850-thread-1-processing-n:127.0.0.1:45407_) [n:127.0.0.1:45407_ c:collection1 s:shard2 r:core_node1 x:collection1] o.a.s.h.l.XMLLoader xsltCacheLifetimeSeconds=60
   [junit4]   2> 427142 INFO  (coreLoadExecutor-2850-thread-1-processing-n:127.0.0.1:45407_) [n:127.0.0.1:45407_ c:collection1 s:shard2 r:core_node1 x:collection1] o.a.s.h.l.XMLLoader xsltCacheLifetimeSeconds=60
   [junit4]   2> 427142 INFO  (coreLoadExecutor-2850-thread-1-processing-n:127.0.0.1:45407_) [n:127.0.0.1:45407_ c:collection1 s:shard2 r:core_node1 x:collection1] o.a.s.h.l.XMLLoader xsltCacheLifetimeSeconds=60
   [junit4]   2> 427144 INFO  (coreLoadExecutor-2850-thread-1-processing-n:127.0.0.1:45407_) [n:127.0.0.1:45407_ c:collection1 s:shard2 r:core_node1 x:collection1] o.a.s.c.RequestHandlers Registered paths: /admin/mbeans,standard,/update/csv,/update/json/docs,/admin/luke,/admin/segments,/get,/admin/system,/replication,/admin/properties,/config,/schema,/admin/plugins,/admin/logging,/update/json,/admin/threads,/admin/ping,/update

[...truncated too long message...]

.s.SolrTestCaseJ4 ###deleteCore
   [junit4]   2> ObjectTracker found 1 object(s) that were not released!!! [TransactionLog]
   [junit4]   2> org.apache.solr.common.util.ObjectReleaseTracker$ObjectTrackerException
   [junit4]   2> 	at org.apache.solr.common.util.ObjectReleaseTracker.track(ObjectReleaseTracker.java:34)
   [junit4]   2> 	at org.apache.solr.update.TransactionLog.<init>(TransactionLog.java:185)
   [junit4]   2> 	at org.apache.solr.update.UpdateLog.newTransactionLog(UpdateLog.java:345)
   [junit4]   2> 	at org.apache.solr.update.UpdateLog.ensureLog(UpdateLog.java:868)
   [junit4]   2> 	at org.apache.solr.update.UpdateLog.add(UpdateLog.java:429)
   [junit4]   2> 	at org.apache.solr.update.UpdateLog.add(UpdateLog.java:416)
   [junit4]   2> 	at org.apache.solr.update.DirectUpdateHandler2.doNormalUpdate(DirectUpdateHandler2.java:293)
   [junit4]   2> 	at org.apache.solr.update.DirectUpdateHandler2.addDoc0(DirectUpdateHandler2.java:202)
   [junit4]   2> 	at org.apache.solr.update.DirectUpdateHandler2.addDoc(DirectUpdateHandler2.java:164)
   [junit4]   2> 	at org.apache.solr.update.processor.RunUpdateProcessor.processAdd(RunUpdateProcessorFactory.java:69)
   [junit4]   2> 	at org.apache.solr.update.processor.UpdateRequestProcessor.processAdd(UpdateRequestProcessor.java:51)
   [junit4]   2> 	at org.apache.solr.update.processor.DistributedUpdateProcessor.doLocalAdd(DistributedUpdateProcessor.java:954)
   [junit4]   2> 	at org.apache.solr.update.processor.DistributedUpdateProcessor.versionAdd(DistributedUpdateProcessor.java:1109)
   [junit4]   2> 	at org.apache.solr.update.processor.DistributedUpdateProcessor.processAdd(DistributedUpdateProcessor.java:705)
   [junit4]   2> 	at org.apache.solr.update.processor.LogUpdateProcessor.processAdd(LogUpdateProcessorFactory.java:104)
   [junit4]   2> 	at org.apache.solr.handler.loader.JavabinLoader$1.update(JavabinLoader.java:101)
   [junit4]   2> 	at org.apache.solr.client.solrj.request.JavaBinUpdateRequestCodec$1.readOuterMostDocIterator(JavaBinUpdateRequestCodec.java:179)
   [junit4]   2> 	at org.apache.solr.client.solrj.request.JavaBinUpdateRequestCodec$1.readIterator(JavaBinUpdateRequestCodec.java:135)
   [junit4]   2> 	at org.apache.solr.common.util.JavaBinCodec.readVal(JavaBinCodec.java:249)
   [junit4]   2> 	at org.apache.solr.client.solrj.request.JavaBinUpdateRequestCodec$1.readNamedList(JavaBinUpdateRequestCodec.java:121)
   [junit4]   2> 	at org.apache.solr.common.util.JavaBinCodec.readVal(JavaBinCodec.java:214)
   [junit4]   2> 	at org.apache.solr.common.util.JavaBinCodec.unmarshal(JavaBinCodec.java:134)
   [junit4]   2> 	at org.apache.solr.client.solrj.request.JavaBinUpdateRequestCodec.unmarshal(JavaBinUpdateRequestCodec.java:186)
   [junit4]   2> 	at org.apache.solr.handler.loader.JavabinLoader.parseAndLoadDocs(JavabinLoader.java:111)
   [junit4]   2> 	at org.apache.solr.handler.loader.JavabinLoader.load(JavabinLoader.java:58)
   [junit4]   2> 	at org.apache.solr.handler.UpdateRequestHandler$1.load(UpdateRequestHandler.java:98)
   [junit4]   2> 	at org.apache.solr.handler.ContentStreamHandlerBase.handleRequestBody(ContentStreamHandlerBase.java:74)
   [junit4]   2> 	at org.apache.solr.handler.RequestHandlerBase.handleRequest(RequestHandlerBase.java:151)
   [junit4]   2> 	at org.apache.solr.core.SolrCore.execute(SolrCore.java:2079)
   [junit4]   2> 	at org.apache.solr.servlet.HttpSolrCall.execute(HttpSolrCall.java:667)
   [junit4]   2> 	at org.apache.solr.servlet.HttpSolrCall.call(HttpSolrCall.java:460)
   [junit4]   2> 	at org.apache.solr.servlet.SolrDispatchFilter.doFilter(SolrDispatchFilter.java:210)
   [junit4]   2> 	at org.apache.solr.servlet.SolrDispatchFilter.doFilter(SolrDispatchFilter.java:179)
   [junit4]   2> 	at org.eclipse.jetty.servlet.ServletHandler$CachedChain.doFilter(ServletHandler.java:1652)
   [junit4]   2> 	at org.apache.solr.client.solrj.embedded.JettySolrRunner$DebugFilter.doFilter(JettySolrRunner.java:106)
   [junit4]   2> 	at org.eclipse.jetty.servlet.ServletHandler$CachedChain.doFilter(ServletHandler.java:1652)
   [junit4]   2> 	at org.eclipse.jetty.servlets.UserAgentFilter.doFilter(UserAgentFilter.java:83)
   [junit4]   2> 	at org.eclipse.jetty.servlets.GzipFilter.doFilter(GzipFilter.java:300)
   [junit4]   2> 	at org.eclipse.jetty.servlet.ServletHandler$CachedChain.doFilter(ServletHandler.java:1652)
   [junit4]   2> 	at org.eclipse.jetty.servlet.ServletHandler.doHandle(ServletHandler.java:585)
   [junit4]   2> 	at org.eclipse.jetty.server.session.SessionHandler.doHandle(SessionHandler.java:221)
   [junit4]   2> 	at org.eclipse.jetty.server.handler.ContextHandler.doHandle(ContextHandler.java:1127)
   [junit4]   2> 	at org.eclipse.jetty.servlet.ServletHandler.doScope(ServletHandler.java:515)
   [junit4]   2> 	at org.eclipse.jetty.server.session.SessionHandler.doScope(SessionHandler.java:185)
   [junit4]   2> 	at org.eclipse.jetty.server.handler.ContextHandler.doScope(ContextHandler.java:1061)
   [junit4]   2> 	at org.eclipse.jetty.server.handler.ScopedHandler.handle(ScopedHandler.java:141)
   [junit4]   2> 	at org.eclipse.jetty.server.handler.HandlerWrapper.handle(HandlerWrapper.java:97)
   [junit4]   2> 	at org.eclipse.jetty.server.Server.handle(Server.java:499)
   [junit4]   2> 	at org.eclipse.jetty.server.HttpChannel.handle(HttpChannel.java:310)
   [junit4]   2> 	at org.eclipse.jetty.server.HttpConnection.onFillable(HttpConnection.java:257)
   [junit4]   2> 	at org.eclipse.jetty.io.AbstractConnection$2.run(AbstractConnection.java:540)
   [junit4]   2> 	at org.eclipse.jetty.util.thread.QueuedThreadPool.runJob(QueuedThreadPool.java:635)
   [junit4]   2> 	at org.eclipse.jetty.util.thread.QueuedThreadPool$3.run(QueuedThreadPool.java:555)
   [junit4]   2> 	at java.lang.Thread.run(Thread.java:745)
   [junit4]   2> 
   [junit4]   2> Aug 20, 2015 12:20:05 PM com.carrotsearch.randomizedtesting.ThreadLeakControl checkThreadLeaks
   [junit4]   2> WARNING: Will linger awaiting termination of 1 leaked thread(s).
   [junit4]   2> NOTE: test params are: codec=Asserting(Lucene53), sim=RandomSimilarityProvider(queryNorm=false,coord=crazy): {}, locale=es_VE, timezone=America/Noronha
   [junit4]   2> NOTE: Linux 3.19.0-25-generic i386/Oracle Corporation 1.8.0_60-ea (32-bit)/cpus=12,threads=1,free=40861464,total=305922048
   [junit4]   2> NOTE: All tests run in this JVM: [HdfsDirectoryTest, SolrCmdDistributorTest, TestCoreDiscovery, ExplicitHLLTest, CollectionsAPIDistributedZkTest, TestDynamicFieldCollectionResource, TestAtomicUpdateErrorCases, DeleteLastCustomShardedReplicaTest, TestAuthenticationFramework, SolrPluginUtilsTest, HdfsSyncSliceTest, TestShortCircuitedRequests, TestSearchPerf, DistributedMLTComponentTest, ClusterStateUpdateTest, FullHLLTest, AnalyticsMergeStrategyTest, SpellCheckComponentTest, TestManagedSchemaFieldResource, OverseerStatusTest, TestConfigOverlay, TestLRUStatsCache, DistributedFacetPivotSmallAdvancedTest, StressHdfsTest, TestSchemaNameResource, SliceStateTest, BasicFunctionalityTest, EchoParamsTest, TestMaxScoreQueryParser, CoreAdminHandlerTest, MergeStrategyTest, CdcrReplicationDistributedZkTest, AddSchemaFieldsUpdateProcessorFactoryTest, TestWriterPerf, DocValuesMissingTest, TestSimpleTrackingShardHandler, TestClassNameShortening, TestReplicationHandlerBackup, TestReqParamsAPI, SimpleMLTQParserTest, TestSolrConfigHandlerCloud, ScriptEngineTest, TestCoreContainer, TestManagedResource, TestClusterStateMutator, DistributedSuggestComponentTest, TestFileDictionaryLookup, TestOrdValues, JsonLoaderTest, TestFastWriter, DocumentAnalysisRequestHandlerTest, TestStressUserVersions, ZkStateReaderTest, CurrencyFieldOpenExchangeTest, NoCacheHeaderTest, OpenCloseCoreStressTest, TestAuthorizationFramework, FileUtilsTest, ShowFileRequestHandlerTest, TestRawResponseWriter, ZkCLITest, SparseHLLTest, DistributedQueryComponentCustomSortTest, TestInitParams, TestDefaultSearchFieldResource, TestFuzzyAnalyzedSuggestions, CollectionStateFormat2Test, TestSuggestSpellingConverter, HttpPartitionTest]
   [junit4]   2> NOTE: reproduce with: ant test  -Dtestcase=HttpPartitionTest -Dtests.seed=5C8A030049025509 -Dtests.multiplier=3 -Dtests.slow=true -Dtests.locale=es_VE -Dtests.timezone=America/Noronha -Dtests.asserts=true -Dtests.file.encoding=UTF-8
   [junit4] ERROR   0.00s J1 | HttpPartitionTest (suite) <<<
   [junit4]    > Throwable #1: java.lang.AssertionError: ObjectTracker found 1 object(s) that were not released!!! [TransactionLog]
   [junit4]    > 	at __randomizedtesting.SeedInfo.seed([5C8A030049025509]:0)
   [junit4]    > 	at org.apache.solr.SolrTestCaseJ4.afterClass(SolrTestCaseJ4.java:236)
   [junit4]    > 	at java.lang.Thread.run(Thread.java:745)
   [junit4] Completed [166/541] on J1 in 135.90s, 1 test, 1 failure <<< FAILURES!

[...truncated 1163 lines...]
BUILD FAILED
/home/jenkins/workspace/Lucene-Solr-trunk-Linux/build.xml:775: The following error occurred while executing this line:
/home/jenkins/workspace/Lucene-Solr-trunk-Linux/build.xml:719: The following error occurred while executing this line:
/home/jenkins/workspace/Lucene-Solr-trunk-Linux/build.xml:59: The following error occurred while executing this line:
/home/jenkins/workspace/Lucene-Solr-trunk-Linux/solr/build.xml:233: The following error occurred while executing this line:
/home/jenkins/workspace/Lucene-Solr-trunk-Linux/solr/common-build.xml:514: The following error occurred while executing this line:
/home/jenkins/workspace/Lucene-Solr-trunk-Linux/lucene/common-build.xml:1431: The following error occurred while executing this line:
/home/jenkins/workspace/Lucene-Solr-trunk-Linux/lucene/common-build.xml:986: There were test failures: 541 suites, 2134 tests, 1 suite-level error, 68 ignored (32 assumptions)

Total time: 44 minutes 22 seconds
Build step 'Invoke Ant' marked build as failure
Archiving artifacts
[WARNINGS] Skipping publisher since build result is FAILURE
Recording test results
Email was triggered for: Failure - Any
Sending email for trigger: Failure - Any



Mime
View raw message