lucene-dev mailing list archives

Site index · List index
Message view « Date » · « Thread »
Top « Date » · « Thread »
From Policeman Jenkins Server <jenk...@thetaphi.de>
Subject [JENKINS] Lucene-Solr-trunk-MacOSX (64bit/jdk1.8.0) - Build # 2577 - Failure!
Date Mon, 03 Aug 2015 15:27:05 GMT
Build: http://jenkins.thetaphi.de/job/Lucene-Solr-trunk-MacOSX/2577/
Java: 64bit/jdk1.8.0 -XX:-UseCompressedOops -XX:+UseG1GC

2 tests failed.
FAILED:  org.apache.solr.cloud.CdcrReplicationDistributedZkTest.doTests

Error Message:
Timeout while trying to assert update logs @ collection=source_collection

Stack Trace:
java.lang.AssertionError: Timeout while trying to assert update logs @ collection=source_collection
	at __randomizedtesting.SeedInfo.seed([BFB2B76258017827:B7D2C24E570F502C]:0)
	at org.apache.solr.cloud.CdcrReplicationDistributedZkTest.assertNumberOfTlogFiles(CdcrReplicationDistributedZkTest.java:644)
	at org.apache.solr.cloud.CdcrReplicationDistributedZkTest.doTestUpdateLogSynchronisation(CdcrReplicationDistributedZkTest.java:384)
	at org.apache.solr.cloud.CdcrReplicationDistributedZkTest.doTests(CdcrReplicationDistributedZkTest.java:50)
	at sun.reflect.NativeMethodAccessorImpl.invoke0(Native Method)
	at sun.reflect.NativeMethodAccessorImpl.invoke(NativeMethodAccessorImpl.java:62)
	at sun.reflect.DelegatingMethodAccessorImpl.invoke(DelegatingMethodAccessorImpl.java:43)
	at java.lang.reflect.Method.invoke(Method.java:497)
	at com.carrotsearch.randomizedtesting.RandomizedRunner.invoke(RandomizedRunner.java:1627)
	at com.carrotsearch.randomizedtesting.RandomizedRunner$6.evaluate(RandomizedRunner.java:836)
	at com.carrotsearch.randomizedtesting.RandomizedRunner$7.evaluate(RandomizedRunner.java:872)
	at com.carrotsearch.randomizedtesting.RandomizedRunner$8.evaluate(RandomizedRunner.java:886)
	at org.apache.solr.BaseDistributedSearchTestCase$ShardsRepeatRule$ShardsFixedStatement.callStatement(BaseDistributedSearchTestCase.java:966)
	at org.apache.solr.BaseDistributedSearchTestCase$ShardsRepeatRule$ShardsStatement.evaluate(BaseDistributedSearchTestCase.java:941)
	at com.carrotsearch.randomizedtesting.rules.SystemPropertiesRestoreRule$1.evaluate(SystemPropertiesRestoreRule.java:57)
	at org.apache.lucene.util.TestRuleSetupTeardownChained$1.evaluate(TestRuleSetupTeardownChained.java:50)
	at org.apache.lucene.util.AbstractBeforeAfterRule$1.evaluate(AbstractBeforeAfterRule.java:46)
	at org.apache.lucene.util.TestRuleThreadAndTestName$1.evaluate(TestRuleThreadAndTestName.java:49)
	at org.apache.lucene.util.TestRuleIgnoreAfterMaxFailures$1.evaluate(TestRuleIgnoreAfterMaxFailures.java:65)
	at org.apache.lucene.util.TestRuleMarkFailure$1.evaluate(TestRuleMarkFailure.java:48)
	at com.carrotsearch.randomizedtesting.rules.StatementAdapter.evaluate(StatementAdapter.java:36)
	at com.carrotsearch.randomizedtesting.ThreadLeakControl$StatementRunner.run(ThreadLeakControl.java:365)
	at com.carrotsearch.randomizedtesting.ThreadLeakControl.forkTimeoutingTask(ThreadLeakControl.java:798)
	at com.carrotsearch.randomizedtesting.ThreadLeakControl$3.evaluate(ThreadLeakControl.java:458)
	at com.carrotsearch.randomizedtesting.RandomizedRunner.runSingleTest(RandomizedRunner.java:845)
	at com.carrotsearch.randomizedtesting.RandomizedRunner$3.evaluate(RandomizedRunner.java:747)
	at com.carrotsearch.randomizedtesting.RandomizedRunner$4.evaluate(RandomizedRunner.java:781)
	at com.carrotsearch.randomizedtesting.RandomizedRunner$5.evaluate(RandomizedRunner.java:792)
	at com.carrotsearch.randomizedtesting.rules.StatementAdapter.evaluate(StatementAdapter.java:36)
	at com.carrotsearch.randomizedtesting.rules.SystemPropertiesRestoreRule$1.evaluate(SystemPropertiesRestoreRule.java:57)
	at org.apache.lucene.util.AbstractBeforeAfterRule$1.evaluate(AbstractBeforeAfterRule.java:46)
	at com.carrotsearch.randomizedtesting.rules.StatementAdapter.evaluate(StatementAdapter.java:36)
	at org.apache.lucene.util.TestRuleStoreClassName$1.evaluate(TestRuleStoreClassName.java:42)
	at com.carrotsearch.randomizedtesting.rules.NoShadowingOrOverridesOnMethodsRule$1.evaluate(NoShadowingOrOverridesOnMethodsRule.java:39)
	at com.carrotsearch.randomizedtesting.rules.NoShadowingOrOverridesOnMethodsRule$1.evaluate(NoShadowingOrOverridesOnMethodsRule.java:39)
	at com.carrotsearch.randomizedtesting.rules.StatementAdapter.evaluate(StatementAdapter.java:36)
	at com.carrotsearch.randomizedtesting.rules.StatementAdapter.evaluate(StatementAdapter.java:36)
	at com.carrotsearch.randomizedtesting.rules.StatementAdapter.evaluate(StatementAdapter.java:36)
	at org.apache.lucene.util.TestRuleAssertionsRequired$1.evaluate(TestRuleAssertionsRequired.java:54)
	at org.apache.lucene.util.TestRuleMarkFailure$1.evaluate(TestRuleMarkFailure.java:48)
	at org.apache.lucene.util.TestRuleIgnoreAfterMaxFailures$1.evaluate(TestRuleIgnoreAfterMaxFailures.java:65)
	at org.apache.lucene.util.TestRuleIgnoreTestSuites$1.evaluate(TestRuleIgnoreTestSuites.java:55)
	at com.carrotsearch.randomizedtesting.rules.StatementAdapter.evaluate(StatementAdapter.java:36)
	at com.carrotsearch.randomizedtesting.ThreadLeakControl$StatementRunner.run(ThreadLeakControl.java:365)
	at java.lang.Thread.run(Thread.java:745)
Caused by: java.lang.AssertionError: Number of tlogs on leader: 70 is superior to: 50.
	at org.junit.Assert.fail(Assert.java:93)
	at org.junit.Assert.assertTrue(Assert.java:43)
	at org.apache.solr.cloud.CdcrReplicationDistributedZkTest._assertNumberOfTlogFiles(CdcrReplicationDistributedZkTest.java:671)
	at org.apache.solr.cloud.CdcrReplicationDistributedZkTest.assertNumberOfTlogFiles(CdcrReplicationDistributedZkTest.java:634)
	... 43 more


FAILED:  org.apache.solr.cloud.CollectionsAPIDistributedZkTest.test

Error Message:
Captured an uncaught exception in thread: Thread[id=4599, name=collection1, state=RUNNABLE, group=TGRP-CollectionsAPIDistributedZkTest]

Stack Trace:
com.carrotsearch.randomizedtesting.UncaughtExceptionError: Captured an uncaught exception in thread: Thread[id=4599, name=collection1, state=RUNNABLE, group=TGRP-CollectionsAPIDistributedZkTest]
Caused by: org.apache.solr.client.solrj.impl.HttpSolrClient$RemoteSolrException: Error from server at http://127.0.0.1:50926: Could not find collection : awholynewstresscollection_collection1_0
	at __randomizedtesting.SeedInfo.seed([BFB2B76258017827]:0)
	at org.apache.solr.client.solrj.impl.HttpSolrClient.executeMethod(HttpSolrClient.java:560)
	at org.apache.solr.client.solrj.impl.HttpSolrClient.request(HttpSolrClient.java:234)
	at org.apache.solr.client.solrj.impl.HttpSolrClient.request(HttpSolrClient.java:226)
	at org.apache.solr.client.solrj.impl.LBHttpSolrClient.doRequest(LBHttpSolrClient.java:376)
	at org.apache.solr.client.solrj.impl.LBHttpSolrClient.request(LBHttpSolrClient.java:328)
	at org.apache.solr.client.solrj.impl.CloudSolrClient.sendRequest(CloudSolrClient.java:1086)
	at org.apache.solr.client.solrj.impl.CloudSolrClient.requestWithRetryOnStaleState(CloudSolrClient.java:856)
	at org.apache.solr.client.solrj.impl.CloudSolrClient.request(CloudSolrClient.java:799)
	at org.apache.solr.client.solrj.SolrClient.request(SolrClient.java:1220)
	at org.apache.solr.cloud.CollectionsAPIDistributedZkTest$1CollectionThread.run(CollectionsAPIDistributedZkTest.java:894)




Build Log:
[...truncated 9853 lines...]
   [junit4] Suite: org.apache.solr.cloud.CollectionsAPIDistributedZkTest
   [junit4]   2> Creating dataDir: /Users/jenkins/workspace/Lucene-Solr-trunk-MacOSX/solr/build/solr-core/test/J1/temp/solr.cloud.CollectionsAPIDistributedZkTest_BFB2B76258017827-001/init-core-data-001
   [junit4]   2> 614438 INFO  (SUITE-CollectionsAPIDistributedZkTest-seed#[BFB2B76258017827]-worker) [    ] o.a.s.SolrTestCaseJ4 Randomized ssl (false) and clientAuth (false)
   [junit4]   2> 614438 INFO  (SUITE-CollectionsAPIDistributedZkTest-seed#[BFB2B76258017827]-worker) [    ] o.a.s.BaseDistributedSearchTestCase Setting hostContext system property: /
   [junit4]   2> 614440 INFO  (TEST-CollectionsAPIDistributedZkTest.test-seed#[BFB2B76258017827]) [    ] o.a.s.c.ZkTestServer STARTING ZK TEST SERVER
   [junit4]   2> 614441 INFO  (Thread-1691) [    ] o.a.s.c.ZkTestServer client port:0.0.0.0/0.0.0.0:0
   [junit4]   2> 614441 INFO  (Thread-1691) [    ] o.a.s.c.ZkTestServer Starting server
   [junit4]   2> 614542 INFO  (TEST-CollectionsAPIDistributedZkTest.test-seed#[BFB2B76258017827]) [    ] o.a.s.c.ZkTestServer start zk server on port:50888
   [junit4]   2> 614542 INFO  (TEST-CollectionsAPIDistributedZkTest.test-seed#[BFB2B76258017827]) [    ] o.a.s.c.c.SolrZkClient Using default ZkCredentialsProvider
   [junit4]   2> 614543 INFO  (TEST-CollectionsAPIDistributedZkTest.test-seed#[BFB2B76258017827]) [    ] o.a.s.c.c.ConnectionManager Waiting for client to connect to ZooKeeper
   [junit4]   2> 614548 INFO  (zkCallback-554-thread-1) [    ] o.a.s.c.c.ConnectionManager Watcher org.apache.solr.common.cloud.ConnectionManager@1d990b40 name:ZooKeeperConnection Watcher:127.0.0.1:50888 got event WatchedEvent state:SyncConnected type:None path:null path:null type:None
   [junit4]   2> 614548 INFO  (TEST-CollectionsAPIDistributedZkTest.test-seed#[BFB2B76258017827]) [    ] o.a.s.c.c.ConnectionManager Client is connected to ZooKeeper
   [junit4]   2> 614548 INFO  (TEST-CollectionsAPIDistributedZkTest.test-seed#[BFB2B76258017827]) [    ] o.a.s.c.c.SolrZkClient Using default ZkACLProvider
   [junit4]   2> 614548 INFO  (TEST-CollectionsAPIDistributedZkTest.test-seed#[BFB2B76258017827]) [    ] o.a.s.c.c.SolrZkClient makePath: /solr
   [junit4]   2> 614552 INFO  (TEST-CollectionsAPIDistributedZkTest.test-seed#[BFB2B76258017827]) [    ] o.a.s.c.c.SolrZkClient Using default ZkCredentialsProvider
   [junit4]   2> 614553 INFO  (TEST-CollectionsAPIDistributedZkTest.test-seed#[BFB2B76258017827]) [    ] o.a.s.c.c.ConnectionManager Waiting for client to connect to ZooKeeper
   [junit4]   2> 614555 INFO  (zkCallback-555-thread-1) [    ] o.a.s.c.c.ConnectionManager Watcher org.apache.solr.common.cloud.ConnectionManager@58e49933 name:ZooKeeperConnection Watcher:127.0.0.1:50888/solr got event WatchedEvent state:SyncConnected type:None path:null path:null type:None
   [junit4]   2> 614555 INFO  (TEST-CollectionsAPIDistributedZkTest.test-seed#[BFB2B76258017827]) [    ] o.a.s.c.c.ConnectionManager Client is connected to ZooKeeper
   [junit4]   2> 614555 INFO  (TEST-CollectionsAPIDistributedZkTest.test-seed#[BFB2B76258017827]) [    ] o.a.s.c.c.SolrZkClient Using default ZkACLProvider
   [junit4]   2> 614555 INFO  (TEST-CollectionsAPIDistributedZkTest.test-seed#[BFB2B76258017827]) [    ] o.a.s.c.c.SolrZkClient makePath: /collections/collection1
   [junit4]   2> 614558 INFO  (TEST-CollectionsAPIDistributedZkTest.test-seed#[BFB2B76258017827]) [    ] o.a.s.c.c.SolrZkClient makePath: /collections/collection1/shards
   [junit4]   2> 614561 INFO  (TEST-CollectionsAPIDistributedZkTest.test-seed#[BFB2B76258017827]) [    ] o.a.s.c.c.SolrZkClient makePath: /collections/control_collection
   [junit4]   2> 614563 INFO  (TEST-CollectionsAPIDistributedZkTest.test-seed#[BFB2B76258017827]) [    ] o.a.s.c.c.SolrZkClient makePath: /collections/control_collection/shards
   [junit4]   2> 614568 INFO  (TEST-CollectionsAPIDistributedZkTest.test-seed#[BFB2B76258017827]) [    ] o.a.s.c.AbstractZkTestCase put /Users/jenkins/workspace/Lucene-Solr-trunk-MacOSX/solr/core/src/test-files/solr/collection1/conf/solrconfig-tlog.xml to /configs/conf1/solrconfig.xml
   [junit4]   2> 614569 INFO  (TEST-CollectionsAPIDistributedZkTest.test-seed#[BFB2B76258017827]) [    ] o.a.s.c.c.SolrZkClient makePath: /configs/conf1/solrconfig.xml
   [junit4]   2> 614572 INFO  (TEST-CollectionsAPIDistributedZkTest.test-seed#[BFB2B76258017827]) [    ] o.a.s.c.AbstractZkTestCase put /Users/jenkins/workspace/Lucene-Solr-trunk-MacOSX/solr/core/src/test-files/solr/collection1/conf/schema.xml to /configs/conf1/schema.xml
   [junit4]   2> 614573 INFO  (TEST-CollectionsAPIDistributedZkTest.test-seed#[BFB2B76258017827]) [    ] o.a.s.c.c.SolrZkClient makePath: /configs/conf1/schema.xml
   [junit4]   2> 614576 INFO  (TEST-CollectionsAPIDistributedZkTest.test-seed#[BFB2B76258017827]) [    ] o.a.s.c.AbstractZkTestCase put /Users/jenkins/workspace/Lucene-Solr-trunk-MacOSX/solr/core/src/test-files/solr/collection1/conf/solrconfig.snippet.randomindexconfig.xml to /configs/conf1/solrconfig.snippet.randomindexconfig.xml
   [junit4]   2> 614576 INFO  (TEST-CollectionsAPIDistributedZkTest.test-seed#[BFB2B76258017827]) [    ] o.a.s.c.c.SolrZkClient makePath: /configs/conf1/solrconfig.snippet.randomindexconfig.xml
   [junit4]   2> 614579 INFO  (TEST-CollectionsAPIDistributedZkTest.test-seed#[BFB2B76258017827]) [    ] o.a.s.c.AbstractZkTestCase put /Users/jenkins/workspace/Lucene-Solr-trunk-MacOSX/solr/core/src/test-files/solr/collection1/conf/stopwords.txt to /configs/conf1/stopwords.txt
   [junit4]   2> 614579 INFO  (TEST-CollectionsAPIDistributedZkTest.test-seed#[BFB2B76258017827]) [    ] o.a.s.c.c.SolrZkClient makePath: /configs/conf1/stopwords.txt
   [junit4]   2> 614582 INFO  (TEST-CollectionsAPIDistributedZkTest.test-seed#[BFB2B76258017827]) [    ] o.a.s.c.AbstractZkTestCase put /Users/jenkins/workspace/Lucene-Solr-trunk-MacOSX/solr/core/src/test-files/solr/collection1/conf/protwords.txt to /configs/conf1/protwords.txt
   [junit4]   2> 614582 INFO  (TEST-CollectionsAPIDistributedZkTest.test-seed#[BFB2B76258017827]) [    ] o.a.s.c.c.SolrZkClient makePath: /configs/conf1/protwords.txt
   [junit4]   2> 614585 INFO  (TEST-CollectionsAPIDistributedZkTest.test-seed#[BFB2B76258017827]) [    ] o.a.s.c.AbstractZkTestCase put /Users/jenkins/workspace/Lucene-Solr-trunk-MacOSX/solr/core/src/test-files/solr/collection1/conf/currency.xml to /configs/conf1/currency.xml
   [junit4]   2> 614586 INFO  (TEST-CollectionsAPIDistributedZkTest.test-seed#[BFB2B76258017827]) [    ] o.a.s.c.c.SolrZkClient makePath: /configs/conf1/currency.xml
   [junit4]   2> 614589 INFO  (TEST-CollectionsAPIDistributedZkTest.test-seed#[BFB2B76258017827]) [    ] o.a.s.c.AbstractZkTestCase put /Users/jenkins/workspace/Lucene-Solr-trunk-MacOSX/solr/core/src/test-files/solr/collection1/conf/enumsConfig.xml to /configs/conf1/enumsConfig.xml
   [junit4]   2> 614589 INFO  (TEST-CollectionsAPIDistributedZkTest.test-seed#[BFB2B76258017827]) [    ] o.a.s.c.c.SolrZkClient makePath: /configs/conf1/enumsConfig.xml
   [junit4]   2> 614592 INFO  (TEST-CollectionsAPIDistributedZkTest.test-seed#[BFB2B76258017827]) [    ] o.a.s.c.AbstractZkTestCase put /Users/jenkins/workspace/Lucene-Solr-trunk-MacOSX/solr/core/src/test-files/solr/collection1/conf/open-exchange-rates.json to /configs/conf1/open-exchange-rates.json
   [junit4]   2> 614592 INFO  (TEST-CollectionsAPIDistributedZkTest.test-seed#[BFB2B76258017827]) [    ] o.a.s.c.c.SolrZkClient makePath: /configs/conf1/open-exchange-rates.json
   [junit4]   2> 614594 INFO  (TEST-CollectionsAPIDistributedZkTest.test-seed#[BFB2B76258017827]) [    ] o.a.s.c.AbstractZkTestCase put /Users/jenkins/workspace/Lucene-Solr-trunk-MacOSX/solr/core/src/test-files/solr/collection1/conf/mapping-ISOLatin1Accent.txt to /configs/conf1/mapping-ISOLatin1Accent.txt
   [junit4]   2> 614594 INFO  (TEST-CollectionsAPIDistributedZkTest.test-seed#[BFB2B76258017827]) [    ] o.a.s.c.c.SolrZkClient makePath: /configs/conf1/mapping-ISOLatin1Accent.txt
   [junit4]   2> 614596 INFO  (TEST-CollectionsAPIDistributedZkTest.test-seed#[BFB2B76258017827]) [    ] o.a.s.c.AbstractZkTestCase put /Users/jenkins/workspace/Lucene-Solr-trunk-MacOSX/solr/core/src/test-files/solr/collection1/conf/old_synonyms.txt to /configs/conf1/old_synonyms.txt
   [junit4]   2> 614596 INFO  (TEST-CollectionsAPIDistributedZkTest.test-seed#[BFB2B76258017827]) [    ] o.a.s.c.c.SolrZkClient makePath: /configs/conf1/old_synonyms.txt
   [junit4]   2> 614598 INFO  (TEST-CollectionsAPIDistributedZkTest.test-seed#[BFB2B76258017827]) [    ] o.a.s.c.AbstractZkTestCase put /Users/jenkins/workspace/Lucene-Solr-trunk-MacOSX/solr/core/src/test-files/solr/collection1/conf/synonyms.txt to /configs/conf1/synonyms.txt
   [junit4]   2> 614599 INFO  (TEST-CollectionsAPIDistributedZkTest.test-seed#[BFB2B76258017827]) [    ] o.a.s.c.c.SolrZkClient makePath: /configs/conf1/synonyms.txt
   [junit4]   2> 614808 INFO  (TEST-CollectionsAPIDistributedZkTest.test-seed#[BFB2B76258017827]) [    ] o.a.s.SolrTestCaseJ4 Writing core.properties file to /Users/jenkins/workspace/Lucene-Solr-trunk-MacOSX/solr/build/solr-core/test/J1/temp/solr.cloud.CollectionsAPIDistributedZkTest_BFB2B76258017827-001/control-001/cores/collection1
   [junit4]   2> 614810 INFO  (TEST-CollectionsAPIDistributedZkTest.test-seed#[BFB2B76258017827]) [    ] o.e.j.s.Server jetty-9.2.11.v20150529
   [junit4]   2> 614813 INFO  (TEST-CollectionsAPIDistributedZkTest.test-seed#[BFB2B76258017827]) [    ] o.e.j.s.h.ContextHandler Started o.e.j.s.ServletContextHandler@ba962{/,null,AVAILABLE}
   [junit4]   2> 614813 INFO  (TEST-CollectionsAPIDistributedZkTest.test-seed#[BFB2B76258017827]) [    ] o.e.j.s.ServerConnector Started ServerConnector@7361e252{HTTP/1.1}{127.0.0.1:50891}
   [junit4]   2> 614814 INFO  (TEST-CollectionsAPIDistributedZkTest.test-seed#[BFB2B76258017827]) [    ] o.e.j.s.Server Started @619457ms
   [junit4]   2> 614814 INFO  (TEST-CollectionsAPIDistributedZkTest.test-seed#[BFB2B76258017827]) [    ] o.a.s.c.s.e.JettySolrRunner Jetty properties: {solr.data.dir=/Users/jenkins/workspace/Lucene-Solr-trunk-MacOSX/solr/build/solr-core/test/J1/temp/solr.cloud.CollectionsAPIDistributedZkTest_BFB2B76258017827-001/tempDir-001/control/data, hostContext=/, hostPort=50891, coreRootDirectory=/Users/jenkins/workspace/Lucene-Solr-trunk-MacOSX/solr/build/solr-core/test/J1/temp/solr.cloud.CollectionsAPIDistributedZkTest_BFB2B76258017827-001/control-001/cores}
   [junit4]   2> 614814 INFO  (TEST-CollectionsAPIDistributedZkTest.test-seed#[BFB2B76258017827]) [    ] o.a.s.s.SolrDispatchFilter SolrDispatchFilter.init(): sun.misc.Launcher$AppClassLoader@74a14482
   [junit4]   2> 614814 INFO  (TEST-CollectionsAPIDistributedZkTest.test-seed#[BFB2B76258017827]) [    ] o.a.s.c.SolrResourceLoader new SolrResourceLoader for directory: '/Users/jenkins/workspace/Lucene-Solr-trunk-MacOSX/solr/build/solr-core/test/J1/temp/solr.cloud.CollectionsAPIDistributedZkTest_BFB2B76258017827-001/control-001/'
   [junit4]   2> 614831 INFO  (TEST-CollectionsAPIDistributedZkTest.test-seed#[BFB2B76258017827]) [    ] o.a.s.c.c.SolrZkClient Using default ZkCredentialsProvider
   [junit4]   2> 614832 INFO  (TEST-CollectionsAPIDistributedZkTest.test-seed#[BFB2B76258017827]) [    ] o.a.s.c.c.ConnectionManager Waiting for client to connect to ZooKeeper
   [junit4]   2> 614834 INFO  (zkCallback-556-thread-1) [    ] o.a.s.c.c.ConnectionManager Watcher org.apache.solr.common.cloud.ConnectionManager@1c495525 name:ZooKeeperConnection Watcher:127.0.0.1:50888/solr got event WatchedEvent state:SyncConnected type:None path:null path:null type:None
   [junit4]   2> 614834 INFO  (TEST-CollectionsAPIDistributedZkTest.test-seed#[BFB2B76258017827]) [    ] o.a.s.c.c.ConnectionManager Client is connected to ZooKeeper
   [junit4]   2> 614834 INFO  (TEST-CollectionsAPIDistributedZkTest.test-seed#[BFB2B76258017827]) [    ] o.a.s.c.c.SolrZkClient Using default ZkACLProvider
   [junit4]   2> 614836 INFO  (TEST-CollectionsAPIDistributedZkTest.test-seed#[BFB2B76258017827]) [    ] o.a.s.s.SolrDispatchFilter Loading solr.xml from SolrHome (not found in ZooKeeper)
   [junit4]   2> 614836 INFO  (TEST-CollectionsAPIDistributedZkTest.test-seed#[BFB2B76258017827]) [    ] o.a.s.c.SolrXmlConfig Loading container configuration from /Users/jenkins/workspace/Lucene-Solr-trunk-MacOSX/solr/build/solr-core/test/J1/temp/solr.cloud.CollectionsAPIDistributedZkTest_BFB2B76258017827-001/control-001/solr.xml
   [junit4]   2> 614842 INFO  (TEST-CollectionsAPIDistributedZkTest.test-seed#[BFB2B76258017827]) [    ] o.a.s.c.CoresLocator Config-defined core root directory: /Users/jenkins/workspace/Lucene-Solr-trunk-MacOSX/solr/build/solr-core/test/J1/temp/solr.cloud.CollectionsAPIDistributedZkTest_BFB2B76258017827-001/control-001/cores
   [junit4]   2> 614842 INFO  (TEST-CollectionsAPIDistributedZkTest.test-seed#[BFB2B76258017827]) [    ] o.a.s.c.CoreContainer New CoreContainer 12003108
   [junit4]   2> 614842 INFO  (TEST-CollectionsAPIDistributedZkTest.test-seed#[BFB2B76258017827]) [    ] o.a.s.c.CoreContainer Loading cores into CoreContainer [instanceDir=/Users/jenkins/workspace/Lucene-Solr-trunk-MacOSX/solr/build/solr-core/test/J1/temp/solr.cloud.CollectionsAPIDistributedZkTest_BFB2B76258017827-001/control-001/]
   [junit4]   2> 614843 INFO  (TEST-CollectionsAPIDistributedZkTest.test-seed#[BFB2B76258017827]) [    ] o.a.s.c.CoreContainer loading shared library: /Users/jenkins/workspace/Lucene-Solr-trunk-MacOSX/solr/build/solr-core/test/J1/temp/solr.cloud.CollectionsAPIDistributedZkTest_BFB2B76258017827-001/control-001/lib
   [junit4]   2> 614843 WARN  (TEST-CollectionsAPIDistributedZkTest.test-seed#[BFB2B76258017827]) [    ] o.a.s.c.SolrResourceLoader Can't find (or read) directory to add to classloader: lib (resolved as: /Users/jenkins/workspace/Lucene-Solr-trunk-MacOSX/solr/build/solr-core/test/J1/temp/solr.cloud.CollectionsAPIDistributedZkTest_BFB2B76258017827-001/control-001/lib).
   [junit4]   2> 614849 INFO  (TEST-CollectionsAPIDistributedZkTest.test-seed#[BFB2B76258017827]) [    ] o.a.s.h.c.HttpShardHandlerFactory created with socketTimeout : 90000,urlScheme : ,connTimeout : 15000,maxConnectionsPerHost : 20,maxConnections : 10000,corePoolSize : 0,maximumPoolSize : 2147483647,maxThreadIdleTime : 5,sizeOfQueue : -1,fairnessPolicy : false,useRetries : false,
   [junit4]   2> 614851 INFO  (TEST-CollectionsAPIDistributedZkTest.test-seed#[BFB2B76258017827]) [    ] o.a.s.u.UpdateShardHandler Creating UpdateShardHandler HTTP client with params: socketTimeout=340000&connTimeout=45000&retry=true
   [junit4]   2> 614852 INFO  (TEST-CollectionsAPIDistributedZkTest.test-seed#[BFB2B76258017827]) [    ] o.a.s.l.LogWatcher SLF4J impl is org.slf4j.impl.Log4jLoggerFactory
   [junit4]   2> 614852 INFO  (TEST-CollectionsAPIDistributedZkTest.test-seed#[BFB2B76258017827]) [    ] o.a.s.l.LogWatcher Registering Log Listener [Log4j (org.slf4j.impl.Log4jLoggerFactory)]
   [junit4]   2> 614852 INFO  (TEST-CollectionsAPIDistributedZkTest.test-seed#[BFB2B76258017827]) [    ] o.a.s.c.ZkContainer Zookeeper client=127.0.0.1:50888/solr
   [junit4]   2> 614852 INFO  (TEST-CollectionsAPIDistributedZkTest.test-seed#[BFB2B76258017827]) [    ] o.a.s.c.ZkController zkHost includes chroot
   [junit4]   2> 614852 INFO  (TEST-CollectionsAPIDistributedZkTest.test-seed#[BFB2B76258017827]) [    ] o.a.s.c.c.SolrZkClient Using default ZkCredentialsProvider
   [junit4]   2> 614853 INFO  (TEST-CollectionsAPIDistributedZkTest.test-seed#[BFB2B76258017827]) [    ] o.a.s.c.c.ConnectionManager Waiting for client to connect to ZooKeeper
   [junit4]   2> 614855 INFO  (zkCallback-558-thread-1) [    ] o.a.s.c.c.ConnectionManager Watcher org.apache.solr.common.cloud.ConnectionManager@745c3dfa name:ZooKeeperConnection Watcher:127.0.0.1:50888 got event WatchedEvent state:SyncConnected type:None path:null path:null type:None
   [junit4]   2> 614855 INFO  (TEST-CollectionsAPIDistributedZkTest.test-seed#[BFB2B76258017827]) [    ] o.a.s.c.c.ConnectionManager Client is connected to ZooKeeper
   [junit4]   2> 614855 INFO  (TEST-CollectionsAPIDistributedZkTest.test-seed#[BFB2B76258017827]) [    ] o.a.s.c.c.SolrZkClient Using default ZkACLProvider
   [junit4]   2> 614858 INFO  (TEST-CollectionsAPIDistributedZkTest.test-seed#[BFB2B76258017827]) [n:127.0.0.1:50891_    ] o.a.s.c.c.ConnectionManager Waiting for client to connect to ZooKeeper
   [junit4]   2> 614859 INFO  (zkCallback-559-thread-1-processing-n:127.0.0.1:50891_) [n:127.0.0.1:50891_    ] o.a.s.c.c.ConnectionManager Watcher org.apache.solr.common.cloud.ConnectionManager@5a05026f name:ZooKeeperConnection Watcher:127.0.0.1:50888/solr got event WatchedEvent state:SyncConnected type:None path:null path:null type:None
   [junit4]   2> 614860 INFO  (TEST-CollectionsAPIDistributedZkTest.test-seed#[BFB2B76258017827]) [n:127.0.0.1:50891_    ] o.a.s.c.c.ConnectionManager Client is connected to ZooKeeper
   [junit4]   2> 614862 INFO  (TEST-CollectionsAPIDistributedZkTest.test-seed#[BFB2B76258017827]) [n:127.0.0.1:50891_    ] o.a.s.c.c.SolrZkClient makePath: /overseer/queue
   [junit4]   2> 614867 INFO  (TEST-CollectionsAPIDistributedZkTest.test-seed#[BFB2B76258017827]) [n:127.0.0.1:50891_    ] o.a.s.c.c.SolrZkClient makePath: /overseer/collection-queue-work
   [junit4]   2> 614871 INFO  (TEST-CollectionsAPIDistributedZkTest.test-seed#[BFB2B76258017827]) [n:127.0.0.1:50891_    ] o.a.s.c.c.SolrZkClient makePath: /overseer/collection-map-running
   [junit4]   2> 614875 INFO  (TEST-CollectionsAPIDistributedZkTest.test-seed#[BFB2B76258017827]) [n:127.0.0.1:50891_    ] o.a.s.c.c.SolrZkClient makePath: /overseer/collection-map-completed
   [junit4]   2> 614879 INFO  (TEST-CollectionsAPIDistributedZkTest.test-seed#[BFB2B76258017827]) [n:127.0.0.1:50891_    ] o.a.s.c.c.SolrZkClient makePath: /overseer/collection-map-failure
   [junit4]   2> 614883 INFO  (TEST-CollectionsAPIDistributedZkTest.test-seed#[BFB2B76258017827]) [n:127.0.0.1:50891_    ] o.a.s.c.c.SolrZkClient makePath: /live_nodes
   [junit4]   2> 614886 INFO  (TEST-CollectionsAPIDistributedZkTest.test-seed#[BFB2B76258017827]) [n:127.0.0.1:50891_    ] o.a.s.c.c.SolrZkClient makePath: /aliases.json
   [junit4]   2> 614889 INFO  (TEST-CollectionsAPIDistributedZkTest.test-seed#[BFB2B76258017827]) [n:127.0.0.1:50891_    ] o.a.s.c.c.SolrZkClient makePath: /clusterstate.json
   [junit4]   2> 614890 INFO  (TEST-CollectionsAPIDistributedZkTest.test-seed#[BFB2B76258017827]) [n:127.0.0.1:50891_    ] o.a.s.c.ZkController Register node as live in ZooKeeper:/live_nodes/127.0.0.1:50891_
   [junit4]   2> 614891 INFO  (TEST-CollectionsAPIDistributedZkTest.test-seed#[BFB2B76258017827]) [n:127.0.0.1:50891_    ] o.a.s.c.c.SolrZkClient makePath: /live_nodes/127.0.0.1:50891_
   [junit4]   2> 614894 INFO  (TEST-CollectionsAPIDistributedZkTest.test-seed#[BFB2B76258017827]) [n:127.0.0.1:50891_    ] o.a.s.c.c.SolrZkClient makePath: /overseer_elect
   [junit4]   2> 614899 INFO  (TEST-CollectionsAPIDistributedZkTest.test-seed#[BFB2B76258017827]) [n:127.0.0.1:50891_    ] o.a.s.c.c.SolrZkClient makePath: /overseer_elect/election
   [junit4]   2> 614902 INFO  (TEST-CollectionsAPIDistributedZkTest.test-seed#[BFB2B76258017827]) [n:127.0.0.1:50891_    ] o.a.s.c.Overseer Overseer (id=null) closing
   [junit4]   2> 614903 INFO  (TEST-CollectionsAPIDistributedZkTest.test-seed#[BFB2B76258017827]) [n:127.0.0.1:50891_    ] o.a.s.c.LeaderElector Joined leadership election with path: /overseer_elect/election/94280950447669252-127.0.0.1:50891_-n_0000000000
   [junit4]   2> 614904 INFO  (TEST-CollectionsAPIDistributedZkTest.test-seed#[BFB2B76258017827]) [n:127.0.0.1:50891_    ] o.a.s.c.OverseerElectionContext I am going to be the leader 127.0.0.1:50891_
   [junit4]   2> 614904 INFO  (TEST-CollectionsAPIDistributedZkTest.test-seed#[BFB2B76258017827]) [n:127.0.0.1:50891_    ] o.a.s.c.c.SolrZkClient makePath: /overseer_elect/leader
   [junit4]   2> 614907 INFO  (TEST-CollectionsAPIDistributedZkTest.test-seed#[BFB2B76258017827]) [n:127.0.0.1:50891_    ] o.a.s.c.Overseer Overseer (id=94280950447669252-127.0.0.1:50891_-n_0000000000) starting
   [junit4]   2> 614910 INFO  (TEST-CollectionsAPIDistributedZkTest.test-seed#[BFB2B76258017827]) [n:127.0.0.1:50891_    ] o.a.s.c.c.SolrZkClient makePath: /overseer/queue-work
   [junit4]   2> 614922 INFO  (TEST-CollectionsAPIDistributedZkTest.test-seed#[BFB2B76258017827]) [n:127.0.0.1:50891_    ] o.a.s.c.OverseerAutoReplicaFailoverThread Starting OverseerAutoReplicaFailoverThread autoReplicaFailoverWorkLoopDelay=10000 autoReplicaFailoverWaitAfterExpiration=10000 autoReplicaFailoverBadNodeExpiration=60000
   [junit4]   2> 614923 INFO  (OverseerCollectionProcessor-94280950447669252-127.0.0.1:50891_-n_0000000000) [n:127.0.0.1:50891_    ] o.a.s.c.OverseerCollectionProcessor Process current queue of collection creations
   [junit4]   2> 614924 INFO  (TEST-CollectionsAPIDistributedZkTest.test-seed#[BFB2B76258017827]) [n:127.0.0.1:50891_    ] o.a.s.c.c.ZkStateReader Updating cluster state from ZooKeeper... 
   [junit4]   2> 614924 INFO  (OverseerStateUpdate-94280950447669252-127.0.0.1:50891_-n_0000000000) [n:127.0.0.1:50891_    ] o.a.s.c.Overseer Starting to work on the main queue
   [junit4]   2> 614931 INFO  (TEST-CollectionsAPIDistributedZkTest.test-seed#[BFB2B76258017827]) [n:127.0.0.1:50891_    ] o.a.s.c.CoreContainer No authentication plugin used.
   [junit4]   2> 614932 INFO  (TEST-CollectionsAPIDistributedZkTest.test-seed#[BFB2B76258017827]) [n:127.0.0.1:50891_    ] o.a.s.c.CoreContainer Security conf doesn't exist. Skipping setup for authorization module.
   [junit4]   2> 614934 INFO  (TEST-CollectionsAPIDistributedZkTest.test-seed#[BFB2B76258017827]) [n:127.0.0.1:50891_    ] o.a.s.c.CoresLocator Looking for core definitions underneath /Users/jenkins/workspace/Lucene-Solr-trunk-MacOSX/solr/build/solr-core/test/J1/temp/solr.cloud.CollectionsAPIDistributedZkTest_BFB2B76258017827-001/control-001/cores
   [junit4]   2> 614936 INFO  (TEST-CollectionsAPIDistributedZkTest.test-seed#[BFB2B76258017827]) [n:127.0.0.1:50891_    ] o.a.s.c.SolrCore Created CoreDescriptor: {name=collection1, config=solrconfig.xml, transient=false, schema=schema.xml, loadOnStartup=true, configSetProperties=configsetprops.json, instanceDir=/Users/jenkins/workspace/Lucene-Solr-trunk-MacOSX/solr/build/solr-core/test/J1/temp/solr.cloud.CollectionsAPIDistributedZkTest_BFB2B76258017827-001/control-001/cores/collection1, collection=control_collection, absoluteInstDir=/Users/jenkins/workspace/Lucene-Solr-trunk-MacOSX/solr/build/solr-core/test/J1/temp/solr.cloud.CollectionsAPIDistributedZkTest_BFB2B76258017827-001/control-001/cores/collection1/, coreNodeName=, dataDir=data/, shard=}
   [junit4]   2> 614936 INFO  (TEST-CollectionsAPIDistributedZkTest.test-seed#[BFB2B76258017827]) [n:127.0.0.1:50891_    ] o.a.s.c.CoresLocator Found core collection1 in /Users/jenkins/workspace/Lucene-Solr-trunk-MacOSX/solr/build/solr-core/test/J1/temp/solr.cloud.CollectionsAPIDistributedZkTest_BFB2B76258017827-001/control-001/cores/collection1/
   [junit4]   2> 614936 INFO  (TEST-CollectionsAPIDistributedZkTest.test-seed#[BFB2B76258017827]) [n:127.0.0.1:50891_    ] o.a.s.c.CoresLocator Found 1 core definitions
   [junit4]   2> 614938 INFO  (coreLoadExecutor-2011-thread-1-processing-n:127.0.0.1:50891_) [n:127.0.0.1:50891_ c:control_collection   x:collection1] o.a.s.c.ZkController publishing state=down
   [junit4]   2> 614938 INFO  (coreLoadExecutor-2011-thread-1-processing-n:127.0.0.1:50891_) [n:127.0.0.1:50891_ c:control_collection   x:collection1] o.a.s.c.ZkController numShards not found on descriptor - reading it from system property
   [junit4]   2> 614938 INFO  (TEST-CollectionsAPIDistributedZkTest.test-seed#[BFB2B76258017827]) [n:127.0.0.1:50891_    ] o.a.s.s.SolrDispatchFilter user.dir=/Users/jenkins/workspace/Lucene-Solr-trunk-MacOSX/solr/build/solr-core/test/J1
   [junit4]   2> 614938 INFO  (TEST-CollectionsAPIDistributedZkTest.test-seed#[BFB2B76258017827]) [n:127.0.0.1:50891_    ] o.a.s.s.SolrDispatchFilter SolrDispatchFilter.init() done
   [junit4]   2> 614939 INFO  (zkCallback-559-thread-1-processing-n:127.0.0.1:50891_) [n:127.0.0.1:50891_    ] o.a.s.c.DistributedQueue NodeChildrenChanged fired on path /overseer/queue state SyncConnected
   [junit4]   2> 614939 INFO  (coreLoadExecutor-2011-thread-1-processing-n:127.0.0.1:50891_) [n:127.0.0.1:50891_ c:control_collection   x:collection1] o.a.s.c.ZkController look for our core node name
   [junit4]   2> 614940 INFO  (OverseerStateUpdate-94280950447669252-127.0.0.1:50891_-n_0000000000) [n:127.0.0.1:50891_    ] o.a.s.c.Overseer processMessage: queueSize: 1, message = {
   [junit4]   2>   "core":"collection1",
   [junit4]   2>   "roles":null,
   [junit4]   2>   "base_url":"http://127.0.0.1:50891",
   [junit4]   2>   "node_name":"127.0.0.1:50891_",
   [junit4]   2>   "numShards":"1",
   [junit4]   2>   "state":"down",
   [junit4]   2>   "shard":null,
   [junit4]   2>   "collection":"control_collection",
   [junit4]   2>   "operation":"state"} current state version: 0
   [junit4]   2> 614941 INFO  (OverseerStateUpdate-94280950447669252-127.0.0.1:50891_-n_0000000000) [n:127.0.0.1:50891_    ] o.a.s.c.o.ReplicaMutator Update state numShards=1 message={
   [junit4]   2>   "core":"collection1",
   [junit4]   2>   "roles":null,
   [junit4]   2>   "base_url":"http://127.0.0.1:50891",
   [junit4]   2>   "node_name":"127.0.0.1:50891_",
   [junit4]   2>   "numShards":"1",
   [junit4]   2>   "state":"down",
   [junit4]   2>   "shard":null,
   [junit4]   2>   "collection":"control_collection",
   [junit4]   2>   "operation":"state"}
   [junit4]   2> 614941 INFO  (OverseerStateUpdate-94280950447669252-127.0.0.1:50891_-n_0000000000) [n:127.0.0.1:50891_    ] o.a.s.c.o.ClusterStateMutator building a new cName: control_collection
   [junit4]   2> 614941 INFO  (OverseerStateUpdate-94280950447669252-127.0.0.1:50891_-n_0000000000) [n:127.0.0.1:50891_    ] o.a.s.c.o.ReplicaMutator Assigning new node to shard shard=shard1
   [junit4]   2> 614943 INFO  (zkCallback-559-thread-1-processing-n:127.0.0.1:50891_) [n:127.0.0.1:50891_    ] o.a.s.c.c.ZkStateReader A cluster state change: WatchedEvent state:SyncConnected type:NodeDataChanged path:/clusterstate.json, has occurred - updating... (live nodes size: 1)
   [junit4]   2> 614946 INFO  (zkCallback-559-thread-1-processing-n:127.0.0.1:50891_) [n:127.0.0.1:50891_    ] o.a.s.c.c.ZkStateReader Updated cluster state version to 1
   [junit4]   2> 615940 INFO  (coreLoadExecutor-2011-thread-1-processing-n:127.0.0.1:50891_) [n:127.0.0.1:50891_ c:control_collection   x:collection1] o.a.s.c.ZkController waiting to find shard id in clusterstate for collection1
   [junit4]   2> 615940 INFO  (coreLoadExecutor-2011-thread-1-processing-n:127.0.0.1:50891_) [n:127.0.0.1:50891_ c:control_collection   x:collection1] o.a.s.c.ZkController Check for collection zkNode:control_collection
   [junit4]   2> 615941 INFO  (coreLoadExecutor-2011-thread-1-processing-n:127.0.0.1:50891_) [n:127.0.0.1:50891_ c:control_collection   x:collection1] o.a.s.c.ZkController Collection zkNode exists
   [junit4]   2> 615941 INFO  (coreLoadExecutor-2011-thread-1-processing-n:127.0.0.1:50891_) [n:127.0.0.1:50891_ c:control_collection   x:collection1] o.a.s.c.c.ZkStateReader Load collection config from:/collections/control_collection
   [junit4]   2> 615943 INFO  (coreLoadExecutor-2011-thread-1-processing-n:127.0.0.1:50891_) [n:127.0.0.1:50891_ c:control_collection   x:collection1] o.a.s.c.c.ZkStateReader path=/collections/control_collection configName=conf1 specified config exists in ZooKeeper
   [junit4]   2> 615943 INFO  (coreLoadExecutor-2011-thread-1-processing-n:127.0.0.1:50891_) [n:127.0.0.1:50891_ c:control_collection   x:collection1] o.a.s.c.SolrResourceLoader new SolrResourceLoader for directory: '/Users/jenkins/workspace/Lucene-Solr-trunk-MacOSX/solr/build/solr-core/test/J1/temp/solr.cloud.CollectionsAPIDistributedZkTest_BFB2B76258017827-001/control-001/cores/collection1/'
   [junit4]   2> 615954 INFO  (coreLoadExecutor-2011-thread-1-processing-n:127.0.0.1:50891_) [n:127.0.0.1:50891_ c:control_collection   x:collection1] o.a.s.c.Config loaded config solrconfig.xml with version 0 
   [junit4]   2> 615960 INFO  (coreLoadExecutor-2011-thread-1-processing-n:127.0.0.1:50891_) [n:127.0.0.1:50891_ c:control_collection   x:collection1] o.a.s.c.SolrConfig current version of requestparams : -1
   [junit4]   2> 615962 INFO  (coreLoadExecutor-2011-thread-1-processing-n:127.0.0.1:50891_) [n:127.0.0.1:50891_ c:control_collection   x:collection1] o.a.s.c.SolrConfig Using Lucene MatchVersion: 6.0.0
   [junit4]   2> 615969 INFO  (coreLoadExecutor-2011-thread-1-processing-n:127.0.0.1:50891_) [n:127.0.0.1:50891_ c:control_collection   x:collection1] o.a.s.c.Config Loaded SolrConfig: solrconfig.xml
   [junit4]   2> 615970 INFO  (coreLoadExecutor-2011-thread-1-processing-n:127.0.0.1:50891_) [n:127.0.0.1:50891_ c:control_collection   x:collection1] o.a.s.s.IndexSchema Reading Solr Schema from /configs/conf1/schema.xml
   [junit4]   2> 615974 INFO  (coreLoadExecutor-2011-thread-1-processing-n:127.0.0.1:50891_) [n:127.0.0.1:50891_ c:control_collection   x:collection1] o.a.s.s.IndexSchema [collection1] Schema name=test
   [junit4]   2> 616062 INFO  (coreLoadExecutor-2011-thread-1-processing-n:127.0.0.1:50891_) [n:127.0.0.1:50891_ c:control_collection   x:collection1] o.a.s.s.OpenExchangeRatesOrgProvider Initialized with rates=open-exchange-rates.json, refreshInterval=1440.
   [junit4]   2> 616068 INFO  (coreLoadExecutor-2011-thread-1-processing-n:127.0.0.1:50891_) [n:127.0.0.1:50891_ c:control_collection   x:collection1] o.a.s.s.IndexSchema default search field in schema is text
   [junit4]   2> 616069 INFO  (coreLoadExecutor-2011-thread-1-processing-n:127.0.0.1:50891_) [n:127.0.0.1:50891_ c:control_collection   x:collection1] o.a.s.s.IndexSchema unique key field: id
   [junit4]   2> 616084 INFO  (coreLoadExecutor-2011-thread-1-processing-n:127.0.0.1:50891_) [n:127.0.0.1:50891_ c:control_collection   x:collection1] o.a.s.s.FileExchangeRateProvider Reloading exchange rates from file currency.xml
   [junit4]   2> 616088 INFO  (coreLoadExecutor-2011-thread-1-processing-n:127.0.0.1:50891_) [n:127.0.0.1:50891_ c:control_collection   x:collection1] o.a.s.s.FileExchangeRateProvider Reloading exchange rates from file currency.xml
   [junit4]   2> 616091 INFO  (coreLoadExecutor-2011-thread-1-processing-n:127.0.0.1:50891_) [n:127.0.0.1:50891_ c:control_collection   x:collection1] o.a.s.s.OpenExchangeRatesOrgProvider Reloading exchange rates from open-exchange-rates.json
   [junit4]   2> 616093 WARN  (coreLoadExecutor-2011-thread-1-processing-n:127.0.0.1:50891_) [n:127.0.0.1:50891_ c:control_collection   x:collection1] o.a.s.s.OpenExchangeRatesOrgProvider Unknown key IMPORTANT NOTE
   [junit4]   2> 616093 WARN  (coreLoadExecutor-2011-thread-1-processing-n:127.0.0.1:50891_) [n:127.0.0.1:50891_ c:control_collection   x:collection1] o.a.s.s.OpenExchangeRatesOrgProvider Expected key, got STRING
   [junit4]   2> 616093 INFO  (coreLoadExecutor-2011-thread-1-processing-n:127.0.0.1:50891_) [n:127.0.0.1:50891_ c:control_collection   x:collection1] o.a.s.s.OpenExchangeRatesOrgProvider Reloading exchange rates from open-exchange-rates.json
   [junit4]   2> 616095 WARN  (coreLoadExecutor-2011-thread-1-processing-n:127.0.0.1:50891_) [n:127.0.0.1:50891_ c:control_collection   x:collection1] o.a.s.s.OpenExchangeRatesOrgProvider Unknown key IMPORTANT NOTE
   [junit4]   2> 616095 WARN  (coreLoadExecutor-2011-thread-1-processing-n:127.0.0.1:50891_) [n:127.0.0.1:50891_ c:control_collection   x:collection1] o.a.s.s.OpenExchangeRatesOrgProvider Expected key, got STRING
   [junit4]   2> 616101 INFO  (coreLoadExecutor-2011-thread-1-processing-n:127.0.0.1:50891_) [n:127.0.0.1:50891_ c:control_collection   x:collection1] o.a.s.c.ConfigSetProperties Did not find ConfigSet properties, assuming default properties: Can't find resource 'configsetprops.json' in classpath or '/configs/conf1', cwd=/Users/jenkins/workspace/Lucene-Solr-trunk-MacOSX/solr/build/solr-core/test/J1
   [junit4]   2> 616101 INFO  (coreLoadExecutor-2011-thread-1-processing-n:127.0.0.1:50891_) [n:127.0.0.1:50891_ c:control_collection   x:collection1] o.a.s.c.CoreContainer Creating SolrCore 'collection1' using configuration from collection control_collection
   [junit4]   2> 616102 INFO  (coreLoadExecutor-2011-thread-1-processing-n:127.0.0.1:50891_) [n:127.0.0.1:50891_ c:control_collection s:shard1 r:core_node1 x:collection1] o.a.s.c.SolrCore org.apache.solr.core.MockDirectoryFactory
   [junit4]   2> 616102 INFO  (coreLoadExecutor-2011-thread-1-processing-n:127.0.0.1:50891_) [n:127.0.0.1:50891_ c:control_collection s:shard1 r:core_node1 x:collection1] o.a.s.c.SolrCore [[collection1] ] Opening new SolrCore at [/Users/jenkins/workspace/Lucene-Solr-trunk-MacOSX/solr/build/solr-core/test/J1/temp/solr.cloud.CollectionsAPIDistributedZkTest_BFB2B76258017827-001/control-001/cores/collection1/], dataDir=[null]
   [junit4]   2> 616102 INFO  (coreLoadExecutor-2011-thread-1-processing-n:127.0.0.1:50891_) [n:127.0.0.1:50891_ c:control_collection s:shard1 r:core_node1 x:collection1] o.a.s.c.JmxMonitoredMap JMX monitoring is enabled. Adding Solr mbeans to JMX Server: com.sun.jmx.mbeanserver.JmxMBeanServer@27b64086
   [junit4]   2> 616102 INFO  (coreLoadExecutor-2011-thread-1-processing-n:127.0.0.1:50891_) [n:127.0.0.1:50891_ c:control_collection s:shard1 r:core_node1 x:collection1] o.a.s.c.CachingDirectoryFactory return new directory for /Users/jenkins/workspace/Lucene-Solr-trunk-MacOSX/solr/build/solr-core/test/J1/temp/solr.cloud.CollectionsAPIDistributedZkTest_BFB2B76258017827-001/control-001/cores/collection1/data
   [junit4]   2> 616102 INFO  (coreLoadExecutor-2011-thread-1-processing-n:127.0.0.1:50891_) [n:127.0.0.1:50891_ c:control_collection s:shard1 r:core_node1 x:collection1] o.a.s.c.SolrCore New index directory detected: old=null new=/Users/jenkins/workspace/Lucene-Solr-trunk-MacOSX/solr/build/solr-core/test/J1/temp/solr.cloud.CollectionsAPIDistributedZkTest_BFB2B76258017827-001/control-001/cores/collection1/data/index/
   [junit4]   2> 616103 WARN  (coreLoadExecutor-2011-thread-1-processing-n:127.0.0.1:50891_) [n:127.0.0.1:50891_ c:control_collection s:shard1 r:core_node1 x:collection1] o.a.s.c.SolrCore [collection1] Solr index directory '/Users/jenkins/workspace/Lucene-Solr-trunk-MacOSX/solr/build/solr-core/test/J1/temp/solr.cloud.CollectionsAPIDistributedZkTest_BFB2B76258017827-001/control-001/cores/collection1/data/index' doesn't exist. Creating new index...
   [junit4]   2> 616103 INFO  (coreLoadExecutor-2011-thread-1-processing-n:127.0.0.1:50891_) [n:127.0.0.1:50891_ c:control_collection s:shard1 r:core_node1 x:collection1] o.a.s.c.CachingDirectoryFactory return new directory for /Users/jenkins/workspace/Lucene-Solr-trunk-MacOSX/solr/build/solr-core/test/J1/temp/solr.cloud.CollectionsAPIDistributedZkTest_BFB2B76258017827-001/control-001/cores/collection1/data/index
   [junit4]   2> 616103 INFO  (coreLoadExecutor-2011-thread-1-processing-n:127.0.0.1:50891_) [n:127.0.0.1:50891_ c:control_collection s:shard1 r:core_node1 x:collection1] o.a.s.u.RandomMergePolicy RandomMergePolicy wrapping class org.apache.lucene.index.TieredMergePolicy: [TieredMergePolicy: maxMergeAtOnce=14, maxMergeAtOnceExplicit=22, maxMergedSegmentMB=61.08203125, floorSegmentMB=1.544921875, forceMergeDeletesPctAllowed=16.2723987584529, segmentsPerTier=19.0, maxCFSSegmentSizeMB=8.796093022207999E12, noCFSRatio=0.6413465649361082
   [junit4]   2> 616103 INFO  (coreLoadExecutor-2011-thread-1-processing-n:127.0.0.1:50891_) [n:127.0.0.1:50891_ c:control_collection s:shard1 r:core_node1 x:collection1] o.a.s.c.SolrCore SolrDeletionPolicy.onCommit: commits: num=1
   [junit4]   2> 	commit{dir=MockDirectoryWrapper(RAMDirectory@396094a3 lockFactory=org.apache.lucene.store.SingleInstanceLockFactory@b5f930f),segFN=segments_1,generation=1}
   [junit4]   2> 616103 INFO  (coreLoadExecutor-2011-thread-1-processing-n:127.0.0.1:50891_) [n:127.0.0.1:50891_ c:control_collection s:shard1 r:core_node1 x:collection1] o.a.s.c.SolrCore newest commit generation = 1
   [junit4]   2> 616104 INFO  (OldIndexDirectoryCleanupThreadForCore-collection1) [n:127.0.0.1:50891_ c:control_collection s:shard1 r:core_node1 x:collection1] o.a.s.c.SolrCore Looking for old index directories to cleanup for core collection1 in /Users/jenkins/workspace/Lucene-Solr-trunk-MacOSX/solr/build/solr-core/test/J1/temp/solr.cloud.CollectionsAPIDistributedZkTest_BFB2B76258017827-001/control-001/cores/collection1/data/
   [junit4]   2> 616105 WARN  (OldIndexDirectoryCleanupThreadForCore-collection1) [n:127.0.0.1:50891_ c:control_collection s:shard1 r:core_node1 x:collection1] o.a.s.c.DirectoryFactory /Users/jenkins/workspace/Lucene-Solr-trunk-MacOSX/solr/build/solr-core/test/J1/temp/solr.cloud.CollectionsAPIDistributedZkTest_BFB2B76258017827-001/control-001/cores/collection1/data/ does not point to a valid data directory; skipping clean-up of old index directories.
   [junit4]   2> 616110 INFO  (coreLoadExecutor-2011-thread-1-processing-n:127.0.0.1:50891_) [n:127.0.0.1:50891_ c:control_collection s:shard1 r:core_node1 x:collection1] o.a.s.u.p.UpdateRequestProcessorChain creating updateRequestProcessorChain "nodistrib"
   [junit4]   2> 616111 INFO  (coreLoadExecutor-2011-thread-1-processing-n:127.0.0.1:50891_) [n:127.0.0.1:50891_ c:control_collection s:shard1 r:core_node1 x:collection1] o.a.s.u.p.UpdateRequestProcessorChain creating updateRequestProcessorChain "dedupe"
   [junit4]   2> 616111 INFO  (coreLoadExecutor-2011-thread-1-processing-n:127.0.0.1:50891_) [n:127.0.0.1:50891_ c:control_collection s:shard1 r:core_node1 x:collection1] o.a.s.u.p.UpdateRequestProcessorChain inserting DistributedUpdateProcessorFactory into updateRequestProcessorChain "dedupe"
   [junit4]   2> 616111 INFO  (coreLoadExecutor-2011-thread-1-processing-n:127.0.0.1:50891_) [n:127.0.0.1:50891_ c:control_collection s:shard1 r:core_node1 x:collection1] o.a.s.u.p.UpdateRequestProcessorChain creating updateRequestProcessorChain "stored_sig"
   [junit4]   2> 616111 INFO  (coreLoadExecutor-2011-thread-1-processing-n:127.0.0.1:50891_) [n:127.0.0.1:50891_ c:control_collection s:shard1 r:core_node1 x:collection1] o.a.s.u.p.UpdateRequestProcessorChain inserting DistributedUpdateProcessorFactory into updateRequestProcessorChain "stored_sig"
   [junit4]   2> 616111 INFO  (coreLoadExecutor-2011-thread-1-processing-n:127.0.0.1:50891_) [n:127.0.0.1:50891_ c:control_collection s:shard1 r:core_node1 x:collection1] o.a.s.u.p.UpdateRequestProcessorChain creating updateRequestProcessorChain "distrib-dup-test-chain-explicit"
   [junit4]   2> 616112 INFO  (coreLoadExecutor-2011-thread-1-processing-n:127.0.0.1:50891_) [n:127.0.0.1:50891_ c:control_collection s:shard1 r:core_node1 x:collection1] o.a.s.u.p.UpdateRequestProcessorChain creating updateRequestProcessorChain "distrib-dup-test-chain-implicit"
   [junit4]   2> 616135 INFO  (coreLoadExecutor-2011-thread-1-processing-n:127.0.0.1:50891_) [n:127.0.0.1:50891_ c:control_collection s:shard1 r:core_node1 x:collection1] o.a.s.u.p.UpdateRequestProcessorChain inserting DistributedUpdateProcessorFactory into updateRequestProcessorChain "distrib-dup-test-chain-implicit"
   [junit4]   2> 616135 INFO  (coreLoadExecutor-2011-thread-1-processing-n:127.0.0.1:50891_) [n:127.0.0.1:50891_ c:control_collection s:shard1 r:core_node1 x:collection1] o.a.s.c.SolrCore no updateRequestProcessorChain defined as default, creating implicit default
   [junit4]   2> 616138 INFO  (coreLoadExecutor-2011-thread-1-processing-n:127.0.0.1:50891_) [n:127.0.0.1:50891_ c:control_collection s:shard1 r:core_node1 x:collection1] o.a.s.h.l.XMLLoader xsltCacheLifetimeSeconds=60
   [junit4]   2> 616139 INFO  (coreLoadExecutor-2011-thread-1-processing-n:127.0.0.1:50891_) [n:127.0.0.1:50891_ c:control_collection s:shard1 r:core_node1 x:collection1] o.a.s.h.l.XMLLoader xsltCacheLifetimeSeconds=60
   [junit4]   2> 616140 INFO  (coreLoadExecutor-2011-thread-1-processing-n:127.0.0.1:50891_) [n:127.0.0.1:50891_ c:control_collection s:shard1 r:core_node1 x:collection1] o.a.s.h.l.XMLLoader xsltCacheLifetimeSeconds=60
   [junit4]   2> 616141 INFO  (coreLoadExecutor-2011-thread-1-processing-n:127.0.0.1:50891_) [n:127.0.0.1:50891_ c:control_collection s:shard1 r:core_node1 x:collection1] o.a.s.h.l.XMLLoader xsltCacheLifetimeSeconds=60
   [junit4]   2> 616144 INFO  (coreLoadExecutor-2011-thread-1-processing-n:127.0.0.1:50891_) [n:127.0.0.1:50891_ c:control_collection s:shard1 r:core_node1 x:collection1] o.a.s.c.RequestHandlers Registered paths: /admin/mbeans,standard,/update/csv,/update/json/docs,/admin/luke,/admin/segments,/get,/admin/system,/replication,/admin/properties,/config,/schema,/admin/plugins,/admin/logging,/update/json,/admin/threads,/admin/ping,/update,/admin/file
   [junit4]   2> 616144 INFO  (coreLoadExecutor-2011-thread-1-processing-n:127.0.0.1:50891_) [n:127.0.0.1:50891_ c:control_collection s:shard1 r:core_node1 x:collection1] o.a.s.c.SolrCore Using default statsCache cache: org.apache.solr.search.stats.LocalStatsCache
   [junit4]   2> 616145 INFO  (coreLoadExecutor-2011-thread-1-processing-n:127.0.0.1:50891_) [n:127.0.0.1:50891_ c:control_collection s:shard1 r:core_node1 x:collection1] o.a.s.u.UpdateHandler Using UpdateLog implementation: org.apache.solr.update.UpdateLog
   [junit4]   2> 616145 INFO  (coreLoadExecutor-2011-thread-1-processing-n:127.0.0.1:50891_) [n:127.0.0.1:50891_ c:control_collection s:shard1 r:core_node1 x:collection1] o.a.s.u.UpdateLog Initializing UpdateLog: dataDir= defaultSyncLevel=FLUSH numRecordsToKeep=100 maxNumLogsToKeep=10 numVersionBuckets=65536
   [junit4]   2> 616147 INFO  (coreLoadExecutor-2011-thread-1-processing-n:127.0.0.1:50891_) [n:127.0.0.1:50891_ c:control_collection s:shard1 r:core_node1 x:collection1] o.a.s.c.SolrCore Hard AutoCommit: disabled
   [junit4]   2> 616147 INFO  (coreLoadExecutor-2011-thread-1-processing-n:127.0.0.1:50891_) [n:127.0.0.1:50891_ c:control_collection s:shard1 r:core_node1 x:collection1] o.a.s.c.SolrCore Soft AutoCommit: disabled
   [junit4]   2> 616147 INFO  (coreLoadExecutor-2011-thread-1-processing-n:127.0.0.1:50891_) [n:127.0.0.1:50891_ c:control_collection s:shard1 r:core_node1 x:collection1] o.a.s.u.RandomMergePolicy RandomMergePolicy wrapping class org.apache.lucene.index.LogByteSizeMergePolicy: [LogByteSizeMergePolicy: minMergeSize=1677721, mergeFactor=29, maxMergeSize=2147483648, maxMergeSizeForForcedMerge=9223372036854775807, calibrateSizeByDeletes=true, maxMergeDocs=2147483647, maxCFSSegmentSizeMB=8.796093022207999E12, noCFSRatio=0.4903590448859013]
   [junit4]   2> 616147 INFO  (coreLoadExecutor-2011-thread-1-processing-n:127.0.0.1:50891_) [n:127.0.0.1:50891_ c:control_collection s:shard1 r:core_node1 x:collection1] o.a.s.c.SolrCore SolrDeletionPolicy.onInit: commits: num=1
   [junit4]   2> 	commit{dir=MockDirectoryWrapper(RAMDirectory@396094a3 lockFactory=org.apache.lucene.store.SingleInstanceLockFactory@b5f930f),segFN=segments_1,generation=1}
   [junit4]   2> 616148 INFO  (coreLoadExecutor-2011-thread-1-processing-n:127.0.0.1:50891_) [n:127.0.0.1:50891_ c:control_collection s:shard1 r:core_node1 x:collection1] o.a.s.c.SolrCore newest commit generation = 1
   [junit4]   2> 616148 INFO  (coreLoadExecutor-2011-thread-1-processing-n:127.0.0.1:50891_) [n:127.0.0.1:50891_ c:control_collection s:shard1 r:core_node1 x:collection1] o.a.s.s.SolrIndexSearcher Opening Searcher@4db7ae8a[collection1] main
   [junit4]   2> 616148 INFO  (coreLoadExecutor-2011-thread-1-processing-n:127.0.0.1:50891_) [n:127.0.0.1:50891_ c:control_collection s:shard1 r:core_node1 x:collection1] o.a.s.c.c.ZkStateReader Load collection config from:/collections/control_collection
   [junit4]   2> 616149 INFO  (coreLoadExecutor-2011-thread-1-processing-n:127.0.0.1:50891_) [n:127.0.0.1:50891_ c:control_collection s:shard1 r:core_node1 x:collection1] o.a.s.c.c.ZkStateReader path=/collections/control_collection configName=conf1 specified config exists in ZooKeeper
   [junit4]   2> 616149 INFO  (coreLoadExecutor-2011-thread-1-processing-n:127.0.0.1:50891_) [n:127.0.0.1:50891_ c:control_collection s:shard1 r:core_node1 x:collection1] o.a.s.r.ManagedResourceStorage Setting up ZooKeeper-based storage for the RestManager with znodeBase: /configs/conf1
   [junit4]   2> 616149 INFO  (coreLoadExecutor-2011-thread-1-processing-n:127.0.0.1:50891_) [n:127.0.0.1:50891_ c:control_collection s:shard1 r:core_node1 x:collection1] o.a.s.r.ManagedResourceStorage Configured ZooKeeperStorageIO with znodeBase: /configs/conf1
   [junit4]   2> 616150 INFO  (coreLoadExecutor-2011-thread-1-processing-n:127.0.0.1:50891_) [n:127.0.0.1:50891_ c:control_collection s:shard1 r:core_node1 x:collection1] o.a.s.r.RestManager Initializing RestManager with initArgs: {}
   [junit4]   2> 616150 INFO  (coreLoadExecutor-2011-thread-1-processing-n:127.0.0.1:50891_) [n:127.0.0.1:50891_ c:control_collection s:shard1 r:core_node1 x:collection1] o.a.s.r.ManagedResourceStorage Reading _rest_managed.json using ZooKeeperStorageIO:path=/configs/conf1
   [junit4]   2> 616150 INFO  (coreLoadExecutor-2011-thread-1-processing-n:127.0.0.1:50891_) [n:127.0.0.1:50891_ c:control_collection s:shard1 r:core_node1 x:collection1] o.a.s.r.ManagedResourceStorage No data found for znode /configs/conf1/_rest_managed.json
   [junit4]   2> 616150 INFO  (coreLoadExecutor-2011-thread-1-processing-n:127.0.0.1:50891_) [n:127.0.0.1:50891_ c:control_collection s:shard1 r:core_node1 x:collection1] o.a.s.r.ManagedResourceStorage Loaded null at path _rest_managed.json using ZooKeeperStorageIO:path=/configs/conf1
   [junit4]   2> 616150 INFO  (coreLoadExecutor-2011-thread-1-processing-n:127.0.0.1:50891_) [n:127.0.0.1:50891_ c:control_collection s:shard1 r:core_node1 x:collection1] o.a.s.r.RestManager Initializing 0 registered ManagedResources
   [junit4]   2> 616151 INFO  (coreLoadExecutor-2011-thread-1-processing-n:127.0.0.1:50891_) [n:127.0.0.1:50891_ c:control_collection s:shard1 r:core_node1 x:collection1] o.a.s.h.ReplicationHandler Commits will be reserved for  10000
   [junit4]   2> 616151 INFO  (coreLoadExecutor-2011-thread-1-processing-n:127.0.0.1:50891_) [n:127.0.0.1:50891_ c:control_collection s:shard1 r:core_node1 x:collection1] o.a.s.u.UpdateLog Looking up max value of version field to seed version buckets
   [junit4]   2> 616151 INFO  (coreLoadExecutor-2011-thread-1-processing-n:127.0.0.1:50891_) [n:127.0.0.1:50891_ c:control_collection s:shard1 r:core_node1 x:collection1] o.a.s.u.VersionInfo Refreshing highest value of _version_ for 65536 version buckets from index
   [junit4]   2> 616151 INFO  (coreLoadExecutor-2011-thread-1-processing-n:127.0.0.1:50891_) [n:127.0.0.1:50891_ c:control_collection s:shard1 r:core_node1 x:collection1] o.a.s.u.VersionInfo No terms found for _version_, cannot seed version bucket highest value from index
   [junit4]   2> 616151 INFO  (coreLoadExecutor-2011-thread-1-processing-n:127.0.0.1:50891_) [n:127.0.0.1:50891_ c:control_collection s:shard1 r:core_node1 x:collection1] o.a.s.u.UpdateLog Could not find max version in index or recent updates, using new clock 1508495208952627200
   [junit4]   2> 616152 INFO  (searcherExecutor-2012-thread-1-processing-n:127.0.0.1:50891_ x:collection1 s:shard1 c:control_collection r:core_node1) [n:127.0.0.1:50891_ c:control_collection s:shard1 r:core_node1 x:collection1] o.a.s.c.SolrCore [collection1] Registered new searcher Searcher@4db7ae8a[collection1] main{ExitableDirectoryReader(UninvertingDirectoryReader())}
   [junit4]   2> 616153 INFO  (coreLoadExecutor-2011-thread-1-processing-n:127.0.0.1:50891_) [n:127.0.0.1:50891_ c:control_collection s:shard1 r:core_node1 x:collection1] o.a.s.u.UpdateLog Took 2 ms to seed version buckets with highest version 1508495208952627200
   [junit4]   2> 616153 INFO  (coreLoadExecutor-2011-thread-1-processing-n:127.0.0.1:50891_) [n:127.0.0.1:50891_ c:control_collection s:shard1 r:core_node1 x:collection1] o.a.s.c.ZkController watch zkdir /configs/conf1
   [junit4]   2> 616154 INFO  (coreLoadExecutor-2011-thread-1-processing-n:127.0.0.1:50891_) [n:127.0.0.1:50891_ c:control_collection s:shard1 r:core_node1 x:collection1] o.a.s.c.CoreContainer registering core: collection1
   [junit4]   2> 616154 INFO  (coreZkRegister-2005-thread-1-processing-n:127.0.0.1:50891_ x:collection1 s:shard1 c:control_collection r:core_node1) [n:127.0.0.1:50891_ c:control_collection s:shard1 r:core_node1 x:collection1] o.a.s.c.ZkController Register replica - core:collection1 address:http://127.0.0.1:50891 collection:control_collection shard:shard1
   [junit4]   2> 616155 INFO  (coreZkRegister-2005-thread-1-processing-n:127.0.0.1:50891_ x:collection1 s:shard1 c:control_collection r:core_node1) [n:127.0.0.1:50891_ c:control_collection s:shard1 r:core_node1 x:collection1] o.a.s.c.c.SolrZkClient makePath: /collections/control_collection/leader_elect/shard1/election
   [junit4]   2> 616163 INFO  (coreZkRegister-2005-thread-1-processing-n:127.0.0.1:50891_ x:collection1 s:shard1 c:control_collection r:core_node1) [n:127.0.0.1:50891_ c:control_collection s:shard1 r:core_node1 x:collection1] o.a.s.c.LeaderElector Joined leadership election with path: /collections/control_collection/leader_elect/shard1/election/94280950447669252-core_node1-n_0000000000
   [junit4]   2> 616164 INFO  (coreZkRegister-2005-thread-1-processing-n:127.0.0.1:50891_ x:collection1 s:shard1 c:control_collection r:core_node1) [n:127.0.0.1:50891_ c:control_collection s:shard1 r:core_node1 x:collection1] o.a.s.c.ShardLeaderElectionContext Running the leader process for shard shard1
   [junit4]   2> 616166 INFO  (zkCallback-559-thread-1-processing-n:127.0.0.1:50891_) [n:127.0.0.1:50891_    ] o.a.s.c.DistributedQueue NodeChildrenChanged fired on path /overseer/queue state SyncConnected
   [junit4]   2> 616167 INFO  (coreZkRegister-2005-thread-1-processing-n:127.0.0.1:50891_ x:collection1 s:shard1 c:control_collection r:core_node1) [n:127.0.0.1:50891_ c:control_collection s:shard1 r:core_node1 x:collection1] o.a.s.c.ShardLeaderElectionContext Enough replicas found to continue.
   [junit4]   2> 616167 INFO  (coreZkRegister-2005-thread-1-processing-n:127.0.0.1:50891_ x:collection1 s:shard1 c:control_collection r:core_node1) [n:127.0.0.1:50891_ c:control_collection s:shard1 r:core_node1 x:collection1] o.a.s.c.ShardLeaderElectionContext I may be the new leader - try and sync
   [junit4]   2> 616167 INFO  (coreZkRegister-2005-thread-1-processing-n:127.0.0.1:50891_ x:collection1 s:shard1 c:control_collection r:core_node1) [n:127.0.0.1:50891_ c:control_collection s:shard1 r:core_node1 x:collection1] o.a.s.c.SyncStrategy Sync replicas to http://127.0.0.1:50891/collection1/
   [junit4]   2> 616167 INFO  (coreZkRegister-2005-thread-1-processing-n:127.0.0.1:50891_ x:collection1 s:shard1 c:control_collection r:core_node1) [n:127.0.0.1:50891_ c:control_collection s:shard1 r:core_node1 x:collection1] o.a.s.c.SyncStrategy Sync Success - now sync replicas to me
   [junit4]   2> 616167 INFO  (coreZkRegister-2005-thread-1-processing-n:127.0.0.1:50891_ x:collection1 s:shard1 c:control_collection r:core_node1) [n:127.0.0.1:50891_ c:control_collection s:shard1 r:core_node1 x:collection1] o.a.s.c.SyncStrategy http://127.0.0.1:50891/collection1/ has no replicas
   [junit4]   2> 616168 INFO  (coreZkRegister-2005-thread-1-processing-n:127.0.0.1:50891_ x:collection1 s:shard1 c:control_collection r:core_node1) [n:127.0.0.1:50891_ c:control_collection s:shard1 r:core_node1 x:collection1] o.a.s.c.ShardLeaderElectionContext I am the new leader: http://127.0.0.1:50891/collection1/ shard1
   [junit4]   2> 616168 INFO  (coreZkRegister-2005-thread-1-processing-n:127.0.0.1:50891_ x:collection1 s:shard1 c:control_collection r:core_node1) [n:127.0.0.1:50891_ c:control_collection s:shard1 r:core_node1 x:collection1] o.a.s.c.c.SolrZkClient makePath: /collections/control_collection/leaders/shard1
   [junit4]   2> 616175 INFO  (OverseerStateUpdate-94280950447669252-127.0.0.1:50891_-n_0000000000) [n:127.0.0.1:50891_    ] o.a.s.c.Overseer processMessage: queueSize: 1, message = {
   [junit4]   2>   "operation":"leader",
   [junit4]   2>   "shard":"shard1",
   [junit4]   2>   "collection":"control_collection"} current state version: 1
   [junit4]   2> 616179 INFO  (OverseerStateUpdate-94280950447669252-127.0.0.1:50891_-n_0000000000) [n:127.0.0.1:50891_    ] o.a.s.c.Overseer processMessage: queueSize: 1, message = {
   [junit4]   2>   "operation":"leader",
   [junit4]   2>   "shard":"shard1",
   [junit4]   2>   "collection":"control_collection",
   [junit4]   2>   "base_url":"http://127.0.0.1:50891",
   [junit4]   2>   "core":"collection1",
   [junit4]   2>   "state":"active"} current state version: 1
   [junit4]   2> 616181 INFO  (zkCallback-559-thread-1-processing-n:127.0.0.1:50891_) [n:127.0.0.1:50891_    ] o.a.s.c.DistributedQueue NodeChildrenChanged fired on path /overseer/queue state SyncConnected
   [junit4]   2> 616388 INFO  (zkCallback-559-thread-1-processing-n:127.0.0.1:50891_) [n:127.0.0.1:50891_    ] o.a.s.c.c.ZkStateReader A cluster state change: WatchedEvent state:SyncConnected type:NodeDataChanged path:/clusterstate.json, has occurred - updating... (live nodes size: 1)
   [junit4]   2> 616400 INFO  (zkCallback-559-thread-1-processing-n:127.0.0.1:50891_) [n:127.0.0.1:50891_    ] o.a.s.c.c.ZkStateReader Updated cluster state version to 2
   [junit4]   2> 616435 INFO  (coreZkRegister-2005-thread-1-processing-n:127.0.0.1:50891_ x:collection1 s:shard1 c:control_collection r:core_node1) [n:127.0.0.1:50891_ c:control_collection s:shard1 r:core_node1 x:collection1] o.a.s.c.ZkController We are http://127.0.0.1:50891/collection1/ and leader is http://127.0.0.1:50891/collection1/
   [junit4]   2> 616435 INFO  (coreZkRegister-2005-thread-1-processing-n:127.0.0.1:50891_ x:collection1 s:shard1 c:control_collection r:core_node1) [n:127.0.0.1:50891_ c:control_collection s:shard1 r:core_node1 x:collection1] o.a.s.c.ZkController No LogReplay needed for core=collection1 baseURL=http://127.0.0.1:50891
   [junit4]   2> 616435 INFO  (coreZkRegister-2005-thread-1-processing-n:127.0.0.1:50891_ x:collection1 s:shard1 c:control_collection r:core_node1) [n:127.0.0.1:50891_ c:control_collection s:shard1 r:core_node1 x:collection1] o.a.s.c.ZkController I am the leader, no recovery necessary
   [junit4]   2> 616435 INFO  (coreZkRegister-2005-thread-1-processing-n:127.0.0.1:50891_ x:collection1 s:shard1 c:control_collection r:core_node1) [n:127.0.0.1:50891_ c:control_collection s:shard1 r:core_node1 x:collection1] o.a.s.c.ZkController publishing state=active
   [junit4]   2> 616435 INFO  (coreZkRegister-2005-thread-1-processing-n:127.0.0.1:50891_ x:collection1 s:shard1 c:control_collection r:core_node1) [n:127.0.0.1:50891_ c:control_collection s:shard1 r:core_node1 x:collection1] o.a.s.c.ZkController numShards not found on descriptor - reading it from system property
   [junit4]   2> 616437 INFO  (zkCallback-559-thread-1-processing-n:127.0.0.1:50891_) [n:127.0.0.1:50891_    ] o.a.s.c.DistributedQueue NodeChildrenChanged fired on path /overseer/queue state SyncConnected
   [junit4]   2> 616443 INFO  (OverseerStateUpdate-94280950447669252-127.0.0.1:50891_-n_0000000000) [n:127.0.0.1:50891_    ] o.a.s.c.Overseer processMessage: queueSize: 1, message = {
   [junit4]   2>   "core":"collection1",
   [junit4]   2>   "core_node_name":"core_node1",
   [junit4]   2>   "roles":null,
   [junit4]   2>   "base_url":"http://127.0.0.1:50891",
   [junit4]   2>   "node_name":"127.0.0.1:50891_",
   [junit4]   2>   "numShards":"1",
   [junit4]   2>   "state":"active",
   [junit4]   2>   "shard":"shard1",
   [junit4]   2>   "collection":"control_collection",
   [junit4]   2>   "operation":"state"} current state version: 2
   [junit4]   2> 616443 INFO  (TEST-CollectionsAPIDistributedZkTest.test-seed#[BFB2B76258017827]) [    ] o.a.s.c.c.SolrZkClient Using default ZkCredentialsProvider
   [junit4]   2> 616443 INFO  (OverseerStateUpdate-94280950447669252-127.0.0.1:50891_-n_0000000000) [n:127.0.0.1:50891_    ] o.a.s.c.o.ReplicaMutator Update state numShards=1 message={
   [junit4]   2>   "core":"collection1",
   [junit4]   2>   "core_node_name":"core_node1",
   [junit4]   2>   "roles":null,
   [junit4]   2>   "base_url":"http://127.0.0.1:50891",
   [junit4]   2>   "node_name":"127.0.0.1:50891_",
   [junit4]   2>   "numShards":"1",
   [junit4]   2>   "state":"active",
   [junit4]   2>   "shard":"shard1",
   [junit4]   2>   "collection":"control_collection",
   [junit4]   2>   "operation":"state"}
   [junit4]   2> 616444 INFO  (TEST-CollectionsAPIDistributedZkTest.test-seed#[BFB2B76258017827]) [    ] o.a.s.c.c.ConnectionManager Waiting for client to connect to ZooKeeper
   [junit4]   2> 616446 INFO  (zkCallback-561-thread-1) [    ] o.a.s.c.c.ConnectionManager Watcher org.apache.solr.common.cloud.ConnectionManager@7064c43d name:ZooKeeperConnection Watcher:127.0.0.1:50888/solr got event WatchedEvent state:SyncConnected type:None path:null path:null type:None
   [junit4]   2> 616446 INFO  (TEST-CollectionsAPIDistributedZkTest.test-seed#[BFB2B76258017827]) [    ] o.a.s.c.c.ConnectionManager Client is connected to ZooKeeper
   [junit4]   2> 616446 INFO  (TEST-CollectionsAPIDistributedZkTest.test-seed#[BFB2B76258017827]) [    ] o.a.s.c.c.SolrZkClient Using default ZkACLProvider
   [junit4]   2> 616446 INFO  (TEST-CollectionsAPIDistributedZkTest.test-seed#[BFB2B76258017827]) [    ] o.a.s.c.c.ZkStateReader Updating cluster state from ZooKeeper... 
   [junit4]   2> 616452 INFO  (TEST-CollectionsAPIDistributedZkTest.test-seed#[BFB2B76258017827]) [    ] o.a.s.c.ChaosMonkey monkey: init - expire sessions:false cause connection loss:false
   [junit4]   2> 616550 INFO  (zkCallback-561-thread-1) [    ] o.a.s.c.c.ZkStateReader A cluster state change: WatchedEvent state:SyncConnected type:NodeDataChanged path:/clusterstate.json, has occurred - updating... (live nodes size: 1)
   [junit4]   2> 616550 INFO  (zkCallback-559-thread-1-processing-n:127.0.0.1:50891_) [n:127.0.0.1:50891_    ] o.a.s.c.c.ZkStateReader A cluster state change: WatchedEvent state:SyncConnected type:NodeDataChanged path:/clusterstate.json, has occurred - updating... (live nodes size: 1)
   [junit4]   2> 616555 INFO  (zkCallback-561-thread-1) [    ] o.a.s.c.c.ZkStateReader Updated cluster state version to 3
   [junit4]   2> 616556 INFO  (zkCallback-559-thread-1-processing-n:127.0.0.1:50891_) [n:127.0.0.1:50891_    ] o.a.s.c.c.ZkStateReader Updated cluster state version to 3
   [junit4]   2> 616668 INFO  (TEST-CollectionsAPIDistributedZkTest.test-seed#[BFB2B76258017827]) [    ] o.a.s.SolrTestCaseJ4 Writing core.properties file to /Users/jenkins/workspace/Lucene-Solr-trunk-MacOSX/solr/build/solr-core/test/J1/temp/solr.cloud.CollectionsAPIDistributedZkTest_BFB2B76258017827-001/shard-1-001/cores/collection1
   [junit4]   2> 616669 INFO  (TEST-CollectionsAPIDistributedZkTest.test-seed#[BFB2B76258017827]) [    ] o.a.s.c.AbstractFullDistribZkTestBase create jetty 1 in directory /Users/jenkins/workspace/Lucene-Solr-trunk-MacOSX/solr/build/solr-core/test/J1/temp/solr.cloud.CollectionsAPIDistributedZkTest_BFB2B76258017827-001/shard-1-001
   [junit4]   2> 616670 INFO  (TEST-CollectionsAPIDistributedZkTest.test-seed#[BFB2B76258017827]) [    ] o.e.j.s.Server jetty-9.2.11.v20150529
   [junit4]   2> 616673 INFO  (TEST-CollectionsAPIDistributedZkTest.test-seed#[BFB2B76258017827]) [    ] o.e.j.s.h.ContextHandler Started o.e.j.s.ServletContextHandler@56046a4b{/,null,AVAILABLE}
   [junit4]   2> 616673 INFO  (TEST-CollectionsAPIDistributedZkTest.test-seed#[BFB2B76258017827]) [    ] o.e.j.s.ServerConnector Started ServerConnector@54da321d{HTTP/1.1}{127.0.0.1:50896}
   [junit4]   2> 616673 INFO  (TEST-CollectionsAPIDistributedZkTest.test-seed#[BFB2B76258017827]) [    ] o.e.j.s.Server Started @621317ms
   [junit4]   2> 616674 INFO  (TEST-CollectionsAPIDistributedZkTest.test-seed#[BFB2B76258017827]) [    ] o.a.s.c.s.e.JettySolrRunner Jetty properties: {solr.data.dir=/Users/jenkins/workspace/Lucene-Solr-trunk-MacOSX/solr/build/solr-core/test/J1/temp/solr.cloud.CollectionsAPIDistributedZkTest_BFB2B76258017827-001/tempDir-001/jetty1, solrconfig=solrconfig.xml, hostContext=/, hostPort=50896, coreRootDirectory=/Users/jenkins/workspace/Lucene-Solr-trunk-MacOSX/solr/build/solr-core/test/J1/temp/solr.cloud.CollectionsAPIDistributedZkTest_BFB2B76258017827-001/shard-1-001/cores}
   [junit4]   2> 616674 INFO  (TEST-CollectionsAPIDistributedZkTest.test-seed#[BFB2B76258017827]) [    ] o.a.s.s.SolrDispatchFilter SolrDispatchFilter.init(): sun.misc.Launcher$AppClassLoader@74a14482
   [junit4]   2> 616674 INFO  (TEST-CollectionsAPIDistributedZkTest.test-seed#[BFB2B76258017827]) [    ] o.a.s.c.SolrResourceLoader new SolrResourceLoader for directory: '/Users/jenkins/workspace/Lucene-Solr-trunk-MacOSX/solr/build/solr-core/test/J1/temp/solr.cloud.CollectionsAPIDistributedZkTest_BFB2B76258017827-001/shard-1-001/'
   [junit4]   2> 616691 INFO  (TEST-CollectionsAPIDistributedZkTest.test-seed#[BFB2B76258017827]) [    ] o.a.s.c.c.SolrZkClient Using default ZkCredentialsProvider
   [junit4]   2> 616691 INFO  (TEST-CollectionsAPIDistributedZkTest.test-seed#[BFB2B76258017827]) [    ] o.a.s.c.c.ConnectionManager Waiting for client to connect to ZooKeeper
   [junit4]   2> 616693 INFO  (zkCallback-562-thread-1) [    ] o.a.s.c.c.ConnectionManager Watcher org.apache.solr.common.cloud.ConnectionManager@2988c551 name:ZooKeeperConnection Watcher:127.0.0.1:50888/solr got event WatchedEvent state:SyncConnected type:None path:null path:null type:None
   [junit4]   2> 616693 INFO  (TEST-CollectionsAPIDistributedZkTest.test-seed#[BFB2B76258017827]) [    ] o.a.s.c.c.ConnectionManager Client is connected to ZooKeeper
   [junit4]   2> 616694 INFO  (TEST-CollectionsAPIDistributedZkTest.test-seed#[BFB2B76258017827]) [    ] o.a.s.c.c.SolrZkClient Using default ZkACLProvider
   [junit4]   2> 616696 INFO  (TEST-CollectionsAPIDistributedZkTest.test-seed#[BFB2B76258017827]) [    ] o.a.s.s.SolrDispatchFilter Loading solr.xml from SolrHome (not found in ZooKeeper)
   [junit4]   2> 616696 INFO  (TEST-CollectionsAPIDistributedZkTest.test-seed#[BFB2B76258017827]) [    ] o.a.s.c.SolrXmlConfig Loading container configuration from /Users/jenkins/workspace/Lucene-Solr-trunk-MacOSX/solr/build/solr-core/test/J1/temp/solr.cloud.CollectionsAPIDistributedZkTest_BFB2B76258017827-001/shard-1-001/solr.xml
   [junit4]   2> 616702 INFO  (TEST-CollectionsAPIDistributedZkTest.test-seed#[BFB2B76258017827]) [    ] o.a.s.c.CoresLocator Config-defined core root directory: /Users/jenkins/workspace/Lucene-Solr-trunk-MacOSX/solr/build/solr-core/test/J1/temp/solr.cloud.CollectionsAPIDistributedZkTest_BFB2B76258017827-001/shard-1-001/cores
   [junit4]   2> 616703 INFO  (TEST-CollectionsAPIDistributedZkTest.test-seed#[BFB2B76258017827]) [    ] o.a.s.c.CoreContainer New CoreContainer 1504962781
   [junit4]   2> 616703 INFO  (TEST-CollectionsAPIDistributedZkTest.test-seed#[BFB2B76258017827]) [    ] o.a.s.c.CoreContainer Loading cores into CoreContainer [instanceDir=/Users/jenkins/workspace/Lucene-Solr-trunk-MacOSX/solr/build/solr-core/test/J1/temp/solr.cloud.CollectionsAPIDistributedZkTest_BFB2B76258017827-001/shard-1-001/]
   [junit4]   2> 616703 INFO  (TEST-CollectionsAPIDistributedZkTest.test-seed#[BFB2B76258017827]) [    ] o.a.s.c.CoreContainer loading shared library: /Users/jenkins/workspace/Lucene-Solr-trunk-MacOSX/solr/build/solr-core/test/J1/temp/solr.cloud.CollectionsAPIDistributedZkTest_BFB2B76258017827-001/shard-1-001/lib
   [junit4]   2> 616703 WARN  (TEST-CollectionsAPIDistributedZkTest.test-seed#[BFB2B76258017827]) [    ] o.a.s.c.SolrResourceLoader Can't find (or read) directory to add to classloader: lib (resolved as: /Users/jenkins/workspace/Lucene-Solr-trunk-MacOSX/solr/build/solr-core/test/J1/temp/solr.cloud.CollectionsAPIDistributedZkTest_BFB2B76258017827-001/shard-1-001/lib).
   [junit4]   2> 616710 INFO  (TEST-CollectionsAPIDistributedZkTest.test-seed#[BFB2B76258017827]) [    ] o.a.s.h.c.HttpShardHandlerFactory created with socketTimeout : 90000,urlScheme : ,connTimeout : 15000,maxConnectionsPerHost : 20,maxConnections : 10000,corePoolSize : 0,maximumPoolSize : 2147483647,maxThreadIdleTime : 5,sizeOfQueue : -1,fairnessPolicy : false,useRetries : false,
   [junit4]   2> 616712 INFO  (TEST-CollectionsAPIDistributedZkTest.test-seed#[BFB2B76258017827]) [    ] o.a.s.u.UpdateShardHandler Creating UpdateShardHandler HTTP client with params: socketTimeout=340000&connTimeout=45000&retry=true
   [junit4]   2> 616713 INFO  (TEST-CollectionsAPIDistributedZkTest.test-seed#[BFB2B76258017827]) [    ] o.a.s.l.LogWatcher SLF4J impl is org.slf4j.impl.Log4jLoggerFactory
   [junit4]   2> 616713 INFO  (TEST-CollectionsAPIDistributedZkTest.test-seed#[BFB2B76258017827]) [    ] o.a.s.l.LogWatcher Registering Log Listener [Log4j (org.slf4j.impl.Log4jLoggerFactory)]
   [junit4]   2> 616713 INFO  (TEST-CollectionsAPIDistributedZkTest.test-seed#[BFB2B76258017827]) [    ] o.a.s.c.ZkContainer Zookeeper client=127.0.0.1:50888/solr
   [junit4]   2> 616713 INFO  (TEST-CollectionsAPIDistributedZkTest.test-seed#[BFB2B76258017827]) [    ] o.a.s.c.ZkController zkHost includes chroot
   [junit4]   2> 616713 INFO  (TEST-CollectionsAPIDistributedZkTest.test-seed#[BFB2B76258017827]) [    ] o.a.s.c.c.SolrZkClient Using default ZkCredentialsProvider
   [junit4]   2> 616714 INFO  (TEST-CollectionsAPIDistributedZkTest.test-seed#[BFB2B76258017827]) [    ] o.a.s.c.c.ConnectionManager Waiting for client to connect to ZooKeeper
   [junit4]   2> 616716 INFO  (zkCallback-564-thread-1) [    ] o.a.s.c.c.ConnectionManager Watcher org.apache.solr.common.cloud.ConnectionManager@8162269 name:ZooKeeperConnection Watcher:127.0.0.1:50888 got event WatchedEvent state:SyncConnected type:None path:null path:null type:None
   [junit4]   2> 616716 INFO  (TEST-CollectionsAPIDistributedZkTest.test-seed#[BFB2B76258017827]) [    ] o.a.s.c.c.ConnectionManager Client is connected to ZooKeeper
   [junit4]   2> 616716 INFO  (TEST-CollectionsAPIDistributedZkTest.test-seed#[BFB2B76258017827]) [    ] o.a.s.c.c.SolrZkClient Using default ZkACLProvider
   [junit4]   2> 616719 INFO  (TEST-CollectionsAPIDistributedZkTest.test-seed#[BFB2B76258017827]) [n:127.0.0.1:50896_    ] o.a.s.c.c.ConnectionManager Waiting for client to connect to ZooKeeper
   [junit4]   2> 616721 INFO  (zkCallback-565-thread-1-processing-n:127.0.0.1:50896_) [n:127.0.0.1:50896_    ] o.a.s.c.c.ConnectionManager Watcher org.apache.solr.common.cloud.ConnectionManager@5ed30942 name:ZooKeeperConnection Watcher:127.0.0.1:50888/solr got event WatchedEvent state:SyncConnected type:None path:null path:null type:None
   [junit4]   2> 616721 INFO  (TEST-CollectionsAPIDistributedZkTest.test-seed#[BFB2B76258017827]) [n:127.0.0.1:50896_    ] o.a.s.c.c.ConnectionManager Client is connected to ZooKeeper
   [junit4]   2> 616728 INFO  (TEST-CollectionsAPIDistributedZkTest.test-seed#[BFB2B76258017827]) [n:127.0.0.1:50896_    ] o.a.s.c.c.ZkStateReader Updating cluster state from ZooKeeper... 
   [junit4]   2> 617737 INFO  (TEST-CollectionsAPIDistributedZkTest.test-seed#[BFB2B76258017827]) [n:127.0.0.1:50896_    ] o.a.s.c.ZkController Register node as live in ZooKeeper:/live_nodes/127.0.0.1:50896_
   [junit4]   2> 617738 INFO  (TEST-CollectionsAPIDistributedZkTest.test-seed#[BFB2B76258017827]) [n:127.0.0.1:50896_    ] o.a.s.c.c.SolrZkClient makePath: /live_nodes/127.0.0.1:50896_
   [junit4]   2> 617743 INFO  (TEST-CollectionsAPIDistributedZkTest.test-seed#[BFB2B76258017827]) [n:127.0.0.1:50896_    ] o.a.s.c.Overseer Overseer (id=null) closing
   [junit4]   2> 617744 INFO  (TEST-CollectionsAPIDistributedZkTest.test-seed#[BFB2B76258017827]) [n:127.0.0.1:50896_    ] o.a.s.c.LeaderElector Joined leadership election with path: /overseer_elect/election/94280950447669256-127.0.0.1:50896_-n_0000000001
   [junit4]   2> 617746 INFO  (TEST-CollectionsAPIDistributedZkTest.test-seed#[BFB2B76258017827]) [n:127.0.0.1:50896_    ] o.a.s.c.LeaderElector Watching path /overseer_elect/election/94280950447669252-127.0.0.1:50891_-n_0000000000 to know if I could be the leader
   [junit4]   2> 617747 INFO  (TEST-CollectionsAPIDistributedZkTest.test-seed#[BFB2B76258017827]) [n:127.0.0.1:50896_    ] o.a.s.c.CoreContainer No authentication plugin used.
   [junit4]   2> 617747 INFO  (TEST-CollectionsAPIDistributedZkTest.test-seed#[BFB2B76258017827]) [n:127.0.0.1:50896_    ] o.a.s.c.CoreContainer Security conf doesn't exist. Skipping setup for authorization module.
   [junit4]   2> 618694 INFO  (TEST-CollectionsAPIDistributedZkTest.test-seed#[BFB2B76258017827]) [n:127.0.0.1:50896_    ] o.a.s.c.CoresLocator Looking for core definitions underneath /Users/jenkins/workspace/Lucene-Solr-trunk-MacOSX/solr/build/solr-core/test/J1/temp/solr.cloud.CollectionsAPIDistributedZkTest_BFB2B76258017827-001/shard-1-001/cores
   [junit4]   2> 618695 INFO  (TEST-CollectionsAPIDistributedZkTest.test-seed#[BFB2B76258017827]) [n:127.0.0.1:50896_    ] o.a.s.c.SolrCore Created CoreDescriptor: {name=collection1, config=solrconfig.xml, transient=false, schema=schema.xml, loadOnStartup=true, configSetProperties=configsetprops.json, instanceDir=/Users/jenkins/workspace/Lucene-Solr-trunk-MacOSX/solr/build/solr-core/test/J1/temp/solr.cloud.CollectionsAPIDistributedZkTest_BFB2B76258017827-001/shard-1-001/cores/collection1, collection=collection1, absoluteInstDir=/Users/jenkins/workspace/Lucene-Solr-trunk-MacOSX/solr/build/solr-core/test/J1/temp/solr.cloud.CollectionsAPIDistributedZkTest_BFB2B76258017827-001/shard-1-001/cores/collection1/, coreNodeName=, dataDir=data/, shard=}
   [junit4]   2> 618695 INFO  (TEST-CollectionsAPIDistributedZkTest.test-seed#[BFB2B76258017827]) [n:127.0.0.1:50896_    ] o.a.s.c.CoresLocator Found core collection1 in /Users/jenkins/workspace/Lucene-Solr-trunk-MacOSX/solr/build/solr-core/test/J1/temp/solr.cloud.CollectionsAPIDistributedZkTest_BFB2B76258017827-001/shard-1-001/cores/collection1/
   [junit4]   2> 618695 INFO  (TEST-CollectionsAPIDistributedZkTest.test-seed#[BFB2B76258017827]) [n:127.0.0.1:50896_    ] o.a.s.c.CoresLocator Found 1 core definitions
   [junit4]   2> 618697 INFO  (coreLoadExecutor-2022-thread-1-processing-n:127.0.0.1:50896_) [n:127.0.0.1:50896_ c:collection1   x:collection1] o.a.s.c.ZkController publishing state=down
   [junit4]   2> 618697 INFO  (TEST-CollectionsAPIDistributedZkTest.test-seed#[BFB2B76258017827]) [n:127.0.0.1:50896_    ] o.a.s.s.SolrDispatchFilter user.dir=/Users/jenkins/workspace/Lucene-Solr-trunk-MacOSX/solr/build/solr-core/test/J1
   [junit4]   2> 618697 INFO  (TEST-CollectionsAPIDistributedZkTest.test-seed#[BFB2B76258017827]) [n:127.0.0.1:50896_    ] o.a.s.s.SolrDispatchFilter SolrDispatchFilter.init() done
   [junit4]   2> 618697 INFO  (coreLoadExecutor-2022-thread-1-processing-n:127.0.0.1:50896_) [n:127.0.0.1:50896_ c:collection1   x:collection1] o.a.s.c.ZkController numShards not found on descriptor - reading it from system property
   [junit4]   2> 618698 INFO  (coreLoadExecutor-2022-thread-1-processing-n:127.0.0.1:50896_) [n:127.0.0.1:50896_ c:collection1   x:collection1] o.a.s.c.ZkController look for our core node name
   [junit4]   2> 618698 INFO  (zkCallback-559-thread-1-processing-n:127.0.0.1:50891_) [n:127.0.0.1:50891_    ] o.a.s.c.DistributedQueue NodeChildrenChanged fired on path /overseer/queue state SyncConnected
   [junit4]   2> 618699 INFO  (OverseerStateUpdate-94280950447669252-127.0.0.1:50891_-n_0000000000) [n:127.0.0.1:50891_    ] o.a.s.c.Overseer processMessage: queueSize: 1, message = {
   [junit4]   2>   "core":"collection1",
   [junit4]   2>   "roles":null,
   [junit4]   2>   "base_url":"http://127.0.0.1:50896",
   [junit4]   2>   "node_name":"127.0.0.1:50896_",
   [junit4]   2>   "numShards":"2",
   [junit4]   2>   "state":"down",
   [junit4]   2>   "shard":null,
   [junit4]   2>   "collection":"collection1",
   [junit4]   2>   "operation":"state"} current state version: 3
   [junit4]   2> 618700 INFO  (OverseerStateUpdate-94280950447669252-127.0.0.1:50891_-n_0000000000) [n:127.0.0.1:50891_    ] o.a.s.c.o.ReplicaMutator Update state numShards=2 message={
   [junit4]   2>   "core":"collection1",
   [junit4]   2>   "roles":null,
   [junit4]   2>   "base_url":"http://127.0.0.1:50896",
   [junit4]   2>   "node_name":"127.0.0.1:50896_",
   [junit4]   2>   "numShards":"2",
   [junit4]   2>   "state":"down",
   [junit4]   2>   "shard":null,
   [junit4]   2>   "collection":"collection1",
   [junit4]   2>   "operation":"state"}
   [junit4]   2> 618700 INFO  (OverseerStateUpdate-94280950447669252-127.0.0.1:50891_-n_0000000000) [n:127.0.0.1:50891_    ] o.a.s.c.o.ClusterStateMutator building a new cName: collection1
   [junit4]   2> 618701 INFO  (OverseerStateUpdate-94280950447669252-127.0.0.1:50891_-n_0000000000) [n:127.0.0.1:50891_    ] o.a.s.c.o.ReplicaMutator Assigning new node to shard shard=shard2
   [junit4]   2> 618702 INFO  (zkCallback-559-thread-1-processing-n:127.0.0.1:50891_) [n:127.0.0.1:50891_    ] o.a.s.c.c.ZkStateReader A cluster state change: WatchedEvent state:SyncConnected type:NodeDataChanged path:/clusterstate.json, has occurred - updating... (live nodes size: 2)
   [junit4]   2> 618702 INFO  (zkCallback-565-thread-1-processing-n:127.0.0.1:50896_) [n:127.0.0.1:50896_    ] o.a.s.c.c.ZkStateReader A cluster state change: WatchedEvent state:SyncConnected type:NodeDataChanged path:/clusterstate.json, has occurred - updating... (live nodes size: 2)
   [junit4]   2> 618703 INFO  (zkCallback-561-thread-1) [    ] o.a.s.c.c.ZkStateReader A cluster state change: WatchedEvent state:SyncConnected type:NodeDataChanged path:/clusterstate.json, has occurred - updating... (live nodes size: 2)
   [junit4]   2> 618707 INFO  (zkCallback-559-thread-1-processing-n:127.0.0.1:50891_) [n:127.0.0.1:50891_    ] o.a.s.c.c.ZkStateReader Updated cluster state version to 4
   [junit4]   2> 618707 INFO  (zkCallback-561-thread-1) [    ] o.a.s.c.c.ZkStateReader Updated cluster state version to 4
   [junit4]   2> 618707 INFO  (zkCallback-565-thread-1-processing-n:127.0.0.1:50896_) [n:127.0.0.1:50896_    ] o.a.s.c.c.ZkStateReader Updated cluster state version to 4
   [junit4]   2> 619699 INFO  (coreLoadExecutor-2022-thread-1-processing-n:127.0.0.1:50896_) [n:127.0.0.1:50896_ c:collection1   x:collection1] o.a.s.c.ZkController waiting to find shard id in clusterstate for collection1
   [junit4]   2> 619699 INFO  (coreLoadExecutor-2022-thread-1-processing-n:127.0.0.1:50896_) [n:127.0.0.1:50896_ c:collection1   x:collection1] o.a.s.c.ZkController Check for collection zkNode:collection1
   [junit4]   2> 619700 INFO  (coreLoadExecutor-2022-thread-1-processing-n:127.0.0.1:50896_) [n:127.0.0.1:50896_ c:collection1   x:collection1] o.a.s.c.ZkController Collection zkNode exists
   [junit4]   2> 619700 INFO  (coreLoadExecutor-2022-thread-1-processing-n:127.0.0.1:50896_) [n:127.0.0.1:50896_ c:collection1   x:collection1] o.a.s.c.c.ZkStateReader Load collection config from:/collections/collection1
   [junit4]   2> 619702 INFO  (coreLoadExecutor-2022-thread-1-processing-n:127.0.0.1:50896_) [n:127.0.0.1:50896_ c:collection1   x:collection1] o.a.s.c.c.ZkStateReader path=/collections/collection1 configName=conf1 specified config exists in ZooKeeper
   [junit4]   2> 619702 INFO  (coreLoadExecutor-2022-thread-1-processing-n:127.0.0.1:50896_) [n:127.0.0.1:50896_ c:collection1   x:collection1] o.a.s.c.SolrResourceLoader new SolrResourceLoader for directory: '/Users/jenkins/workspace/Lucene-Solr-trunk-MacOSX/solr/build/solr-core/test/J1/temp/solr.cloud.CollectionsAPIDistributedZkTest_BFB2B76258017827-001/shard-1-001/cores/collection1/'
   [junit4]   2> 619713 INFO  (coreLoadExecutor-2022-thread-1-processing-n:127.0.0.1:50896_) [n:127.0.0.1:50896_ c:collection1   x:collection1] o.a.s.c.Config loaded config solrconfig.xml with version 0 
   [junit4]   2> 619719 INFO  (coreLoadExecutor-2022-thread-1-processing-n:127.0.0.1:50896_) [n:127.0.0.1:50896_ c:collection1   x:collection1] o.a.s.c.SolrConfig current version of requestparams : -1
   [junit4]   2> 619722 INFO  (coreLoadExecutor-2022-thread-1-processing-n:127.0.0.1:50896_) [n:127.0.0.1:50896_ c:collection1   x:collection1] o.a.s.c.SolrConfig Using Lucene MatchVersion: 6.0.0
   [junit4]   2> 619728 INFO  (coreLoadExecutor-2022-thread-1-processing-n:127.0.0.1:50896_) [n:127.0.0.1:50896_ c:collection1   x:collection1] o.a.s.c.Config Loaded SolrConfig: solrconfig.xml
   [junit4]   2> 619730 INFO  (coreLoadExecutor-2022-thread-1-processing-n:127.0.0.1:50896_) [n:127.0.0.1:50896_ c:collection1   x:collection1] o.a.s.s.IndexSchema Reading Solr Schema from /configs/conf1/schema.xml
   [junit4]   2> 619735 INFO  (coreLoadExecutor-2022-thread-1-processing-n:127.0.0.1:50896_) [n:127.0.0.1:50896_ c:collection1   x:collection1] o.a.s.s.IndexSchema [collection1] Schema name=test
   [junit4]   2> 619864 INFO  (coreLoadExecutor-2022-thread-1-processing-n:127.0.0.1:50896_) [n:127.0.0.1:50896_ c:collection1   x:collection1] o.a.s.s.OpenExchangeRatesOrgProvider Initialized with rates=open-exchange-rates.json, refreshInterval=1440.
   [junit4]   2> 619870 INFO  (coreLoadExecutor-2022-thread-1-processing-n:127.0.0.1:50896_) [n:127.0.0.1:50896_ c:collection1   x:collection1] o.a.s.s.IndexSchema default search field in schema is text
   [junit4]   2> 619871 INFO  (coreLoadExecutor-2022-thread-1-processing-n:127.0.0.1:50896_) [n:127.0.0.1:50896_ c:collection1   x:collection1] o.a.s.s.IndexSchema unique key field: id
   [junit4]   2> 619888 INFO  (coreLoadExecutor-2022-thread-1-processing-n:127.0.0.1:50896_) [n:127.0.0.1:50896_ c:collection1   x:collection1] o.a.s.s.FileExchangeRateProvider Reloading exchange rates from file currency.xml
   [junit4]   2> 619891 INFO  (coreLoadExecutor-2022-thread-1-processing-n:127.0.0.1:50896_) [n:127.0.0.1:50896_ c:collection1   x:collection1] o.a.s.s.FileExchangeRateProvider Reloading exchange rates from file currency.xml
   [junit4]   2> 619893 INFO  (coreLoadExecutor-2022-thread-1-processing-n:127.0.0.1:50896_) [n:127.0.0.1:50896_ c:collection1   x:collection1] o.a.s.s.OpenExchangeRatesOrgProvider Reloading exchange rates from open-exchange-rates.json
   [junit4]   2> 619896 WARN  (coreLoadExecutor-2022-thread-1-processing-n:127.0.0.1:50896_) [n:127.0.0.1:50896_ c:collection1   x:collection1] o.a.s.s.OpenExchangeRatesOrgProvider Unknown key IMPORTANT NOTE
   [junit4]   2> 619896 WARN  (coreLoadExecutor-2022-thread-1-processing-n:127.0.0.1:50896_) [n:127.0.0.1:50896_ c:collection1   x:collection1] o.a.s.s.OpenExchangeRatesOrgProvider Expected key, got STRING
   [junit4]   2> 619896 INFO  (coreLoadExecutor-2022-thread-1-processing-n:127.0.0.1:50896_) [n:127.0.0.1:50896_ c:collection1   x:collection1] o.a.s.s.OpenExchangeRatesOrgProvider Reloading exchange rates from open-exchange-rates.json
   [junit4]   2> 619898 WARN  (coreLoadExecutor-2022-thread-1-processing-n:127.0.0.1:50896_) [n:127.0.0.1:50896_ c:collection1   x:collection1] o.a.s.s.OpenExchangeRatesOrgProvider Unknown key IMPORTANT NOTE
   [junit4]   2> 619898 WARN  (coreLoadExecutor-2022-thread-1-processing-n:127.0.0.1:50896_) [n:127.0.0.1:50896_ c:collection1   x:collection1] o.a.s.s.OpenExchangeRatesOrgProvider Expected key, got STRING
   [junit4]   2> 619900 INFO  (coreLoadExecutor-2022-thread-1-processing-n:127.0.0.1:50896_) [n:127.0.0.1:50896_ c:collection1   x:collection1] o.a.s.c.ConfigSetProperties Did not find ConfigSet properties, assuming default properties: Can't find resource 'configsetprops.json' in classpath or '/configs/conf1', cwd=/Users/jenkins/workspace/Lucene-Solr-trunk-MacOSX/solr/build/solr-core/test/J1
   [junit4]   2> 619900 INFO  (coreLoadExecutor-2022-thread-1-processing-n:127.0.0.1:50896_) [n:127.0.0.1:50896_ c:collection1   x:collection1] o.a.s.c.CoreContainer Creating SolrCore 'collection1' using configuration from collection collection1
   [junit4]   2> 619900 INFO  (coreLoadExecutor-2022-thread-1-processing-n:127.0.0.1:50896_) [n:127.0.0.1:50896_ c:collection1 s:shard2 r:core_node1 x:collection1] o.a.s.c.SolrCore org.apache.solr.core.MockDirectoryFactory
   [junit4]   2> 619900 INFO  (coreLoadExecutor-2022-thread-1-processing-n:127.0.0.1:50896_) [n:127.0.0.1:50896_ c:collection1 s:shard2 r:core_node1 x:collection1] o.a.s.c.SolrCore [[collection1] ] Opening new SolrCore at [/Users/jenkins/workspace/Lucene-Solr-trunk-MacOSX/solr/build/solr-core/test/J1/temp/solr.cloud.CollectionsAPIDistributedZkTest_BFB2B76258017827-001/shard-1-001/cores/collection1/], dataDir=[null]
   [junit4]   2> 619900 INFO  (coreLoadExecutor-2022-thread-1-processing-n:127.0.0.1:50896_) [n:127.0.0.1:50896_ c:collection1 s:shard2 r:core_node1 x:collection1] o.a.s.c.JmxMonitoredMap JMX monitoring is enabled. Adding Solr mbeans to JMX Server: com.sun.jmx.mbeanserver.JmxMBeanServer@27b64086
   [junit4]   2> 619901 INFO  (coreLoadExecutor-2022-thread-1-processing-n:127.0.0.1:50896_) [n:127.0.0.1:50896_ c:collection1 s:shard2 r:core_node1 x:collection1] o.a.s.c.CachingDirectoryFactory return new directory for /Users/jenkins/workspace/Lucene-Solr-trunk-MacOSX/solr/build/solr-core/test/J1/temp/solr.cloud.CollectionsAPIDistributedZkTest_BFB2B76258017827-001/shard-1-001/cores/collection1/data
   [junit4]   2> 619901 INFO  (coreLoadExecutor-2022-thread-1-processing-n:127.0.0.1:50896_) [n:127.0.0.1:50896_ c:collection1 s:shard2 r:core_node1 x:collection1] o.a.s.c.SolrCore New index directory detected: old=null new=/Users/jenkins/workspace/Lucene-Solr-trunk-MacOSX/solr/build/solr-core/test/J1/temp/solr.cloud.CollectionsAPIDistributedZkTest_BFB2B76258017827-001/shard-1-001/cores/collection1/data/index/
   [junit4]   2> 619901 WARN  (coreLoadExecutor-2022-thread-1-processing-n:127.0.0.1:50896_) [n:127.0.0.1:50896_ c:collection1 s:shard2 r:core_node1 x:collection1] o.a.s.c.SolrCore [collection1] Solr index directory '/Users/jenkins/workspace/Lucene-Solr-trunk-MacOSX/solr/build/solr-core/test/J1/temp/solr.cloud.CollectionsAPIDistributedZkTest_BFB2B76258017827-001/shard-1-001/cores/collection1/data/index' doesn't exist. Creating new index...
   [junit4]   2> 619901 INFO  (coreLoadExecutor-2022-thread-1-processing-n:127.0.0.1:50896_) [n:127.0.0.1:50896_ c:collection1 s:shard2 r:core_node1 x:collection1] o.a.s.c.CachingDirectoryFactory return new directory for /Users/jenkins/workspace/Lucene-Solr-trunk-MacOSX/solr/build/solr-core/test/J1/temp/solr.cloud.CollectionsAPIDistributedZkTest_BFB2B76258017827-001/shard-1-001/cores/collection1/data/index
   [junit4]   2> 619902 INFO  (coreLoadExecutor-2022-thread-1-processing-n:127.0.0.1:50896_) [n:127.0.0.1:50896_ c:collection1 s:shard2 r:core_node1 x:collection1] o.a.s.u.RandomMergePolicy RandomMergePolicy wrapping class org.apache.lucene.index.TieredMerg

[...truncated too long message...]

it4]   2> 	2	/solr/overseer_elect/election/94281047321346079-127.0.0.1:55535_jbci%2Fn-n_0000000007
   [junit4]   2> 	2	/solr/overseer_elect/election/94281047321346229-127.0.0.1:55500_jbci%2Fn-n_0000000013
   [junit4]   2> 	2	/solr/collections/target_collection/leader_elect/shard2/election/94281047321346116-core_node2-n_0000000000
   [junit4]   2> 	2	/solr/collections/source_collection/leader_elect/shard1/election/94281047321346061-core_node1-n_0000000000
   [junit4]   2> 	2	/solr/collections/target_collection/leader_elect/shard1/election/94281047321346073-core_node4-n_0000000000
   [junit4]   2> 
   [junit4]   2> Maximum concurrent children watches above limit:
   [junit4]   2> 
   [junit4]   2> 	285	/solr/live_nodes
   [junit4]   2> 	5	/solr/overseer/collection-queue-work
   [junit4]   2> 	4	/solr/overseer/queue
   [junit4]   2> 
   [junit4]   2> NOTE: reproduce with: ant test  -Dtestcase=CdcrReplicationDistributedZkTest -Dtests.method=doTests -Dtests.seed=BFB2B76258017827 -Dtests.slow=true -Dtests.locale=sr -Dtests.timezone=America/Cancun -Dtests.asserts=true -Dtests.file.encoding=UTF-8
   [junit4] FAILURE  416s J1 | CdcrReplicationDistributedZkTest.doTests <<<
   [junit4]    > Throwable #1: java.lang.AssertionError: Timeout while trying to assert update logs @ collection=source_collection
   [junit4]    > 	at __randomizedtesting.SeedInfo.seed([BFB2B76258017827:B7D2C24E570F502C]:0)
   [junit4]    > 	at org.apache.solr.cloud.CdcrReplicationDistributedZkTest.assertNumberOfTlogFiles(CdcrReplicationDistributedZkTest.java:644)
   [junit4]    > 	at org.apache.solr.cloud.CdcrReplicationDistributedZkTest.doTestUpdateLogSynchronisation(CdcrReplicationDistributedZkTest.java:384)
   [junit4]    > 	at org.apache.solr.cloud.CdcrReplicationDistributedZkTest.doTests(CdcrReplicationDistributedZkTest.java:50)
   [junit4]    > 	at org.apache.solr.BaseDistributedSearchTestCase$ShardsRepeatRule$ShardsFixedStatement.callStatement(BaseDistributedSearchTestCase.java:966)
   [junit4]    > 	at org.apache.solr.BaseDistributedSearchTestCase$ShardsRepeatRule$ShardsStatement.evaluate(BaseDistributedSearchTestCase.java:941)
   [junit4]    > 	at java.lang.Thread.run(Thread.java:745)
   [junit4]    > Caused by: java.lang.AssertionError: Number of tlogs on leader: 70 is superior to: 50.
   [junit4]    > 	at org.apache.solr.cloud.CdcrReplicationDistributedZkTest._assertNumberOfTlogFiles(CdcrReplicationDistributedZkTest.java:671)
   [junit4]    > 	at org.apache.solr.cloud.CdcrReplicationDistributedZkTest.assertNumberOfTlogFiles(CdcrReplicationDistributedZkTest.java:634)
   [junit4]    > 	... 43 more
   [junit4]   2> 2508358 INFO  (SUITE-CdcrReplicationDistributedZkTest-seed#[BFB2B76258017827]-worker) [n:127.0.0.1:55535_jbci%2Fn c:target_collection s:shard2 r:core_node3 x:target_collection_shard2_replica2] o.a.s.SolrTestCaseJ4 ###deleteCore
   [junit4]   2> NOTE: leaving temporary files on disk at: /Users/jenkins/workspace/Lucene-Solr-trunk-MacOSX/solr/build/solr-core/test/J1/temp/solr.cloud.CdcrReplicationDistributedZkTest_BFB2B76258017827-001
   [junit4]   2> NOTE: test params are: codec=Asserting(Lucene53), sim=DefaultSimilarity, locale=sr, timezone=America/Cancun
   [junit4]   2> NOTE: Mac OS X 10.8.5 x86_64/Oracle Corporation 1.8.0_51 (64-bit)/cpus=3,threads=1,free=218017640,total=524288000
   [junit4]   2> NOTE: All tests run in this JVM: [TestRandomFaceting, TestBadConfig, CdcrRequestHandlerTest, DistributedQueryComponentOptimizationTest, TestShortCircuitedRequests, TestDistributedGrouping, MultiThreadedOCPTest, XsltUpdateRequestHandlerTest, ParsingFieldUpdateProcessorsTest, DataDrivenBlockJoinTest, TestAddFieldRealTimeGet, CdcrVersionReplicationTest, TestCollationFieldDocValues, DisMaxRequestHandlerTest, TestConfigSetImmutable, ZkSolrClientTest, SolrRequestParserTest, SmileWriterTest, TestReversedWildcardFilterFactory, BinaryUpdateRequestHandlerTest, TestFiltering, RankQueryTest, TestValueSourceCache, DistributedDebugComponentTest, EchoParamsTest, ResourceLoaderTest, TestZkChroot, TestCodecSupport, TestSolrDynamicMBean, DistributedFacetPivotSmallAdvancedTest, TestStandardQParsers, SchemaVersionSpecificBehaviorTest, TestManagedSchemaFieldResource, TestPHPSerializedResponseWriter, DistributedTermsComponentTest, FileUtilsTest, MinimalSchemaTest, TestRestManager, TestQuerySenderListener, CachingDirectoryFactoryTest, TestHighlightDedupGrouping, ReturnFieldsTest, CollectionStateFormat2Test, UpdateParamsTest, TestSearchPerf, CloudMLTQParserTest, TestNamedUpdateProcessors, TestRemoteStreaming, TestAuthorizationFramework, TermVectorComponentTest, DirectUpdateHandlerOptimizeTest, DistributedFacetPivotLargeTest, ChangedSchemaMergeTest, TestFuzzyAnalyzedSuggestions, TestOverriddenPrefixQueryForCustomFieldType, SpatialFilterTest, BasicZkTest, FullHLLTest, AutoCommitTest, TestRangeQuery, TestQuerySenderNoQuery, TermVectorComponentDistributedTest, SolrIndexConfigTest, CollectionsAPIDistributedZkTest, HdfsUnloadDistributedZkTest, CollectionTooManyReplicasTest, StressHdfsTest, BasicFunctionalityTest, TestNoOpRegenerator, RollingRestartTest, TestReload, LeaderElectionIntegrationTest, LeaderFailoverAfterPartitionTest, TestManagedSchemaFieldTypeResource, HighlighterTest, JsonLoaderTest, CopyFieldTest, TestTrie, SpellCheckCollatorTest, ZkNodePropsTest, DateMathParserTest, HighlighterMaxOffsetTest, TestConfigOverlay, EnumFieldTest, PrimitiveFieldTypeTest, TestManagedResource, TestSortingResponseWriter, TestRealTimeGet, AddBlockUpdateTest, SuggesterTSTTest, CoreMergeIndexesAdminHandlerTest, FileBasedSpellCheckerTest, TestJsonFacets, TestSolrDeletionPolicy1, DistributedMLTComponentTest, TestMiniSolrCloudCluster, TestSolrCoreProperties, AssignTest, TestManagedSynonymFilterFactory, UpdateRequestProcessorFactoryTest, TestDFRSimilarityFactory, PluginInfoTest, FastVectorHighlighterTest, TestFieldResource, TestMaxScoreQueryParser, CleanupOldIndexTest, JavabinLoaderTest, TestChildDocTransformer, HighlighterConfigTest, DistributedFacetPivotWhiteBoxTest, ShardSplitTest, BigEndianAscendingWordSerializerTest, AnalyticsQueryTest, ChaosMonkeySafeLeaderTest, BitVectorTest, TestSolrConfigHandlerConcurrent, DistribCursorPagingTest, TestPivotHelperCode, TestSolrJ, TestDefaultSimilarityFactory, TestSuggestSpellingConverter, HdfsThreadLeakTest, CurrencyFieldOpenExchangeTest, NotRequiredUniqueKeyTest, BasicDistributedZk2Test, DistribJoinFromCollectionTest, TestLMDirichletSimilarityFactory, UnloadDistributedZkTest, SyncSliceTest, RecoveryZkTest, ClusterStateUpdateTest, LeaderElectionTest, TestFaceting, TestRecovery, TestHashPartitioner, ZkControllerTest, TestStressReorder, TestJoin, HardAutoCommitTest, TestCoreContainer, SimpleFacetsTest, TestSolr4Spatial, SolrCoreTest, StatsComponentTest, SpellCheckComponentTest, TestGroupingSearch, SolrCmdDistributorTest, QueryElevationComponentTest, PeerSyncTest, BadIndexSchemaTest, ConvertedLegacyTest, TestSort, DirectUpdateHandlerTest, OverseerCollectionProcessorTest, TestIndexSearcher, ShowFileRequestHandlerTest, CurrencyFieldXmlFileTest, SolrIndexSplitterTest, SimplePostToolTest, TestCoreDiscovery, SignatureUpdateProcessorFactoryTest, CoreAdminHandlerTest, TestFoldingMultitermQuery, DocValuesTest, SuggesterTest, TestStressLucene, PolyFieldTest, NoCacheHeaderTest, WordBreakSolrSpellCheckerTest, TestPseudoReturnFields, FieldMutatingUpdateProcessorTest, TestWordDelimiterFilterFactory, QueryEqualityTest, StatelessScriptUpdateProcessorFactoryTest, SortByFunctionTest, DocValuesMultiTest, SolrInfoMBeanTest, IndexBasedSpellCheckerTest, StandardRequestHandlerTest, TestWriterPerf, DocumentAnalysisRequestHandlerTest, TermsComponentTest, DocumentBuilderTest, MoreLikeThisHandlerTest, TestArbitraryIndexDir, LoggingHandlerTest, IndexSchemaTest, JSONWriterTest, MBeansHandlerTest, TestAnalyzedSuggestions, PingRequestHandlerTest, TestLFUCache, TestMergePolicyConfig, TestSolrDeletionPolicy2, TestDocSet, TestBinaryField, TestElisionMultitermQuery, TestConfig, ExternalFileFieldSortTest, TestPostingsSolrHighlighter, TestLuceneMatchVersion, SpellPossibilityIteratorTest, TestPerFieldSimilarity, TestLMJelinekMercerSimilarityFactory, TestFastWriter, TestJmxMonitoredMap, TestFastOutputStream, ScriptEngineTest, OpenExchangeRatesOrgProviderTest, URLClassifyProcessorTest, PreAnalyzedFieldTest, TestSystemIdResolver, PrimUtilsTest, DateFieldTest, SpellingQueryConverterTest, DOMUtilTest, RAMDirectoryFactoryTest, TestUtils, TestDocumentBuilder, SliceStateTest, CircularListTest, TestRTGBase, CursorPagingTest, DistributedIntervalFacetingTest, TestTolerantSearch, TestEmbeddedSolrServerConstructors, TestJettySolrRunner, ActionThrottleTest, AsyncCallRequestStatusResponseTest, BaseCdcrDistributedZkTest, CdcrReplicationDistributedZkTest]
   [junit4] Completed [411/529] on J1 in 415.81s, 1 test, 1 failure <<< FAILURES!

[...truncated 388 lines...]
BUILD FAILED
/Users/jenkins/workspace/Lucene-Solr-trunk-MacOSX/build.xml:716: The following error occurred while executing this line:
/Users/jenkins/workspace/Lucene-Solr-trunk-MacOSX/build.xml:660: The following error occurred while executing this line:
/Users/jenkins/workspace/Lucene-Solr-trunk-MacOSX/build.xml:59: The following error occurred while executing this line:
/Users/jenkins/workspace/Lucene-Solr-trunk-MacOSX/solr/build.xml:230: The following error occurred while executing this line:
/Users/jenkins/workspace/Lucene-Solr-trunk-MacOSX/solr/common-build.xml:514: The following error occurred while executing this line:
/Users/jenkins/workspace/Lucene-Solr-trunk-MacOSX/lucene/common-build.xml:1429: The following error occurred while executing this line:
/Users/jenkins/workspace/Lucene-Solr-trunk-MacOSX/lucene/common-build.xml:984: There were test failures: 529 suites, 2093 tests, 1 error, 1 failure, 70 ignored (29 assumptions)

Total time: 71 minutes 45 seconds
Build step 'Invoke Ant' marked build as failure
Archiving artifacts
Recording test results
Email was triggered for: Failure - Any
Sending email for trigger: Failure - Any



Mime
View raw message