lucene-dev mailing list archives

Site index · List index
Message view « Date » · « Thread »
Top « Date » · « Thread »
From Apache Jenkins Server <jenk...@builds.apache.org>
Subject [JENKINS] Lucene-Solr-NightlyTests-trunk - Build # 773 - Still Failing
Date Sun, 23 Aug 2015 11:38:08 GMT
Build: https://builds.apache.org/job/Lucene-Solr-NightlyTests-trunk/773/

5 tests failed.
FAILED:  junit.framework.TestSuite.org.apache.solr.cloud.ChaosMonkeyNothingIsSafeTest

Error Message:
ERROR: SolrIndexSearcher opens=20 closes=19

Stack Trace:
java.lang.AssertionError: ERROR: SolrIndexSearcher opens=20 closes=19
	at __randomizedtesting.SeedInfo.seed([585170DC09A44684]:0)
	at org.junit.Assert.fail(Assert.java:93)
	at org.apache.solr.SolrTestCaseJ4.endTrackingSearchers(SolrTestCaseJ4.java:467)
	at org.apache.solr.SolrTestCaseJ4.afterClass(SolrTestCaseJ4.java:233)
	at sun.reflect.GeneratedMethodAccessor142.invoke(Unknown Source)
	at sun.reflect.DelegatingMethodAccessorImpl.invoke(DelegatingMethodAccessorImpl.java:43)
	at java.lang.reflect.Method.invoke(Method.java:497)
	at com.carrotsearch.randomizedtesting.RandomizedRunner.invoke(RandomizedRunner.java:1627)
	at com.carrotsearch.randomizedtesting.RandomizedRunner$5.evaluate(RandomizedRunner.java:799)
	at com.carrotsearch.randomizedtesting.rules.StatementAdapter.evaluate(StatementAdapter.java:36)
	at com.carrotsearch.randomizedtesting.rules.SystemPropertiesRestoreRule$1.evaluate(SystemPropertiesRestoreRule.java:57)
	at org.apache.lucene.util.AbstractBeforeAfterRule$1.evaluate(AbstractBeforeAfterRule.java:46)
	at com.carrotsearch.randomizedtesting.rules.StatementAdapter.evaluate(StatementAdapter.java:36)
	at org.apache.lucene.util.TestRuleStoreClassName$1.evaluate(TestRuleStoreClassName.java:42)
	at com.carrotsearch.randomizedtesting.rules.NoShadowingOrOverridesOnMethodsRule$1.evaluate(NoShadowingOrOverridesOnMethodsRule.java:39)
	at com.carrotsearch.randomizedtesting.rules.NoShadowingOrOverridesOnMethodsRule$1.evaluate(NoShadowingOrOverridesOnMethodsRule.java:39)
	at com.carrotsearch.randomizedtesting.rules.StatementAdapter.evaluate(StatementAdapter.java:36)
	at com.carrotsearch.randomizedtesting.rules.StatementAdapter.evaluate(StatementAdapter.java:36)
	at com.carrotsearch.randomizedtesting.rules.StatementAdapter.evaluate(StatementAdapter.java:36)
	at org.apache.lucene.util.TestRuleAssertionsRequired$1.evaluate(TestRuleAssertionsRequired.java:54)
	at org.apache.lucene.util.TestRuleMarkFailure$1.evaluate(TestRuleMarkFailure.java:48)
	at org.apache.lucene.util.TestRuleIgnoreAfterMaxFailures$1.evaluate(TestRuleIgnoreAfterMaxFailures.java:65)
	at org.apache.lucene.util.TestRuleIgnoreTestSuites$1.evaluate(TestRuleIgnoreTestSuites.java:55)
	at com.carrotsearch.randomizedtesting.rules.StatementAdapter.evaluate(StatementAdapter.java:36)
	at com.carrotsearch.randomizedtesting.ThreadLeakControl$StatementRunner.run(ThreadLeakControl.java:365)
	at java.lang.Thread.run(Thread.java:745)


FAILED:  junit.framework.TestSuite.org.apache.solr.cloud.ChaosMonkeyNothingIsSafeTest

Error Message:
2 threads leaked from SUITE scope at org.apache.solr.cloud.ChaosMonkeyNothingIsSafeTest:     1) Thread[id=16026, name=qtp978674930-16026, state=WAITING, group=TGRP-ChaosMonkeyNothingIsSafeTest]         at java.lang.Object.wait(Native Method)         at java.lang.Object.wait(Object.java:502)         at org.apache.solr.client.solrj.impl.ConcurrentUpdateSolrClient.blockUntilFinished(ConcurrentUpdateSolrClient.java:404)         at org.apache.solr.update.StreamingSolrClients.blockUntilFinished(StreamingSolrClients.java:103)         at org.apache.solr.update.SolrCmdDistributor.blockAndDoRetries(SolrCmdDistributor.java:231)         at org.apache.solr.update.SolrCmdDistributor.finish(SolrCmdDistributor.java:89)         at org.apache.solr.update.processor.DistributedUpdateProcessor.doFinish(DistributedUpdateProcessor.java:781)         at org.apache.solr.update.processor.DistributedUpdateProcessor.finish(DistributedUpdateProcessor.java:1655)         at org.apache.solr.update.processor.LogUpdateProcessor.finish(LogUpdateProcessorFactory.java:183)         at org.apache.solr.handler.ContentStreamHandlerBase.handleRequestBody(ContentStreamHandlerBase.java:83)         at org.apache.solr.handler.RequestHandlerBase.handleRequest(RequestHandlerBase.java:151)         at org.apache.solr.core.SolrCore.execute(SolrCore.java:2079)         at org.apache.solr.servlet.HttpSolrCall.execute(HttpSolrCall.java:667)         at org.apache.solr.servlet.HttpSolrCall.call(HttpSolrCall.java:460)         at org.apache.solr.servlet.SolrDispatchFilter.doFilter(SolrDispatchFilter.java:210)         at org.apache.solr.servlet.SolrDispatchFilter.doFilter(SolrDispatchFilter.java:179)         at org.eclipse.jetty.servlet.ServletHandler$CachedChain.doFilter(ServletHandler.java:1652)         at org.apache.solr.client.solrj.embedded.JettySolrRunner$DebugFilter.doFilter(JettySolrRunner.java:106)         at org.eclipse.jetty.servlet.ServletHandler$CachedChain.doFilter(ServletHandler.java:1652)         at org.eclipse.jetty.servlets.UserAgentFilter.doFilter(UserAgentFilter.java:83)         at org.eclipse.jetty.servlets.GzipFilter.doFilter(GzipFilter.java:300)         at org.eclipse.jetty.servlet.ServletHandler$CachedChain.doFilter(ServletHandler.java:1652)         at org.eclipse.jetty.servlet.ServletHandler.doHandle(ServletHandler.java:585)         at org.eclipse.jetty.server.session.SessionHandler.doHandle(SessionHandler.java:221)         at org.eclipse.jetty.server.handler.ContextHandler.doHandle(ContextHandler.java:1127)         at org.eclipse.jetty.servlet.ServletHandler.doScope(ServletHandler.java:515)         at org.eclipse.jetty.server.session.SessionHandler.doScope(SessionHandler.java:185)         at org.eclipse.jetty.server.handler.ContextHandler.doScope(ContextHandler.java:1061)         at org.eclipse.jetty.server.handler.ScopedHandler.handle(ScopedHandler.java:141)         at org.eclipse.jetty.server.handler.HandlerWrapper.handle(HandlerWrapper.java:97)         at org.eclipse.jetty.server.Server.handle(Server.java:499)         at org.eclipse.jetty.server.HttpChannel.handle(HttpChannel.java:310)         at org.eclipse.jetty.server.HttpConnection.onFillable(HttpConnection.java:257)         at org.eclipse.jetty.io.AbstractConnection$2.run(AbstractConnection.java:540)         at org.eclipse.jetty.util.thread.QueuedThreadPool.runJob(QueuedThreadPool.java:635)         at org.eclipse.jetty.util.thread.QueuedThreadPool$3.run(QueuedThreadPool.java:555)         at java.lang.Thread.run(Thread.java:745)    2) Thread[id=16045, name=searcherExecutor-4181-thread-1, state=WAITING, group=TGRP-ChaosMonkeyNothingIsSafeTest]         at sun.misc.Unsafe.park(Native Method)         at java.util.concurrent.locks.LockSupport.park(LockSupport.java:175)         at java.util.concurrent.locks.AbstractQueuedSynchronizer$ConditionObject.await(AbstractQueuedSynchronizer.java:2039)         at java.util.concurrent.LinkedBlockingQueue.take(LinkedBlockingQueue.java:442)         at java.util.concurrent.ThreadPoolExecutor.getTask(ThreadPoolExecutor.java:1067)         at java.util.concurrent.ThreadPoolExecutor.runWorker(ThreadPoolExecutor.java:1127)         at java.util.concurrent.ThreadPoolExecutor$Worker.run(ThreadPoolExecutor.java:617)         at java.lang.Thread.run(Thread.java:745)

Stack Trace:
com.carrotsearch.randomizedtesting.ThreadLeakError: 2 threads leaked from SUITE scope at org.apache.solr.cloud.ChaosMonkeyNothingIsSafeTest: 
   1) Thread[id=16026, name=qtp978674930-16026, state=WAITING, group=TGRP-ChaosMonkeyNothingIsSafeTest]
        at java.lang.Object.wait(Native Method)
        at java.lang.Object.wait(Object.java:502)
        at org.apache.solr.client.solrj.impl.ConcurrentUpdateSolrClient.blockUntilFinished(ConcurrentUpdateSolrClient.java:404)
        at org.apache.solr.update.StreamingSolrClients.blockUntilFinished(StreamingSolrClients.java:103)
        at org.apache.solr.update.SolrCmdDistributor.blockAndDoRetries(SolrCmdDistributor.java:231)
        at org.apache.solr.update.SolrCmdDistributor.finish(SolrCmdDistributor.java:89)
        at org.apache.solr.update.processor.DistributedUpdateProcessor.doFinish(DistributedUpdateProcessor.java:781)
        at org.apache.solr.update.processor.DistributedUpdateProcessor.finish(DistributedUpdateProcessor.java:1655)
        at org.apache.solr.update.processor.LogUpdateProcessor.finish(LogUpdateProcessorFactory.java:183)
        at org.apache.solr.handler.ContentStreamHandlerBase.handleRequestBody(ContentStreamHandlerBase.java:83)
        at org.apache.solr.handler.RequestHandlerBase.handleRequest(RequestHandlerBase.java:151)
        at org.apache.solr.core.SolrCore.execute(SolrCore.java:2079)
        at org.apache.solr.servlet.HttpSolrCall.execute(HttpSolrCall.java:667)
        at org.apache.solr.servlet.HttpSolrCall.call(HttpSolrCall.java:460)
        at org.apache.solr.servlet.SolrDispatchFilter.doFilter(SolrDispatchFilter.java:210)
        at org.apache.solr.servlet.SolrDispatchFilter.doFilter(SolrDispatchFilter.java:179)
        at org.eclipse.jetty.servlet.ServletHandler$CachedChain.doFilter(ServletHandler.java:1652)
        at org.apache.solr.client.solrj.embedded.JettySolrRunner$DebugFilter.doFilter(JettySolrRunner.java:106)
        at org.eclipse.jetty.servlet.ServletHandler$CachedChain.doFilter(ServletHandler.java:1652)
        at org.eclipse.jetty.servlets.UserAgentFilter.doFilter(UserAgentFilter.java:83)
        at org.eclipse.jetty.servlets.GzipFilter.doFilter(GzipFilter.java:300)
        at org.eclipse.jetty.servlet.ServletHandler$CachedChain.doFilter(ServletHandler.java:1652)
        at org.eclipse.jetty.servlet.ServletHandler.doHandle(ServletHandler.java:585)
        at org.eclipse.jetty.server.session.SessionHandler.doHandle(SessionHandler.java:221)
        at org.eclipse.jetty.server.handler.ContextHandler.doHandle(ContextHandler.java:1127)
        at org.eclipse.jetty.servlet.ServletHandler.doScope(ServletHandler.java:515)
        at org.eclipse.jetty.server.session.SessionHandler.doScope(SessionHandler.java:185)
        at org.eclipse.jetty.server.handler.ContextHandler.doScope(ContextHandler.java:1061)
        at org.eclipse.jetty.server.handler.ScopedHandler.handle(ScopedHandler.java:141)
        at org.eclipse.jetty.server.handler.HandlerWrapper.handle(HandlerWrapper.java:97)
        at org.eclipse.jetty.server.Server.handle(Server.java:499)
        at org.eclipse.jetty.server.HttpChannel.handle(HttpChannel.java:310)
        at org.eclipse.jetty.server.HttpConnection.onFillable(HttpConnection.java:257)
        at org.eclipse.jetty.io.AbstractConnection$2.run(AbstractConnection.java:540)
        at org.eclipse.jetty.util.thread.QueuedThreadPool.runJob(QueuedThreadPool.java:635)
        at org.eclipse.jetty.util.thread.QueuedThreadPool$3.run(QueuedThreadPool.java:555)
        at java.lang.Thread.run(Thread.java:745)
   2) Thread[id=16045, name=searcherExecutor-4181-thread-1, state=WAITING, group=TGRP-ChaosMonkeyNothingIsSafeTest]
        at sun.misc.Unsafe.park(Native Method)
        at java.util.concurrent.locks.LockSupport.park(LockSupport.java:175)
        at java.util.concurrent.locks.AbstractQueuedSynchronizer$ConditionObject.await(AbstractQueuedSynchronizer.java:2039)
        at java.util.concurrent.LinkedBlockingQueue.take(LinkedBlockingQueue.java:442)
        at java.util.concurrent.ThreadPoolExecutor.getTask(ThreadPoolExecutor.java:1067)
        at java.util.concurrent.ThreadPoolExecutor.runWorker(ThreadPoolExecutor.java:1127)
        at java.util.concurrent.ThreadPoolExecutor$Worker.run(ThreadPoolExecutor.java:617)
        at java.lang.Thread.run(Thread.java:745)
	at __randomizedtesting.SeedInfo.seed([585170DC09A44684]:0)


REGRESSION:  org.apache.solr.handler.TestReplicationHandler.doTestReplicateAfterCoreReload

Error Message:
expected:<[{indexVersion=1440327373113,generation=2,filelist=[_1bo2.cfe, _1bo2.cfs, _1bo2.si, _1buc.cfe, _1buc.cfs, _1buc.si, _1buj.cfe, _1buj.cfs, _1buj.si, _1buk.cfe, _1buk.cfs, _1buk.si, _1bul.cfe, _1bul.cfs, _1bul.si, _1bum.cfe, _1bum.cfs, _1bum.si, _1bun.cfe, _1bun.cfs, _1bun.si, _1bvd.cfe, _1bvd.cfs, _1bvd.si, _1bve.cfe, _1bve.cfs, _1bve.si, _1bvh.cfe, _1bvh.cfs, _1bvh.si, _1bvj.cfe, _1bvj.cfs, _1bvj.si, _1bvk.cfe, _1bvk.cfs, _1bvk.si, _1bvl.cfe, _1bvl.cfs, _1bvl.si, _1bvm.cfe, _1bvm.cfs, _1bvm.si, _1bvn.cfe, _1bvn.cfs, _1bvn.si, _1bvo.cfe, _1bvo.cfs, _1bvo.si, _1bvp.fdt, _1bvp.fdx, _1bvp.fnm, _1bvp.nvd, _1bvp.nvm, _1bvp.si, _1bvp_FSTOrd50_0.doc, _1bvp_FSTOrd50_0.tbk, _1bvp_FSTOrd50_0.tix, segments_2]}]> but was:<[{indexVersion=1440327373113,generation=2,filelist=[_1bo2.cfe, _1bo2.cfs, _1bo2.si, _1buc.cfe, _1buc.cfs, _1buc.si, _1buj.cfe, _1buj.cfs, _1buj.si, _1buk.cfe, _1buk.cfs, _1buk.si, _1bul.cfe, _1bul.cfs, _1bul.si, _1bum.cfe, _1bum.cfs, _1bum.si, _1bun.cfe, _1bun.cfs, _1bun.si, _1bvd.cfe, _1bvd.cfs, _1bvd.si, _1bve.cfe, _1bve.cfs, _1bve.si, _1bvh.cfe, _1bvh.cfs, _1bvh.si, _1bvj.cfe, _1bvj.cfs, _1bvj.si, _1bvk.cfe, _1bvk.cfs, _1bvk.si, _1bvl.cfe, _1bvl.cfs, _1bvl.si, _1bvm.cfe, _1bvm.cfs, _1bvm.si, _1bvn.cfe, _1bvn.cfs, _1bvn.si, _1bvo.cfe, _1bvo.cfs, _1bvo.si, _1bvp.fdt, _1bvp.fdx, _1bvp.fnm, _1bvp.nvd, _1bvp.nvm, _1bvp.si, _1bvp_FSTOrd50_0.doc, _1bvp_FSTOrd50_0.tbk, _1bvp_FSTOrd50_0.tix, segments_2]}, {indexVersion=1440327373113,generation=3,filelist=[_1bup.cfe, _1bup.cfs, _1bup.si, _1bvd.cfe, _1bvd.cfs, _1bvd.si, _1bve.cfe, _1bve.cfs, _1bve.si, _1bvh.cfe, _1bvh.cfs, _1bvh.si, _1bvm.cfe, _1bvm.cfs, _1bvm.si, _1bvo.cfe, _1bvo.cfs, _1bvo.si, _1bvp.fdt, _1bvp.fdx, _1bvp.fnm, _1bvp.nvd, _1bvp.nvm, _1bvp.si, _1bvp_FSTOrd50_0.doc, _1bvp_FSTOrd50_0.tbk, _1bvp_FSTOrd50_0.tix, _1bvq.cfe, _1bvq.cfs, _1bvq.si, segments_3]}]>

Stack Trace:
java.lang.AssertionError: expected:<[{indexVersion=1440327373113,generation=2,filelist=[_1bo2.cfe, _1bo2.cfs, _1bo2.si, _1buc.cfe, _1buc.cfs, _1buc.si, _1buj.cfe, _1buj.cfs, _1buj.si, _1buk.cfe, _1buk.cfs, _1buk.si, _1bul.cfe, _1bul.cfs, _1bul.si, _1bum.cfe, _1bum.cfs, _1bum.si, _1bun.cfe, _1bun.cfs, _1bun.si, _1bvd.cfe, _1bvd.cfs, _1bvd.si, _1bve.cfe, _1bve.cfs, _1bve.si, _1bvh.cfe, _1bvh.cfs, _1bvh.si, _1bvj.cfe, _1bvj.cfs, _1bvj.si, _1bvk.cfe, _1bvk.cfs, _1bvk.si, _1bvl.cfe, _1bvl.cfs, _1bvl.si, _1bvm.cfe, _1bvm.cfs, _1bvm.si, _1bvn.cfe, _1bvn.cfs, _1bvn.si, _1bvo.cfe, _1bvo.cfs, _1bvo.si, _1bvp.fdt, _1bvp.fdx, _1bvp.fnm, _1bvp.nvd, _1bvp.nvm, _1bvp.si, _1bvp_FSTOrd50_0.doc, _1bvp_FSTOrd50_0.tbk, _1bvp_FSTOrd50_0.tix, segments_2]}]> but was:<[{indexVersion=1440327373113,generation=2,filelist=[_1bo2.cfe, _1bo2.cfs, _1bo2.si, _1buc.cfe, _1buc.cfs, _1buc.si, _1buj.cfe, _1buj.cfs, _1buj.si, _1buk.cfe, _1buk.cfs, _1buk.si, _1bul.cfe, _1bul.cfs, _1bul.si, _1bum.cfe, _1bum.cfs, _1bum.si, _1bun.cfe, _1bun.cfs, _1bun.si, _1bvd.cfe, _1bvd.cfs, _1bvd.si, _1bve.cfe, _1bve.cfs, _1bve.si, _1bvh.cfe, _1bvh.cfs, _1bvh.si, _1bvj.cfe, _1bvj.cfs, _1bvj.si, _1bvk.cfe, _1bvk.cfs, _1bvk.si, _1bvl.cfe, _1bvl.cfs, _1bvl.si, _1bvm.cfe, _1bvm.cfs, _1bvm.si, _1bvn.cfe, _1bvn.cfs, _1bvn.si, _1bvo.cfe, _1bvo.cfs, _1bvo.si, _1bvp.fdt, _1bvp.fdx, _1bvp.fnm, _1bvp.nvd, _1bvp.nvm, _1bvp.si, _1bvp_FSTOrd50_0.doc, _1bvp_FSTOrd50_0.tbk, _1bvp_FSTOrd50_0.tix, segments_2]}, {indexVersion=1440327373113,generation=3,filelist=[_1bup.cfe, _1bup.cfs, _1bup.si, _1bvd.cfe, _1bvd.cfs, _1bvd.si, _1bve.cfe, _1bve.cfs, _1bve.si, _1bvh.cfe, _1bvh.cfs, _1bvh.si, _1bvm.cfe, _1bvm.cfs, _1bvm.si, _1bvo.cfe, _1bvo.cfs, _1bvo.si, _1bvp.fdt, _1bvp.fdx, _1bvp.fnm, _1bvp.nvd, _1bvp.nvm, _1bvp.si, _1bvp_FSTOrd50_0.doc, _1bvp_FSTOrd50_0.tbk, _1bvp_FSTOrd50_0.tix, _1bvq.cfe, _1bvq.cfs, _1bvq.si, segments_3]}]>
	at __randomizedtesting.SeedInfo.seed([585170DC09A44684:7D866BEC79EC4887]:0)
	at org.junit.Assert.fail(Assert.java:93)
	at org.junit.Assert.failNotEquals(Assert.java:647)
	at org.junit.Assert.assertEquals(Assert.java:128)
	at org.junit.Assert.assertEquals(Assert.java:147)
	at org.apache.solr.handler.TestReplicationHandler.doTestReplicateAfterCoreReload(TestReplicationHandler.java:1138)
	at sun.reflect.NativeMethodAccessorImpl.invoke0(Native Method)
	at sun.reflect.NativeMethodAccessorImpl.invoke(NativeMethodAccessorImpl.java:62)
	at sun.reflect.DelegatingMethodAccessorImpl.invoke(DelegatingMethodAccessorImpl.java:43)
	at java.lang.reflect.Method.invoke(Method.java:497)
	at com.carrotsearch.randomizedtesting.RandomizedRunner.invoke(RandomizedRunner.java:1627)
	at com.carrotsearch.randomizedtesting.RandomizedRunner$6.evaluate(RandomizedRunner.java:836)
	at com.carrotsearch.randomizedtesting.RandomizedRunner$7.evaluate(RandomizedRunner.java:872)
	at com.carrotsearch.randomizedtesting.RandomizedRunner$8.evaluate(RandomizedRunner.java:886)
	at com.carrotsearch.randomizedtesting.rules.SystemPropertiesRestoreRule$1.evaluate(SystemPropertiesRestoreRule.java:57)
	at org.apache.lucene.util.TestRuleSetupTeardownChained$1.evaluate(TestRuleSetupTeardownChained.java:50)
	at org.apache.lucene.util.AbstractBeforeAfterRule$1.evaluate(AbstractBeforeAfterRule.java:46)
	at org.apache.lucene.util.TestRuleThreadAndTestName$1.evaluate(TestRuleThreadAndTestName.java:49)
	at org.apache.lucene.util.TestRuleIgnoreAfterMaxFailures$1.evaluate(TestRuleIgnoreAfterMaxFailures.java:65)
	at org.apache.lucene.util.TestRuleMarkFailure$1.evaluate(TestRuleMarkFailure.java:48)
	at com.carrotsearch.randomizedtesting.rules.StatementAdapter.evaluate(StatementAdapter.java:36)
	at com.carrotsearch.randomizedtesting.ThreadLeakControl$StatementRunner.run(ThreadLeakControl.java:365)
	at com.carrotsearch.randomizedtesting.ThreadLeakControl.forkTimeoutingTask(ThreadLeakControl.java:798)
	at com.carrotsearch.randomizedtesting.ThreadLeakControl$3.evaluate(ThreadLeakControl.java:458)
	at com.carrotsearch.randomizedtesting.RandomizedRunner.runSingleTest(RandomizedRunner.java:845)
	at com.carrotsearch.randomizedtesting.RandomizedRunner$3.evaluate(RandomizedRunner.java:747)
	at com.carrotsearch.randomizedtesting.RandomizedRunner$4.evaluate(RandomizedRunner.java:781)
	at com.carrotsearch.randomizedtesting.RandomizedRunner$5.evaluate(RandomizedRunner.java:792)
	at com.carrotsearch.randomizedtesting.rules.StatementAdapter.evaluate(StatementAdapter.java:36)
	at com.carrotsearch.randomizedtesting.rules.SystemPropertiesRestoreRule$1.evaluate(SystemPropertiesRestoreRule.java:57)
	at org.apache.lucene.util.AbstractBeforeAfterRule$1.evaluate(AbstractBeforeAfterRule.java:46)
	at com.carrotsearch.randomizedtesting.rules.StatementAdapter.evaluate(StatementAdapter.java:36)
	at org.apache.lucene.util.TestRuleStoreClassName$1.evaluate(TestRuleStoreClassName.java:42)
	at com.carrotsearch.randomizedtesting.rules.NoShadowingOrOverridesOnMethodsRule$1.evaluate(NoShadowingOrOverridesOnMethodsRule.java:39)
	at com.carrotsearch.randomizedtesting.rules.NoShadowingOrOverridesOnMethodsRule$1.evaluate(NoShadowingOrOverridesOnMethodsRule.java:39)
	at com.carrotsearch.randomizedtesting.rules.StatementAdapter.evaluate(StatementAdapter.java:36)
	at com.carrotsearch.randomizedtesting.rules.StatementAdapter.evaluate(StatementAdapter.java:36)
	at com.carrotsearch.randomizedtesting.rules.StatementAdapter.evaluate(StatementAdapter.java:36)
	at org.apache.lucene.util.TestRuleAssertionsRequired$1.evaluate(TestRuleAssertionsRequired.java:54)
	at org.apache.lucene.util.TestRuleMarkFailure$1.evaluate(TestRuleMarkFailure.java:48)
	at org.apache.lucene.util.TestRuleIgnoreAfterMaxFailures$1.evaluate(TestRuleIgnoreAfterMaxFailures.java:65)
	at org.apache.lucene.util.TestRuleIgnoreTestSuites$1.evaluate(TestRuleIgnoreTestSuites.java:55)
	at com.carrotsearch.randomizedtesting.rules.StatementAdapter.evaluate(StatementAdapter.java:36)
	at com.carrotsearch.randomizedtesting.ThreadLeakControl$StatementRunner.run(ThreadLeakControl.java:365)
	at java.lang.Thread.run(Thread.java:745)


FAILED:  org.apache.solr.cloud.CollectionsAPIDistributedZkTest.test

Error Message:
Error from server at https://127.0.0.1:38923/whqo/lz: Error CREATEing SolrCore 'halfcollection_shard1_replica1': Error reading cluster properties Caused by: KeeperErrorCode = Session expired for /clusterprops.json

Stack Trace:
org.apache.solr.client.solrj.impl.HttpSolrClient$RemoteSolrException: Error from server at https://127.0.0.1:38923/whqo/lz: Error CREATEing SolrCore 'halfcollection_shard1_replica1': Error reading cluster properties Caused by: KeeperErrorCode = Session expired for /clusterprops.json
	at org.apache.solr.client.solrj.impl.HttpSolrClient.executeMethod(HttpSolrClient.java:560)
	at org.apache.solr.client.solrj.impl.HttpSolrClient.request(HttpSolrClient.java:234)
	at org.apache.solr.client.solrj.impl.HttpSolrClient.request(HttpSolrClient.java:226)
	at org.apache.solr.client.solrj.SolrClient.request(SolrClient.java:1220)
	at org.apache.solr.cloud.CollectionsAPIDistributedZkTest.makeRequest(CollectionsAPIDistributedZkTest.java:302)
	at org.apache.solr.cloud.CollectionsAPIDistributedZkTest.testErrorHandling(CollectionsAPIDistributedZkTest.java:419)
	at org.apache.solr.cloud.CollectionsAPIDistributedZkTest.test(CollectionsAPIDistributedZkTest.java:169)
	at sun.reflect.NativeMethodAccessorImpl.invoke0(Native Method)
	at sun.reflect.NativeMethodAccessorImpl.invoke(NativeMethodAccessorImpl.java:62)
	at sun.reflect.DelegatingMethodAccessorImpl.invoke(DelegatingMethodAccessorImpl.java:43)
	at java.lang.reflect.Method.invoke(Method.java:497)
	at com.carrotsearch.randomizedtesting.RandomizedRunner.invoke(RandomizedRunner.java:1627)
	at com.carrotsearch.randomizedtesting.RandomizedRunner$6.evaluate(RandomizedRunner.java:836)
	at com.carrotsearch.randomizedtesting.RandomizedRunner$7.evaluate(RandomizedRunner.java:872)
	at com.carrotsearch.randomizedtesting.RandomizedRunner$8.evaluate(RandomizedRunner.java:886)
	at org.apache.solr.BaseDistributedSearchTestCase$ShardsRepeatRule$ShardsFixedStatement.callStatement(BaseDistributedSearchTestCase.java:963)
	at org.apache.solr.BaseDistributedSearchTestCase$ShardsRepeatRule$ShardsStatement.evaluate(BaseDistributedSearchTestCase.java:938)
	at com.carrotsearch.randomizedtesting.rules.SystemPropertiesRestoreRule$1.evaluate(SystemPropertiesRestoreRule.java:57)
	at org.apache.lucene.util.TestRuleSetupTeardownChained$1.evaluate(TestRuleSetupTeardownChained.java:50)
	at org.apache.lucene.util.AbstractBeforeAfterRule$1.evaluate(AbstractBeforeAfterRule.java:46)
	at org.apache.lucene.util.TestRuleThreadAndTestName$1.evaluate(TestRuleThreadAndTestName.java:49)
	at org.apache.lucene.util.TestRuleIgnoreAfterMaxFailures$1.evaluate(TestRuleIgnoreAfterMaxFailures.java:65)
	at org.apache.lucene.util.TestRuleMarkFailure$1.evaluate(TestRuleMarkFailure.java:48)
	at com.carrotsearch.randomizedtesting.rules.StatementAdapter.evaluate(StatementAdapter.java:36)
	at com.carrotsearch.randomizedtesting.ThreadLeakControl$StatementRunner.run(ThreadLeakControl.java:365)
	at com.carrotsearch.randomizedtesting.ThreadLeakControl.forkTimeoutingTask(ThreadLeakControl.java:798)
	at com.carrotsearch.randomizedtesting.ThreadLeakControl$3.evaluate(ThreadLeakControl.java:458)
	at com.carrotsearch.randomizedtesting.RandomizedRunner.runSingleTest(RandomizedRunner.java:845)
	at com.carrotsearch.randomizedtesting.RandomizedRunner$3.evaluate(RandomizedRunner.java:747)
	at com.carrotsearch.randomizedtesting.RandomizedRunner$4.evaluate(RandomizedRunner.java:781)
	at com.carrotsearch.randomizedtesting.RandomizedRunner$5.evaluate(RandomizedRunner.java:792)
	at com.carrotsearch.randomizedtesting.rules.StatementAdapter.evaluate(StatementAdapter.java:36)
	at com.carrotsearch.randomizedtesting.rules.SystemPropertiesRestoreRule$1.evaluate(SystemPropertiesRestoreRule.java:57)
	at org.apache.lucene.util.AbstractBeforeAfterRule$1.evaluate(AbstractBeforeAfterRule.java:46)
	at com.carrotsearch.randomizedtesting.rules.StatementAdapter.evaluate(StatementAdapter.java:36)
	at org.apache.lucene.util.TestRuleStoreClassName$1.evaluate(TestRuleStoreClassName.java:42)
	at com.carrotsearch.randomizedtesting.rules.NoShadowingOrOverridesOnMethodsRule$1.evaluate(NoShadowingOrOverridesOnMethodsRule.java:39)
	at com.carrotsearch.randomizedtesting.rules.NoShadowingOrOverridesOnMethodsRule$1.evaluate(NoShadowingOrOverridesOnMethodsRule.java:39)
	at com.carrotsearch.randomizedtesting.rules.StatementAdapter.evaluate(StatementAdapter.java:36)
	at com.carrotsearch.randomizedtesting.rules.StatementAdapter.evaluate(StatementAdapter.java:36)
	at com.carrotsearch.randomizedtesting.rules.StatementAdapter.evaluate(StatementAdapter.java:36)
	at org.apache.lucene.util.TestRuleAssertionsRequired$1.evaluate(TestRuleAssertionsRequired.java:54)
	at org.apache.lucene.util.TestRuleMarkFailure$1.evaluate(TestRuleMarkFailure.java:48)
	at org.apache.lucene.util.TestRuleIgnoreAfterMaxFailures$1.evaluate(TestRuleIgnoreAfterMaxFailures.java:65)
	at org.apache.lucene.util.TestRuleIgnoreTestSuites$1.evaluate(TestRuleIgnoreTestSuites.java:55)
	at com.carrotsearch.randomizedtesting.rules.StatementAdapter.evaluate(StatementAdapter.java:36)
	at com.carrotsearch.randomizedtesting.ThreadLeakControl$StatementRunner.run(ThreadLeakControl.java:365)
	at java.lang.Thread.run(Thread.java:745)


FAILED:  org.apache.solr.cloud.hdfs.HdfsCollectionsAPIDistributedZkTest.test

Error Message:
Captured an uncaught exception in thread: Thread[id=21934, name=collection0, state=RUNNABLE, group=TGRP-HdfsCollectionsAPIDistributedZkTest]

Stack Trace:
com.carrotsearch.randomizedtesting.UncaughtExceptionError: Captured an uncaught exception in thread: Thread[id=21934, name=collection0, state=RUNNABLE, group=TGRP-HdfsCollectionsAPIDistributedZkTest]
Caused by: org.apache.solr.client.solrj.impl.HttpSolrClient$RemoteSolrException: Error from server at http://127.0.0.1:51353: Could not find collection : awholynewstresscollection_collection0_0
	at __randomizedtesting.SeedInfo.seed([585170DC09A44684]:0)
	at org.apache.solr.client.solrj.impl.HttpSolrClient.executeMethod(HttpSolrClient.java:560)
	at org.apache.solr.client.solrj.impl.HttpSolrClient.request(HttpSolrClient.java:234)
	at org.apache.solr.client.solrj.impl.HttpSolrClient.request(HttpSolrClient.java:226)
	at org.apache.solr.client.solrj.impl.LBHttpSolrClient.doRequest(LBHttpSolrClient.java:372)
	at org.apache.solr.client.solrj.impl.LBHttpSolrClient.request(LBHttpSolrClient.java:325)
	at org.apache.solr.client.solrj.impl.CloudSolrClient.sendRequest(CloudSolrClient.java:1086)
	at org.apache.solr.client.solrj.impl.CloudSolrClient.requestWithRetryOnStaleState(CloudSolrClient.java:857)
	at org.apache.solr.client.solrj.impl.CloudSolrClient.request(CloudSolrClient.java:800)
	at org.apache.solr.client.solrj.SolrClient.request(SolrClient.java:1220)
	at org.apache.solr.cloud.CollectionsAPIDistributedZkTest$1CollectionThread.run(CollectionsAPIDistributedZkTest.java:895)




Build Log:
[...truncated 10405 lines...]
   [junit4] Suite: org.apache.solr.cloud.CollectionsAPIDistributedZkTest
   [junit4]   2> Creating dataDir: /x1/jenkins/jenkins-slave/workspace/Lucene-Solr-NightlyTests-trunk/solr/build/solr-core/test/J2/temp/solr.cloud.CollectionsAPIDistributedZkTest_585170DC09A44684-001/init-core-data-001
   [junit4]   2> 1142264 INFO  (SUITE-CollectionsAPIDistributedZkTest-seed#[585170DC09A44684]-worker) [    ] o.a.s.SolrTestCaseJ4 Randomized ssl (true) and clientAuth (false)
   [junit4]   2> 1142265 INFO  (SUITE-CollectionsAPIDistributedZkTest-seed#[585170DC09A44684]-worker) [    ] o.a.s.BaseDistributedSearchTestCase Setting hostContext system property: /whqo/lz
   [junit4]   2> 1142268 INFO  (TEST-CollectionsAPIDistributedZkTest.test-seed#[585170DC09A44684]) [    ] o.a.s.c.ZkTestServer STARTING ZK TEST SERVER
   [junit4]   2> 1142268 INFO  (Thread-7336) [    ] o.a.s.c.ZkTestServer client port:0.0.0.0/0.0.0.0:0
   [junit4]   2> 1142268 INFO  (Thread-7336) [    ] o.a.s.c.ZkTestServer Starting server
   [junit4]   2> 1142368 INFO  (TEST-CollectionsAPIDistributedZkTest.test-seed#[585170DC09A44684]) [    ] o.a.s.c.ZkTestServer start zk server on port:51224
   [junit4]   2> 1142368 INFO  (TEST-CollectionsAPIDistributedZkTest.test-seed#[585170DC09A44684]) [    ] o.a.s.c.c.SolrZkClient Using default ZkCredentialsProvider
   [junit4]   2> 1142369 INFO  (TEST-CollectionsAPIDistributedZkTest.test-seed#[585170DC09A44684]) [    ] o.a.s.c.c.ConnectionManager Waiting for client to connect to ZooKeeper
   [junit4]   2> 1142374 INFO  (zkCallback-974-thread-1) [    ] o.a.s.c.c.ConnectionManager Watcher org.apache.solr.common.cloud.ConnectionManager@2286be79 name:ZooKeeperConnection Watcher:127.0.0.1:51224 got event WatchedEvent state:SyncConnected type:None path:null path:null type:None
   [junit4]   2> 1142374 INFO  (TEST-CollectionsAPIDistributedZkTest.test-seed#[585170DC09A44684]) [    ] o.a.s.c.c.ConnectionManager Client is connected to ZooKeeper
   [junit4]   2> 1142375 INFO  (TEST-CollectionsAPIDistributedZkTest.test-seed#[585170DC09A44684]) [    ] o.a.s.c.c.SolrZkClient Using default ZkACLProvider
   [junit4]   2> 1142375 INFO  (TEST-CollectionsAPIDistributedZkTest.test-seed#[585170DC09A44684]) [    ] o.a.s.c.c.SolrZkClient makePath: /solr
   [junit4]   2> 1142378 INFO  (TEST-CollectionsAPIDistributedZkTest.test-seed#[585170DC09A44684]) [    ] o.a.s.c.c.SolrZkClient Using default ZkCredentialsProvider
   [junit4]   2> 1142378 INFO  (TEST-CollectionsAPIDistributedZkTest.test-seed#[585170DC09A44684]) [    ] o.a.s.c.c.ConnectionManager Waiting for client to connect to ZooKeeper
   [junit4]   2> 1142385 INFO  (zkCallback-975-thread-1) [    ] o.a.s.c.c.ConnectionManager Watcher org.apache.solr.common.cloud.ConnectionManager@13978219 name:ZooKeeperConnection Watcher:127.0.0.1:51224/solr got event WatchedEvent state:SyncConnected type:None path:null path:null type:None
   [junit4]   2> 1142385 INFO  (TEST-CollectionsAPIDistributedZkTest.test-seed#[585170DC09A44684]) [    ] o.a.s.c.c.ConnectionManager Client is connected to ZooKeeper
   [junit4]   2> 1142386 INFO  (TEST-CollectionsAPIDistributedZkTest.test-seed#[585170DC09A44684]) [    ] o.a.s.c.c.SolrZkClient Using default ZkACLProvider
   [junit4]   2> 1142386 INFO  (TEST-CollectionsAPIDistributedZkTest.test-seed#[585170DC09A44684]) [    ] o.a.s.c.c.SolrZkClient makePath: /collections/collection1
   [junit4]   2> 1142387 INFO  (TEST-CollectionsAPIDistributedZkTest.test-seed#[585170DC09A44684]) [    ] o.a.s.c.c.SolrZkClient makePath: /collections/collection1/shards
   [junit4]   2> 1142389 INFO  (TEST-CollectionsAPIDistributedZkTest.test-seed#[585170DC09A44684]) [    ] o.a.s.c.c.SolrZkClient makePath: /collections/control_collection
   [junit4]   2> 1142390 INFO  (TEST-CollectionsAPIDistributedZkTest.test-seed#[585170DC09A44684]) [    ] o.a.s.c.c.SolrZkClient makePath: /collections/control_collection/shards
   [junit4]   2> 1142391 INFO  (TEST-CollectionsAPIDistributedZkTest.test-seed#[585170DC09A44684]) [    ] o.a.s.c.AbstractZkTestCase put /x1/jenkins/jenkins-slave/workspace/Lucene-Solr-NightlyTests-trunk/solr/core/src/test-files/solr/collection1/conf/solrconfig-tlog.xml to /configs/conf1/solrconfig.xml
   [junit4]   2> 1142392 INFO  (TEST-CollectionsAPIDistributedZkTest.test-seed#[585170DC09A44684]) [    ] o.a.s.c.c.SolrZkClient makePath: /configs/conf1/solrconfig.xml
   [junit4]   2> 1142394 INFO  (TEST-CollectionsAPIDistributedZkTest.test-seed#[585170DC09A44684]) [    ] o.a.s.c.AbstractZkTestCase put /x1/jenkins/jenkins-slave/workspace/Lucene-Solr-NightlyTests-trunk/solr/core/src/test-files/solr/collection1/conf/schema.xml to /configs/conf1/schema.xml
   [junit4]   2> 1142394 INFO  (TEST-CollectionsAPIDistributedZkTest.test-seed#[585170DC09A44684]) [    ] o.a.s.c.c.SolrZkClient makePath: /configs/conf1/schema.xml
   [junit4]   2> 1142396 INFO  (TEST-CollectionsAPIDistributedZkTest.test-seed#[585170DC09A44684]) [    ] o.a.s.c.AbstractZkTestCase put /x1/jenkins/jenkins-slave/workspace/Lucene-Solr-NightlyTests-trunk/solr/core/src/test-files/solr/collection1/conf/solrconfig.snippet.randomindexconfig.xml to /configs/conf1/solrconfig.snippet.randomindexconfig.xml
   [junit4]   2> 1142396 INFO  (TEST-CollectionsAPIDistributedZkTest.test-seed#[585170DC09A44684]) [    ] o.a.s.c.c.SolrZkClient makePath: /configs/conf1/solrconfig.snippet.randomindexconfig.xml
   [junit4]   2> 1142400 INFO  (TEST-CollectionsAPIDistributedZkTest.test-seed#[585170DC09A44684]) [    ] o.a.s.c.AbstractZkTestCase put /x1/jenkins/jenkins-slave/workspace/Lucene-Solr-NightlyTests-trunk/solr/core/src/test-files/solr/collection1/conf/stopwords.txt to /configs/conf1/stopwords.txt
   [junit4]   2> 1142400 INFO  (TEST-CollectionsAPIDistributedZkTest.test-seed#[585170DC09A44684]) [    ] o.a.s.c.c.SolrZkClient makePath: /configs/conf1/stopwords.txt
   [junit4]   2> 1142401 INFO  (TEST-CollectionsAPIDistributedZkTest.test-seed#[585170DC09A44684]) [    ] o.a.s.c.AbstractZkTestCase put /x1/jenkins/jenkins-slave/workspace/Lucene-Solr-NightlyTests-trunk/solr/core/src/test-files/solr/collection1/conf/protwords.txt to /configs/conf1/protwords.txt
   [junit4]   2> 1142402 INFO  (TEST-CollectionsAPIDistributedZkTest.test-seed#[585170DC09A44684]) [    ] o.a.s.c.c.SolrZkClient makePath: /configs/conf1/protwords.txt
   [junit4]   2> 1142403 INFO  (TEST-CollectionsAPIDistributedZkTest.test-seed#[585170DC09A44684]) [    ] o.a.s.c.AbstractZkTestCase put /x1/jenkins/jenkins-slave/workspace/Lucene-Solr-NightlyTests-trunk/solr/core/src/test-files/solr/collection1/conf/currency.xml to /configs/conf1/currency.xml
   [junit4]   2> 1142403 INFO  (TEST-CollectionsAPIDistributedZkTest.test-seed#[585170DC09A44684]) [    ] o.a.s.c.c.SolrZkClient makePath: /configs/conf1/currency.xml
   [junit4]   2> 1142405 INFO  (TEST-CollectionsAPIDistributedZkTest.test-seed#[585170DC09A44684]) [    ] o.a.s.c.AbstractZkTestCase put /x1/jenkins/jenkins-slave/workspace/Lucene-Solr-NightlyTests-trunk/solr/core/src/test-files/solr/collection1/conf/enumsConfig.xml to /configs/conf1/enumsConfig.xml
   [junit4]   2> 1142405 INFO  (TEST-CollectionsAPIDistributedZkTest.test-seed#[585170DC09A44684]) [    ] o.a.s.c.c.SolrZkClient makePath: /configs/conf1/enumsConfig.xml
   [junit4]   2> 1142407 INFO  (TEST-CollectionsAPIDistributedZkTest.test-seed#[585170DC09A44684]) [    ] o.a.s.c.AbstractZkTestCase put /x1/jenkins/jenkins-slave/workspace/Lucene-Solr-NightlyTests-trunk/solr/core/src/test-files/solr/collection1/conf/open-exchange-rates.json to /configs/conf1/open-exchange-rates.json
   [junit4]   2> 1142407 INFO  (TEST-CollectionsAPIDistributedZkTest.test-seed#[585170DC09A44684]) [    ] o.a.s.c.c.SolrZkClient makePath: /configs/conf1/open-exchange-rates.json
   [junit4]   2> 1142408 INFO  (TEST-CollectionsAPIDistributedZkTest.test-seed#[585170DC09A44684]) [    ] o.a.s.c.AbstractZkTestCase put /x1/jenkins/jenkins-slave/workspace/Lucene-Solr-NightlyTests-trunk/solr/core/src/test-files/solr/collection1/conf/mapping-ISOLatin1Accent.txt to /configs/conf1/mapping-ISOLatin1Accent.txt
   [junit4]   2> 1142409 INFO  (TEST-CollectionsAPIDistributedZkTest.test-seed#[585170DC09A44684]) [    ] o.a.s.c.c.SolrZkClient makePath: /configs/conf1/mapping-ISOLatin1Accent.txt
   [junit4]   2> 1142410 INFO  (TEST-CollectionsAPIDistributedZkTest.test-seed#[585170DC09A44684]) [    ] o.a.s.c.AbstractZkTestCase put /x1/jenkins/jenkins-slave/workspace/Lucene-Solr-NightlyTests-trunk/solr/core/src/test-files/solr/collection1/conf/old_synonyms.txt to /configs/conf1/old_synonyms.txt
   [junit4]   2> 1142410 INFO  (TEST-CollectionsAPIDistributedZkTest.test-seed#[585170DC09A44684]) [    ] o.a.s.c.c.SolrZkClient makePath: /configs/conf1/old_synonyms.txt
   [junit4]   2> 1142412 INFO  (TEST-CollectionsAPIDistributedZkTest.test-seed#[585170DC09A44684]) [    ] o.a.s.c.AbstractZkTestCase put /x1/jenkins/jenkins-slave/workspace/Lucene-Solr-NightlyTests-trunk/solr/core/src/test-files/solr/collection1/conf/synonyms.txt to /configs/conf1/synonyms.txt
   [junit4]   2> 1142412 INFO  (TEST-CollectionsAPIDistributedZkTest.test-seed#[585170DC09A44684]) [    ] o.a.s.c.c.SolrZkClient makePath: /configs/conf1/synonyms.txt
   [junit4]   2> 1142414 INFO  (TEST-CollectionsAPIDistributedZkTest.test-seed#[585170DC09A44684]) [    ] o.a.s.c.c.SolrZkClient Using default ZkCredentialsProvider
   [junit4]   2> 1142415 INFO  (TEST-CollectionsAPIDistributedZkTest.test-seed#[585170DC09A44684]) [    ] o.a.s.c.c.ConnectionManager Waiting for client to connect to ZooKeeper
   [junit4]   2> 1142415 INFO  (zkCallback-976-thread-1) [    ] o.a.s.c.c.ConnectionManager Watcher org.apache.solr.common.cloud.ConnectionManager@3f75b40e name:ZooKeeperConnection Watcher:127.0.0.1:51224/solr got event WatchedEvent state:SyncConnected type:None path:null path:null type:None
   [junit4]   2> 1142416 INFO  (TEST-CollectionsAPIDistributedZkTest.test-seed#[585170DC09A44684]) [    ] o.a.s.c.c.ConnectionManager Client is connected to ZooKeeper
   [junit4]   2> 1142416 INFO  (TEST-CollectionsAPIDistributedZkTest.test-seed#[585170DC09A44684]) [    ] o.a.s.c.c.SolrZkClient Using default ZkACLProvider
   [junit4]   2> 1142417 INFO  (TEST-CollectionsAPIDistributedZkTest.test-seed#[585170DC09A44684]) [    ] o.a.s.c.c.SolrZkClient Using default ZkCredentialsProvider
   [junit4]   2> 1142417 INFO  (TEST-CollectionsAPIDistributedZkTest.test-seed#[585170DC09A44684]) [    ] o.a.s.c.c.ConnectionManager Waiting for client to connect to ZooKeeper
   [junit4]   2> 1142418 INFO  (zkCallback-977-thread-1) [    ] o.a.s.c.c.ConnectionManager Watcher org.apache.solr.common.cloud.ConnectionManager@391ae8d5 name:ZooKeeperConnection Watcher:127.0.0.1:51224 got event WatchedEvent state:SyncConnected type:None path:null path:null type:None
   [junit4]   2> 1142418 INFO  (TEST-CollectionsAPIDistributedZkTest.test-seed#[585170DC09A44684]) [    ] o.a.s.c.c.ConnectionManager Client is connected to ZooKeeper
   [junit4]   2> 1142418 INFO  (TEST-CollectionsAPIDistributedZkTest.test-seed#[585170DC09A44684]) [    ] o.a.s.c.c.SolrZkClient Using default ZkACLProvider
   [junit4]   2> 1142419 INFO  (TEST-CollectionsAPIDistributedZkTest.test-seed#[585170DC09A44684]) [    ] o.a.s.c.c.SolrZkClient makePath: /solr
   [junit4]   2> 1142420 INFO  (TEST-CollectionsAPIDistributedZkTest.test-seed#[585170DC09A44684]) [    ] o.a.s.c.c.SolrZkClient Using default ZkCredentialsProvider
   [junit4]   2> 1142420 INFO  (TEST-CollectionsAPIDistributedZkTest.test-seed#[585170DC09A44684]) [    ] o.a.s.c.c.ConnectionManager Waiting for client to connect to ZooKeeper
   [junit4]   2> 1142421 INFO  (zkCallback-978-thread-1) [    ] o.a.s.c.c.ConnectionManager Watcher org.apache.solr.common.cloud.ConnectionManager@3e9b1743 name:ZooKeeperConnection Watcher:127.0.0.1:51224/solr got event WatchedEvent state:SyncConnected type:None path:null path:null type:None
   [junit4]   2> 1142421 INFO  (TEST-CollectionsAPIDistributedZkTest.test-seed#[585170DC09A44684]) [    ] o.a.s.c.c.ConnectionManager Client is connected to ZooKeeper
   [junit4]   2> 1142422 INFO  (TEST-CollectionsAPIDistributedZkTest.test-seed#[585170DC09A44684]) [    ] o.a.s.c.c.SolrZkClient Using default ZkACLProvider
   [junit4]   2> 1142422 INFO  (TEST-CollectionsAPIDistributedZkTest.test-seed#[585170DC09A44684]) [    ] o.a.s.c.AbstractZkTestCase put /x1/jenkins/jenkins-slave/workspace/Lucene-Solr-NightlyTests-trunk/solr/core/src/test-files/solr/collection1/conf/solrconfig-tlog.xml to /configs/conf2/solrconfig.xml
   [junit4]   2> 1142422 INFO  (TEST-CollectionsAPIDistributedZkTest.test-seed#[585170DC09A44684]) [    ] o.a.s.c.c.SolrZkClient makePath: /configs/conf2/solrconfig.xml
   [junit4]   2> 1142424 INFO  (TEST-CollectionsAPIDistributedZkTest.test-seed#[585170DC09A44684]) [    ] o.a.s.c.AbstractZkTestCase put /x1/jenkins/jenkins-slave/workspace/Lucene-Solr-NightlyTests-trunk/solr/core/src/test-files/solr/collection1/conf/schema.xml to /configs/conf2/schema.xml
   [junit4]   2> 1142425 INFO  (TEST-CollectionsAPIDistributedZkTest.test-seed#[585170DC09A44684]) [    ] o.a.s.c.c.SolrZkClient makePath: /configs/conf2/schema.xml
   [junit4]   2> 1142426 INFO  (TEST-CollectionsAPIDistributedZkTest.test-seed#[585170DC09A44684]) [    ] o.a.s.c.AbstractZkTestCase put /x1/jenkins/jenkins-slave/workspace/Lucene-Solr-NightlyTests-trunk/solr/core/src/test-files/solr/collection1/conf/enumsConfig.xml to /configs/conf2/enumsConfig.xml
   [junit4]   2> 1142426 INFO  (TEST-CollectionsAPIDistributedZkTest.test-seed#[585170DC09A44684]) [    ] o.a.s.c.c.SolrZkClient makePath: /configs/conf2/enumsConfig.xml
   [junit4]   2> 1142428 INFO  (TEST-CollectionsAPIDistributedZkTest.test-seed#[585170DC09A44684]) [    ] o.a.s.c.AbstractZkTestCase put /x1/jenkins/jenkins-slave/workspace/Lucene-Solr-NightlyTests-trunk/solr/core/src/test-files/solr/collection1/conf/solrconfig.snippet.randomindexconfig.xml to /configs/conf2/solrconfig.snippet.randomindexconfig.xml
   [junit4]   2> 1142428 INFO  (TEST-CollectionsAPIDistributedZkTest.test-seed#[585170DC09A44684]) [    ] o.a.s.c.c.SolrZkClient makePath: /configs/conf2/solrconfig.snippet.randomindexconfig.xml
   [junit4]   2> 1142430 INFO  (TEST-CollectionsAPIDistributedZkTest.test-seed#[585170DC09A44684]) [    ] o.a.s.c.AbstractZkTestCase put /x1/jenkins/jenkins-slave/workspace/Lucene-Solr-NightlyTests-trunk/solr/core/src/test-files/solr/collection1/conf/stopwords.txt to /configs/conf2/stopwords.txt
   [junit4]   2> 1142430 INFO  (TEST-CollectionsAPIDistributedZkTest.test-seed#[585170DC09A44684]) [    ] o.a.s.c.c.SolrZkClient makePath: /configs/conf2/stopwords.txt
   [junit4]   2> 1142431 INFO  (TEST-CollectionsAPIDistributedZkTest.test-seed#[585170DC09A44684]) [    ] o.a.s.c.AbstractZkTestCase put /x1/jenkins/jenkins-slave/workspace/Lucene-Solr-NightlyTests-trunk/solr/core/src/test-files/solr/collection1/conf/protwords.txt to /configs/conf2/protwords.txt
   [junit4]   2> 1142432 INFO  (TEST-CollectionsAPIDistributedZkTest.test-seed#[585170DC09A44684]) [    ] o.a.s.c.c.SolrZkClient makePath: /configs/conf2/protwords.txt
   [junit4]   2> 1142433 INFO  (TEST-CollectionsAPIDistributedZkTest.test-seed#[585170DC09A44684]) [    ] o.a.s.c.AbstractZkTestCase put /x1/jenkins/jenkins-slave/workspace/Lucene-Solr-NightlyTests-trunk/solr/core/src/test-files/solr/collection1/conf/currency.xml to /configs/conf2/currency.xml
   [junit4]   2> 1142433 INFO  (TEST-CollectionsAPIDistributedZkTest.test-seed#[585170DC09A44684]) [    ] o.a.s.c.c.SolrZkClient makePath: /configs/conf2/currency.xml
   [junit4]   2> 1142435 INFO  (TEST-CollectionsAPIDistributedZkTest.test-seed#[585170DC09A44684]) [    ] o.a.s.c.AbstractZkTestCase put /x1/jenkins/jenkins-slave/workspace/Lucene-Solr-NightlyTests-trunk/solr/core/src/test-files/solr/collection1/conf/open-exchange-rates.json to /configs/conf2/open-exchange-rates.json
   [junit4]   2> 1142435 INFO  (TEST-CollectionsAPIDistributedZkTest.test-seed#[585170DC09A44684]) [    ] o.a.s.c.c.SolrZkClient makePath: /configs/conf2/open-exchange-rates.json
   [junit4]   2> 1142436 INFO  (TEST-CollectionsAPIDistributedZkTest.test-seed#[585170DC09A44684]) [    ] o.a.s.c.AbstractZkTestCase put /x1/jenkins/jenkins-slave/workspace/Lucene-Solr-NightlyTests-trunk/solr/core/src/test-files/solr/collection1/conf/mapping-ISOLatin1Accent.txt to /configs/conf2/mapping-ISOLatin1Accent.txt
   [junit4]   2> 1142437 INFO  (TEST-CollectionsAPIDistributedZkTest.test-seed#[585170DC09A44684]) [    ] o.a.s.c.c.SolrZkClient makePath: /configs/conf2/mapping-ISOLatin1Accent.txt
   [junit4]   2> 1142438 INFO  (TEST-CollectionsAPIDistributedZkTest.test-seed#[585170DC09A44684]) [    ] o.a.s.c.AbstractZkTestCase put /x1/jenkins/jenkins-slave/workspace/Lucene-Solr-NightlyTests-trunk/solr/core/src/test-files/solr/collection1/conf/old_synonyms.txt to /configs/conf2/old_synonyms.txt
   [junit4]   2> 1142438 INFO  (TEST-CollectionsAPIDistributedZkTest.test-seed#[585170DC09A44684]) [    ] o.a.s.c.c.SolrZkClient makePath: /configs/conf2/old_synonyms.txt
   [junit4]   2> 1142440 INFO  (TEST-CollectionsAPIDistributedZkTest.test-seed#[585170DC09A44684]) [    ] o.a.s.c.AbstractZkTestCase put /x1/jenkins/jenkins-slave/workspace/Lucene-Solr-NightlyTests-trunk/solr/core/src/test-files/solr/collection1/conf/synonyms.txt to /configs/conf2/synonyms.txt
   [junit4]   2> 1142440 INFO  (TEST-CollectionsAPIDistributedZkTest.test-seed#[585170DC09A44684]) [    ] o.a.s.c.c.SolrZkClient makePath: /configs/conf2/synonyms.txt
   [junit4]   2> 1142441 INFO  (TEST-CollectionsAPIDistributedZkTest.test-seed#[585170DC09A44684]) [    ] o.a.s.c.AbstractZkTestCase put /x1/jenkins/jenkins-slave/workspace/Lucene-Solr-NightlyTests-trunk/solr/core/src/test-files/solr/collection1/conf/elevate.xml to /configs/conf2/elevate.xml
   [junit4]   2> 1142442 INFO  (TEST-CollectionsAPIDistributedZkTest.test-seed#[585170DC09A44684]) [    ] o.a.s.c.c.SolrZkClient makePath: /configs/conf2/elevate.xml
   [junit4]   2> 1142783 INFO  (TEST-CollectionsAPIDistributedZkTest.test-seed#[585170DC09A44684]) [    ] o.a.s.SolrTestCaseJ4 Writing core.properties file to /x1/jenkins/jenkins-slave/workspace/Lucene-Solr-NightlyTests-trunk/solr/build/solr-core/test/J2/temp/solr.cloud.CollectionsAPIDistributedZkTest_585170DC09A44684-001/control-001/cores/collection1
   [junit4]   2> 1142785 INFO  (TEST-CollectionsAPIDistributedZkTest.test-seed#[585170DC09A44684]) [    ] o.e.j.s.Server jetty-9.2.13.v20150730
   [junit4]   2> 1142788 INFO  (TEST-CollectionsAPIDistributedZkTest.test-seed#[585170DC09A44684]) [    ] o.e.j.s.h.ContextHandler Started o.e.j.s.ServletContextHandler@14f5c231{/whqo/lz,null,AVAILABLE}
   [junit4]   2> 1142796 INFO  (TEST-CollectionsAPIDistributedZkTest.test-seed#[585170DC09A44684]) [    ] o.e.j.s.ServerConnector Started ServerConnector@666e7baa{SSL-http/1.1}{127.0.0.1:53024}
   [junit4]   2> 1142796 INFO  (TEST-CollectionsAPIDistributedZkTest.test-seed#[585170DC09A44684]) [    ] o.e.j.s.Server Started @1145845ms
   [junit4]   2> 1142796 INFO  (TEST-CollectionsAPIDistributedZkTest.test-seed#[585170DC09A44684]) [    ] o.a.s.c.s.e.JettySolrRunner Jetty properties: {solr.data.dir=/x1/jenkins/jenkins-slave/workspace/Lucene-Solr-NightlyTests-trunk/solr/build/solr-core/test/J2/temp/solr.cloud.CollectionsAPIDistributedZkTest_585170DC09A44684-001/tempDir-001/control/data, hostContext=/whqo/lz, hostPort=53024, coreRootDirectory=/x1/jenkins/jenkins-slave/workspace/Lucene-Solr-NightlyTests-trunk/solr/build/solr-core/test/J2/temp/solr.cloud.CollectionsAPIDistributedZkTest_585170DC09A44684-001/control-001/cores}
   [junit4]   2> 1142796 INFO  (TEST-CollectionsAPIDistributedZkTest.test-seed#[585170DC09A44684]) [    ] o.a.s.s.SolrDispatchFilter SolrDispatchFilter.init(): sun.misc.Launcher$AppClassLoader@4e0e2f2a
   [junit4]   2> 1142797 INFO  (TEST-CollectionsAPIDistributedZkTest.test-seed#[585170DC09A44684]) [    ] o.a.s.c.SolrResourceLoader new SolrResourceLoader for directory: '/x1/jenkins/jenkins-slave/workspace/Lucene-Solr-NightlyTests-trunk/solr/build/solr-core/test/J2/temp/solr.cloud.CollectionsAPIDistributedZkTest_585170DC09A44684-001/control-001/'
   [junit4]   2> 1142813 INFO  (TEST-CollectionsAPIDistributedZkTest.test-seed#[585170DC09A44684]) [    ] o.a.s.c.c.SolrZkClient Using default ZkCredentialsProvider
   [junit4]   2> 1142813 INFO  (TEST-CollectionsAPIDistributedZkTest.test-seed#[585170DC09A44684]) [    ] o.a.s.c.c.ConnectionManager Waiting for client to connect to ZooKeeper
   [junit4]   2> 1142814 INFO  (zkCallback-979-thread-1) [    ] o.a.s.c.c.ConnectionManager Watcher org.apache.solr.common.cloud.ConnectionManager@3f5bee12 name:ZooKeeperConnection Watcher:127.0.0.1:51224/solr got event WatchedEvent state:SyncConnected type:None path:null path:null type:None
   [junit4]   2> 1142815 INFO  (TEST-CollectionsAPIDistributedZkTest.test-seed#[585170DC09A44684]) [    ] o.a.s.c.c.ConnectionManager Client is connected to ZooKeeper
   [junit4]   2> 1142815 INFO  (TEST-CollectionsAPIDistributedZkTest.test-seed#[585170DC09A44684]) [    ] o.a.s.c.c.SolrZkClient Using default ZkACLProvider
   [junit4]   2> 1142816 INFO  (TEST-CollectionsAPIDistributedZkTest.test-seed#[585170DC09A44684]) [    ] o.a.s.s.SolrDispatchFilter Loading solr.xml from SolrHome (not found in ZooKeeper)
   [junit4]   2> 1142816 INFO  (TEST-CollectionsAPIDistributedZkTest.test-seed#[585170DC09A44684]) [    ] o.a.s.c.SolrXmlConfig Loading container configuration from /x1/jenkins/jenkins-slave/workspace/Lucene-Solr-NightlyTests-trunk/solr/build/solr-core/test/J2/temp/solr.cloud.CollectionsAPIDistributedZkTest_585170DC09A44684-001/control-001/solr.xml
   [junit4]   2> 1142822 INFO  (TEST-CollectionsAPIDistributedZkTest.test-seed#[585170DC09A44684]) [    ] o.a.s.c.CoresLocator Config-defined core root directory: /x1/jenkins/jenkins-slave/workspace/Lucene-Solr-NightlyTests-trunk/solr/build/solr-core/test/J2/temp/solr.cloud.CollectionsAPIDistributedZkTest_585170DC09A44684-001/control-001/cores
   [junit4]   2> 1142822 INFO  (TEST-CollectionsAPIDistributedZkTest.test-seed#[585170DC09A44684]) [    ] o.a.s.c.CoreContainer New CoreContainer 37223970
   [junit4]   2> 1142822 INFO  (TEST-CollectionsAPIDistributedZkTest.test-seed#[585170DC09A44684]) [    ] o.a.s.c.CoreContainer Loading cores into CoreContainer [instanceDir=/x1/jenkins/jenkins-slave/workspace/Lucene-Solr-NightlyTests-trunk/solr/build/solr-core/test/J2/temp/solr.cloud.CollectionsAPIDistributedZkTest_585170DC09A44684-001/control-001/]
   [junit4]   2> 1142822 INFO  (TEST-CollectionsAPIDistributedZkTest.test-seed#[585170DC09A44684]) [    ] o.a.s.c.CoreContainer loading shared library: /x1/jenkins/jenkins-slave/workspace/Lucene-Solr-NightlyTests-trunk/solr/build/solr-core/test/J2/temp/solr.cloud.CollectionsAPIDistributedZkTest_585170DC09A44684-001/control-001/lib
   [junit4]   2> 1142822 WARN  (TEST-CollectionsAPIDistributedZkTest.test-seed#[585170DC09A44684]) [    ] o.a.s.c.SolrResourceLoader Can't find (or read) directory to add to classloader: lib (resolved as: /x1/jenkins/jenkins-slave/workspace/Lucene-Solr-NightlyTests-trunk/solr/build/solr-core/test/J2/temp/solr.cloud.CollectionsAPIDistributedZkTest_585170DC09A44684-001/control-001/lib).
   [junit4]   2> 1142830 INFO  (TEST-CollectionsAPIDistributedZkTest.test-seed#[585170DC09A44684]) [    ] o.a.s.h.c.HttpShardHandlerFactory created with socketTimeout : 90000,urlScheme : ,connTimeout : 15000,maxConnectionsPerHost : 20,maxConnections : 10000,corePoolSize : 0,maximumPoolSize : 2147483647,maxThreadIdleTime : 5,sizeOfQueue : -1,fairnessPolicy : false,useRetries : false,
   [junit4]   2> 1142843 INFO  (TEST-CollectionsAPIDistributedZkTest.test-seed#[585170DC09A44684]) [    ] o.a.s.u.UpdateShardHandler Creating UpdateShardHandler HTTP client with params: socketTimeout=340000&connTimeout=45000&retry=true
   [junit4]   2> 1142845 INFO  (TEST-CollectionsAPIDistributedZkTest.test-seed#[585170DC09A44684]) [    ] o.a.s.l.LogWatcher SLF4J impl is org.slf4j.impl.Log4jLoggerFactory
   [junit4]   2> 1142845 INFO  (TEST-CollectionsAPIDistributedZkTest.test-seed#[585170DC09A44684]) [    ] o.a.s.l.LogWatcher Registering Log Listener [Log4j (org.slf4j.impl.Log4jLoggerFactory)]
   [junit4]   2> 1142845 INFO  (TEST-CollectionsAPIDistributedZkTest.test-seed#[585170DC09A44684]) [    ] o.a.s.c.ZkContainer Zookeeper client=127.0.0.1:51224/solr
   [junit4]   2> 1142845 INFO  (TEST-CollectionsAPIDistributedZkTest.test-seed#[585170DC09A44684]) [    ] o.a.s.c.ZkController zkHost includes chroot
   [junit4]   2> 1142845 INFO  (TEST-CollectionsAPIDistributedZkTest.test-seed#[585170DC09A44684]) [    ] o.a.s.c.c.SolrZkClient Using default ZkCredentialsProvider
   [junit4]   2> 1142854 INFO  (TEST-CollectionsAPIDistributedZkTest.test-seed#[585170DC09A44684]) [    ] o.a.s.c.c.ConnectionManager Waiting for client to connect to ZooKeeper
   [junit4]   2> 1142858 INFO  (zkCallback-981-thread-1) [    ] o.a.s.c.c.ConnectionManager Watcher org.apache.solr.common.cloud.ConnectionManager@34410b24 name:ZooKeeperConnection Watcher:127.0.0.1:51224 got event WatchedEvent state:SyncConnected type:None path:null path:null type:None
   [junit4]   2> 1142859 INFO  (TEST-CollectionsAPIDistributedZkTest.test-seed#[585170DC09A44684]) [    ] o.a.s.c.c.ConnectionManager Client is connected to ZooKeeper
   [junit4]   2> 1142859 INFO  (TEST-CollectionsAPIDistributedZkTest.test-seed#[585170DC09A44684]) [    ] o.a.s.c.c.SolrZkClient Using default ZkACLProvider
   [junit4]   2> 1142862 INFO  (TEST-CollectionsAPIDistributedZkTest.test-seed#[585170DC09A44684]) [n:127.0.0.1:53024_whqo%2Flz    ] o.a.s.c.c.ConnectionManager Waiting for client to connect to ZooKeeper
   [junit4]   2> 1142863 INFO  (zkCallback-982-thread-1-processing-n:127.0.0.1:53024_whqo%2Flz) [n:127.0.0.1:53024_whqo%2Flz    ] o.a.s.c.c.ConnectionManager Watcher org.apache.solr.common.cloud.ConnectionManager@326dc831 name:ZooKeeperConnection Watcher:127.0.0.1:51224/solr got event WatchedEvent state:SyncConnected type:None path:null path:null type:None
   [junit4]   2> 1142863 INFO  (TEST-CollectionsAPIDistributedZkTest.test-seed#[585170DC09A44684]) [n:127.0.0.1:53024_whqo%2Flz    ] o.a.s.c.c.ConnectionManager Client is connected to ZooKeeper
   [junit4]   2> 1142864 INFO  (TEST-CollectionsAPIDistributedZkTest.test-seed#[585170DC09A44684]) [n:127.0.0.1:53024_whqo%2Flz    ] o.a.s.c.c.SolrZkClient makePath: /overseer/queue
   [junit4]   2> 1142866 INFO  (TEST-CollectionsAPIDistributedZkTest.test-seed#[585170DC09A44684]) [n:127.0.0.1:53024_whqo%2Flz    ] o.a.s.c.c.SolrZkClient makePath: /overseer/collection-queue-work
   [junit4]   2> 1142867 INFO  (TEST-CollectionsAPIDistributedZkTest.test-seed#[585170DC09A44684]) [n:127.0.0.1:53024_whqo%2Flz    ] o.a.s.c.c.SolrZkClient makePath: /overseer/collection-map-running
   [junit4]   2> 1142869 INFO  (TEST-CollectionsAPIDistributedZkTest.test-seed#[585170DC09A44684]) [n:127.0.0.1:53024_whqo%2Flz    ] o.a.s.c.c.SolrZkClient makePath: /overseer/collection-map-completed
   [junit4]   2> 1142870 INFO  (TEST-CollectionsAPIDistributedZkTest.test-seed#[585170DC09A44684]) [n:127.0.0.1:53024_whqo%2Flz    ] o.a.s.c.c.SolrZkClient makePath: /overseer/collection-map-failure
   [junit4]   2> 1142873 INFO  (TEST-CollectionsAPIDistributedZkTest.test-seed#[585170DC09A44684]) [n:127.0.0.1:53024_whqo%2Flz    ] o.a.s.c.c.SolrZkClient makePath: /live_nodes
   [junit4]   2> 1142874 INFO  (TEST-CollectionsAPIDistributedZkTest.test-seed#[585170DC09A44684]) [n:127.0.0.1:53024_whqo%2Flz    ] o.a.s.c.c.SolrZkClient makePath: /aliases.json
   [junit4]   2> 1142875 INFO  (TEST-CollectionsAPIDistributedZkTest.test-seed#[585170DC09A44684]) [n:127.0.0.1:53024_whqo%2Flz    ] o.a.s.c.c.SolrZkClient makePath: /clusterstate.json
   [junit4]   2> 1142876 INFO  (TEST-CollectionsAPIDistributedZkTest.test-seed#[585170DC09A44684]) [n:127.0.0.1:53024_whqo%2Flz    ] o.a.s.c.c.SolrZkClient makePath: /security.json
   [junit4]   2> 1142877 INFO  (TEST-CollectionsAPIDistributedZkTest.test-seed#[585170DC09A44684]) [n:127.0.0.1:53024_whqo%2Flz    ] o.a.s.c.ZkController Register node as live in ZooKeeper:/live_nodes/127.0.0.1:53024_whqo%2Flz
   [junit4]   2> 1142877 INFO  (TEST-CollectionsAPIDistributedZkTest.test-seed#[585170DC09A44684]) [n:127.0.0.1:53024_whqo%2Flz    ] o.a.s.c.c.SolrZkClient makePath: /live_nodes/127.0.0.1:53024_whqo%2Flz
   [junit4]   2> 1142878 INFO  (TEST-CollectionsAPIDistributedZkTest.test-seed#[585170DC09A44684]) [n:127.0.0.1:53024_whqo%2Flz    ] o.a.s.c.c.SolrZkClient makePath: /overseer_elect
   [junit4]   2> 1142880 INFO  (TEST-CollectionsAPIDistributedZkTest.test-seed#[585170DC09A44684]) [n:127.0.0.1:53024_whqo%2Flz    ] o.a.s.c.c.SolrZkClient makePath: /overseer_elect/election
   [junit4]   2> 1142881 INFO  (TEST-CollectionsAPIDistributedZkTest.test-seed#[585170DC09A44684]) [n:127.0.0.1:53024_whqo%2Flz    ] o.a.s.c.Overseer Overseer (id=null) closing
   [junit4]   2> 1142881 INFO  (TEST-CollectionsAPIDistributedZkTest.test-seed#[585170DC09A44684]) [n:127.0.0.1:53024_whqo%2Flz    ] o.a.s.c.LeaderElector Joined leadership election with path: /overseer_elect/election/94393157429493767-127.0.0.1:53024_whqo%2Flz-n_0000000000
   [junit4]   2> 1142882 INFO  (TEST-CollectionsAPIDistributedZkTest.test-seed#[585170DC09A44684]) [n:127.0.0.1:53024_whqo%2Flz    ] o.a.s.c.OverseerElectionContext I am going to be the leader 127.0.0.1:53024_whqo%2Flz
   [junit4]   2> 1142882 INFO  (TEST-CollectionsAPIDistributedZkTest.test-seed#[585170DC09A44684]) [n:127.0.0.1:53024_whqo%2Flz    ] o.a.s.c.c.SolrZkClient makePath: /overseer_elect/leader
   [junit4]   2> 1142883 INFO  (TEST-CollectionsAPIDistributedZkTest.test-seed#[585170DC09A44684]) [n:127.0.0.1:53024_whqo%2Flz    ] o.a.s.c.Overseer Overseer (id=94393157429493767-127.0.0.1:53024_whqo%2Flz-n_0000000000) starting
   [junit4]   2> 1142885 INFO  (TEST-CollectionsAPIDistributedZkTest.test-seed#[585170DC09A44684]) [n:127.0.0.1:53024_whqo%2Flz    ] o.a.s.c.c.SolrZkClient makePath: /overseer/queue-work
   [junit4]   2> 1142890 INFO  (TEST-CollectionsAPIDistributedZkTest.test-seed#[585170DC09A44684]) [n:127.0.0.1:53024_whqo%2Flz    ] o.a.s.c.OverseerAutoReplicaFailoverThread Starting OverseerAutoReplicaFailoverThread autoReplicaFailoverWorkLoopDelay=10000 autoReplicaFailoverWaitAfterExpiration=10000 autoReplicaFailoverBadNodeExpiration=60000
   [junit4]   2> 1142890 INFO  (TEST-CollectionsAPIDistributedZkTest.test-seed#[585170DC09A44684]) [n:127.0.0.1:53024_whqo%2Flz    ] o.a.s.c.c.ZkStateReader Updating cluster state from ZooKeeper... 
   [junit4]   2> 1142890 INFO  (OverseerCollectionProcessor-94393157429493767-127.0.0.1:53024_whqo%2Flz-n_0000000000) [n:127.0.0.1:53024_whqo%2Flz    ] o.a.s.c.OverseerProcessor Process current queue of overseer operations
   [junit4]   2> 1142891 INFO  (OverseerStateUpdate-94393157429493767-127.0.0.1:53024_whqo%2Flz-n_0000000000) [n:127.0.0.1:53024_whqo%2Flz    ] o.a.s.c.Overseer Starting to work on the main queue
   [junit4]   2> 1142908 INFO  (TEST-CollectionsAPIDistributedZkTest.test-seed#[585170DC09A44684]) [n:127.0.0.1:53024_whqo%2Flz    ] o.a.s.c.CoreContainer Security conf doesn't exist. Skipping setup for authorization module.
   [junit4]   2> 1142908 INFO  (TEST-CollectionsAPIDistributedZkTest.test-seed#[585170DC09A44684]) [n:127.0.0.1:53024_whqo%2Flz    ] o.a.s.c.CoreContainer No authentication plugin used.
   [junit4]   2> 1142909 INFO  (TEST-CollectionsAPIDistributedZkTest.test-seed#[585170DC09A44684]) [n:127.0.0.1:53024_whqo%2Flz    ] o.a.s.c.CoresLocator Looking for core definitions underneath /x1/jenkins/jenkins-slave/workspace/Lucene-Solr-NightlyTests-trunk/solr/build/solr-core/test/J2/temp/solr.cloud.CollectionsAPIDistributedZkTest_585170DC09A44684-001/control-001/cores
   [junit4]   2> 1142910 INFO  (TEST-CollectionsAPIDistributedZkTest.test-seed#[585170DC09A44684]) [n:127.0.0.1:53024_whqo%2Flz    ] o.a.s.c.SolrCore Created CoreDescriptor: {name=collection1, config=solrconfig.xml, transient=false, schema=schema.xml, loadOnStartup=true, configSetProperties=configsetprops.json, instanceDir=/x1/jenkins/jenkins-slave/workspace/Lucene-Solr-NightlyTests-trunk/solr/build/solr-core/test/J2/temp/solr.cloud.CollectionsAPIDistributedZkTest_585170DC09A44684-001/control-001/cores/collection1, collection=control_collection, absoluteInstDir=/x1/jenkins/jenkins-slave/workspace/Lucene-Solr-NightlyTests-trunk/solr/build/solr-core/test/J2/temp/solr.cloud.CollectionsAPIDistributedZkTest_585170DC09A44684-001/control-001/cores/collection1/, coreNodeName=, dataDir=data/, shard=}
   [junit4]   2> 1142910 INFO  (TEST-CollectionsAPIDistributedZkTest.test-seed#[585170DC09A44684]) [n:127.0.0.1:53024_whqo%2Flz    ] o.a.s.c.CoresLocator Found core collection1 in /x1/jenkins/jenkins-slave/workspace/Lucene-Solr-NightlyTests-trunk/solr/build/solr-core/test/J2/temp/solr.cloud.CollectionsAPIDistributedZkTest_585170DC09A44684-001/control-001/cores/collection1/
   [junit4]   2> 1142910 INFO  (TEST-CollectionsAPIDistributedZkTest.test-seed#[585170DC09A44684]) [n:127.0.0.1:53024_whqo%2Flz    ] o.a.s.c.CoresLocator Found 1 core definitions
   [junit4]   2> 1142911 INFO  (coreLoadExecutor-2508-thread-1-processing-n:127.0.0.1:53024_whqo%2Flz) [n:127.0.0.1:53024_whqo%2Flz c:control_collection   x:collection1] o.a.s.c.ZkController publishing state=down
   [junit4]   2> 1142911 INFO  (TEST-CollectionsAPIDistributedZkTest.test-seed#[585170DC09A44684]) [n:127.0.0.1:53024_whqo%2Flz    ] o.a.s.s.SolrDispatchFilter user.dir=/x1/jenkins/jenkins-slave/workspace/Lucene-Solr-NightlyTests-trunk/solr/build/solr-core/test/J2
   [junit4]   2> 1142912 INFO  (TEST-CollectionsAPIDistributedZkTest.test-seed#[585170DC09A44684]) [n:127.0.0.1:53024_whqo%2Flz    ] o.a.s.s.SolrDispatchFilter SolrDispatchFilter.init() done
   [junit4]   2> 1142911 INFO  (coreLoadExecutor-2508-thread-1-processing-n:127.0.0.1:53024_whqo%2Flz) [n:127.0.0.1:53024_whqo%2Flz c:control_collection   x:collection1] o.a.s.c.ZkController numShards not found on descriptor - reading it from system property
   [junit4]   2> 1142912 INFO  (coreLoadExecutor-2508-thread-1-processing-n:127.0.0.1:53024_whqo%2Flz) [n:127.0.0.1:53024_whqo%2Flz c:control_collection   x:collection1] o.a.s.c.ZkController look for our core node name
   [junit4]   2> 1142913 INFO  (OverseerStateUpdate-94393157429493767-127.0.0.1:53024_whqo%2Flz-n_0000000000) [n:127.0.0.1:53024_whqo%2Flz    ] o.a.s.c.Overseer processMessage: queueSize: 1, message = {
   [junit4]   2>   "core":"collection1",
   [junit4]   2>   "roles":null,
   [junit4]   2>   "base_url":"https://127.0.0.1:53024/whqo/lz",
   [junit4]   2>   "node_name":"127.0.0.1:53024_whqo%2Flz",
   [junit4]   2>   "numShards":"1",
   [junit4]   2>   "state":"down",
   [junit4]   2>   "shard":null,
   [junit4]   2>   "collection":"control_collection",
   [junit4]   2>   "operation":"state"} current state version: 0
   [junit4]   2> 1142914 INFO  (OverseerStateUpdate-94393157429493767-127.0.0.1:53024_whqo%2Flz-n_0000000000) [n:127.0.0.1:53024_whqo%2Flz    ] o.a.s.c.o.ReplicaMutator Update state numShards=1 message={
   [junit4]   2>   "core":"collection1",
   [junit4]   2>   "roles":null,
   [junit4]   2>   "base_url":"https://127.0.0.1:53024/whqo/lz",
   [junit4]   2>   "node_name":"127.0.0.1:53024_whqo%2Flz",
   [junit4]   2>   "numShards":"1",
   [junit4]   2>   "state":"down",
   [junit4]   2>   "shard":null,
   [junit4]   2>   "collection":"control_collection",
   [junit4]   2>   "operation":"state"}
   [junit4]   2> 1142914 INFO  (OverseerStateUpdate-94393157429493767-127.0.0.1:53024_whqo%2Flz-n_0000000000) [n:127.0.0.1:53024_whqo%2Flz    ] o.a.s.c.o.ClusterStateMutator building a new cName: control_collection
   [junit4]   2> 1142914 INFO  (OverseerStateUpdate-94393157429493767-127.0.0.1:53024_whqo%2Flz-n_0000000000) [n:127.0.0.1:53024_whqo%2Flz    ] o.a.s.c.o.ReplicaMutator Assigning new node to shard shard=shard1
   [junit4]   2> 1142915 INFO  (zkCallback-982-thread-1-processing-n:127.0.0.1:53024_whqo%2Flz) [n:127.0.0.1:53024_whqo%2Flz    ] o.a.s.c.c.ZkStateReader A cluster state change: WatchedEvent state:SyncConnected type:NodeDataChanged path:/clusterstate.json, has occurred - updating... (live nodes size: 1)
   [junit4]   2> 1143913 INFO  (coreLoadExecutor-2508-thread-1-processing-n:127.0.0.1:53024_whqo%2Flz) [n:127.0.0.1:53024_whqo%2Flz c:control_collection   x:collection1] o.a.s.c.ZkController waiting to find shard id in clusterstate for collection1
   [junit4]   2> 1143913 INFO  (coreLoadExecutor-2508-thread-1-processing-n:127.0.0.1:53024_whqo%2Flz) [n:127.0.0.1:53024_whqo%2Flz c:control_collection   x:collection1] o.a.s.c.ZkController Check for collection zkNode:control_collection
   [junit4]   2> 1143914 INFO  (coreLoadExecutor-2508-thread-1-processing-n:127.0.0.1:53024_whqo%2Flz) [n:127.0.0.1:53024_whqo%2Flz c:control_collection   x:collection1] o.a.s.c.ZkController Collection zkNode exists
   [junit4]   2> 1143914 INFO  (coreLoadExecutor-2508-thread-1-processing-n:127.0.0.1:53024_whqo%2Flz) [n:127.0.0.1:53024_whqo%2Flz c:control_collection   x:collection1] o.a.s.c.c.ZkStateReader Load collection config from:/collections/control_collection
   [junit4]   2> 1143915 INFO  (coreLoadExecutor-2508-thread-1-processing-n:127.0.0.1:53024_whqo%2Flz) [n:127.0.0.1:53024_whqo%2Flz c:control_collection   x:collection1] o.a.s.c.c.ZkStateReader path=/collections/control_collection configName=conf1 specified config exists in ZooKeeper
   [junit4]   2> 1143915 INFO  (coreLoadExecutor-2508-thread-1-processing-n:127.0.0.1:53024_whqo%2Flz) [n:127.0.0.1:53024_whqo%2Flz c:control_collection   x:collection1] o.a.s.c.SolrResourceLoader new SolrResourceLoader for directory: '/x1/jenkins/jenkins-slave/workspace/Lucene-Solr-NightlyTests-trunk/solr/build/solr-core/test/J2/temp/solr.cloud.CollectionsAPIDistributedZkTest_585170DC09A44684-001/control-001/cores/collection1/'
   [junit4]   2> 1143929 INFO  (coreLoadExecutor-2508-thread-1-processing-n:127.0.0.1:53024_whqo%2Flz) [n:127.0.0.1:53024_whqo%2Flz c:control_collection   x:collection1] o.a.s.c.Config loaded config solrconfig.xml with version 0 
   [junit4]   2> 1143933 INFO  (coreLoadExecutor-2508-thread-1-processing-n:127.0.0.1:53024_whqo%2Flz) [n:127.0.0.1:53024_whqo%2Flz c:control_collection   x:collection1] o.a.s.c.SolrConfig current version of requestparams : -1
   [junit4]   2> 1143936 INFO  (coreLoadExecutor-2508-thread-1-processing-n:127.0.0.1:53024_whqo%2Flz) [n:127.0.0.1:53024_whqo%2Flz c:control_collection   x:collection1] o.a.s.c.SolrConfig Using Lucene MatchVersion: 6.0.0
   [junit4]   2> 1143944 INFO  (coreLoadExecutor-2508-thread-1-processing-n:127.0.0.1:53024_whqo%2Flz) [n:127.0.0.1:53024_whqo%2Flz c:control_collection   x:collection1] o.a.s.c.Config Loaded SolrConfig: solrconfig.xml
   [junit4]   2> 1143945 INFO  (coreLoadExecutor-2508-thread-1-processing-n:127.0.0.1:53024_whqo%2Flz) [n:127.0.0.1:53024_whqo%2Flz c:control_collection   x:collection1] o.a.s.s.IndexSchema Reading Solr Schema from /configs/conf1/schema.xml
   [junit4]   2> 1143949 INFO  (coreLoadExecutor-2508-thread-1-processing-n:127.0.0.1:53024_whqo%2Flz) [n:127.0.0.1:53024_whqo%2Flz c:control_collection   x:collection1] o.a.s.s.IndexSchema [collection1] Schema name=test
   [junit4]   2> 1144040 INFO  (coreLoadExecutor-2508-thread-1-processing-n:127.0.0.1:53024_whqo%2Flz) [n:127.0.0.1:53024_whqo%2Flz c:control_collection   x:collection1] o.a.s.s.OpenExchangeRatesOrgProvider Initialized with rates=open-exchange-rates.json, refreshInterval=1440.
   [junit4]   2> 1144045 INFO  (coreLoadExecutor-2508-thread-1-processing-n:127.0.0.1:53024_whqo%2Flz) [n:127.0.0.1:53024_whqo%2Flz c:control_collection   x:collection1] o.a.s.s.IndexSchema default search field in schema is text
   [junit4]   2> 1144046 INFO  (coreLoadExecutor-2508-thread-1-processing-n:127.0.0.1:53024_whqo%2Flz) [n:127.0.0.1:53024_whqo%2Flz c:control_collection   x:collection1] o.a.s.s.IndexSchema unique key field: id
   [junit4]   2> 1144054 INFO  (coreLoadExecutor-2508-thread-1-processing-n:127.0.0.1:53024_whqo%2Flz) [n:127.0.0.1:53024_whqo%2Flz c:control_collection   x:collection1] o.a.s.s.FileExchangeRateProvider Reloading exchange rates from file currency.xml
   [junit4]   2> 1144056 INFO  (coreLoadExecutor-2508-thread-1-processing-n:127.0.0.1:53024_whqo%2Flz) [n:127.0.0.1:53024_whqo%2Flz c:control_collection   x:collection1] o.a.s.s.FileExchangeRateProvider Reloading exchange rates from file currency.xml
   [junit4]   2> 1144058 INFO  (coreLoadExecutor-2508-thread-1-processing-n:127.0.0.1:53024_whqo%2Flz) [n:127.0.0.1:53024_whqo%2Flz c:control_collection   x:collection1] o.a.s.s.OpenExchangeRatesOrgProvider Reloading exchange rates from open-exchange-rates.json
   [junit4]   2> 1144058 WARN  (coreLoadExecutor-2508-thread-1-processing-n:127.0.0.1:53024_whqo%2Flz) [n:127.0.0.1:53024_whqo%2Flz c:control_collection   x:collection1] o.a.s.s.OpenExchangeRatesOrgProvider Unknown key IMPORTANT NOTE
   [junit4]   2> 1144059 WARN  (coreLoadExecutor-2508-thread-1-processing-n:127.0.0.1:53024_whqo%2Flz) [n:127.0.0.1:53024_whqo%2Flz c:control_collection   x:collection1] o.a.s.s.OpenExchangeRatesOrgProvider Expected key, got STRING
   [junit4]   2> 1144059 INFO  (coreLoadExecutor-2508-thread-1-processing-n:127.0.0.1:53024_whqo%2Flz) [n:127.0.0.1:53024_whqo%2Flz c:control_collection   x:collection1] o.a.s.s.OpenExchangeRatesOrgProvider Reloading exchange rates from open-exchange-rates.json
   [junit4]   2> 1144059 WARN  (coreLoadExecutor-2508-thread-1-processing-n:127.0.0.1:53024_whqo%2Flz) [n:127.0.0.1:53024_whqo%2Flz c:control_collection   x:collection1] o.a.s.s.OpenExchangeRatesOrgProvider Unknown key IMPORTANT NOTE
   [junit4]   2> 1144059 WARN  (coreLoadExecutor-2508-thread-1-processing-n:127.0.0.1:53024_whqo%2Flz) [n:127.0.0.1:53024_whqo%2Flz c:control_collection   x:collection1] o.a.s.s.OpenExchangeRatesOrgProvider Expected key, got STRING
   [junit4]   2> 1144061 INFO  (coreLoadExecutor-2508-thread-1-processing-n:127.0.0.1:53024_whqo%2Flz) [n:127.0.0.1:53024_whqo%2Flz c:control_collection   x:collection1] o.a.s.c.ConfigSetProperties Did not find ConfigSet properties, assuming default properties: Can't find resource 'configsetprops.json' in classpath or '/configs/conf1', cwd=/x1/jenkins/jenkins-slave/workspace/Lucene-Solr-NightlyTests-trunk/solr/build/solr-core/test/J2
   [junit4]   2> 1144061 INFO  (coreLoadExecutor-2508-thread-1-processing-n:127.0.0.1:53024_whqo%2Flz) [n:127.0.0.1:53024_whqo%2Flz c:control_collection   x:collection1] o.a.s.c.CoreContainer Creating SolrCore 'collection1' using configuration from collection control_collection
   [junit4]   2> 1144061 INFO  (coreLoadExecutor-2508-thread-1-processing-n:127.0.0.1:53024_whqo%2Flz) [n:127.0.0.1:53024_whqo%2Flz c:control_collection s:shard1 r:core_node1 x:collection1] o.a.s.c.SolrCore org.apache.solr.core.MockDirectoryFactory
   [junit4]   2> 1144061 INFO  (coreLoadExecutor-2508-thread-1-processing-n:127.0.0.1:53024_whqo%2Flz) [n:127.0.0.1:53024_whqo%2Flz c:control_collection s:shard1 r:core_node1 x:collection1] o.a.s.c.SolrCore [[collection1] ] Opening new SolrCore at [/x1/jenkins/jenkins-slave/workspace/Lucene-Solr-NightlyTests-trunk/solr/build/solr-core/test/J2/temp/solr.cloud.CollectionsAPIDistributedZkTest_585170DC09A44684-001/control-001/cores/collection1/], dataDir=[null]
   [junit4]   2> 1144062 INFO  (coreLoadExecutor-2508-thread-1-processing-n:127.0.0.1:53024_whqo%2Flz) [n:127.0.0.1:53024_whqo%2Flz c:control_collection s:shard1 r:core_node1 x:collection1] o.a.s.c.JmxMonitoredMap JMX monitoring is enabled. Adding Solr mbeans to JMX Server: com.sun.jmx.mbeanserver.JmxMBeanServer@448f989a
   [junit4]   2> 1144062 INFO  (coreLoadExecutor-2508-thread-1-processing-n:127.0.0.1:53024_whqo%2Flz) [n:127.0.0.1:53024_whqo%2Flz c:control_collection s:shard1 r:core_node1 x:collection1] o.a.s.c.CachingDirectoryFactory return new directory for /x1/jenkins/jenkins-slave/workspace/Lucene-Solr-NightlyTests-trunk/solr/build/solr-core/test/J2/temp/solr.cloud.CollectionsAPIDistributedZkTest_585170DC09A44684-001/control-001/cores/collection1/data
   [junit4]   2> 1144062 INFO  (coreLoadExecutor-2508-thread-1-processing-n:127.0.0.1:53024_whqo%2Flz) [n:127.0.0.1:53024_whqo%2Flz c:control_collection s:shard1 r:core_node1 x:collection1] o.a.s.c.SolrCore New index directory detected: old=null new=/x1/jenkins/jenkins-slave/workspace/Lucene-Solr-NightlyTests-trunk/solr/build/solr-core/test/J2/temp/solr.cloud.CollectionsAPIDistributedZkTest_585170DC09A44684-001/control-001/cores/collection1/data/index/
   [junit4]   2> 1144063 WARN  (coreLoadExecutor-2508-thread-1-processing-n:127.0.0.1:53024_whqo%2Flz) [n:127.0.0.1:53024_whqo%2Flz c:control_collection s:shard1 r:core_node1 x:collection1] o.a.s.c.SolrCore [collection1] Solr index directory '/x1/jenkins/jenkins-slave/workspace/Lucene-Solr-NightlyTests-trunk/solr/build/solr-core/test/J2/temp/solr.cloud.CollectionsAPIDistributedZkTest_585170DC09A44684-001/control-001/cores/collection1/data/index' doesn't exist. Creating new index...
   [junit4]   2> 1144063 INFO  (coreLoadExecutor-2508-thread-1-processing-n:127.0.0.1:53024_whqo%2Flz) [n:127.0.0.1:53024_whqo%2Flz c:control_collection s:shard1 r:core_node1 x:collection1] o.a.s.c.CachingDirectoryFactory return new directory for /x1/jenkins/jenkins-slave/workspace/Lucene-Solr-NightlyTests-trunk/solr/build/solr-core/test/J2/temp/solr.cloud.CollectionsAPIDistributedZkTest_585170DC09A44684-001/control-001/cores/collection1/data/index
   [junit4]   2> 1144063 INFO  (coreLoadExecutor-2508-thread-1-processing-n:127.0.0.1:53024_whqo%2Flz) [n:127.0.0.1:53024_whqo%2Flz c:control_collection s:shard1 r:core_node1 x:collection1] o.a.s.u.RandomMergePolicy RandomMergePolicy wrapping class org.apache.lucene.index.TieredMergePolicy: [TieredMergePolicy: maxMergeAtOnce=6, maxMergeAtOnceExplicit=9, maxMergedSegmentMB=96.5029296875, floorSegmentMB=0.599609375, forceMergeDeletesPctAllowed=12.906747641957894, segmentsPerTier=50.0, maxCFSSegmentSizeMB=8.796093022207999E12, noCFSRatio=1.0
   [junit4]   2> 1144064 INFO  (coreLoadExecutor-2508-thread-1-processing-n:127.0.0.1:53024_whqo%2Flz) [n:127.0.0.1:53024_whqo%2Flz c:control_collection s:shard1 r:core_node1 x:collection1] o.a.s.c.SolrCore SolrDeletionPolicy.onCommit: commits: num=1
   [junit4]   2> 	commit{dir=MockDirectoryWrapper(RAMDirectory@2462dd27 lockFactory=org.apache.lucene.store.SingleInstanceLockFactory@6eb0f020),segFN=segments_1,generation=1}
   [junit4]   2> 1144064 INFO  (coreLoadExecutor-2508-thread-1-processing-n:127.0.0.1:53024_whqo%2Flz) [n:127.0.0.1:53024_whqo%2Flz c:control_collection s:shard1 r:core_node1 x:collection1] o.a.s.c.SolrCore newest commit generation = 1
   [junit4]   2> 1144064 INFO  (OldIndexDirectoryCleanupThreadForCore-collection1) [n:127.0.0.1:53024_whqo%2Flz c:control_collection s:shard1 r:core_node1 x:collection1] o.a.s.c.SolrCore Looking for old index directories to cleanup for core collection1 in /x1/jenkins/jenkins-slave/workspace/Lucene-Solr-NightlyTests-trunk/solr/build/solr-core/test/J2/temp/solr.cloud.CollectionsAPIDistributedZkTest_585170DC09A44684-001/control-001/cores/collection1/data/
   [junit4]   2> 1144065 WARN  (OldIndexDirectoryCleanupThreadForCore-collection1) [n:127.0.0.1:53024_whqo%2Flz c:control_collection s:shard1 r:core_node1 x:collection1] o.a.s.c.DirectoryFactory /x1/jenkins/jenkins-slave/workspace/Lucene-Solr-NightlyTests-trunk/solr/build/solr-core/test/J2/temp/solr.cloud.CollectionsAPIDistributedZkTest_585170DC09A44684-001/control-001/cores/collection1/data/ does not point to a valid data directory; skipping clean-up of old index directories.
   [junit4]   2> 1144068 INFO  (coreLoadExecutor-2508-thread-1-processing-n:127.0.0.1:53024_whqo%2Flz) [n:127.0.0.1:53024_whqo%2Flz c:control_collection s:shard1 r:core_node1 x:collection1] o.a.s.u.p.UpdateRequestProcessorChain creating updateRequestProcessorChain "nodistrib"
   [junit4]   2> 1144068 INFO  (coreLoadExecutor-2508-thread-1-processing-n:127.0.0.1:53024_whqo%2Flz) [n:127.0.0.1:53024_whqo%2Flz c:control_collection s:shard1 r:core_node1 x:collection1] o.a.s.u.p.UpdateRequestProcessorChain creating updateRequestProcessorChain "dedupe"
   [junit4]   2> 1144068 INFO  (coreLoadExecutor-2508-thread-1-processing-n:127.0.0.1:53024_whqo%2Flz) [n:127.0.0.1:53024_whqo%2Flz c:control_collection s:shard1 r:core_node1 x:collection1] o.a.s.u.p.UpdateRequestProcessorChain inserting DistributedUpdateProcessorFactory into updateRequestProcessorChain "dedupe"
   [junit4]   2> 1144068 INFO  (coreLoadExecutor-2508-thread-1-processing-n:127.0.0.1:53024_whqo%2Flz) [n:127.0.0.1:53024_whqo%2Flz c:control_collection s:shard1 r:core_node1 x:collection1] o.a.s.u.p.UpdateRequestProcessorChain creating updateRequestProcessorChain "stored_sig"
   [junit4]   2> 1144068 INFO  (coreLoadExecutor-2508-thread-1-processing-n:127.0.0.1:53024_whqo%2Flz) [n:127.0.0.1:53024_whqo%2Flz c:control_collection s:shard1 r:core_node1 x:collection1] o.a.s.u.p.UpdateRequestProcessorChain inserting DistributedUpdateProcessorFactory into updateRequestProcessorChain "stored_sig"
   [junit4]   2> 1144069 INFO  (coreLoadExecutor-2508-thread-1-processing-n:127.0.0.1:53024_whqo%2Flz) [n:127.0.0.1:53024_whqo%2Flz c:control_collection s:shard1 r:core_node1 x:collection1] o.a.s.u.p.UpdateRequestProcessorChain creating updateRequestProcessorChain "distrib-dup-test-chain-explicit"
   [junit4]   2> 1144069 INFO  (coreLoadExecutor-2508-thread-1-processing-n:127.0.0.1:53024_whqo%2Flz) [n:127.0.0.1:53024_whqo%2Flz c:control_collection s:shard1 r:core_node1 x:collection1] o.a.s.u.p.UpdateRequestProcessorChain creating updateRequestProcessorChain "distrib-dup-test-chain-implicit"
   [junit4]   2> 1144069 INFO  (coreLoadExecutor-2508-thread-1-processing-n:127.0.0.1:53024_whqo%2Flz) [n:127.0.0.1:53024_whqo%2Flz c:control_collection s:shard1 r:core_node1 x:collection1] o.a.s.u.p.UpdateRequestProcessorChain inserting DistributedUpdateProcessorFactory into updateRequestProcessorChain "distrib-dup-test-chain-implicit"
   [junit4]   2> 1144069 INFO  (coreLoadExecutor-2508-thread-1-processing-n:127.0.0.1:53024_whqo%2Flz) [n:127.0.0.1:53024_whqo%2Flz c:control_collection s:shard1 r:core_node1 x:collection1] o.a.s.c.SolrCore no updateRequestProcessorChain defined as default, creating implicit default
   [junit4]   2> 1144071 INFO  (coreLoadExecutor-2508-thread-1-processing-n:127.0.0.1:53024_whqo%2Flz) [n:127.0.0.1:53024_whqo%2Flz c:control_collection s:shard1 r:core_node1 x:collection1] o.a.s.h.l.XMLLoader xsltCacheLifetimeSeconds=60
   [junit4]   2> 1144072 INFO  (coreLoadExecutor-2508-thread-1-processing-n:127.0.0.1:53024_whqo%2Flz) [n:127.0.0.1:53024_whqo%2Flz c:control_collection s:shard1 r:core_node1 x:collection1] o.a.s.h.l.XMLLoader xsltCacheLifetimeSeconds=60
   [junit4]   2> 1144073 INFO  (coreLoadExecutor-2508-thread-1-processing-n:127.0.0.1:53024_whqo%2Flz) [n:127.0.0.1:53024_whqo%2Flz c:control_collection s:shard1 r:core_node1 x:collection1] o.a.s.h.l.XMLLoader xsltCacheLifetimeSeconds=60
   [junit4]   2> 1144074 INFO  (coreLoadExecutor-2508-thread-1-processing-n:127.0.0.1:53024_whqo%2Flz) [n:127.0.0.1:53024_whqo%2Flz c:control_collection s:shard1 r:core_node1 x:collection1] o.a.s.h.l.XMLLoader xsltCacheLifetimeSeconds=60
   [junit4]   2> 1144076 INFO  (coreLoadExecutor-2508-thread-1-processing-n:127.0.0.1:53024_whqo%2Flz) [n:127.0.0.1:53024_whqo%2Flz c:control_collection s:shard1 r:core_node1 x:collection1] o.a.s.c.RequestHandlers Registered paths: /admin/mbeans,standard,/update/csv,/update/json/docs,/admin/luke,/admin/segments,/get,/admin/system,/replication,/admin/properties,/config,/schema,/admin/plugins,/admin/logging,/update/json,/admin/threads,/admin/ping,/update,/admin/file
   [junit4]   2> 1144077 INFO  (coreLoadExecutor-2508-thread-1-processing-n:127.0.0.1:53024_whqo%2Flz) [n:127.0.0.1:53024_whqo%2Flz c:control_collection s:shard1 r:core_node1 x:collection1] o.a.s.c.SolrCore Using default statsCache cache: org.apache.solr.search.stats.LocalStatsCache
   [junit4]   2> 1144077 INFO  (coreLoadExecutor-2508-thread-1-processing-n:127.0.0.1:53024_whqo%2Flz) [n:127.0.0.1:53024_whqo%2Flz c:control_collection s:shard1 r:core_node1 x:collection1] o.a.s.u.UpdateHandler Using UpdateLog implementation: org.apache.solr.update.UpdateLog
   [junit4]   2> 1144077 INFO  (coreLoadExecutor-2508-thread-1-processing-n:127.0.0.1:53024_whqo%2Flz) [n:127.0.0.1:53024_whqo%2Flz c:control_collection s:shard1 r:core_node1 x:collection1] o.a.s.u.UpdateLog Initializing UpdateLog: dataDir= defaultSyncLevel=FLUSH numRecordsToKeep=100 maxNumLogsToKeep=10 numVersionBuckets=65536
   [junit4]   2> 1144078 INFO  (coreLoadExecutor-2508-thread-1-processing-n:127.0.0.1:53024_whqo%2Flz) [n:127.0.0.1:53024_whqo%2Flz c:control_collection s:shard1 r:core_node1 x:collection1] o.a.s.c.SolrCore Hard AutoCommit: disabled
   [junit4]   2> 1144078 INFO  (coreLoadExecutor-2508-thread-1-processing-n:127.0.0.1:53024_whqo%2Flz) [n:127.0.0.1:53024_whqo%2Flz c:control_collection s:shard1 r:core_node1 x:collection1] o.a.s.c.SolrCore Soft AutoCommit: disabled
   [junit4]   2> 1144079 INFO  (coreLoadExecutor-2508-thread-1-processing-n:127.0.0.1:53024_whqo%2Flz) [n:127.0.0.1:53024_whqo%2Flz c:control_collection s:shard1 r:core_node1 x:collection1] o.a.s.u.RandomMergePolicy RandomMergePolicy wrapping class org.apache.lucene.index.LogDocMergePolicy: [LogDocMergePolicy: minMergeSize=1000, mergeFactor=41, maxMergeSize=9223372036854775807, maxMergeSizeForForcedMerge=9223372036854775807, calibrateSizeByDeletes=false, maxMergeDocs=2147483647, maxCFSSegmentSizeMB=8.796093022207999E12, noCFSRatio=0.0]
   [junit4]   2> 1144079 INFO  (coreLoadExecutor-2508-thread-1-processing-n:127.0.0.1:53024_whqo%2Flz) [n:127.0.0.1:53024_whqo%2Flz c:control_collection s:shard1 r:core_node1 x:collection1] o.a.s.c.SolrCore SolrDeletionPolicy.onInit: commits: num=1
   [junit4]   2> 	commit{dir=MockDirectoryWrapper(RAMDirectory@2462dd27 lockFactory=org.apache.lucene.store.SingleInstanceLockFactory@6eb0f020),segFN=segments_1,generation=1}
   [junit4]   2> 1144079 INFO  (coreLoadExecutor-2508-thread-1-processing-n:127.0.0.1:53024_whqo%2Flz) [n:127.0.0.1:53024_whqo%2Flz c:control_collection s:shard1 r:core_node1 x:collection1] o.a.s.c.SolrCore newest commit generation = 1
   [junit4]   2> 1144079 INFO  (coreLoadExecutor-2508-thread-1-processing-n:127.0.0.1:53024_whqo%2Flz) [n:127.0.0.1:53024_whqo%2Flz c:control_collection s:shard1 r:core_node1 x:collection1] o.a.s.s.SolrIndexSearcher Opening Searcher@3f99eefe[collection1] main
   [junit4]   2> 1144080 INFO  (coreLoadExecutor-2508-thread-1-processing-n:127.0.0.1:53024_whqo%2Flz) [n:127.0.0.1:53024_whqo%2Flz c:control_collection s:shard1 r:core_node1 x:collection1] o.a.s.c.c.ZkStateReader Load collection config from:/collections/control_collection
   [junit4]   2> 1144080 INFO  (coreLoadExecutor-2508-thread-1-processing-n:127.0.0.1:53024_whqo%2Flz) [n:127.0.0.1:53024_whqo%2Flz c:control_collection s:shard1 r:core_node1 x:collection1] o.a.s.c.c.ZkStateReader path=/collections/control_collection configName=conf1 specified config exists in ZooKeeper
   [junit4]   2> 1144080 INFO  (coreLoadExecutor-2508-thread-1-processing-n:127.0.0.1:53024_whqo%2Flz) [n:127.0.0.1:53024_whqo%2Flz c:control_collection s:shard1 r:core_node1 x:collection1] o.a.s.r.ManagedResourceStorage Setting up ZooKeeper-based storage for the RestManager with znodeBase: /configs/conf1
   [junit4]   2> 1144081 INFO  (coreLoadExecutor-2508-thread-1-processing-n:127.0.0.1:53024_whqo%2Flz) [n:127.0.0.1:53024_whqo%2Flz c:control_collection s:shard1 r:core_node1 x:collection1] o.a.s.r.ManagedResourceStorage Configured ZooKeeperStorageIO with znodeBase: /configs/conf1
   [junit4]   2> 1144081 INFO  (coreLoadExecutor-2508-thread-1-processing-n:127.0.0.1:53024_whqo%2Flz) [n:127.0.0.1:53024_whqo%2Flz c:control_collection s:shard1 r:core_node1 x:collection1] o.a.s.r.RestManager Initializing RestManager with initArgs: {}
   [junit4]   2> 1144081 INFO  (coreLoadExecutor-2508-thread-1-processing-n:127.0.0.1:53024_whqo%2Flz) [n:127.0.0.1:53024_whqo%2Flz c:control_collection s:shard1 r:core_node1 x:collection1] o.a.s.r.ManagedResourceStorage Reading _rest_managed.json using ZooKeeperStorageIO:path=/configs/conf1
   [junit4]   2> 1144081 INFO  (coreLoadExecutor-2508-thread-1-processing-n:127.0.0.1:53024_whqo%2Flz) [n:127.0.0.1:53024_whqo%2Flz c:control_collection s:shard1 r:core_node1 x:collection1] o.a.s.r.ManagedResourceStorage No data found for znode /configs/conf1/_rest_managed.json
   [junit4]   2> 1144082 INFO  (coreLoadExecutor-2508-thread-1-processing-n:127.0.0.1:53024_whqo%2Flz) [n:127.0.0.1:53024_whqo%2Flz c:control_collection s:shard1 r:core_node1 x:collection1] o.a.s.r.ManagedResourceStorage Loaded null at path _rest_managed.json using ZooKeeperStorageIO:path=/configs/conf1
   [junit4]   2> 1144082 INFO  (coreLoadExecutor-2508-thread-1-processing-n:127.0.0.1:53024_whqo%2Flz) [n:127.0.0.1:53024_whqo%2Flz c:control_collection s:shard1 r:core_node1 x:collection1] o.a.s.r.RestManager Initializing 0 registered ManagedResources
   [junit4]   2> 1144082 INFO  (coreLoadExecutor-2508-thread-1-processing-n:127.0.0.1:53024_whqo%2Flz) [n:127.0.0.1:53024_whqo%2Flz c:control_collection s:shard1 r:core_node1 x:collection1] o.a.s.h.ReplicationHandler Commits will be reserved for  10000
   [junit4]   2> 1144086 INFO  (searcherExecutor-2509-thread-1-processing-n:127.0.0.1:53024_whqo%2Flz x:collection1 s:shard1 c:control_collection r:core_node1) [n:127.0.0.1:53024_whqo%2Flz c:control_collection s:shard1 r:core_node1 x:collection1] o.a.s.c.SolrCore [collection1] Registered new searcher Searcher@3f99eefe[collection1] main{ExitableDirectoryReader(UninvertingDirectoryReader())}
   [junit4]   2> 1144086 INFO  (coreLoadExecutor-2508-thread-1-processing-n:127.0.0.1:53024_whqo%2Flz) [n:127.0.0.1:53024_whqo%2Flz c:control_collection s:shard1 r:core_node1 x:collection1] o.a.s.u.UpdateLog Looking up max value of version field to seed version buckets
   [junit4]   2> 1144086 INFO  (coreLoadExecutor-2508-thread-1-processing-n:127.0.0.1:53024_whqo%2Flz) [n:127.0.0.1:53024_whqo%2Flz c:control_collection s:shard1 r:core_node1 x:collection1] o.a.s.u.VersionInfo Refreshing highest value of _version_ for 65536 version buckets from index
   [junit4]   2> 1144086 INFO  (coreLoadExecutor-2508-thread-1-processing-n:127.0.0.1:53024_whqo%2Flz) [n:127.0.0.1:53024_whqo%2Flz c:control_collection s:shard1 r:core_node1 x:collection1] o.a.s.u.VersionInfo No terms found for _version_, cannot seed version bucket highest value from index
   [junit4]   2> 1144086 INFO  (coreLoadExecutor-2508-thread-1-processing-n:127.0.0.1:53024_whqo%2Flz) [n:127.0.0.1:53024_whqo%2Flz c:control_collection s:shard1 r:core_node1 x:collection1] o.a.s.u.UpdateLog Could not find max version in index or recent updates, using new clock 1510290520776114176
   [junit4]   2> 1144089 INFO  (coreLoadExecutor-2508-thread-1-processing-n:127.0.0.1:53024_whqo%2Flz) [n:127.0.0.1:53024_whqo%2Flz c:control_collection s:shard1 r:core_node1 x:collection1] o.a.s.u.UpdateLog Took 2.0ms to seed version buckets with highest version 1510290520776114176
   [junit4]   2> 1144089 INFO  (coreLoadExecutor-2508-thread-1-processing-n:127.0.0.1:53024_whqo%2Flz) [n:127.0.0.1:53024_whqo%2Flz c:control_collection s:shard1 r:core_node1 x:collection1] o.a.s.c.ZkController watch zkdir /configs/conf1
   [junit4]   2> 1144089 INFO  (coreLoadExecutor-2508-thread-1-processing-n:127.0.0.1:53024_whqo%2Flz) [n:127.0.0.1:53024_whqo%2Flz c:control_collection s:shard1 r:core_node1 x:collection1] o.a.s.c.CoreContainer registering core: collection1
   [junit4]   2> 1144090 INFO  (coreZkRegister-2502-thread-1-processing-n:127.0.0.1:53024_whqo%2Flz x:collection1 s:shard1 c:control_collection r:core_node1) [n:127.0.0.1:53024_whqo%2Flz c:control_collection s:shard1 r:core_node1 x:collection1] o.a.s.c.ZkController Register replica - core:collection1 address:https://127.0.0.1:53024/whqo/lz collection:control_collection shard:shard1
   [junit4]   2> 1144090 INFO  (coreZkRegister-2502-thread-1-processing-n:127.0.0.1:53024_whqo%2Flz x:collection1 s:shard1 c:control_collection r:core_node1) [n:127.0.0.1:53024_whqo%2Flz c:control_collection s:shard1 r:core_node1 x:collection1] o.a.s.c.c.SolrZkClient makePath: /collections/control_collection/leader_elect/shard1/election
   [junit4]   2> 1144093 INFO  (coreZkRegister-2502-thread-1-processing-n:127.0.0.1:53024_whqo%2Flz x:collection1 s:shard1 c:control_collection r:core_node1) [n:127.0.0.1:53024_whqo%2Flz c:control_collection s:shard1 r:core_node1 x:collection1] o.a.s.c.LeaderElector Joined leadership election with path: /collections/control_collection/leader_elect/shard1/election/94393157429493767-core_node1-n_0000000000
   [junit4]   2> 1144094 INFO  (coreZkRegister-2502-thread-1-processing-n:127.0.0.1:53024_whqo%2Flz x:collection1 s:shard1 c:control_collection r:core_node1) [n:127.0.0.1:53024_whqo%2Flz c:control_collection s:shard1 r:core_node1 x:collection1] o.a.s.c.ShardLeaderElectionContext Running the leader process for shard shard1
   [junit4]   2> 1144096 INFO  (coreZkRegister-2502-thread-1-processing-n:127.0.0.1:53024_whqo%2Flz x:collection1 s:shard1 c:control_collection r:core_node1) [n:127.0.0.1:53024_whqo%2Flz c:control_collection s:shard1 r:core_node1 x:collection1] o.a.s.c.ShardLeaderElectionContext Enough replicas found to continue.
   [junit4]   2> 1144096 INFO  (coreZkRegister-2502-thread-1-processing-n:127.0.0.1:53024_whqo%2Flz x:collection1 s:shard1 c:control_collection r:core_node1) [n:127.0.0.1:53024_whqo%2Flz c:control_collection s:shard1 r:core_node1 x:collection1] o.a.s.c.ShardLeaderElectionContext I may be the new leader - try and sync
   [junit4]   2> 1144096 INFO  (coreZkRegister-2502-thread-1-processing-n:127.0.0.1:53024_whqo%2Flz x:collection1 s:shard1 c:control_collection r:core_node1) [n:127.0.0.1:53024_whqo%2Flz c:control_collection s:shard1 r:core_node1 x:collection1] o.a.s.c.SyncStrategy Sync replicas to https://127.0.0.1:53024/whqo/lz/collection1/
   [junit4]   2> 1144096 INFO  (coreZkRegister-2502-thread-1-processing-n:127.0.0.1:53024_whqo%2Flz x:collection1 s:shard1 c:control_collection r:core_node1) [n:127.0.0.1:53024_whqo%2Flz c:control_collection s:shard1 r:core_node1 x:collection1] o.a.s.c.SyncStrategy Sync Success - now sync replicas to me
   [junit4]   2> 1144096 INFO  (OverseerStateUpdate-94393157429493767-127.0.0.1:53024_whqo%2Flz-n_0000000000) [n:127.0.0.1:53024_whqo%2Flz    ] o.a.s.c.Overseer processMessage: queueSize: 1, message = {
   [junit4]   2>   "operation":"leader",
   [junit4]   2>   "shard":"shard1",
   [junit4]   2>   "collection":"control_collection"} current state version: 1
   [junit4]   2> 1144096 INFO  (coreZkRegister-2502-thread-1-processing-n:127.0.0.1:53024_whqo%2Flz x:collection1 s:shard1 c:control_collection r:core_node1) [n:127.0.0.1:53024_whqo%2Flz c:control_collection s:shard1 r:core_node1 x:collection1] o.a.s.c.SyncStrategy https://127.0.0.1:53024/whqo/lz/collection1/ has no replicas
   [junit4]   2> 1144096 INFO  (coreZkRegister-2502-thread-1-processing-n:127.0.0.1:53024_whqo%2Flz x:collection1 s:shard1 c:control_collection r:core_node1) [n:127.0.0.1:53024_whqo%2Flz c:control_collection s:shard1 r:core_node1 x:collection1] o.a.s.c.ShardLeaderElectionContext I am the new leader: https://127.0.0.1:53024/whqo/lz/collection1/ shard1
   [junit4]   2> 1144096 INFO  (coreZkRegister-2502-thread-1-p

[...truncated too long message...]

s(MetricsSystemImpl.java:461)
   [junit4]   2> 	at org.apache.hadoop.metrics2.impl.MetricsSystemImpl.stop(MetricsSystemImpl.java:212)
   [junit4]   2> 	at org.apache.hadoop.metrics2.impl.MetricsSystemImpl.shutdown(MetricsSystemImpl.java:592)
   [junit4]   2> 	at org.apache.hadoop.metrics2.lib.DefaultMetricsSystem.shutdownInstance(DefaultMetricsSystem.java:72)
   [junit4]   2> 	at org.apache.hadoop.metrics2.lib.DefaultMetricsSystem.shutdown(DefaultMetricsSystem.java:68)
   [junit4]   2> 	at org.apache.hadoop.hdfs.server.namenode.metrics.NameNodeMetrics.shutdown(NameNodeMetrics.java:145)
   [junit4]   2> 	at org.apache.hadoop.hdfs.server.namenode.NameNode.stop(NameNode.java:822)
   [junit4]   2> 	at org.apache.hadoop.hdfs.MiniDFSCluster.shutdown(MiniDFSCluster.java:1720)
   [junit4]   2> 	at org.apache.hadoop.hdfs.MiniDFSCluster.shutdown(MiniDFSCluster.java:1699)
   [junit4]   2> 	at org.apache.solr.cloud.hdfs.HdfsTestUtil.teardownClass(HdfsTestUtil.java:197)
   [junit4]   2> 	at org.apache.solr.cloud.hdfs.HdfsCollectionsAPIDistributedZkTest.teardownClass(HdfsCollectionsAPIDistributedZkTest.java:50)
   [junit4]   2> 	at sun.reflect.NativeMethodAccessorImpl.invoke0(Native Method)
   [junit4]   2> 	at sun.reflect.NativeMethodAccessorImpl.invoke(NativeMethodAccessorImpl.java:62)
   [junit4]   2> 	at sun.reflect.DelegatingMethodAccessorImpl.invoke(DelegatingMethodAccessorImpl.java:43)
   [junit4]   2> 	at java.lang.reflect.Method.invoke(Method.java:497)
   [junit4]   2> 	at com.carrotsearch.randomizedtesting.RandomizedRunner.invoke(RandomizedRunner.java:1627)
   [junit4]   2> 	at com.carrotsearch.randomizedtesting.RandomizedRunner$5.evaluate(RandomizedRunner.java:799)
   [junit4]   2> 	at com.carrotsearch.randomizedtesting.rules.StatementAdapter.evaluate(StatementAdapter.java:36)
   [junit4]   2> 	at com.carrotsearch.randomizedtesting.rules.SystemPropertiesRestoreRule$1.evaluate(SystemPropertiesRestoreRule.java:57)
   [junit4]   2> 	at org.apache.lucene.util.AbstractBeforeAfterRule$1.evaluate(AbstractBeforeAfterRule.java:46)
   [junit4]   2> 	at com.carrotsearch.randomizedtesting.rules.StatementAdapter.evaluate(StatementAdapter.java:36)
   [junit4]   2> 	at org.apache.lucene.util.TestRuleStoreClassName$1.evaluate(TestRuleStoreClassName.java:42)
   [junit4]   2> 	at com.carrotsearch.randomizedtesting.rules.NoShadowingOrOverridesOnMethodsRule$1.evaluate(NoShadowingOrOverridesOnMethodsRule.java:39)
   [junit4]   2> 	at com.carrotsearch.randomizedtesting.rules.NoShadowingOrOverridesOnMethodsRule$1.evaluate(NoShadowingOrOverridesOnMethodsRule.java:39)
   [junit4]   2> 	at com.carrotsearch.randomizedtesting.rules.StatementAdapter.evaluate(StatementAdapter.java:36)
   [junit4]   2> 	at com.carrotsearch.randomizedtesting.rules.StatementAdapter.evaluate(StatementAdapter.java:36)
   [junit4]   2> 	at com.carrotsearch.randomizedtesting.rules.StatementAdapter.evaluate(StatementAdapter.java:36)
   [junit4]   2> 	at org.apache.lucene.util.TestRuleAssertionsRequired$1.evaluate(TestRuleAssertionsRequired.java:54)
   [junit4]   2> 	at org.apache.lucene.util.TestRuleMarkFailure$1.evaluate(TestRuleMarkFailure.java:48)
   [junit4]   2> 	at org.apache.lucene.util.TestRuleIgnoreAfterMaxFailures$1.evaluate(TestRuleIgnoreAfterMaxFailures.java:65)
   [junit4]   2> 	at org.apache.lucene.util.TestRuleIgnoreTestSuites$1.evaluate(TestRuleIgnoreTestSuites.java:55)
   [junit4]   2> 	at com.carrotsearch.randomizedtesting.rules.StatementAdapter.evaluate(StatementAdapter.java:36)
   [junit4]   2> 	at com.carrotsearch.randomizedtesting.ThreadLeakControl$StatementRunner.run(ThreadLeakControl.java:365)
   [junit4]   2> 	at java.lang.Thread.run(Thread.java:745)
   [junit4]   2> Caused by: java.lang.NullPointerException
   [junit4]   2> 	at org.apache.hadoop.hdfs.server.blockmanagement.BlocksMap.size(BlocksMap.java:198)
   [junit4]   2> 	at org.apache.hadoop.hdfs.server.blockmanagement.BlockManager.getTotalBlocks(BlockManager.java:3291)
   [junit4]   2> 	at org.apache.hadoop.hdfs.server.namenode.FSNamesystem.getBlocksTotal(FSNamesystem.java:6223)
   [junit4]   2> 	... 53 more
   [junit4]   2> 5698928 INFO  (SUITE-HdfsCollectionsAPIDistributedZkTest-seed#[585170DC09A44684]-worker) [n:127.0.0.1:50588_ c:addReplicaColl s:shard1 r:core_node2 x:addReplicaColl_shard1_replica1] o.a.s.SolrTestCaseJ4 ###deleteCore
   [junit4]   2> Aug 23, 2015 7:37:15 AM com.carrotsearch.randomizedtesting.ThreadLeakControl checkThreadLeaks
   [junit4]   2> WARNING: Will linger awaiting termination of 2 leaked thread(s).
   [junit4]   2> NOTE: test params are: codec=CheapBastard, sim=RandomSimilarityProvider(queryNorm=true,coord=crazy): {}, locale=bg, timezone=Asia/Singapore
   [junit4]   2> NOTE: Linux 3.13.0-52-generic amd64/Oracle Corporation 1.8.0_45 (64-bit)/cpus=4,threads=2,free=235956920,total=529530880
   [junit4]   2> NOTE: All tests run in this JVM: [AliasIntegrationTest, TestSimpleQParserPlugin, OutOfBoxZkACLAndCredentialsProvidersTest, QueryParsingTest, MultiThreadedOCPTest, TestJsonRequest, BasicDistributedZk2Test, TestSortByMinMaxFunction, HdfsThreadLeakTest, BadIndexSchemaTest, TestPartialUpdateDeduplication, DocValuesTest, TestSolr4Spatial2, TestBlendedInfixSuggestions, TestAddFieldRealTimeGet, StatsComponentTest, AutoCommitTest, ZkStateWriterTest, SpellCheckCollatorTest, OpenExchangeRatesOrgProviderTest, TestManagedSynonymFilterFactory, TestInitQParser, TestExtendedDismaxParser, DirectSolrSpellCheckerTest, TestZkChroot, SearchHandlerTest, OverseerCollectionProcessorTest, CdcrReplicationHandlerTest, TestDocSet, SuggesterTest, TestSystemIdResolver, TestExpandComponent, BufferStoreTest, LeaderElectionTest, TestReloadAndDeleteDocs, TestCSVResponseWriter, HdfsChaosMonkeySafeLeaderTest, TestQueryTypes, TestDefaultStatsCache, CachingDirectoryFactoryTest, TestCollationField, DistanceUnitsTest, TestBinaryResponseWriter, SortByFunctionTest, TestStressReorder, XmlUpdateRequestHandlerTest, TestPerFieldSimilarity, SolrCoreCheckLockOnStartupTest, UUIDUpdateProcessorFallbackTest, TestIntervalFaceting, MoreLikeThisHandlerTest, TestXIncludeConfig, SecurityConfHandlerTest, TestImplicitCoreProperties, TestObjectReleaseTracker, LoggingHandlerTest, TestCollectionAPI, TestHighFrequencyDictionaryFactory, AsyncMigrateRouteKeyTest, TestManagedSchemaDynamicFieldResource, SoftAutoCommitTest, SegmentsInfoRequestHandlerTest, TestHighlightDedupGrouping, AnalyticsQueryTest, SOLR749Test, DirectUpdateHandlerOptimizeTest, AsyncCallRequestStatusResponseTest, TestSolrQueryParser, AssignTest, TestGroupingSearch, OutputWriterTest, TestPseudoReturnFields, BitVectorTest, DeleteShardTest, TestCopyFieldCollectionResource, TestDownShardTolerantSearch, NotRequiredUniqueKeyTest, TestExactSharedStatsCache, SolrInfoMBeanTest, TestReload, OverseerTest, SolrXmlInZkTest, TestRestoreCore, SaslZkACLProviderTest, TestFieldCollectionResource, TestFastOutputStream, UnloadDistributedZkTest, CollectionsAPIDistributedZkTest, ClusterStateUpdateTest, TestRandomFaceting, HardAutoCommitTest, DistributedTermsComponentTest, SimpleFacetsTest, PeerSyncTest, TestSort, DirectUpdateHandlerTest, DistributedQueryElevationComponentTest, SuggesterTSTTest, TestTrie, SuggesterWFSTTest, TestCSVLoader, PolyFieldTest, SchemaVersionSpecificBehaviorTest, TestWordDelimiterFilterFactory, DefaultValueUpdateProcessorTest, StatelessScriptUpdateProcessorFactoryTest, TestQueryUtils, DocumentAnalysisRequestHandlerTest, FileBasedSpellCheckerTest, RequestHandlersTest, TestValueSourceCache, TermVectorComponentTest, TestArbitraryIndexDir, RegexBoostProcessorTest, MBeansHandlerTest, UniqFieldsUpdateProcessorFactoryTest, CSVRequestHandlerTest, TestQuerySenderListener, AlternateDirectoryTest, TestQuerySenderNoQuery, CopyFieldTest, ResponseLogComponentTest, BadComponentTest, TestStressRecovery, TestSolrDeletionPolicy2, SampleTest, TestBinaryField, TestSearchPerf, NumericFieldsTest, TestElisionMultitermQuery, TestLuceneMatchVersion, TestPhraseSuggestions, SynonymTokenizerTest, TestBM25SimilarityFactory, TestDefaultSimilarityFactory, ScriptEngineTest, PluginInfoTest, TestFastLRUCache, ChaosMonkeyNothingIsSafeTest, CdcrRequestHandlerTest, CdcrVersionReplicationTest, CleanupOldIndexTest, CollectionsAPIAsyncDistributedZkTest, ConcurrentDeleteAndCreateCollectionTest, ConnectionManagerTest, CustomCollectionTest, DeleteLastCustomShardedReplicaTest, DistribCursorPagingTest, DistribDocExpirationUpdateProcessorTest, HttpPartitionTest, OverseerRolesTest, ReplicationFactorTest, ShardSplitTest, HdfsCollectionsAPIDistributedZkTest]
   [junit4] Completed [541/541] on J2 in 1437.76s, 1 test, 1 error <<< FAILURES!

[...truncated 14 lines...]
BUILD FAILED
/x1/jenkins/jenkins-slave/workspace/Lucene-Solr-NightlyTests-trunk/build.xml:782: The following error occurred while executing this line:
/x1/jenkins/jenkins-slave/workspace/Lucene-Solr-NightlyTests-trunk/build.xml:719: The following error occurred while executing this line:
/x1/jenkins/jenkins-slave/workspace/Lucene-Solr-NightlyTests-trunk/build.xml:59: The following error occurred while executing this line:
/x1/jenkins/jenkins-slave/workspace/Lucene-Solr-NightlyTests-trunk/solr/build.xml:233: The following error occurred while executing this line:
/x1/jenkins/jenkins-slave/workspace/Lucene-Solr-NightlyTests-trunk/solr/common-build.xml:514: The following error occurred while executing this line:
/x1/jenkins/jenkins-slave/workspace/Lucene-Solr-NightlyTests-trunk/lucene/common-build.xml:1432: The following error occurred while executing this line:
/x1/jenkins/jenkins-slave/workspace/Lucene-Solr-NightlyTests-trunk/lucene/common-build.xml:987: There were test failures: 541 suites, 2134 tests, 2 suite-level errors, 2 errors, 1 failure, 26 ignored (14 assumptions)

Total time: 203 minutes 9 seconds
Build step 'Invoke Ant' marked build as failure
Archiving artifacts
No prior successful build to compare, so performing full copy of artifacts
Recording test results
Email was triggered for: Failure
Sending email for trigger: Failure



Mime
View raw message