lucene-dev mailing list archives

Site index · List index
Message view « Date » · « Thread »
Top « Date » · « Thread »
From Policeman Jenkins Server <jenk...@thetaphi.de>
Subject [JENKINS] Lucene-Solr-trunk-Linux (64bit/jdk1.8.0_60) - Build # 13981 - Failure!
Date Mon, 24 Aug 2015 10:12:34 GMT
Build: http://jenkins.thetaphi.de/job/Lucene-Solr-trunk-Linux/13981/
Java: 64bit/jdk1.8.0_60 -XX:-UseCompressedOops -XX:+UseParallelGC

1 tests failed.
FAILED:  org.apache.solr.cloud.CdcrReplicationHandlerTest.doTest

Error Message:
There are still nodes recoverying - waited for 330 seconds

Stack Trace:
java.lang.AssertionError: There are still nodes recoverying - waited for 330 seconds
	at __randomizedtesting.SeedInfo.seed([5A760E747179A7E:A2E3D8432AAC89C7]:0)
	at org.junit.Assert.fail(Assert.java:93)
	at org.apache.solr.cloud.AbstractDistribZkTestBase.waitForRecoveriesToFinish(AbstractDistribZkTestBase.java:172)
	at org.apache.solr.cloud.AbstractDistribZkTestBase.waitForRecoveriesToFinish(AbstractDistribZkTestBase.java:133)
	at org.apache.solr.cloud.AbstractDistribZkTestBase.waitForRecoveriesToFinish(AbstractDistribZkTestBase.java:128)
	at org.apache.solr.cloud.BaseCdcrDistributedZkTest.waitForRecoveriesToFinish(BaseCdcrDistributedZkTest.java:465)
	at org.apache.solr.cloud.BaseCdcrDistributedZkTest.clearSourceCollection(BaseCdcrDistributedZkTest.java:319)
	at org.apache.solr.cloud.CdcrReplicationHandlerTest.doTestPartialReplication(CdcrReplicationHandlerTest.java:86)
	at org.apache.solr.cloud.CdcrReplicationHandlerTest.doTest(CdcrReplicationHandlerTest.java:51)
	at sun.reflect.NativeMethodAccessorImpl.invoke0(Native Method)
	at sun.reflect.NativeMethodAccessorImpl.invoke(NativeMethodAccessorImpl.java:62)
	at sun.reflect.DelegatingMethodAccessorImpl.invoke(DelegatingMethodAccessorImpl.java:43)
	at java.lang.reflect.Method.invoke(Method.java:497)
	at com.carrotsearch.randomizedtesting.RandomizedRunner.invoke(RandomizedRunner.java:1627)
	at com.carrotsearch.randomizedtesting.RandomizedRunner$6.evaluate(RandomizedRunner.java:836)
	at com.carrotsearch.randomizedtesting.RandomizedRunner$7.evaluate(RandomizedRunner.java:872)
	at com.carrotsearch.randomizedtesting.RandomizedRunner$8.evaluate(RandomizedRunner.java:886)
	at org.apache.solr.BaseDistributedSearchTestCase$ShardsRepeatRule$ShardsFixedStatement.callStatement(BaseDistributedSearchTestCase.java:963)
	at org.apache.solr.BaseDistributedSearchTestCase$ShardsRepeatRule$ShardsStatement.evaluate(BaseDistributedSearchTestCase.java:938)
	at com.carrotsearch.randomizedtesting.rules.SystemPropertiesRestoreRule$1.evaluate(SystemPropertiesRestoreRule.java:57)
	at org.apache.lucene.util.TestRuleSetupTeardownChained$1.evaluate(TestRuleSetupTeardownChained.java:50)
	at org.apache.lucene.util.AbstractBeforeAfterRule$1.evaluate(AbstractBeforeAfterRule.java:46)
	at org.apache.lucene.util.TestRuleThreadAndTestName$1.evaluate(TestRuleThreadAndTestName.java:49)
	at org.apache.lucene.util.TestRuleIgnoreAfterMaxFailures$1.evaluate(TestRuleIgnoreAfterMaxFailures.java:65)
	at org.apache.lucene.util.TestRuleMarkFailure$1.evaluate(TestRuleMarkFailure.java:48)
	at com.carrotsearch.randomizedtesting.rules.StatementAdapter.evaluate(StatementAdapter.java:36)
	at com.carrotsearch.randomizedtesting.ThreadLeakControl$StatementRunner.run(ThreadLeakControl.java:365)
	at com.carrotsearch.randomizedtesting.ThreadLeakControl.forkTimeoutingTask(ThreadLeakControl.java:798)
	at com.carrotsearch.randomizedtesting.ThreadLeakControl$3.evaluate(ThreadLeakControl.java:458)
	at com.carrotsearch.randomizedtesting.RandomizedRunner.runSingleTest(RandomizedRunner.java:845)
	at com.carrotsearch.randomizedtesting.RandomizedRunner$3.evaluate(RandomizedRunner.java:747)
	at com.carrotsearch.randomizedtesting.RandomizedRunner$4.evaluate(RandomizedRunner.java:781)
	at com.carrotsearch.randomizedtesting.RandomizedRunner$5.evaluate(RandomizedRunner.java:792)
	at com.carrotsearch.randomizedtesting.rules.StatementAdapter.evaluate(StatementAdapter.java:36)
	at com.carrotsearch.randomizedtesting.rules.SystemPropertiesRestoreRule$1.evaluate(SystemPropertiesRestoreRule.java:57)
	at org.apache.lucene.util.AbstractBeforeAfterRule$1.evaluate(AbstractBeforeAfterRule.java:46)
	at com.carrotsearch.randomizedtesting.rules.StatementAdapter.evaluate(StatementAdapter.java:36)
	at org.apache.lucene.util.TestRuleStoreClassName$1.evaluate(TestRuleStoreClassName.java:42)
	at com.carrotsearch.randomizedtesting.rules.NoShadowingOrOverridesOnMethodsRule$1.evaluate(NoShadowingOrOverridesOnMethodsRule.java:39)
	at com.carrotsearch.randomizedtesting.rules.NoShadowingOrOverridesOnMethodsRule$1.evaluate(NoShadowingOrOverridesOnMethodsRule.java:39)
	at com.carrotsearch.randomizedtesting.rules.StatementAdapter.evaluate(StatementAdapter.java:36)
	at com.carrotsearch.randomizedtesting.rules.StatementAdapter.evaluate(StatementAdapter.java:36)
	at com.carrotsearch.randomizedtesting.rules.StatementAdapter.evaluate(StatementAdapter.java:36)
	at org.apache.lucene.util.TestRuleAssertionsRequired$1.evaluate(TestRuleAssertionsRequired.java:54)
	at org.apache.lucene.util.TestRuleMarkFailure$1.evaluate(TestRuleMarkFailure.java:48)
	at org.apache.lucene.util.TestRuleIgnoreAfterMaxFailures$1.evaluate(TestRuleIgnoreAfterMaxFailures.java:65)
	at org.apache.lucene.util.TestRuleIgnoreTestSuites$1.evaluate(TestRuleIgnoreTestSuites.java:55)
	at com.carrotsearch.randomizedtesting.rules.StatementAdapter.evaluate(StatementAdapter.java:36)
	at com.carrotsearch.randomizedtesting.ThreadLeakControl$StatementRunner.run(ThreadLeakControl.java:365)
	at java.lang.Thread.run(Thread.java:745)




Build Log:
[...truncated 10593 lines...]
   [junit4] Suite: org.apache.solr.cloud.CdcrReplicationHandlerTest
   [junit4]   2> Creating dataDir: /home/jenkins/workspace/Lucene-Solr-trunk-Linux/solr/build/solr-core/test/J1/temp/solr.cloud.CdcrReplicationHandlerTest_5A760E747179A7E-001/init-core-data-001
   [junit4]   2> 1090692 INFO  (SUITE-CdcrReplicationHandlerTest-seed#[5A760E747179A7E]-worker) [    ] o.a.s.SolrTestCaseJ4 Randomized ssl (true) and clientAuth (false)
   [junit4]   2> 1090692 INFO  (SUITE-CdcrReplicationHandlerTest-seed#[5A760E747179A7E]-worker) [    ] o.a.s.BaseDistributedSearchTestCase Setting hostContext system property: /
   [junit4]   2> 1090694 INFO  (TEST-CdcrReplicationHandlerTest.doTest-seed#[5A760E747179A7E]) [    ] o.a.s.c.ZkTestServer STARTING ZK TEST SERVER
   [junit4]   2> 1090695 INFO  (Thread-3737) [    ] o.a.s.c.ZkTestServer client port:0.0.0.0/0.0.0.0:0
   [junit4]   2> 1090695 INFO  (Thread-3737) [    ] o.a.s.c.ZkTestServer Starting server
   [junit4]   2> 1090795 INFO  (TEST-CdcrReplicationHandlerTest.doTest-seed#[5A760E747179A7E]) [    ] o.a.s.c.ZkTestServer start zk server on port:35372
   [junit4]   2> 1090796 INFO  (TEST-CdcrReplicationHandlerTest.doTest-seed#[5A760E747179A7E]) [    ] o.a.s.c.c.SolrZkClient Using default ZkCredentialsProvider
   [junit4]   2> 1090796 INFO  (TEST-CdcrReplicationHandlerTest.doTest-seed#[5A760E747179A7E]) [    ] o.a.s.c.c.ConnectionManager Waiting for client to connect to ZooKeeper
   [junit4]   2> 1090798 INFO  (zkCallback-1421-thread-1) [    ] o.a.s.c.c.ConnectionManager Watcher org.apache.solr.common.cloud.ConnectionManager@1dafe557 name:ZooKeeperConnection Watcher:127.0.0.1:35372 got event WatchedEvent state:SyncConnected type:None path:null path:null type:None
   [junit4]   2> 1090799 INFO  (TEST-CdcrReplicationHandlerTest.doTest-seed#[5A760E747179A7E]) [    ] o.a.s.c.c.ConnectionManager Client is connected to ZooKeeper
   [junit4]   2> 1090799 INFO  (TEST-CdcrReplicationHandlerTest.doTest-seed#[5A760E747179A7E]) [    ] o.a.s.c.c.SolrZkClient Using default ZkACLProvider
   [junit4]   2> 1090799 INFO  (TEST-CdcrReplicationHandlerTest.doTest-seed#[5A760E747179A7E]) [    ] o.a.s.c.c.SolrZkClient makePath: /solr
   [junit4]   2> 1090801 INFO  (TEST-CdcrReplicationHandlerTest.doTest-seed#[5A760E747179A7E]) [    ] o.a.s.c.c.SolrZkClient Using default ZkCredentialsProvider
   [junit4]   2> 1090801 INFO  (TEST-CdcrReplicationHandlerTest.doTest-seed#[5A760E747179A7E]) [    ] o.a.s.c.c.ConnectionManager Waiting for client to connect to ZooKeeper
   [junit4]   2> 1090803 INFO  (zkCallback-1422-thread-1) [    ] o.a.s.c.c.ConnectionManager Watcher org.apache.solr.common.cloud.ConnectionManager@2837e03f name:ZooKeeperConnection Watcher:127.0.0.1:35372/solr got event WatchedEvent state:SyncConnected type:None path:null path:null type:None
   [junit4]   2> 1090803 INFO  (TEST-CdcrReplicationHandlerTest.doTest-seed#[5A760E747179A7E]) [    ] o.a.s.c.c.ConnectionManager Client is connected to ZooKeeper
   [junit4]   2> 1090803 INFO  (TEST-CdcrReplicationHandlerTest.doTest-seed#[5A760E747179A7E]) [    ] o.a.s.c.c.SolrZkClient Using default ZkACLProvider
   [junit4]   2> 1090803 INFO  (TEST-CdcrReplicationHandlerTest.doTest-seed#[5A760E747179A7E]) [    ] o.a.s.c.c.SolrZkClient makePath: /collections/collection1
   [junit4]   2> 1090804 INFO  (TEST-CdcrReplicationHandlerTest.doTest-seed#[5A760E747179A7E]) [    ] o.a.s.c.c.SolrZkClient makePath: /collections/collection1/shards
   [junit4]   2> 1090805 INFO  (TEST-CdcrReplicationHandlerTest.doTest-seed#[5A760E747179A7E]) [    ] o.a.s.c.c.SolrZkClient makePath: /collections/control_collection
   [junit4]   2> 1090806 INFO  (TEST-CdcrReplicationHandlerTest.doTest-seed#[5A760E747179A7E]) [    ] o.a.s.c.c.SolrZkClient makePath: /collections/control_collection/shards
   [junit4]   2> 1090807 INFO  (TEST-CdcrReplicationHandlerTest.doTest-seed#[5A760E747179A7E]) [    ] o.a.s.c.AbstractZkTestCase put /home/jenkins/workspace/Lucene-Solr-trunk-Linux/solr/core/src/test-files/solr/collection1/conf/solrconfig-cdcr.xml to /configs/conf1/solrconfig.xml
   [junit4]   2> 1090807 INFO  (TEST-CdcrReplicationHandlerTest.doTest-seed#[5A760E747179A7E]) [    ] o.a.s.c.c.SolrZkClient makePath: /configs/conf1/solrconfig.xml
   [junit4]   2> 1090809 INFO  (TEST-CdcrReplicationHandlerTest.doTest-seed#[5A760E747179A7E]) [    ] o.a.s.c.AbstractZkTestCase put /home/jenkins/workspace/Lucene-Solr-trunk-Linux/solr/core/src/test-files/solr/collection1/conf/schema15.xml to /configs/conf1/schema.xml
   [junit4]   2> 1090809 INFO  (TEST-CdcrReplicationHandlerTest.doTest-seed#[5A760E747179A7E]) [    ] o.a.s.c.c.SolrZkClient makePath: /configs/conf1/schema.xml
   [junit4]   2> 1090810 INFO  (TEST-CdcrReplicationHandlerTest.doTest-seed#[5A760E747179A7E]) [    ] o.a.s.c.AbstractZkTestCase put /home/jenkins/workspace/Lucene-Solr-trunk-Linux/solr/core/src/test-files/solr/collection1/conf/solrconfig.snippet.randomindexconfig.xml to /configs/conf1/solrconfig.snippet.randomindexconfig.xml
   [junit4]   2> 1090810 INFO  (TEST-CdcrReplicationHandlerTest.doTest-seed#[5A760E747179A7E]) [    ] o.a.s.c.c.SolrZkClient makePath: /configs/conf1/solrconfig.snippet.randomindexconfig.xml
   [junit4]   2> 1090812 INFO  (TEST-CdcrReplicationHandlerTest.doTest-seed#[5A760E747179A7E]) [    ] o.a.s.c.AbstractZkTestCase put /home/jenkins/workspace/Lucene-Solr-trunk-Linux/solr/core/src/test-files/solr/collection1/conf/stopwords.txt to /configs/conf1/stopwords.txt
   [junit4]   2> 1090812 INFO  (TEST-CdcrReplicationHandlerTest.doTest-seed#[5A760E747179A7E]) [    ] o.a.s.c.c.SolrZkClient makePath: /configs/conf1/stopwords.txt
   [junit4]   2> 1090813 INFO  (TEST-CdcrReplicationHandlerTest.doTest-seed#[5A760E747179A7E]) [    ] o.a.s.c.AbstractZkTestCase put /home/jenkins/workspace/Lucene-Solr-trunk-Linux/solr/core/src/test-files/solr/collection1/conf/protwords.txt to /configs/conf1/protwords.txt
   [junit4]   2> 1090813 INFO  (TEST-CdcrReplicationHandlerTest.doTest-seed#[5A760E747179A7E]) [    ] o.a.s.c.c.SolrZkClient makePath: /configs/conf1/protwords.txt
   [junit4]   2> 1090814 INFO  (TEST-CdcrReplicationHandlerTest.doTest-seed#[5A760E747179A7E]) [    ] o.a.s.c.AbstractZkTestCase put /home/jenkins/workspace/Lucene-Solr-trunk-Linux/solr/core/src/test-files/solr/collection1/conf/currency.xml to /configs/conf1/currency.xml
   [junit4]   2> 1090814 INFO  (TEST-CdcrReplicationHandlerTest.doTest-seed#[5A760E747179A7E]) [    ] o.a.s.c.c.SolrZkClient makePath: /configs/conf1/currency.xml
   [junit4]   2> 1090816 INFO  (TEST-CdcrReplicationHandlerTest.doTest-seed#[5A760E747179A7E]) [    ] o.a.s.c.AbstractZkTestCase put /home/jenkins/workspace/Lucene-Solr-trunk-Linux/solr/core/src/test-files/solr/collection1/conf/enumsConfig.xml to /configs/conf1/enumsConfig.xml
   [junit4]   2> 1090816 INFO  (TEST-CdcrReplicationHandlerTest.doTest-seed#[5A760E747179A7E]) [    ] o.a.s.c.c.SolrZkClient makePath: /configs/conf1/enumsConfig.xml
   [junit4]   2> 1090817 INFO  (TEST-CdcrReplicationHandlerTest.doTest-seed#[5A760E747179A7E]) [    ] o.a.s.c.AbstractZkTestCase put /home/jenkins/workspace/Lucene-Solr-trunk-Linux/solr/core/src/test-files/solr/collection1/conf/open-exchange-rates.json to /configs/conf1/open-exchange-rates.json
   [junit4]   2> 1090817 INFO  (TEST-CdcrReplicationHandlerTest.doTest-seed#[5A760E747179A7E]) [    ] o.a.s.c.c.SolrZkClient makePath: /configs/conf1/open-exchange-rates.json
   [junit4]   2> 1090818 INFO  (TEST-CdcrReplicationHandlerTest.doTest-seed#[5A760E747179A7E]) [    ] o.a.s.c.AbstractZkTestCase put /home/jenkins/workspace/Lucene-Solr-trunk-Linux/solr/core/src/test-files/solr/collection1/conf/mapping-ISOLatin1Accent.txt to /configs/conf1/mapping-ISOLatin1Accent.txt
   [junit4]   2> 1090819 INFO  (TEST-CdcrReplicationHandlerTest.doTest-seed#[5A760E747179A7E]) [    ] o.a.s.c.c.SolrZkClient makePath: /configs/conf1/mapping-ISOLatin1Accent.txt
   [junit4]   2> 1090820 INFO  (TEST-CdcrReplicationHandlerTest.doTest-seed#[5A760E747179A7E]) [    ] o.a.s.c.AbstractZkTestCase put /home/jenkins/workspace/Lucene-Solr-trunk-Linux/solr/core/src/test-files/solr/collection1/conf/old_synonyms.txt to /configs/conf1/old_synonyms.txt
   [junit4]   2> 1090820 INFO  (TEST-CdcrReplicationHandlerTest.doTest-seed#[5A760E747179A7E]) [    ] o.a.s.c.c.SolrZkClient makePath: /configs/conf1/old_synonyms.txt
   [junit4]   2> 1090821 INFO  (TEST-CdcrReplicationHandlerTest.doTest-seed#[5A760E747179A7E]) [    ] o.a.s.c.AbstractZkTestCase put /home/jenkins/workspace/Lucene-Solr-trunk-Linux/solr/core/src/test-files/solr/collection1/conf/synonyms.txt to /configs/conf1/synonyms.txt
   [junit4]   2> 1090821 INFO  (TEST-CdcrReplicationHandlerTest.doTest-seed#[5A760E747179A7E]) [    ] o.a.s.c.c.SolrZkClient makePath: /configs/conf1/synonyms.txt
   [junit4]   2> 1090823 INFO  (TEST-CdcrReplicationHandlerTest.doTest-seed#[5A760E747179A7E]) [    ] o.a.s.c.c.SolrZkClient Using default ZkCredentialsProvider
   [junit4]   2> 1090823 INFO  (TEST-CdcrReplicationHandlerTest.doTest-seed#[5A760E747179A7E]) [    ] o.a.s.c.c.ConnectionManager Waiting for client to connect to ZooKeeper
   [junit4]   2> 1090827 INFO  (zkCallback-1423-thread-1) [    ] o.a.s.c.c.ConnectionManager Watcher org.apache.solr.common.cloud.ConnectionManager@66dce093 name:ZooKeeperConnection Watcher:127.0.0.1:35372/solr got event WatchedEvent state:SyncConnected type:None path:null path:null type:None
   [junit4]   2> 1090828 INFO  (TEST-CdcrReplicationHandlerTest.doTest-seed#[5A760E747179A7E]) [    ] o.a.s.c.c.ConnectionManager Client is connected to ZooKeeper
   [junit4]   2> 1090828 INFO  (TEST-CdcrReplicationHandlerTest.doTest-seed#[5A760E747179A7E]) [    ] o.a.s.c.c.SolrZkClient Using default ZkACLProvider
   [junit4]   2> 1090829 INFO  (TEST-CdcrReplicationHandlerTest.doTest-seed#[5A760E747179A7E]) [    ] o.a.s.SolrTestCaseJ4 ###Starting doTest
   [junit4]   2> 1090933 INFO  (TEST-CdcrReplicationHandlerTest.doTest-seed#[5A760E747179A7E]) [    ] o.a.s.SolrTestCaseJ4 Writing core.properties file to /home/jenkins/workspace/Lucene-Solr-trunk-Linux/solr/build/solr-core/test/J1/temp/solr.cloud.CdcrReplicationHandlerTest_5A760E747179A7E-001/jetty-001/cores/collection1
   [junit4]   2> 1090935 INFO  (TEST-CdcrReplicationHandlerTest.doTest-seed#[5A760E747179A7E]) [    ] o.e.j.s.Server jetty-9.2.13.v20150730
   [junit4]   2> 1090936 INFO  (TEST-CdcrReplicationHandlerTest.doTest-seed#[5A760E747179A7E]) [    ] o.e.j.s.h.ContextHandler Started o.e.j.s.ServletContextHandler@52c6e352{/,null,AVAILABLE}
   [junit4]   2> 1090940 INFO  (TEST-CdcrReplicationHandlerTest.doTest-seed#[5A760E747179A7E]) [    ] o.e.j.s.ServerConnector Started ServerConnector@2683a7f4{SSL-http/1.1}{127.0.0.1:44120}
   [junit4]   2> 1090940 INFO  (TEST-CdcrReplicationHandlerTest.doTest-seed#[5A760E747179A7E]) [    ] o.e.j.s.Server Started @1092574ms
   [junit4]   2> 1090940 INFO  (TEST-CdcrReplicationHandlerTest.doTest-seed#[5A760E747179A7E]) [    ] o.a.s.c.s.e.JettySolrRunner Jetty properties: {shards=shard1, hostContext=/, hostPort=44120, coreRootDirectory=/home/jenkins/workspace/Lucene-Solr-trunk-Linux/solr/build/solr-core/test/J1/temp/solr.cloud.CdcrReplicationHandlerTest_5A760E747179A7E-001/jetty-001/cores}
   [junit4]   2> 1090941 INFO  (TEST-CdcrReplicationHandlerTest.doTest-seed#[5A760E747179A7E]) [    ] o.a.s.s.SolrDispatchFilter SolrDispatchFilter.init(): sun.misc.Launcher$AppClassLoader@4e0e2f2a
   [junit4]   2> 1090941 INFO  (TEST-CdcrReplicationHandlerTest.doTest-seed#[5A760E747179A7E]) [    ] o.a.s.c.SolrResourceLoader new SolrResourceLoader for directory: '/home/jenkins/workspace/Lucene-Solr-trunk-Linux/solr/build/solr-core/test/J1/temp/solr.cloud.CdcrReplicationHandlerTest_5A760E747179A7E-001/jetty-001/'
   [junit4]   2> 1090954 INFO  (TEST-CdcrReplicationHandlerTest.doTest-seed#[5A760E747179A7E]) [    ] o.a.s.c.c.SolrZkClient Using default ZkCredentialsProvider
   [junit4]   2> 1090967 INFO  (TEST-CdcrReplicationHandlerTest.doTest-seed#[5A760E747179A7E]) [    ] o.a.s.c.c.ConnectionManager Waiting for client to connect to ZooKeeper
   [junit4]   2> 1090991 INFO  (zkCallback-1424-thread-1) [    ] o.a.s.c.c.ConnectionManager Watcher org.apache.solr.common.cloud.ConnectionManager@703fa212 name:ZooKeeperConnection Watcher:127.0.0.1:35372/solr got event WatchedEvent state:SyncConnected type:None path:null path:null type:None
   [junit4]   2> 1090992 INFO  (TEST-CdcrReplicationHandlerTest.doTest-seed#[5A760E747179A7E]) [    ] o.a.s.c.c.ConnectionManager Client is connected to ZooKeeper
   [junit4]   2> 1090992 INFO  (TEST-CdcrReplicationHandlerTest.doTest-seed#[5A760E747179A7E]) [    ] o.a.s.c.c.SolrZkClient Using default ZkACLProvider
   [junit4]   2> 1090993 INFO  (TEST-CdcrReplicationHandlerTest.doTest-seed#[5A760E747179A7E]) [    ] o.a.s.s.SolrDispatchFilter Loading solr.xml from SolrHome (not found in ZooKeeper)
   [junit4]   2> 1090993 INFO  (TEST-CdcrReplicationHandlerTest.doTest-seed#[5A760E747179A7E]) [    ] o.a.s.c.SolrXmlConfig Loading container configuration from /home/jenkins/workspace/Lucene-Solr-trunk-Linux/solr/build/solr-core/test/J1/temp/solr.cloud.CdcrReplicationHandlerTest_5A760E747179A7E-001/jetty-001/solr.xml
   [junit4]   2> 1090998 INFO  (TEST-CdcrReplicationHandlerTest.doTest-seed#[5A760E747179A7E]) [    ] o.a.s.c.CoresLocator Config-defined core root directory: /home/jenkins/workspace/Lucene-Solr-trunk-Linux/solr/build/solr-core/test/J1/temp/solr.cloud.CdcrReplicationHandlerTest_5A760E747179A7E-001/jetty-001/cores
   [junit4]   2> 1090999 INFO  (TEST-CdcrReplicationHandlerTest.doTest-seed#[5A760E747179A7E]) [    ] o.a.s.c.CoreContainer New CoreContainer 5575704
   [junit4]   2> 1090999 INFO  (TEST-CdcrReplicationHandlerTest.doTest-seed#[5A760E747179A7E]) [    ] o.a.s.c.CoreContainer Loading cores into CoreContainer [instanceDir=/home/jenkins/workspace/Lucene-Solr-trunk-Linux/solr/build/solr-core/test/J1/temp/solr.cloud.CdcrReplicationHandlerTest_5A760E747179A7E-001/jetty-001/]
   [junit4]   2> 1090999 INFO  (TEST-CdcrReplicationHandlerTest.doTest-seed#[5A760E747179A7E]) [    ] o.a.s.c.CoreContainer loading shared library: /home/jenkins/workspace/Lucene-Solr-trunk-Linux/solr/build/solr-core/test/J1/temp/solr.cloud.CdcrReplicationHandlerTest_5A760E747179A7E-001/jetty-001/lib
   [junit4]   2> 1090999 WARN  (TEST-CdcrReplicationHandlerTest.doTest-seed#[5A760E747179A7E]) [    ] o.a.s.c.SolrResourceLoader Can't find (or read) directory to add to classloader: lib (resolved as: /home/jenkins/workspace/Lucene-Solr-trunk-Linux/solr/build/solr-core/test/J1/temp/solr.cloud.CdcrReplicationHandlerTest_5A760E747179A7E-001/jetty-001/lib).
   [junit4]   2> 1091005 INFO  (TEST-CdcrReplicationHandlerTest.doTest-seed#[5A760E747179A7E]) [    ] o.a.s.h.c.HttpShardHandlerFactory created with socketTimeout : 90000,urlScheme : ,connTimeout : 15000,maxConnectionsPerHost : 20,maxConnections : 10000,corePoolSize : 0,maximumPoolSize : 2147483647,maxThreadIdleTime : 5,sizeOfQueue : -1,fairnessPolicy : false,useRetries : false,
   [junit4]   2> 1091008 INFO  (TEST-CdcrReplicationHandlerTest.doTest-seed#[5A760E747179A7E]) [    ] o.a.s.u.UpdateShardHandler Creating UpdateShardHandler HTTP client with params: socketTimeout=340000&connTimeout=45000&retry=true
   [junit4]   2> 1091009 INFO  (TEST-CdcrReplicationHandlerTest.doTest-seed#[5A760E747179A7E]) [    ] o.a.s.l.LogWatcher SLF4J impl is org.slf4j.impl.Log4jLoggerFactory
   [junit4]   2> 1091009 INFO  (TEST-CdcrReplicationHandlerTest.doTest-seed#[5A760E747179A7E]) [    ] o.a.s.l.LogWatcher Registering Log Listener [Log4j (org.slf4j.impl.Log4jLoggerFactory)]
   [junit4]   2> 1091009 INFO  (TEST-CdcrReplicationHandlerTest.doTest-seed#[5A760E747179A7E]) [    ] o.a.s.c.ZkContainer Zookeeper client=127.0.0.1:35372/solr
   [junit4]   2> 1091009 INFO  (TEST-CdcrReplicationHandlerTest.doTest-seed#[5A760E747179A7E]) [    ] o.a.s.c.ZkController zkHost includes chroot
   [junit4]   2> 1091009 INFO  (TEST-CdcrReplicationHandlerTest.doTest-seed#[5A760E747179A7E]) [    ] o.a.s.c.c.SolrZkClient Using default ZkCredentialsProvider
   [junit4]   2> 1091015 INFO  (TEST-CdcrReplicationHandlerTest.doTest-seed#[5A760E747179A7E]) [    ] o.a.s.c.c.ConnectionManager Waiting for client to connect to ZooKeeper
   [junit4]   2> 1091016 INFO  (zkCallback-1426-thread-1) [    ] o.a.s.c.c.ConnectionManager Watcher org.apache.solr.common.cloud.ConnectionManager@68a6dd89 name:ZooKeeperConnection Watcher:127.0.0.1:35372 got event WatchedEvent state:SyncConnected type:None path:null path:null type:None
   [junit4]   2> 1091016 INFO  (TEST-CdcrReplicationHandlerTest.doTest-seed#[5A760E747179A7E]) [    ] o.a.s.c.c.ConnectionManager Client is connected to ZooKeeper
   [junit4]   2> 1091017 INFO  (TEST-CdcrReplicationHandlerTest.doTest-seed#[5A760E747179A7E]) [    ] o.a.s.c.c.SolrZkClient Using default ZkACLProvider
   [junit4]   2> 1091039 INFO  (TEST-CdcrReplicationHandlerTest.doTest-seed#[5A760E747179A7E]) [n:127.0.0.1:44120_    ] o.a.s.c.c.ConnectionManager Waiting for client to connect to ZooKeeper
   [junit4]   2> 1091040 INFO  (zkCallback-1427-thread-1-processing-n:127.0.0.1:44120_) [n:127.0.0.1:44120_    ] o.a.s.c.c.ConnectionManager Watcher org.apache.solr.common.cloud.ConnectionManager@4fbcb341 name:ZooKeeperConnection Watcher:127.0.0.1:35372/solr got event WatchedEvent state:SyncConnected type:None path:null path:null type:None
   [junit4]   2> 1091041 INFO  (TEST-CdcrReplicationHandlerTest.doTest-seed#[5A760E747179A7E]) [n:127.0.0.1:44120_    ] o.a.s.c.c.ConnectionManager Client is connected to ZooKeeper
   [junit4]   2> 1091041 INFO  (TEST-CdcrReplicationHandlerTest.doTest-seed#[5A760E747179A7E]) [n:127.0.0.1:44120_    ] o.a.s.c.c.SolrZkClient makePath: /overseer/queue
   [junit4]   2> 1091048 INFO  (TEST-CdcrReplicationHandlerTest.doTest-seed#[5A760E747179A7E]) [n:127.0.0.1:44120_    ] o.a.s.c.c.SolrZkClient makePath: /overseer/collection-queue-work
   [junit4]   2> 1091053 INFO  (TEST-CdcrReplicationHandlerTest.doTest-seed#[5A760E747179A7E]) [n:127.0.0.1:44120_    ] o.a.s.c.c.SolrZkClient makePath: /overseer/collection-map-running
   [junit4]   2> 1091054 INFO  (TEST-CdcrReplicationHandlerTest.doTest-seed#[5A760E747179A7E]) [n:127.0.0.1:44120_    ] o.a.s.c.c.SolrZkClient makePath: /overseer/collection-map-completed
   [junit4]   2> 1091055 INFO  (TEST-CdcrReplicationHandlerTest.doTest-seed#[5A760E747179A7E]) [n:127.0.0.1:44120_    ] o.a.s.c.c.SolrZkClient makePath: /overseer/collection-map-failure
   [junit4]   2> 1091057 INFO  (TEST-CdcrReplicationHandlerTest.doTest-seed#[5A760E747179A7E]) [n:127.0.0.1:44120_    ] o.a.s.c.c.SolrZkClient makePath: /live_nodes
   [junit4]   2> 1091058 INFO  (TEST-CdcrReplicationHandlerTest.doTest-seed#[5A760E747179A7E]) [n:127.0.0.1:44120_    ] o.a.s.c.c.SolrZkClient makePath: /aliases.json
   [junit4]   2> 1091058 INFO  (TEST-CdcrReplicationHandlerTest.doTest-seed#[5A760E747179A7E]) [n:127.0.0.1:44120_    ] o.a.s.c.c.SolrZkClient makePath: /clusterstate.json
   [junit4]   2> 1091059 INFO  (TEST-CdcrReplicationHandlerTest.doTest-seed#[5A760E747179A7E]) [n:127.0.0.1:44120_    ] o.a.s.c.c.SolrZkClient makePath: /security.json
   [junit4]   2> 1091060 INFO  (TEST-CdcrReplicationHandlerTest.doTest-seed#[5A760E747179A7E]) [n:127.0.0.1:44120_    ] o.a.s.c.ZkController Register node as live in ZooKeeper:/live_nodes/127.0.0.1:44120_
   [junit4]   2> 1091060 INFO  (TEST-CdcrReplicationHandlerTest.doTest-seed#[5A760E747179A7E]) [n:127.0.0.1:44120_    ] o.a.s.c.c.SolrZkClient makePath: /live_nodes/127.0.0.1:44120_
   [junit4]   2> 1091061 INFO  (TEST-CdcrReplicationHandlerTest.doTest-seed#[5A760E747179A7E]) [n:127.0.0.1:44120_    ] o.a.s.c.c.SolrZkClient makePath: /overseer_elect
   [junit4]   2> 1091062 INFO  (TEST-CdcrReplicationHandlerTest.doTest-seed#[5A760E747179A7E]) [n:127.0.0.1:44120_    ] o.a.s.c.c.SolrZkClient makePath: /overseer_elect/election
   [junit4]   2> 1091063 INFO  (TEST-CdcrReplicationHandlerTest.doTest-seed#[5A760E747179A7E]) [n:127.0.0.1:44120_    ] o.a.s.c.Overseer Overseer (id=null) closing
   [junit4]   2> 1091063 INFO  (TEST-CdcrReplicationHandlerTest.doTest-seed#[5A760E747179A7E]) [n:127.0.0.1:44120_    ] o.a.s.c.LeaderElector Joined leadership election with path: /overseer_elect/election/94398740154089477-127.0.0.1:44120_-n_0000000000
   [junit4]   2> 1091064 INFO  (TEST-CdcrReplicationHandlerTest.doTest-seed#[5A760E747179A7E]) [n:127.0.0.1:44120_    ] o.a.s.c.OverseerElectionContext I am going to be the leader 127.0.0.1:44120_
   [junit4]   2> 1091064 INFO  (TEST-CdcrReplicationHandlerTest.doTest-seed#[5A760E747179A7E]) [n:127.0.0.1:44120_    ] o.a.s.c.c.SolrZkClient makePath: /overseer_elect/leader
   [junit4]   2> 1091065 INFO  (TEST-CdcrReplicationHandlerTest.doTest-seed#[5A760E747179A7E]) [n:127.0.0.1:44120_    ] o.a.s.c.Overseer Overseer (id=94398740154089477-127.0.0.1:44120_-n_0000000000) starting
   [junit4]   2> 1091066 INFO  (TEST-CdcrReplicationHandlerTest.doTest-seed#[5A760E747179A7E]) [n:127.0.0.1:44120_    ] o.a.s.c.c.SolrZkClient makePath: /overseer/queue-work
   [junit4]   2> 1091069 INFO  (TEST-CdcrReplicationHandlerTest.doTest-seed#[5A760E747179A7E]) [n:127.0.0.1:44120_    ] o.a.s.c.OverseerAutoReplicaFailoverThread Starting OverseerAutoReplicaFailoverThread autoReplicaFailoverWorkLoopDelay=10000 autoReplicaFailoverWaitAfterExpiration=30000 autoReplicaFailoverBadNodeExpiration=60000
   [junit4]   2> 1091079 INFO  (TEST-CdcrReplicationHandlerTest.doTest-seed#[5A760E747179A7E]) [n:127.0.0.1:44120_    ] o.a.s.c.c.ZkStateReader Updating cluster state from ZooKeeper... 
   [junit4]   2> 1091079 INFO  (OverseerCollectionProcessor-94398740154089477-127.0.0.1:44120_-n_0000000000) [n:127.0.0.1:44120_    ] o.a.s.c.OverseerProcessor Process current queue of overseer operations
   [junit4]   2> 1091098 INFO  (OverseerStateUpdate-94398740154089477-127.0.0.1:44120_-n_0000000000) [n:127.0.0.1:44120_    ] o.a.s.c.Overseer Starting to work on the main queue
   [junit4]   2> 1091114 INFO  (TEST-CdcrReplicationHandlerTest.doTest-seed#[5A760E747179A7E]) [n:127.0.0.1:44120_    ] o.a.s.c.CoreContainer Security conf doesn't exist. Skipping setup for authorization module.
   [junit4]   2> 1091114 INFO  (TEST-CdcrReplicationHandlerTest.doTest-seed#[5A760E747179A7E]) [n:127.0.0.1:44120_    ] o.a.s.c.CoreContainer No authentication plugin used.
   [junit4]   2> 1091115 INFO  (TEST-CdcrReplicationHandlerTest.doTest-seed#[5A760E747179A7E]) [n:127.0.0.1:44120_    ] o.a.s.c.CoresLocator Looking for core definitions underneath /home/jenkins/workspace/Lucene-Solr-trunk-Linux/solr/build/solr-core/test/J1/temp/solr.cloud.CdcrReplicationHandlerTest_5A760E747179A7E-001/jetty-001/cores
   [junit4]   2> 1091116 INFO  (TEST-CdcrReplicationHandlerTest.doTest-seed#[5A760E747179A7E]) [n:127.0.0.1:44120_    ] o.a.s.c.SolrCore Created CoreDescriptor: {name=collection1, config=solrconfig.xml, transient=false, schema=schema.xml, loadOnStartup=true, configSetProperties=configsetprops.json, instanceDir=/home/jenkins/workspace/Lucene-Solr-trunk-Linux/solr/build/solr-core/test/J1/temp/solr.cloud.CdcrReplicationHandlerTest_5A760E747179A7E-001/jetty-001/cores/collection1, collection=tmp_collection, absoluteInstDir=/home/jenkins/workspace/Lucene-Solr-trunk-Linux/solr/build/solr-core/test/J1/temp/solr.cloud.CdcrReplicationHandlerTest_5A760E747179A7E-001/jetty-001/cores/collection1/, coreNodeName=, dataDir=data/, shard=}
   [junit4]   2> 1091116 INFO  (TEST-CdcrReplicationHandlerTest.doTest-seed#[5A760E747179A7E]) [n:127.0.0.1:44120_    ] o.a.s.c.CoresLocator Found core collection1 in /home/jenkins/workspace/Lucene-Solr-trunk-Linux/solr/build/solr-core/test/J1/temp/solr.cloud.CdcrReplicationHandlerTest_5A760E747179A7E-001/jetty-001/cores/collection1/
   [junit4]   2> 1091116 INFO  (TEST-CdcrReplicationHandlerTest.doTest-seed#[5A760E747179A7E]) [n:127.0.0.1:44120_    ] o.a.s.c.CoresLocator Found 1 core definitions
   [junit4]   2> 1091117 INFO  (coreLoadExecutor-4472-thread-1-processing-n:127.0.0.1:44120_) [n:127.0.0.1:44120_ c:tmp_collection   x:collection1] o.a.s.c.ZkController publishing state=down
   [junit4]   2> 1091117 INFO  (coreLoadExecutor-4472-thread-1-processing-n:127.0.0.1:44120_) [n:127.0.0.1:44120_ c:tmp_collection   x:collection1] o.a.s.c.ZkController numShards not found on descriptor - reading it from system property
   [junit4]   2> 1091118 INFO  (coreLoadExecutor-4472-thread-1-processing-n:127.0.0.1:44120_) [n:127.0.0.1:44120_ c:tmp_collection   x:collection1] o.a.s.c.ZkController look for our core node name
   [junit4]   2> 1091124 INFO  (OverseerStateUpdate-94398740154089477-127.0.0.1:44120_-n_0000000000) [n:127.0.0.1:44120_    ] o.a.s.c.Overseer processMessage: queueSize: 1, message = {
   [junit4]   2>   "core":"collection1",
   [junit4]   2>   "roles":null,
   [junit4]   2>   "base_url":"https://127.0.0.1:44120",
   [junit4]   2>   "node_name":"127.0.0.1:44120_",
   [junit4]   2>   "numShards":"1",
   [junit4]   2>   "state":"down",
   [junit4]   2>   "shard":null,
   [junit4]   2>   "collection":"tmp_collection",
   [junit4]   2>   "operation":"state"} current state version: 0
   [junit4]   2> 1091125 INFO  (OverseerStateUpdate-94398740154089477-127.0.0.1:44120_-n_0000000000) [n:127.0.0.1:44120_    ] o.a.s.c.o.ReplicaMutator Update state numShards=1 message={
   [junit4]   2>   "core":"collection1",
   [junit4]   2>   "roles":null,
   [junit4]   2>   "base_url":"https://127.0.0.1:44120",
   [junit4]   2>   "node_name":"127.0.0.1:44120_",
   [junit4]   2>   "numShards":"1",
   [junit4]   2>   "state":"down",
   [junit4]   2>   "shard":null,
   [junit4]   2>   "collection":"tmp_collection",
   [junit4]   2>   "operation":"state"}
   [junit4]   2> 1091125 INFO  (OverseerStateUpdate-94398740154089477-127.0.0.1:44120_-n_0000000000) [n:127.0.0.1:44120_    ] o.a.s.c.o.ClusterStateMutator building a new cName: tmp_collection
   [junit4]   2> 1091125 INFO  (OverseerStateUpdate-94398740154089477-127.0.0.1:44120_-n_0000000000) [n:127.0.0.1:44120_    ] o.a.s.c.o.ReplicaMutator Assigning new node to shard shard=shard1
   [junit4]   2> 1091125 INFO  (TEST-CdcrReplicationHandlerTest.doTest-seed#[5A760E747179A7E]) [n:127.0.0.1:44120_    ] o.a.s.s.SolrDispatchFilter user.dir=/home/jenkins/workspace/Lucene-Solr-trunk-Linux/solr/build/solr-core/test/J1
   [junit4]   2> 1091125 INFO  (TEST-CdcrReplicationHandlerTest.doTest-seed#[5A760E747179A7E]) [n:127.0.0.1:44120_    ] o.a.s.s.SolrDispatchFilter SolrDispatchFilter.init() done
   [junit4]   2> 1091126 INFO  (zkCallback-1427-thread-1-processing-n:127.0.0.1:44120_) [n:127.0.0.1:44120_    ] o.a.s.c.c.ZkStateReader A cluster state change: WatchedEvent state:SyncConnected type:NodeDataChanged path:/clusterstate.json, has occurred - updating... (live nodes size: 1)
   [junit4]   2> 1092118 INFO  (coreLoadExecutor-4472-thread-1-processing-n:127.0.0.1:44120_) [n:127.0.0.1:44120_ c:tmp_collection   x:collection1] o.a.s.c.ZkController waiting to find shard id in clusterstate for collection1
   [junit4]   2> 1092118 INFO  (coreLoadExecutor-4472-thread-1-processing-n:127.0.0.1:44120_) [n:127.0.0.1:44120_ c:tmp_collection   x:collection1] o.a.s.c.ZkController Check for collection zkNode:tmp_collection
   [junit4]   2> 1092119 INFO  (coreLoadExecutor-4472-thread-1-processing-n:127.0.0.1:44120_) [n:127.0.0.1:44120_ c:tmp_collection   x:collection1] o.a.s.c.ZkController Creating collection in ZooKeeper:tmp_collection
   [junit4]   2> 1092119 INFO  (coreLoadExecutor-4472-thread-1-processing-n:127.0.0.1:44120_) [n:127.0.0.1:44120_ c:tmp_collection   x:collection1] o.a.s.c.ZkController Looking for collection configName
   [junit4]   2> 1092120 INFO  (coreLoadExecutor-4472-thread-1-processing-n:127.0.0.1:44120_) [n:127.0.0.1:44120_ c:tmp_collection   x:collection1] o.a.s.c.ZkController Only one config set found in zk - using it:conf1
   [junit4]   2> 1092120 INFO  (coreLoadExecutor-4472-thread-1-processing-n:127.0.0.1:44120_) [n:127.0.0.1:44120_ c:tmp_collection   x:collection1] o.a.s.c.c.SolrZkClient makePath: /collections/tmp_collection
   [junit4]   2> 1092120 INFO  (coreLoadExecutor-4472-thread-1-processing-n:127.0.0.1:44120_) [n:127.0.0.1:44120_ c:tmp_collection   x:collection1] o.a.s.c.c.ZkStateReader Load collection config from:/collections/tmp_collection
   [junit4]   2> 1092121 INFO  (coreLoadExecutor-4472-thread-1-processing-n:127.0.0.1:44120_) [n:127.0.0.1:44120_ c:tmp_collection   x:collection1] o.a.s.c.c.ZkStateReader path=/collections/tmp_collection configName=conf1 specified config exists in ZooKeeper
   [junit4]   2> 1092121 INFO  (coreLoadExecutor-4472-thread-1-processing-n:127.0.0.1:44120_) [n:127.0.0.1:44120_ c:tmp_collection   x:collection1] o.a.s.c.SolrResourceLoader new SolrResourceLoader for directory: '/home/jenkins/workspace/Lucene-Solr-trunk-Linux/solr/build/solr-core/test/J1/temp/solr.cloud.CdcrReplicationHandlerTest_5A760E747179A7E-001/jetty-001/cores/collection1/'
   [junit4]   2> 1092128 INFO  (coreLoadExecutor-4472-thread-1-processing-n:127.0.0.1:44120_) [n:127.0.0.1:44120_ c:tmp_collection   x:collection1] o.a.s.c.Config loaded config solrconfig.xml with version 0 
   [junit4]   2> 1092130 INFO  (coreLoadExecutor-4472-thread-1-processing-n:127.0.0.1:44120_) [n:127.0.0.1:44120_ c:tmp_collection   x:collection1] o.a.s.c.SolrConfig current version of requestparams : -1
   [junit4]   2> 1092133 INFO  (coreLoadExecutor-4472-thread-1-processing-n:127.0.0.1:44120_) [n:127.0.0.1:44120_ c:tmp_collection   x:collection1] o.a.s.c.SolrConfig Using Lucene MatchVersion: 6.0.0
   [junit4]   2> 1092138 INFO  (coreLoadExecutor-4472-thread-1-processing-n:127.0.0.1:44120_) [n:127.0.0.1:44120_ c:tmp_collection   x:collection1] o.a.s.c.Config Loaded SolrConfig: solrconfig.xml
   [junit4]   2> 1092138 INFO  (coreLoadExecutor-4472-thread-1-processing-n:127.0.0.1:44120_) [n:127.0.0.1:44120_ c:tmp_collection   x:collection1] o.a.s.s.IndexSchema Reading Solr Schema from /configs/conf1/schema.xml
   [junit4]   2> 1092141 INFO  (coreLoadExecutor-4472-thread-1-processing-n:127.0.0.1:44120_) [n:127.0.0.1:44120_ c:tmp_collection   x:collection1] o.a.s.s.IndexSchema [collection1] Schema name=test
   [junit4]   2> 1092214 INFO  (coreLoadExecutor-4472-thread-1-processing-n:127.0.0.1:44120_) [n:127.0.0.1:44120_ c:tmp_collection   x:collection1] o.a.s.s.IndexSchema default search field in schema is text
   [junit4]   2> 1092215 INFO  (coreLoadExecutor-4472-thread-1-processing-n:127.0.0.1:44120_) [n:127.0.0.1:44120_ c:tmp_collection   x:collection1] o.a.s.s.IndexSchema unique key field: id
   [junit4]   2> 1092216 INFO  (coreLoadExecutor-4472-thread-1-processing-n:127.0.0.1:44120_) [n:127.0.0.1:44120_ c:tmp_collection   x:collection1] o.a.s.s.FileExchangeRateProvider Reloading exchange rates from file currency.xml
   [junit4]   2> 1092217 INFO  (coreLoadExecutor-4472-thread-1-processing-n:127.0.0.1:44120_) [n:127.0.0.1:44120_ c:tmp_collection   x:collection1] o.a.s.s.FileExchangeRateProvider Reloading exchange rates from file currency.xml
   [junit4]   2> 1092226 INFO  (coreLoadExecutor-4472-thread-1-processing-n:127.0.0.1:44120_) [n:127.0.0.1:44120_ c:tmp_collection   x:collection1] o.a.s.c.ConfigSetProperties Did not find ConfigSet properties, assuming default properties: Can't find resource 'configsetprops.json' in classpath or '/configs/conf1', cwd=/home/jenkins/workspace/Lucene-Solr-trunk-Linux/solr/build/solr-core/test/J1
   [junit4]   2> 1092226 INFO  (coreLoadExecutor-4472-thread-1-processing-n:127.0.0.1:44120_) [n:127.0.0.1:44120_ c:tmp_collection   x:collection1] o.a.s.c.CoreContainer Creating SolrCore 'collection1' using configuration from collection tmp_collection
   [junit4]   2> 1092226 INFO  (coreLoadExecutor-4472-thread-1-processing-n:127.0.0.1:44120_) [n:127.0.0.1:44120_ c:tmp_collection s:shard1 r:core_node1 x:collection1] o.a.s.c.SolrCore solr.StandardDirectoryFactory
   [junit4]   2> 1092227 INFO  (coreLoadExecutor-4472-thread-1-processing-n:127.0.0.1:44120_) [n:127.0.0.1:44120_ c:tmp_collection s:shard1 r:core_node1 x:collection1] o.a.s.c.SolrCore [[collection1] ] Opening new SolrCore at [/home/jenkins/workspace/Lucene-Solr-trunk-Linux/solr/build/solr-core/test/J1/temp/solr.cloud.CdcrReplicationHandlerTest_5A760E747179A7E-001/jetty-001/cores/collection1/], dataDir=[null]
   [junit4]   2> 1092227 INFO  (coreLoadExecutor-4472-thread-1-processing-n:127.0.0.1:44120_) [n:127.0.0.1:44120_ c:tmp_collection s:shard1 r:core_node1 x:collection1] o.a.s.c.JmxMonitoredMap JMX monitoring is enabled. Adding Solr mbeans to JMX Server: com.sun.jmx.mbeanserver.JmxMBeanServer@73be84d2
   [junit4]   2> 1092227 INFO  (coreLoadExecutor-4472-thread-1-processing-n:127.0.0.1:44120_) [n:127.0.0.1:44120_ c:tmp_collection s:shard1 r:core_node1 x:collection1] o.a.s.c.CachingDirectoryFactory return new directory for /home/jenkins/workspace/Lucene-Solr-trunk-Linux/solr/build/solr-core/test/J1/temp/solr.cloud.CdcrReplicationHandlerTest_5A760E747179A7E-001/jetty-001/cores/collection1/data
   [junit4]   2> 1092228 INFO  (coreLoadExecutor-4472-thread-1-processing-n:127.0.0.1:44120_) [n:127.0.0.1:44120_ c:tmp_collection s:shard1 r:core_node1 x:collection1] o.a.s.c.SolrCore New index directory detected: old=null new=/home/jenkins/workspace/Lucene-Solr-trunk-Linux/solr/build/solr-core/test/J1/temp/solr.cloud.CdcrReplicationHandlerTest_5A760E747179A7E-001/jetty-001/cores/collection1/data/index/
   [junit4]   2> 1092228 WARN  (coreLoadExecutor-4472-thread-1-processing-n:127.0.0.1:44120_) [n:127.0.0.1:44120_ c:tmp_collection s:shard1 r:core_node1 x:collection1] o.a.s.c.SolrCore [collection1] Solr index directory '/home/jenkins/workspace/Lucene-Solr-trunk-Linux/solr/build/solr-core/test/J1/temp/solr.cloud.CdcrReplicationHandlerTest_5A760E747179A7E-001/jetty-001/cores/collection1/data/index' doesn't exist. Creating new index...
   [junit4]   2> 1092228 INFO  (coreLoadExecutor-4472-thread-1-processing-n:127.0.0.1:44120_) [n:127.0.0.1:44120_ c:tmp_collection s:shard1 r:core_node1 x:collection1] o.a.s.c.CachingDirectoryFactory return new directory for /home/jenkins/workspace/Lucene-Solr-trunk-Linux/solr/build/solr-core/test/J1/temp/solr.cloud.CdcrReplicationHandlerTest_5A760E747179A7E-001/jetty-001/cores/collection1/data/index
   [junit4]   2> 1092228 INFO  (coreLoadExecutor-4472-thread-1-processing-n:127.0.0.1:44120_) [n:127.0.0.1:44120_ c:tmp_collection s:shard1 r:core_node1 x:collection1] o.a.s.u.RandomMergePolicy RandomMergePolicy wrapping class org.apache.lucene.index.TieredMergePolicy: [TieredMergePolicy: maxMergeAtOnce=33, maxMergeAtOnceExplicit=29, maxMergedSegmentMB=17.4462890625, floorSegmentMB=1.591796875, forceMergeDeletesPctAllowed=20.72073819931009, segmentsPerTier=43.0, maxCFSSegmentSizeMB=8.796093022207999E12, noCFSRatio=0.0
   [junit4]   2> 1092256 INFO  (coreLoadExecutor-4472-thread-1-processing-n:127.0.0.1:44120_) [n:127.0.0.1:44120_ c:tmp_collection s:shard1 r:core_node1 x:collection1] o.a.s.c.SolrCore SolrDeletionPolicy.onCommit: commits: num=1
   [junit4]   2> 	commit{dir=/home/jenkins/workspace/Lucene-Solr-trunk-Linux/solr/build/solr-core/test/J1/temp/solr.cloud.CdcrReplicationHandlerTest_5A760E747179A7E-001/jetty-001/cores/collection1/data/index,segFN=segments_1,generation=1}
   [junit4]   2> 1092256 INFO  (coreLoadExecutor-4472-thread-1-processing-n:127.0.0.1:44120_) [n:127.0.0.1:44120_ c:tmp_collection s:shard1 r:core_node1 x:collection1] o.a.s.c.SolrCore newest commit generation = 1
   [junit4]   2> 1092256 INFO  (OldIndexDirectoryCleanupThreadForCore-collection1) [n:127.0.0.1:44120_ c:tmp_collection s:shard1 r:core_node1 x:collection1] o.a.s.c.SolrCore Looking for old index directories to cleanup for core collection1 in /home/jenkins/workspace/Lucene-Solr-trunk-Linux/solr/build/solr-core/test/J1/temp/solr.cloud.CdcrReplicationHandlerTest_5A760E747179A7E-001/jetty-001/cores/collection1/data/
   [junit4]   2> 1092258 INFO  (coreLoadExecutor-4472-thread-1-processing-n:127.0.0.1:44120_) [n:127.0.0.1:44120_ c:tmp_collection s:shard1 r:core_node1 x:collection1] o.a.s.u.p.UpdateRequestProcessorChain creating updateRequestProcessorChain "cdcr-processor-chain"
   [junit4]   2> 1092268 INFO  (coreLoadExecutor-4472-thread-1-processing-n:127.0.0.1:44120_) [n:127.0.0.1:44120_ c:tmp_collection s:shard1 r:core_node1 x:collection1] o.a.s.c.SolrCore no updateRequestProcessorChain defined as default, creating implicit default
   [junit4]   2> 1092272 INFO  (coreLoadExecutor-4472-thread-1-processing-n:127.0.0.1:44120_) [n:127.0.0.1:44120_ c:tmp_collection s:shard1 r:core_node1 x:collection1] o.a.s.h.l.XMLLoader xsltCacheLifetimeSeconds=60
   [junit4]   2> 1092272 INFO  (coreLoadExecutor-4472-thread-1-processing-n:127.0.0.1:44120_) [n:127.0.0.1:44120_ c:tmp_collection s:shard1 r:core_node1 x:collection1] o.a.s.h.l.XMLLoader xsltCacheLifetimeSeconds=60
   [junit4]   2> 1092273 INFO  (coreLoadExecutor-4472-thread-1-processing-n:127.0.0.1:44120_) [n:127.0.0.1:44120_ c:tmp_collection s:shard1 r:core_node1 x:collection1] o.a.s.h.l.XMLLoader xsltCacheLifetimeSeconds=60
   [junit4]   2> 1092274 INFO  (coreLoadExecutor-4472-thread-1-processing-n:127.0.0.1:44120_) [n:127.0.0.1:44120_ c:tmp_collection s:shard1 r:core_node1 x:collection1] o.a.s.h.l.XMLLoader xsltCacheLifetimeSeconds=60
   [junit4]   2> 1092278 INFO  (coreLoadExecutor-4472-thread-1-processing-n:127.0.0.1:44120_) [n:127.0.0.1:44120_ c:tmp_collection s:shard1 r:core_node1 x:collection1] o.a.s.c.RequestHandlers Registered paths: /admin/mbeans,standard,/update/csv,/update/json/docs,/admin/luke,/admin/segments,/get,/admin/system,/replication,/admin/properties,/config,/schema,/admin/plugins,/admin/logging,/update/json,/admin/threads,/admin/ping,/cdcr,/update,/admin/file
   [junit4]   2> 1092278 INFO  (coreLoadExecutor-4472-thread-1-processing-n:127.0.0.1:44120_) [n:127.0.0.1:44120_ c:tmp_collection s:shard1 r:core_node1 x:collection1] o.a.s.c.SolrCore Using default statsCache cache: org.apache.solr.search.stats.LocalStatsCache
   [junit4]   2> 1092286 INFO  (coreLoadExecutor-4472-thread-1-processing-n:127.0.0.1:44120_) [n:127.0.0.1:44120_ c:tmp_collection s:shard1 r:core_node1 x:collection1] o.a.s.u.UpdateHandler Using UpdateLog implementation: org.apache.solr.update.CdcrUpdateLog
   [junit4]   2> 1092286 INFO  (coreLoadExecutor-4472-thread-1-processing-n:127.0.0.1:44120_) [n:127.0.0.1:44120_ c:tmp_collection s:shard1 r:core_node1 x:collection1] o.a.s.u.UpdateLog Initializing UpdateLog: dataDir= defaultSyncLevel=FLUSH numRecordsToKeep=100 maxNumLogsToKeep=10 numVersionBuckets=65536
   [junit4]   2> 1092287 INFO  (coreLoadExecutor-4472-thread-1-processing-n:127.0.0.1:44120_) [n:127.0.0.1:44120_ c:tmp_collection s:shard1 r:core_node1 x:collection1] o.a.s.c.SolrCore Hard AutoCommit: disabled
   [junit4]   2> 1092287 INFO  (coreLoadExecutor-4472-thread-1-processing-n:127.0.0.1:44120_) [n:127.0.0.1:44120_ c:tmp_collection s:shard1 r:core_node1 x:collection1] o.a.s.c.SolrCore Soft AutoCommit: disabled
   [junit4]   2> 1092288 INFO  (coreLoadExecutor-4472-thread-1-processing-n:127.0.0.1:44120_) [n:127.0.0.1:44120_ c:tmp_collection s:shard1 r:core_node1 x:collection1] o.a.s.u.RandomMergePolicy RandomMergePolicy wrapping class org.apache.lucene.index.LogByteSizeMergePolicy: [LogByteSizeMergePolicy: minMergeSize=1677721, mergeFactor=44, maxMergeSize=2147483648, maxMergeSizeForForcedMerge=9223372036854775807, calibrateSizeByDeletes=false, maxMergeDocs=2147483647, maxCFSSegmentSizeMB=8.796093022207999E12, noCFSRatio=0.0]
   [junit4]   2> 1092288 INFO  (coreLoadExecutor-4472-thread-1-processing-n:127.0.0.1:44120_) [n:127.0.0.1:44120_ c:tmp_collection s:shard1 r:core_node1 x:collection1] o.a.s.c.SolrCore SolrDeletionPolicy.onInit: commits: num=1
   [junit4]   2> 	commit{dir=/home/jenkins/workspace/Lucene-Solr-trunk-Linux/solr/build/solr-core/test/J1/temp/solr.cloud.CdcrReplicationHandlerTest_5A760E747179A7E-001/jetty-001/cores/collection1/data/index,segFN=segments_1,generation=1}
   [junit4]   2> 1092288 INFO  (coreLoadExecutor-4472-thread-1-processing-n:127.0.0.1:44120_) [n:127.0.0.1:44120_ c:tmp_collection s:shard1 r:core_node1 x:collection1] o.a.s.c.SolrCore newest commit generation = 1
   [junit4]   2> 1092288 INFO  (coreLoadExecutor-4472-thread-1-processing-n:127.0.0.1:44120_) [n:127.0.0.1:44120_ c:tmp_collection s:shard1 r:core_node1 x:collection1] o.a.s.s.SolrIndexSearcher Opening Searcher@5bec1c16[collection1] main
   [junit4]   2> 1092288 INFO  (coreLoadExecutor-4472-thread-1-processing-n:127.0.0.1:44120_) [n:127.0.0.1:44120_ c:tmp_collection s:shard1 r:core_node1 x:collection1] o.a.s.c.c.ZkStateReader Load collection config from:/collections/tmp_collection
   [junit4]   2> 1092289 INFO  (coreLoadExecutor-4472-thread-1-processing-n:127.0.0.1:44120_) [n:127.0.0.1:44120_ c:tmp_collection s:shard1 r:core_node1 x:collection1] o.a.s.c.c.ZkStateReader path=/collections/tmp_collection configName=conf1 specified config exists in ZooKeeper
   [junit4]   2> 1092289 INFO  (coreLoadExecutor-4472-thread-1-processing-n:127.0.0.1:44120_) [n:127.0.0.1:44120_ c:tmp_collection s:shard1 r:core_node1 x:collection1] o.a.s.r.ManagedResourceStorage Setting up ZooKeeper-based storage for the RestManager with znodeBase: /configs/conf1
   [junit4]   2> 1092289 INFO  (coreLoadExecutor-4472-thread-1-processing-n:127.0.0.1:44120_) [n:127.0.0.1:44120_ c:tmp_collection s:shard1 r:core_node1 x:collection1] o.a.s.r.ManagedResourceStorage Configured ZooKeeperStorageIO with znodeBase: /configs/conf1
   [junit4]   2> 1092289 INFO  (coreLoadExecutor-4472-thread-1-processing-n:127.0.0.1:44120_) [n:127.0.0.1:44120_ c:tmp_collection s:shard1 r:core_node1 x:collection1] o.a.s.r.RestManager Initializing RestManager with initArgs: {}
   [junit4]   2> 1092289 INFO  (coreLoadExecutor-4472-thread-1-processing-n:127.0.0.1:44120_) [n:127.0.0.1:44120_ c:tmp_collection s:shard1 r:core_node1 x:collection1] o.a.s.r.ManagedResourceStorage Reading _rest_managed.json using ZooKeeperStorageIO:path=/configs/conf1
   [junit4]   2> 1092290 INFO  (coreLoadExecutor-4472-thread-1-processing-n:127.0.0.1:44120_) [n:127.0.0.1:44120_ c:tmp_collection s:shard1 r:core_node1 x:collection1] o.a.s.r.ManagedResourceStorage No data found for znode /configs/conf1/_rest_managed.json
   [junit4]   2> 1092290 INFO  (coreLoadExecutor-4472-thread-1-processing-n:127.0.0.1:44120_) [n:127.0.0.1:44120_ c:tmp_collection s:shard1 r:core_node1 x:collection1] o.a.s.r.ManagedResourceStorage Loaded null at path _rest_managed.json using ZooKeeperStorageIO:path=/configs/conf1
   [junit4]   2> 1092290 INFO  (coreLoadExecutor-4472-thread-1-processing-n:127.0.0.1:44120_) [n:127.0.0.1:44120_ c:tmp_collection s:shard1 r:core_node1 x:collection1] o.a.s.r.RestManager Initializing 0 registered ManagedResources
   [junit4]   2> 1092290 INFO  (coreLoadExecutor-4472-thread-1-processing-n:127.0.0.1:44120_) [n:127.0.0.1:44120_ c:tmp_collection s:shard1 r:core_node1 x:collection1] o.a.s.h.ReplicationHandler Commits will be reserved for  10000
   [junit4]   2> 1092291 INFO  (coreLoadExecutor-4472-thread-1-processing-n:127.0.0.1:44120_) [n:127.0.0.1:44120_ c:tmp_collection s:shard1 r:core_node1 x:collection1] o.a.s.c.c.SolrZkClient makePath: /collections/tmp_collection/cdcr/state
   [junit4]   2> 1092293 INFO  (coreLoadExecutor-4472-thread-1-processing-n:127.0.0.1:44120_) [n:127.0.0.1:44120_ c:tmp_collection s:shard1 r:core_node1 x:collection1] o.a.s.h.CdcrBufferStateManager Created znode /collections/tmp_collection/cdcr/state/buffer
   [junit4]   2> 1092294 INFO  (coreLoadExecutor-4472-thread-1-processing-n:127.0.0.1:44120_) [n:127.0.0.1:44120_ c:tmp_collection s:shard1 r:core_node1 x:collection1] o.a.s.h.CdcrProcessStateManager Created znode /collections/tmp_collection/cdcr/state/process
   [junit4]   2> 1092298 INFO  (searcherExecutor-4473-thread-1-processing-n:127.0.0.1:44120_ x:collection1 s:shard1 c:tmp_collection r:core_node1) [n:127.0.0.1:44120_ c:tmp_collection s:shard1 r:core_node1 x:collection1] o.a.s.c.SolrCore [collection1] Registered new searcher Searcher@5bec1c16[collection1] main{ExitableDirectoryReader(UninvertingDirectoryReader())}
   [junit4]   2> 1092298 INFO  (coreLoadExecutor-4472-thread-1-processing-n:127.0.0.1:44120_) [n:127.0.0.1:44120_ c:tmp_collection s:shard1 r:core_node1 x:collection1] o.a.s.u.UpdateLog Looking up max value of version field to seed version buckets
   [junit4]   2> 1092298 INFO  (coreLoadExecutor-4472-thread-1-processing-n:127.0.0.1:44120_) [n:127.0.0.1:44120_ c:tmp_collection s:shard1 r:core_node1 x:collection1] o.a.s.u.VersionInfo Refreshing highest value of _version_ for 65536 version buckets from index
   [junit4]   2> 1092298 INFO  (coreLoadExecutor-4472-thread-1-processing-n:127.0.0.1:44120_) [n:127.0.0.1:44120_ c:tmp_collection s:shard1 r:core_node1 x:collection1] o.a.s.u.VersionInfo No terms found for _version_, cannot seed version bucket highest value from index
   [junit4]   2> 1092298 INFO  (coreLoadExecutor-4472-thread-1-processing-n:127.0.0.1:44120_) [n:127.0.0.1:44120_ c:tmp_collection s:shard1 r:core_node1 x:collection1] o.a.s.u.UpdateLog Could not find max version in index or recent updates, using new clock 1510379844145250304
   [junit4]   2> 1092300 INFO  (coreLoadExecutor-4472-thread-1-processing-n:127.0.0.1:44120_) [n:127.0.0.1:44120_ c:tmp_collection s:shard1 r:core_node1 x:collection1] o.a.s.u.UpdateLog Took 2.0ms to seed version buckets with highest version 1510379844145250304
   [junit4]   2> 1092300 INFO  (coreLoadExecutor-4472-thread-1-processing-n:127.0.0.1:44120_) [n:127.0.0.1:44120_ c:tmp_collection s:shard1 r:core_node1 x:collection1] o.a.s.c.ZkController watch zkdir /configs/conf1
   [junit4]   2> 1092301 INFO  (coreLoadExecutor-4472-thread-1-processing-n:127.0.0.1:44120_) [n:127.0.0.1:44120_ c:tmp_collection s:shard1 r:core_node1 x:collection1] o.a.s.c.CoreContainer registering core: collection1
   [junit4]   2> 1092301 INFO  (coreZkRegister-4466-thread-1-processing-n:127.0.0.1:44120_ x:collection1 s:shard1 c:tmp_collection r:core_node1) [n:127.0.0.1:44120_ c:tmp_collection s:shard1 r:core_node1 x:collection1] o.a.s.c.ZkController Register replica - core:collection1 address:https://127.0.0.1:44120 collection:tmp_collection shard:shard1
   [junit4]   2> 1092301 INFO  (coreZkRegister-4466-thread-1-processing-n:127.0.0.1:44120_ x:collection1 s:shard1 c:tmp_collection r:core_node1) [n:127.0.0.1:44120_ c:tmp_collection s:shard1 r:core_node1 x:collection1] o.a.s.c.c.SolrZkClient makePath: /collections/tmp_collection/leader_elect/shard1/election
   [junit4]   2> 1092303 INFO  (coreZkRegister-4466-thread-1-processing-n:127.0.0.1:44120_ x:collection1 s:shard1 c:tmp_collection r:core_node1) [n:127.0.0.1:44120_ c:tmp_collection s:shard1 r:core_node1 x:collection1] o.a.s.c.LeaderElector Joined leadership election with path: /collections/tmp_collection/leader_elect/shard1/election/94398740154089477-core_node1-n_0000000000
   [junit4]   2> 1092303 INFO  (coreZkRegister-4466-thread-1-processing-n:127.0.0.1:44120_ x:collection1 s:shard1 c:tmp_collection r:core_node1) [n:127.0.0.1:44120_ c:tmp_collection s:shard1 r:core_node1 x:collection1] o.a.s.c.ShardLeaderElectionContext Running the leader process for shard shard1
   [junit4]   2> 1092304 INFO  (coreZkRegister-4466-thread-1-processing-n:127.0.0.1:44120_ x:collection1 s:shard1 c:tmp_collection r:core_node1) [n:127.0.0.1:44120_ c:tmp_collection s:shard1 r:core_node1 x:collection1] o.a.s.c.ShardLeaderElectionContext Enough replicas found to continue.
   [junit4]   2> 1092304 INFO  (coreZkRegister-4466-thread-1-processing-n:127.0.0.1:44120_ x:collection1 s:shard1 c:tmp_collection r:core_node1) [n:127.0.0.1:44120_ c:tmp_collection s:shard1 r:core_node1 x:collection1] o.a.s.c.ShardLeaderElectionContext I may be the new leader - try and sync
   [junit4]   2> 1092304 INFO  (coreZkRegister-4466-thread-1-processing-n:127.0.0.1:44120_ x:collection1 s:shard1 c:tmp_collection r:core_node1) [n:127.0.0.1:44120_ c:tmp_collection s:shard1 r:core_node1 x:collection1] o.a.s.c.SyncStrategy Sync replicas to https://127.0.0.1:44120/collection1/
   [junit4]   2> 1092304 INFO  (OverseerStateUpdate-94398740154089477-127.0.0.1:44120_-n_0000000000) [n:127.0.0.1:44120_    ] o.a.s.c.Overseer processMessage: queueSize: 1, message = {
   [junit4]   2>   "operation":"leader",
   [junit4]   2>   "shard":"shard1",
   [junit4]   2>   "collection":"tmp_collection"} current state version: 1
   [junit4]   2> 1092304 INFO  (coreZkRegister-4466-thread-1-processing-n:127.0.0.1:44120_ x:collection1 s:shard1 c:tmp_collection r:core_node1) [n:127.0.0.1:44120_ c:tmp_collection s:shard1 r:core_node1 x:collection1] o.a.s.c.SyncStrategy Sync Success - now sync replicas to me
   [junit4]   2> 1092305 INFO  (coreZkRegister-4466-thread-1-processing-n:127.0.0.1:44120_ x:collection1 s:shard1 c:tmp_collection r:core_node1) [n:127.0.0.1:44120_ c:tmp_collection s:shard1 r:core_node1 x:collection1] o.a.s.c.SyncStrategy https://127.0.0.1:44120/collection1/ has no replicas
   [junit4]   2> 1092305 INFO  (coreZkRegister-4466-thread-1-processing-n:127.0.0.1:44120_ x:collection1 s:shard1 c:tmp_collection r:core_node1) [n:127.0.0.1:44120_ c:tmp_collection s:shard1 r:core_node1 x:collection1] o.a.s.c.ShardLeaderElectionContext I am the new leader: https://127.0.0.1:44120/collection1/ shard1
   [junit4]   2> 1092305 INFO  (coreZkRegister-4466-thread-1-processing-n:127.0.0.1:44120_ x:collection1 s:shard1 c:tmp_collection r:core_node1) [n:127.0.0.1:44120_ c:tmp_collection s:shard1 r:core_node1 x:collection1] o.a.s.c.c.SolrZkClient makePath: /collections/tmp_collection/leaders/shard1
   [junit4]   2> 1092306 INFO  (zkCallback-1427-thread-1-processing-n:127.0.0.1:44120_) [n:127.0.0.1:44120_    ] o.a.s.h.CdcrProcessStateManager Received new leader state @ tmp_collection:shard1
   [junit4]   2> 1092308 INFO  (OverseerStateUpdate-94398740154089477-127.0.0.1:44120_-n_0000000000) [n:127.0.0.1:44120_    ] o.a.s.c.Overseer processMessage: queueSize: 1, message = {
   [junit4]   2>   "operation":"leader",
   [junit4]   2>   "shard":"shard1",
   [junit4]   2>   "collection":"tmp_collection",
   [junit4]   2>   "base_url":"https://127.0.0.1:44120",
   [junit4]   2>   "core":"collection1",
   [junit4]   2>   "state":"active"} current state version: 1
   [junit4]   2> 1092409 INFO  (zkCallback-1427-thread-1-processing-n:127.0.0.1:44120_) [n:127.0.0.1:44120_    ] o.a.s.c.c.ZkStateReader A cluster state change: WatchedEvent state:SyncConnected type:NodeDataChanged path:/clusterstate.json, has occurred - updating... (live nodes size: 1)
   [junit4]   2> 1092458 INFO  (coreZkRegister-4466-thread-1-processing-n:127.0.0.1:44120_ x:collection1 s:shard1 c:tmp_collection r:core_node1) [n:127.0.0.1:44120_ c:tmp_collection s:shard1 r:core_node1 x:collection1] o.a.s.c.ZkController We are https://127.0.0.1:44120/collection1/ and leader is https://127.0.0.1:44120/collection1/
   [junit4]   2> 1092458 INFO  (coreZkRegister-4466-thread-1-processing-n:127.0.0.1:44120_ x:collection1 s:shard1 c:tmp_collection r:core_node1) [n:127.0.0.1:44120_ c:tmp_collection s:shard1 r:core_node1 x:collection1] o.a.s.c.ZkController No LogReplay needed for core=collection1 baseURL=https://127.0.0.1:44120
   [junit4]   2> 1092458 INFO  (coreZkRegister-4466-thread-1-processing-n:127.0.0.1:44120_ x:collection1 s:shard1 c:tmp_collection r:core_node1) [n:127.0.0.1:44120_ c:tmp_collection s:shard1 r:core_node1 x:collection1] o.a.s.c.ZkController I am the leader, no recovery necessary
   [junit4]   2> 1092458 INFO  (coreZkRegister-4466-thread-1-processing-n:127.0.0.1:44120_ x:collection1 s:shard1 c:tmp_collection r:core_node1) [n:127.0.0.1:44120_ c:tmp_collection s:shard1 r:core_node1 x:collection1] o.a.s.c.ZkController publishing state=active
   [junit4]   2> 1092459 INFO  (coreZkRegister-4466-thread-1-processing-n:127.0.0.1:44120_ x:collection1 s:shard1 c:tmp_collection r:core_node1) [n:127.0.0.1:44120_ c:tmp_collection s:shard1 r:core_node1 x:collection1] o.a.s.c.ZkController numShards not found on descriptor - reading it from system property
   [junit4]   2> 1092460 INFO  (OverseerStateUpdate-94398740154089477-127.0.0.1:44120_-n_0000000000) [n:127.0.0.1:44120_    ] o.a.s.c.Overseer processMessage: queueSize: 1, message = {
   [junit4]   2>   "core":"collection1",
   [junit4]   2>   "core_node_name":"core_node1",
   [junit4]   2>   "roles":null,
   [junit4]   2>   "base_url":"https://127.0.0.1:44120",
   [junit4]   2>   "node_name":"127.0.0.1:44120_",
   [junit4]   2>   "numShards":"1",
   [junit4]   2>   "state":"active",
   [junit4]   2>   "shard":"shard1",
   [junit4]   2>   "collection":"tmp_collection",
   [junit4]   2>   "operation":"state"} current state version: 2
   [junit4]   2> 1092460 INFO  (OverseerStateUpdate-94398740154089477-127.0.0.1:44120_-n_0000000000) [n:127.0.0.1:44120_    ] o.a.s.c.o.ReplicaMutator Update state numShards=1 message={
   [junit4]   2>   "core":"collection1",
   [junit4]   2>   "core_node_name":"core_node1",
   [junit4]   2>   "roles":null,
   [junit4]   2>   "base_url":"https://127.0.0.1:44120",
   [junit4]   2>   "node_name":"127.0.0.1:44120_",
   [junit4]   2>   "numShards":"1",
   [junit4]   2>   "state":"active",
   [junit4]   2>   "shard":"shard1",
   [junit4]   2>   "collection":"tmp_collection",
   [junit4]   2>   "operation":"state"}
   [junit4]   2> 1092562 INFO  (zkCallback-1427-thread-1-processing-n:127.0.0.1:44120_) [n:127.0.0.1:44120_    ] o.a.s.c.c.ZkStateReader A cluster state change: WatchedEvent state:SyncConnected type:NodeDataChanged path:/clusterstate.json, has occurred - updating... (live nodes size: 1)
   [junit4]   2> 1092686 INFO  (TEST-CdcrReplicationHandlerTest.doTest-seed#[5A760E747179A7E]) [    ] o.a.s.SolrTestCaseJ4 Writing core.properties file to /home/jenkins/workspace/Lucene-Solr-trunk-Linux/solr/build/solr-core/test/J1/temp/solr.cloud.CdcrReplicationHandlerTest_5A760E747179A7E-001/jetty-002/cores/collection1
   [junit4]   2> 1092687 INFO  (TEST-CdcrReplicationHandlerTest.doTest-seed#[5A760E747179A7E]) [    ] o.e.j.s.Server jetty-9.2.13.v20150730
   [junit4]   2> 1092688 INFO  (TEST-CdcrReplicationHandlerTest.doTest-seed#[5A760E747179A7E]) [    ] o.e.j.s.h.ContextHandler Started o.e.j.s.ServletContextHandler@17334788{/,null,AVAILABLE}
   [junit4]   2> 1092690 INFO  (TEST-CdcrReplicationHandlerTest.doTest-seed#[5A760E747179A7E]) [    ] o.e.j.s.ServerConnector Started ServerConnector@28f87c64{SSL-http/1.1}{127.0.0.1:33054}
   [junit4]   2> 1092690 INFO  (TEST-CdcrReplicationHandlerTest.doTest-seed#[5A760E747179A7E]) [    ] o.e.j.s.Server Started @1094324ms
   [junit4]   2> 1092690 INFO  (TEST-CdcrReplicationHandlerTest.doTest-seed#[5A760E747179A7E]) [    ] o.a.s.c.s.e.JettySolrRunner Jetty properties: {shards=shard2, hostContext=/, hostPort=33054, coreRootDirectory=/home/jenkins/workspace/Lucene-Solr-trunk-Linux/solr/build/solr-core/test/J1/temp/solr.cloud.CdcrReplicationHandlerTest_5A760E747179A7E-001/jetty-002/cores}
   [junit4]   2> 1092691 INFO  (TEST-CdcrReplicationHandlerTest.doTest-seed#[5A760E747179A7E]) [    ] o.a.s.s.SolrDispatchFilter SolrDispatchFilter.init(): sun.misc.Launcher$AppClassLoader@4e0e2f2a
   [junit4]   2> 1092691 INFO  (TEST-CdcrReplicationHandlerTest.doTest-seed#[5A760E747179A7E]) [    ] o.a.s.c.SolrResourceLoader new SolrResourceLoader for directory: '/home/jenkins/workspace/Lucene-Solr-trunk-Linux/solr/build/solr-core/test/J1/temp/solr.cloud.CdcrReplicationHandlerTest_5A760E747179A7E-001/jetty-002/'
   [junit4]   2> 1092699 INFO  (TEST-CdcrReplicationHandlerTest.doTest-seed#[5A760E747179A7E]) [    ] o.a.s.c.c.SolrZkClient Using default ZkCredentialsProvider
   [junit4]   2> 1092700 INFO  (TEST-CdcrReplicationHandlerTest.doTest-seed#[5A760E747179A7E]) [    ] o.a.s.c.c.ConnectionManager Waiting for client to connect to ZooKeeper
   [junit4]   2> 1092700 INFO  (zkCallback-1428-thread-1) [    ] o.a.s.c.c.ConnectionManager Watcher org.apache.solr.common.cloud.ConnectionManager@7ee26276 name:ZooKeeperConnection Watcher:127.0.0.1:35372/solr got event WatchedEvent state:SyncConnected type:None path:null path:null type:None
   [junit4]   2> 1092701 INFO  (TEST-CdcrReplicationHandlerTest.doTest-seed#[5A760E747179A7E]) [    ] o.a.s.c.c.ConnectionManager Client is connected to ZooKeeper
   [junit4]   2> 1092701 INFO  (TEST-CdcrReplicationHandlerTest.doTest-seed#[5A760E747179A7E]) [    ] o.a.s.c.c.SolrZkClient Using default ZkACLProvider
   [junit4]   2> 1092701 INFO  (TEST-CdcrReplicationHandlerTest.doTest-seed#[5A760E747179A7E]) [    ] o.a.s.s.SolrDispatchFilter Loading solr.xml from SolrHome (not found in ZooKeeper)
   [junit4]   2> 1092701 INFO  (TEST-CdcrReplicationHandlerTest.doTest-seed#[5A760E747179A7E]) [    ] o.a.s.c.SolrXmlConfig Loading container configuration from /home/jenkins/workspace/Lucene-Solr-trunk-Linux/solr/build/solr-core/test/J1/temp/solr.cloud.CdcrReplicationHandlerTest_5A760E747179A7E-001/jetty-002/solr.xml
   [junit4]   2> 1092704 INFO  (TEST-CdcrReplicationHandlerTest.doTest-seed#[5A760E747179A7E]) [    ] o.a.s.c.CoresLocator Config-defined core root directory: /home/jenkins/workspace/Lucene-Solr-trunk-Linux/solr/build/solr-core/test/J1/temp/solr.cloud.CdcrReplicationHandlerTest_5A760E747179A7E-001/jetty-002/cores
   [junit4]   2> 1092705 INFO  (TEST-CdcrReplicationHandlerTest.doTest-seed#[5A760E747179A7E]) [    ] o.a.s.c.CoreContainer New CoreContainer 1924666823
   [junit4]   2> 1092705 INFO  (TEST-CdcrReplicationHandlerTest.doTest-seed#[5A760E747179A7E]) [    ] o.a.s.c.CoreContainer Loading cores into CoreContainer [instanceDir=/home/jenkins/workspace/Lucene-Solr-trunk-Linux/solr/build/solr-core/test/J1/temp/solr.cloud.CdcrReplicationHandlerTest_5A760E747179A7E-001/jetty-002/]
   [junit4]   2> 1092705 INFO  (TEST-CdcrReplicationHandlerTest.doTest-seed#[5A760E747179A7E]) [    ] o.a.s.c.CoreContainer loading shared library: /home/jenkins/workspace/Lucene-Solr-trunk-Linux/solr/build/solr-core/test/J1/temp/solr.cloud.CdcrReplicationHandlerTest_5A760E747179A7E-001/jetty-002/lib
   [junit4]   2> 1092705 WARN  (TEST-CdcrReplicationHandlerTest.doTest-seed#[5A760E747179A7E]) [    ] o.a.s.c.SolrResourceLoader Can't find (or read) directory to add to classloader: lib (resolved as: /home/jenkins/workspace/Lucene-Solr-trunk-Linux/solr/build/solr-core/test/J1/temp/solr.cloud.CdcrReplicationHandlerTest_5A760E747179A7E-001/jetty-002/lib).
   [junit4]   2> 1092709 INFO  (TEST-CdcrReplicationHandlerTest.doTest-seed#[5A760E747179A7E]) [    ] o.a.s.h.c.HttpShardHandlerFactory created with socketTimeout : 90000,urlScheme : ,connTimeout : 15000,maxConnectionsPerHost : 20,maxConnections : 10000,corePoolSize : 0,maximumPoolSize : 2147483647,maxThreadIdleTime : 5,sizeOfQueue : -1,fairnessPolicy : false,useRetries : false,
   [junit4]   2> 1092710 INFO  (TEST-CdcrReplicationHandlerTest.doTest-seed#[5A760E747179A7E]) [    ] o.a.s.u.UpdateShardHandler Creating UpdateShardHandler HTTP client with params: socketTimeout=340000&connTimeout=45000&retry=true
   [junit4]   2> 1092711 INFO  (TEST-CdcrReplicationHandlerTest.doTest-seed#[5A760E747179A7E]) [    ] o.a.s.l.LogWatcher SLF4J impl is org.slf4j.impl.Log4jLoggerFactory
   [junit4]   2> 1092711 INFO  (TEST-CdcrReplicationHandlerTest.doTest-seed#[5A760E747179A7E]) [    ] o.a.s.l.LogWatcher Registering Log Listener [Log4j (org.slf4j.impl.Log4jLoggerFactory)]
   [junit4]   2> 1092711 INFO  (TEST-CdcrReplicationHandlerTest.doTest-seed#[5A760E747179A7E]) [    ] o.a.s.c.ZkContainer Zookeeper client=127.0.0.1:35372/solr
   [junit4]   2> 1092711 INFO  (TEST-CdcrReplicationHandlerTest.doTest-seed#[5A760E747179A7E]) [    ] o.a.s.c.ZkController zkHost includes chroot
   [junit4]   2> 1092711 INFO  (TEST-CdcrReplicationHandlerTest.doTest-seed#[5A760E747179A7E]) [    ] o.a.s.c.c.SolrZkClient Using default ZkCredentialsProvider
   [junit4]   2> 1092712 INFO  (TEST-CdcrReplicationHandlerTest.doTest-seed#[5A760E747179A7E]) [    ] o.a.s.c.c.ConnectionManager Waiting for client to connect to ZooKeeper
   [junit4]   2> 1092712 INFO  (zkCallback-1430-thread-1) [    ] o.a.s.c.c.ConnectionManager Watcher org.apache.solr.common.cloud.ConnectionManager@32260eec name:ZooKeeperConnection Watcher:127.0.0.1:35372 got event WatchedEvent state:SyncConnected type:None path:null path:null type:None
   [junit4]   2> 1092712 INFO  (TEST-CdcrReplicationHandlerTest.doTest-seed#[5A760E747179A7E]) [    ] o.a.s.c.c.ConnectionManager Client is connected to ZooKeeper
   [junit4]   2> 1092713 INFO  (TEST-CdcrReplicationHandlerTest.doTest-seed#[5A760E747179A7E]) [    ] o.a.s.c.c.SolrZkClient Using default ZkACLProvider
   [junit4]   2> 1092713 INFO  (TEST-CdcrReplicationHandlerTest.doTest-seed#[5A760E747179A7E]) [n:127.0.0.1:33054_    ] o.a.s.c.c.ConnectionManager Waiting for client to connect to ZooKeeper
   [junit4]   2> 1092714 INFO  (zkCallback-1431-thread-1-processing-n:127.0.0.1:33054_) [n:127.0.0.1:33054_    ] o.a.s.c.c.ConnectionManager Watcher org.apache.solr.common.cloud.ConnectionManager@38791794 name:ZooKeeperConnection Watcher:127.0.0.1:35372/solr got event WatchedEvent state:SyncConnected type:None path:null path:null type:None
   [junit4]   2> 1092714 INFO  (TEST-CdcrReplicationHandlerTest.doTest-seed#[5A760E747179A7E]) [n:127.0.0.1:33054_    ] o.a.s.c.c.ConnectionManager Client is connected to ZooKeeper
   [junit4]   2> 1092715 INFO  (TEST-CdcrReplicationHandlerTest.doTest-seed#[5A760E747179A7E]) [n:127.0.0.1:33054_    ] o.a.s.c.c.ZkStateReader Updating cluster state from ZooKeeper... 
   [junit4]   2> 1093717 INFO  (TEST-CdcrReplicationHandlerTest.doTest-seed#[5A760E747179A7E]) [n:127.0.0.1:33054_    ] o.a.s.c.ZkController Register node as live in ZooKeeper:/live_nodes/127.0.0.1:33054_
   [junit4]   2> 1093717 INFO  (TEST-CdcrReplicationHandlerTest.doTest-seed#[5A760E747179A7E]) [n:127.0.0.1:33054_    ] o.a.s.c.c.SolrZkClient makePath: /live_nodes/127.0.0.1:33054_
   [junit4]   2> 1093718 INFO  (zkCallback-1427-thread-1-processing-n:127.0.0.1:44120_) [n:127.0.0.1:44120_    ] o.a.s.c.c.ZkStateReader A live node change: WatchedEvent state:SyncConnected type:NodeChildrenChanged path:/live_nodes, has occurred - updating... (live nodes size: 1)
   [junit4]   2> 1093718 INFO  (zkCallback-1431-thread-1-processing-n:127.0.0.1:33054_) [n:127.0.0.1:33054_    ] o.a.s.c.c.ZkStateReader A live node change: WatchedEvent state:SyncConnected type:NodeChildrenChanged path:/live_nodes, has occurred - updating... (live nodes size: 1)
   [junit4]   2> 1093718 INFO  (TEST-CdcrReplicationHandlerTest.doTest-seed#[5A760E747179A7E]) [n:127.0.0.1:33054_    ] o.a.s.c.Overseer Overseer (id=null) closing
   [junit4]   2> 1093719 INFO  (TEST-CdcrReplicationHandlerTest.doTest-seed#[5A760E747179A7E]) [n:127.0.0.1:33054_    ] o.a.s.c.LeaderElector Joined leadership election with path: /overseer_elect/election/94398740154089480-127.0.0.1:33054_-n_0000000001
   [junit4]   2> 1093719 INFO  (TEST-CdcrReplicationHandlerTest.doTest-seed#[5A760E747179A7E]) [n:127.0.0.1:33054_    ] o.a.s.c.LeaderElector Watching path /overseer_elect/election/94398740154089477-127.0.0.1:44120_-n_0000000000 to know if I could be the leader
   [junit4]   2> 1093726 INFO  (TEST-CdcrReplicationHandlerTest.doTest-seed#[5A760E747179A7E]) [n:127.0.0.1:33054_    ] o.a.s.c.CoreContainer Security conf doesn't exist. Skipping setup for authorization module.
   [junit4]   2> 1093726 INFO  (TEST-CdcrReplicationHandlerTest.doTest-seed#[5A760E747179A7E]) [n:127.0.0.1:33054_    ] o.a.s.c.CoreContainer No authentication plugin used.
   [junit4]   2> 1093726 INFO  (TEST-CdcrReplicationHandlerTest.doTest-seed#[5A760E747179A7E]) [n:127.0.0.1:33054_    ] o.a.s.c.CoresLocator Looking for core definitions underneath /home/jenkins/workspace/Lucene-Solr-trunk-Linux/solr/build/solr-core/test/J1/temp/solr.cloud.CdcrReplicationHandlerTest_5A760E747179A7E-001/jetty-002/cores
   [junit4]   2> 1093727 INFO  (TEST-CdcrReplicationHandlerTest.doTest-seed#[5A760E747179A7E]) [n:127.0.0.1:33054_    ] o.a.s.c.SolrCore Created CoreDescriptor: {name=collection1, config=solrconfig.xml, transient=false, schema=schema.xml, loadOnStartup=true, configSetProperties=configsetprops.json, instanceDir=/home/jenkins/workspace/Lucene-Solr-trunk-Linux/solr/build/solr-core/test/J1/temp/solr.cloud.CdcrReplicationHandlerTest_5A760E747179A7E-001/jetty-002/cores/collection1, collection=tmp_collection, absoluteInstDir=/home/jenkins/workspace/Lucene-Solr-trunk-Linux/solr/build/solr-core/test/J1/temp/solr.cloud.CdcrReplicationHandlerTest_5A760E747179A7E-001/jetty-002/cores/collection1/, coreNodeName=, dataDir=data/, shard=}
   [junit4]   2> 1093727 INFO  (TEST-CdcrReplicationHandlerTest.doTest-seed#[5A760E747179A7E]) [n:127.0.0.1:33054_    ] o.a.s.c.CoresLocator Found core collection1 in /home/jenkins/workspace/Lucene-Solr-trunk-Linux/solr/build/solr-core/test/J1/temp/solr.cloud.CdcrReplicationHandlerTest_5A760E747179A7E-001/jetty-002/cores/collection1/
   [junit4]   2> 1093727 INFO  (TEST-CdcrReplicationHandlerTest.doTest-seed#[5A760E747179A7E]) [n:127.0.0.1:33054_    ] o.a.s.c.CoresLocator Found 1 core definitions
   [junit4]   2> 1093728 INFO  (TEST-CdcrReplicationHandlerTest.doTest-seed#[5A760E747179A7E]) [n:127.0.0.1:33054_    ] o.a.s.s.SolrDispatchFilter user.dir=/home/jenkins/workspace/Lucene-Solr-trunk-Linux/solr/build/solr-core/test/J1
   [junit4]   2> 1093728 INFO  (TEST-CdcrReplicationHandlerTest.doTest-seed#[5A760E747179A7E]) [n:127.0.0.1:33054_    ] o.a.s.s.SolrDispatchFilter SolrDispatchFilter.init() done
   [junit4]   2> 1093728 INFO  (coreLoadExecutor-4484-thread-1-processing-n:127.0.0.1:33054_) [n:127.0.0.1:33054_ c:tmp_collection   x:collection1] o.a.s.c.ZkController publishing state=down
   [junit4]   2> 1093728 INFO  (coreLoadExecutor-4484-thread-1-processing-n:127.0.0.1:33054_) [n:127.0.0.1:33054_ c:tmp_collection   x:collection1] o.a.s.c.ZkController numShards not found on descriptor - reading it from system property
   [junit4]   2> 1093728 INFO  (coreLoadExecutor-4484-thread-1-processing-n:127.0.0.1:33054_) [n:127.0.0.1:33054_ c:tmp_collection   x:collection1] o.a.s.c.ZkController Registering watch for collection tmp_collection
   [junit4]   2> 1093729 INFO  (coreLoadExecutor-4484-thread-1-processing-n:127.0.0.1:33054_) [n:127.0.0.1:33054_ c:tmp_collection   x:collection1] o.a.s.c.c.ZkStateReader addZkWatch tmp_collection
   [junit4]   2> 1093729 INFO  (coreLoadExecutor-4484-thread-1-processing-n:127.0.0.1:33054_) [n:127.0.0.1:33054_ c:tmp_collection   x:collection1] o.a.s.c.c.ZkStateReader Deleting data for tmp_collection
   [junit4]   2> 1093729 INFO  (OverseerStateUpdate-94398740154089477-127.0.0.1:44120_-n_0000000000) [n:127.0.0.1:44120_    ] o.a.s.c.Overseer processMessage: queueSize: 1, message = {
   [junit4]   2>   "core":"collection1",
   [junit4]   2>   "roles":null,
   [junit4]   2>   "base_url":"https://127.0.0.1:33054",
   [junit4]   2>   "node_name":"127.0.0.1:33054_",
   [junit4]   2>   "numShards":"1",
   [junit4]   2>   "state":"down",
   [junit4]   2>   "shard":null,
   [junit4]   2>   "collection":"tmp_collection",
   [junit4]   2>   "operation":"state"} current state version: 3
   [junit4]   2> 1093729 INFO  (coreLoadExecutor-4484-thread-1-processing-n:127.0.0.1:33054_) [n:127.0.0.1:33054_ c:tmp_collection   x:collection1] o.a.s.c.ZkController look for our core node name
   [junit4]   2> 1093729 INFO  (OverseerStateUpdate-94398740154089477-127.0.0.1:44120_-n_0000000000) [n:127.0.0.1:44120_    ] o.a.s.c.o.ReplicaMutator Update state numShards=1 message={
   [junit4]   2>   "core":"collection1",
   [junit4]   2>   "roles":null,
   [junit4]   2>   "base_url":"https://127.0.0.1:33054",
   [junit4]   2>   "node_name":"127.0.0.1:33054_",
   [junit4]   2>   "numShards":"1",
   [junit4]   2>   "state":"down",
   [junit4]   2>   "shard":null,
   [junit4]   2>   "collection":"tmp_collection",
   [junit4]   2>   "operation":"state"}
   [junit4]   2> 1093729 INFO  (OverseerStateUpdate-94398740154089477-127.0.0.1:44120_-n_0000000000) [n:127.0.0.1:44120_    ] o.a.s.c.o.ReplicaMutator Collection already exists with numShards=1
   [junit4]   2> 1093730 INFO  (OverseerStateUpdate-94398740154089477-127.0.0.1:44120_-n_0000000000) [n:127.0.0.1:44120_    ] o.a.s.c.o.ReplicaMutator Assigning new node to shard shard=shard1
   [junit4]   2> 1093831 INFO  (zkCallback-1427-thread-1-processing-n:127.0.0.1:44120_) [n:127.0.0.1:44120_    ] o.a.s.c.c.ZkStateReader A cluster state change: WatchedEvent state:SyncConnected type:NodeDataChanged path:/clusterstate.json, has occurred - updating... (live nodes size: 2)
   [junit4]   2> 1093831 INFO  (zkCallback-1431-thread-1-processing-n:127.0.0.1:33054_) [n:127.0.0.1:33054_    ] o.a.s.c.c.ZkStateReader A cluster state change: WatchedEvent state:SyncConnected type:NodeDataChanged path:/clusterstate.json, has occurred - updating... (live nodes size: 2)
   [junit4]   2> 1094729 INFO  (coreLoadExecutor-4484-thread-1-processing-n:127.0.0.1:33054_) [n:127.0.0.1:33054_ c:tmp_collection   x:collection1] o.a.s.c.ZkController waiting to find shard id in clusterstate for collection1
   [junit4]   2> 1094729 INFO  (coreLoadExecutor-4484-thread-1-processing-n:127.0.0.1:33054_) [n:127.0.0.1:33054_ c:tmp_collection   x:collection1] o.a.s.c.ZkController Check for collection zkNode:tmp_collection
   [junit4]   2> 1094730 INFO  (coreLoadExecutor-4484-thread-1-processing-n:127.0.0.1:33054_) [n:127.0.0.1:33054_ c:tmp_collection   x:collection1] o.a.s.c.ZkController Collection zkNode exists
   [junit4]   2> 1094730 INFO  (coreLoadExecutor-4484-thread-1-processing-n:127.0.0.1:33054_) [n:127.0.0.1:33054_ c:tmp_collection   x:collection1] o.a.s.c.c.ZkStateReader Load collection config from:/collections/tmp_collection
   [junit4]   2> 1094730 INFO  (coreLoadExecutor-4484-thread-1-processing-n:127.0.0.1:33054_) [n:127.0.0.1:33054_ c:tmp_collection   x:collection1] o.a.s.c.c.ZkStateReader path=/collections/tmp_collection configName=conf1 specified config exists in ZooKeeper
   [junit4]   2> 1094730 INFO  (coreLoadExecutor-4484-thread-1-processing-n:127.0.0.1:33054_) [n:127.0.0.1:33054_ c:tmp_collection   x:collection1] o.a.s.c.SolrResourceLoader new SolrResourceLoader for directory: '/home/jenkins/workspace/Lucene-Solr-trunk-Linux/solr/build/solr-core/test/J1/temp/solr.cloud.CdcrReplicationHandlerTest_5A760E747179A7E-001/jetty-002/cores/collection1/'
   [junit4]   2> 1094737 INFO  (coreLoadExecutor-4484-thread-1-processing-n:127.0.0.1:33054_) [n:127.0.0.1:33054_ c:tmp_collection   x:collection1] o.a.s.c.Config loaded config solrconfig.xml with version 0 
   [junit4]   2> 1094739 INFO  (coreLoadExecutor-4484-thread-1-processing-n:127.0.0.1:33054_) [n:127.0.0.1:33054_ c:tmp_collection   x:collection1] o.a.s.c.SolrConfig current version of requestparams : -1
   [junit4]   2> 1094742 INFO  (coreLoadExecutor-4484-thread-1-processing-n:127.0.0.1:33054_) [n:127.0.0.1:33054_ c:tmp_collection   x:collection1] o.a.s.c.SolrConfig Using Lucene MatchVersion: 6.0.0
   [junit4]   2> 1094747 INFO  (coreLoadExecutor-4484-thread-1-processing-n:127.0.0.1:33054_) [n:127.0.0.1:33054_ c:tmp_collection   x:collection1] o.a.s.c.Config Loaded SolrConfig: solrconfig.xml
   [junit4]   2> 1094748 INFO  (coreLoadExecutor-4484-thread-1-processing-n:127.0.0.1:33054_) [n:127.0.0.1:33054_ c:tmp_collection   x:collection1] o.a.s.s.IndexSchema Reading Solr Schema from /configs/conf1/schema.xml
   [junit4]   2> 1094750 INFO  (coreLoadExecutor-4484-thread-1-processing-n:127.0.0.1:33054_) [n:127.0.0.1:33054_ c:tmp_collection   x:collection1] o.a.s.s.IndexSchema [collection1] Schema name=test
   [junit4]   2> 1094816 INFO  (coreLoadExecutor-4484-thread-1-processing-n:127.0.0.1:33054_) [n:127.0.0.1:33054_ c:tmp_collection   x:collection1] o.a.s.s.IndexSchema default search field in schema is text
   [junit4]   2> 1094817 INFO  (coreLoadExecutor-4484-thread-1-processing-n:127.0.0.1:33054_) [n:127.0.0.1:33054_ c:tmp_collection   x:collection1] o.a.s.s.IndexSchema unique key field: id
   [junit4]   2> 1094818 INFO  (coreLoadExecutor-4484-thread-1-processing-n:127.0.0.1:33054_) [n:127.0.0.1:33054_ c:tmp_collection   x:collection1] o.a.s.s.FileExchangeRateProvider Reloading exchange rates from file currency.xml
   [junit4]   2> 1094819 INFO  (coreLoadExecutor-4484-thread-1-processing-n:127.0.0.1:33054_) [n:127.0.0.1:33054_ c:tmp_collection   x:collection1] o.a.s.s.FileExchangeRateProvider Reloading exchange rates from file currency.xml
   [junit4]   2> 1094825 INFO  (coreLoadExecutor-4484-thread-1-processing-n:127.0.0.1:33054_) [n:127.0.0.1:33054_ c:tmp_collection   x:collection1] o.a.s.c.ConfigSetProperties Did not find ConfigSet properties, assuming default properties: Can't find resource 'configsetprops.json' in classpath or '/configs/conf1', cwd=/home/jenkins/workspace/Lucene-Solr-trunk-Linux/solr/build/solr-core/test/J1
   [junit4]   2> 1094825 INFO  (coreLoadExecutor-4484-thread-1-processing-n:127.0.0.1:33054_) [n:127.0.0.1:33054_ c:tmp_collection   x:collection1] o.a.s.c.CoreContainer Creating SolrCore 'collection1' using configuration from collection tmp_collection
   [junit4]   2> 1094825 INFO  (coreLoadExecutor-4484-thread-1-processing-n:127.0.0.1:33054_) [n:127.0.0.1:33054_ c:tmp_collection s:shard1 r:core_node2 x:collection1] o.a.s.c.SolrCore solr.StandardDirectoryFactory
   [junit4]   2> 1094825 INFO  (coreLoadExecutor-4484-thread-1-processing-n:127.0.0.1:33054_) [n:127.0.0.1:33054_ c:tmp_collection s:shard1 r:core_node2 x:collection1] o.a.s.c.SolrCore [[collection1] ] Opening new SolrCore at [/home/jenkins/workspace/Lucene-Solr-trunk-Linux/solr/build/solr-core/test/J1/temp/solr.cloud.CdcrReplicationHandlerTest_5A760E747179A7E-001/jetty-002/cores/collection1/], dataDir=[null]
   [junit4]   2> 1094825 INFO  (coreLoadExecutor-4484-thread-1-processing-n:127.0.0.1:33054_) [n:127.0.0.1:33054_ c:tmp_collection s:shard1 r:core_node2 x:collection1] o.a.s.c.JmxMonitoredMap JMX monitoring is enabled. Adding Solr mbeans to JMX Server: com.sun.jmx.mbeanserver.JmxMBeanServer@73be84d2
   [junit4]   2> 1094826 INFO  (coreLoadExecutor-4484-thread-1-processing-n:127.0.0.1:33054_) [n:127.0.0.1:33054_ c:tmp_collection s:shard1 r:core_node2 x:collection1] o.a.s.c.CachingDirectoryFactory return new directory for /home/jenkins/workspace/Lucene-Solr-trunk-Linux/solr/build/solr-core/test/J1/temp/solr.cloud.CdcrReplicationHandlerTest_5A760E747179A7E-001/jetty-002/cores/collection1/data
   [junit4]   2> 1094826 INFO  (coreLoadExecutor-4484-thread-1-processing-n:127.0.0.1:33054_) [n:127.0.0.1:33054_ c:tmp_collection s:shard1 r:core_node2 x:collection1] o.a.s.c.SolrCore New index directory detected: old=null new=/home/jenkins/workspace/Lucene-Solr-trunk-Linux/solr/build/solr-core/test/J1/temp/solr.cloud.CdcrReplicationHandlerTest_5A760E747179A7E-001/jetty-002/cores/collection1/data/index/
   [junit4]   2> 1094826 WARN  (coreLoadExecutor-4484-thread-1-processing-n:127.0.0.1:33054_) [n:127.0.0.1:33054_ c:tmp_collection s:shard1 r:core_node2 x:collection1] o.a.s.c.SolrCore [collection1] Solr index directory '/home/jenkins/workspace/Lucene-Solr-trunk-Linux/solr/build/solr-core/test/J1/temp/solr.cloud.CdcrReplicationHandlerTest_5A760E747179A7E-001/jetty-002/cores/collection1/data/index' doesn't exist. Creating new index...
   [junit4]   2> 1094826 INFO  (coreLoadExecutor-4484-thread-1-processing-n:127.0.0.1:33054_) [n:127.0.0.1:33054_ c:tmp_collection s:shard1 r:core_node2 x:collection1] o.a.s.c.CachingDirectoryFactory return new directory for /home/jenkins/workspace/Lucene-Solr-trunk-Linux/solr/build/solr-core/test/J1/temp/solr.cloud.CdcrReplicationHandlerTest_5A760E747179A7E-001/jetty-002/cores/collection1/data/index
   [junit4]   2> 1094827 INFO  (coreLoadExecutor-4484-thread-1-processing-n:127.0.0.1:33054_) [n:127.0.0.1:33054_ c:tmp_collection s:shard1 r:core_node2 x:collection1] o.a.s.u.RandomMergePolicy RandomMergePolicy wrapping class org.apache.lucene.index.TieredMergePolicy: [TieredMergePolicy: maxMergeAtOnce=33, maxMergeAtOnceExplicit=29, maxMergedSegmentMB=17.4462890625, floorSegmentMB=1.591796875, forceMergeDeletesPctAllowed=20.72073819931009, segmentsPerTier=43.0, maxCFSSegmentSizeMB=8.796093022207999E12, noCFSRatio=0.0
   [junit4]   2> 1094857 INFO  (coreLoadExecutor-4484-thread-1-processing-n:127.0.0.1:33054_) [n:127.0.0.1:33054_ c:tmp_collection s:shard1 r:core_node2 x:collection1] o.a.s.c.SolrCore SolrDeletionPolicy.onCommit: commits: num=1
   [junit4]   2> 	commit{dir=/home/jenkins/workspace/Lucene-Solr-trunk-Linux/solr/build/solr-core/test/J1/temp/solr.cloud.CdcrReplicationHandlerTest_5A760E747179A7E-001/jetty-002/cores/collection1/data/index,segFN=segments_1,generation=1}
   [junit4]   2> 1094858 INFO  (coreLoadExecutor-4484-thread-1-processing-n:127.0.0.1:33054_) [n:127.0.0.1:33054_ c:tmp_collection s:shard1 r:core_node2 x:collection1] o.a.s.c.SolrCore newest commit generation = 1
   [junit4]   2> 1094858 INFO  (OldIndexDirectoryCleanupThreadForCore-collection1) [n:127.0.0.1:33054_ c:tmp_collection s:shard1 r:core_node2 x:collection1] o.a.s.c.SolrCore Looking for old index directories to cleanup for core collection1 in /home/jenkins/workspace/Lucene-Solr-trunk-Linux/solr/build/solr-core/test/J1/temp/solr.cloud.CdcrReplicationHandlerTest_5A760E747179A7E-001/jetty-002/cores/collection1/data/
   [junit4]   2> 1094860 INFO  (coreLoadExecutor-4484-thread-1-processing-n:127.0.0.1:33054_) [n:127.0.0.1:33054_ c:tmp_collection s:shard1 r:core_node2 x:collection1] o.a.s.u.p.UpdateRequestProcessorChain creating updateRequestProcessorChain "cdcr-processor-chain"
   [junit4]   2> 1094860 INFO  (coreLoadExecutor-4484-thread-1-processing-n:127.0.0.1:33054_) [n:127.0.0.1:33054_ c:tmp_collection s:shard1 r:core_node2 x:collection1] o.a.s.c.SolrCore no updateRequestProcessorChain defined as default, creating implicit default
   [junit4]   2> 1094862 INFO  (coreLoadExecutor-4484-thread-1-processing-n:127.0.0.1:33054_) [n:127.0.0.1:33054_ c:tmp_collection s:shard1 r:core_node2 x:collection1] o.a.s.h.l.XMLLoader xsltCacheLifetimeSeconds=60
   [junit4]   2> 1094862 INFO  (coreLoadExecutor-4484-thread-1-processing-n:127.0.0.1:33054_) [n:127.0.0.1:33054_ c:tmp_collection s:shard1 r:core_node2 x:collection1] o.a.s.h.l.XMLLoader xsltCacheLifetimeSeconds=60
   [junit4]   2> 1094863 INFO  (coreLoadExecutor-4484-thread-1-processing-n:127.0.0.1:33054_) [n:127.0.0.1:33054_ c:tmp_collection s:shard1 r:core_node2 x:collection1] o.a.s.h.l.XMLLoader xsltCacheLifetimeSeconds=60
   [junit4]   2> 1094863 INFO  (coreLoadExecutor-4484-thread-1-processing-n:127.0.0.1:33054_) [n:127.0.0.1:33054_ c:tmp_collection s:shard1 r:core_node2 x:collection1] o.a.s.h.l.XMLLoader xsltCacheLifetimeSeconds=60
   [junit4]   2> 1094866 INFO  (coreLoadExecutor-4484-thread-1-processing-n:127.0.0.1:33054_) [n:127.0.0.1:33054_ c:tmp_collection s:shard1 r:core_node2 x:collection1] o.a.s.c.RequestHandlers Registered paths: /admin/mbeans,standard,/update/csv,/update/json/docs,/admin/luke,/admin/segments,/get,/admin/system,/replication,/admin/properties,/config,/schema,/admin/plugins,/admin/logging,/update/json,/admin/threads,/admin/ping,/cdcr,/update,/admin/file
   [junit4]   2> 1094867 INFO  (coreLoadExecutor-4484-thread-1-processing-n:127.0.0.1:33054_) [n:127.0.0.1:33054_ c:tmp_collection s:shard1 r:core_node2 x:collection1] o.a.s.c.SolrCore Using default statsCache cache: org.apache.solr.search.stats.LocalStatsCache
   [junit4]   2> 1094867 INFO  (coreLoadExecutor-4484-thread-1-processing-n:127.0.0.1:33054_) [n:127.0.0.1:33054_ c:tmp_collection s:shard1 r:core_node2 x:collection1] o.a.s.u.UpdateHandler Using UpdateLog implementation: org.apache.solr.update.CdcrUpdateLog
   [junit4]   2> 1094867 INFO  (coreLoadExecutor-4484-thread-1-processing-n:127.0.0.1:33054_) [n:127.0.0.1:33054_ c:tmp_collection s:shard1 r:core_node2 x:collection1] o.a.s.u.UpdateLog Initializing UpdateLog: dataDir= defaultSyncLevel=FLUSH numRecordsToKeep=100 maxNumLogsToKeep=10 numVersionBuckets=65536
   [junit4]   2> 1094868 INFO  (coreLoadExecutor-4484-thread-1-processing-n:127.0.0.1:33054_) [n:127.0.0.1:33054_ c:tmp_collection s:shard1 r:core_node2 x:collection1] o.a.s.c.SolrCore Hard AutoCommit: disabled
   [junit4]   2> 1094868 INFO  (coreLoadExecutor-4484-thread-1-processing-n:127.0.0.1:33054_) [n:127.0.0.1:33054_ c:tmp_collection s:shard1 r:core_node2 x:collection1] o.a.s.c.SolrCore Soft AutoCommit: disabled
   [junit4]   2> 1094869 INFO  (coreLoadExecutor-4484-thread-1-processing-n:127.0.0.1:33054_) [n:127.0.0.1:33054_ c:tmp_collection s:shard1 r:core_node2 x:collection1] o.a.s.u.RandomMergePolicy RandomMergePolicy wrapping class org.apache.lucene.index.LogByteSizeMergePolicy: [LogByteSizeMergePolicy: minMergeSize=1677721, mergeFactor=44, maxMergeSize=2147483648, maxMergeSizeForForcedMerge=9223372036854775807, calibrateSizeByDeletes=false, maxMergeDocs=2147483647, maxCFSSegmentSizeMB=8.796093022207999E12, noCFSRatio=0.0]
   [junit4]   2> 1094869 INFO  (coreLoadExecutor-4484-thread-1-processing-n:127.0.0.1:33054_) [n:127.0.0.1:33054_ c:tmp_collection s:shard1 r:core_node2 x:collection1] o.a.s.c.SolrCore SolrDeletionPolicy.onInit: commits: num=1
   [junit4]   2> 	commit{dir=/home/jenkins/workspace/Lucene-Solr-trunk-Linux/solr/build/solr-core/test/J1/temp/solr.cloud.CdcrReplicationHandlerTest_5A760E747179A7E-001/jetty-002/cores/collection1/data/index,segFN=segments_1,generation=1}
   [junit4]   2> 1094869 INFO  (coreLoadExecutor-4484-thread-1-processing-n:127.0.0.1:33054_) [n:127.0.0.1:33054_ c:tmp_collection s:shard1 r:core_node2 x:collection1] o.a.s.c.SolrCore newest commit generation = 1
   [junit4]   2> 1094869 INFO  (coreLoadExecutor-4484-thread-1-processing-n:127.0.0.1:33054_) [n:127.0.0.1:33054_ c:tmp_collection s:shard1 r:core_node2 x:collection1] o.a.s.s.SolrIndexSearcher Opening Searcher@31cbdc[collection1] main
   [junit4]   2> 1094869 INFO  (coreLoadExecutor-4484-thread-1-processing-n:127.0.0.1:33054_) [n:127.0.0.1:33054_ c:tmp_collection s:shard1 r:core_node2 x:collection1] o.a.s.c.c.ZkStateReader Load collection config from:/collections/tmp_collection
   [junit4]   2> 1094870 INFO  (coreLoadExecutor-4484-thread-1-processing-n:127.0.0.1:33054_) [n:127.0.0.1:33054_ c:tmp_collection s:shard1 r:core_node2 x:collection1] o.a.s.c.c.ZkStateReader path=/collections/tmp_collection configName=conf1 specified config exists in ZooKeeper
   [junit4]   2> 1094870 INFO  (coreLoadExecutor-4484-thread-1-processing-n:127.0.0.1:33054_) [n:127.0.0.1:33054_ c:tmp_collection s:shard1 r:core_node2 x:collection1] o.a.s.r.ManagedResourceStorage Setting up ZooKeeper-based storage for the RestManager with znodeBase: /configs/conf1
   [junit4]   2> 1094870 INFO  (coreLoadExecutor-4484-thread-1-processing-n:127.0.0.1:33054_) [n:127.0.0.1:33054_ c:tmp_collection s:shard1 r:core_node2 x:collection1] o.a.s.r.ManagedResourceStorage Configured ZooKeeperStorageIO with znodeBase: /configs/conf1
   [junit4]   2> 1094870 INFO  (coreLoadExecutor-4484-thread-1-processing-n:127.0.0.1:33054_) [n:127.0.0.1:33054_ c:tmp_collection s:shard1 r:core_node2 x:collection1] o.a.s.r.RestManager Initializing RestManager with initArgs: {}
   [junit4]   2> 1094870 INFO  (coreLoadExecutor-4484-thread-1-processing-n:127.0.0.1:33054_) [n:127.0.0.1:33054_ c:tmp_collection s:shard1 r:core_node2 x:collection1] o.a.s.r.ManagedResourceStorage Reading _rest_managed.json using ZooKeeperStorageIO:path=/configs/conf1
   [junit4]   2> 1094871 INFO  (coreLoadExecutor-4484-thread-1-processing-n:127.0.0.1:33054_) [n:127.0.0.1:33054_ c:tmp_collection s:shard1 r:core_node2 x:collection1] o.a.s.r.ManagedResourceStorage No data found for znode /configs/conf1/_rest_managed.json
   [junit4]   2> 1094871 INFO  (coreLoadExecutor-4484-thread-1-processing-n:127.0.0.1:33054_) [n:127.0.0.1:33054_ c:tmp_collection s:shard1 r:core_node2 x:collection1] o.a.s.r.ManagedResourceStorage Loaded null at path _rest_managed.json using ZooKeeperStorageIO:path=/configs/conf1
   [junit4]   2> 1094871 INFO  (coreLoadExecutor-4484-thread-1-processing-n:127.0.0.1:33054_) [n:127.0.0.1:33054_ c:tmp_collection s:shard1 r:core_node2 x:collection1] o.a.s.r.RestManager Initializing 0 registered ManagedResources
   [junit4]   2> 1094871 INFO  (coreLoadExecutor-4484-thread-1-processing-n:127.0.0.1:33054_) [n:127.0.0.1:33054_ c:tmp_collection s:shard1 r:core_node2 x:collection1] o.a.s.h.ReplicationHandler Commits will be reserved for  10000
   [junit4]   2> 1094872 INFO  (searcherExecutor-4485-thread-1-processing-n:127.0.0.1:33054_ x:collection1 s:shard1 c:tmp_collection r:core_node2) [n:127.0.0.1:33054_ c:tmp_collection s:shard1 r:core_node2 x:collection1] o.a.s.c.SolrCore [collection1] Register

[...truncated too long message...]

nxn.java:498)
   [junit4]   2> 1491817 WARN  (zkCallback-1483-thread-5-processing-n:127.0.0.1:33054_) [n:127.0.0.1:33054_    ] o.a.s.c.c.ZkStateReader ZooKeeper watch triggered, but Solr cannot talk to ZK
   [junit4]   2> 1491818 INFO  (TEST-CdcrReplicationHandlerTest.doTest-seed#[5A760E747179A7E]) [    ] o.e.j.s.ServerConnector Stopped ServerConnector@66b56022{SSL-http/1.1}{127.0.0.1:33054}
   [junit4]   2> 1491818 INFO  (TEST-CdcrReplicationHandlerTest.doTest-seed#[5A760E747179A7E]) [    ] o.e.j.s.h.ContextHandler Stopped o.e.j.s.ServletContextHandler@659a22a6{/,null,UNAVAILABLE}
   [junit4]   2> 1491819 INFO  (TEST-CdcrReplicationHandlerTest.doTest-seed#[5A760E747179A7E]) [n:127.0.0.1:33054_ c:source_collection s:shard1 r:core_node2 x:source_collection_shard1_replica2] o.a.s.SolrTestCaseJ4 ###Ending doTest
   [junit4]   2> 1491819 INFO  (TEST-CdcrReplicationHandlerTest.doTest-seed#[5A760E747179A7E]) [n:127.0.0.1:33054_ c:source_collection s:shard1 r:core_node2 x:source_collection_shard1_replica2] o.a.s.c.ZkTestServer connecting to 127.0.0.1:35372 35372
   [junit4]   2> 1491964 INFO  (Thread-3737) [    ] o.a.s.c.ZkTestServer connecting to 127.0.0.1:35372 35372
   [junit4]   2> 1491965 WARN  (Thread-3737) [    ] o.a.s.c.ZkTestServer Watch limit violations: 
   [junit4]   2> Maximum concurrent create/delete watches above limit:
   [junit4]   2> 
   [junit4]   2> 	29	/solr/aliases.json
   [junit4]   2> 	8	/solr/configs/conf1
   [junit4]   2> 	5	/solr/collections/source_collection/leaders/shard1
   [junit4]   2> 	3	/solr/security.json
   [junit4]   2> 	2	/solr/collections/tmp_collection/leaders/shard1
   [junit4]   2> 
   [junit4]   2> Maximum concurrent data watches above limit:
   [junit4]   2> 
   [junit4]   2> 	29	/solr/clusterstate.json
   [junit4]   2> 	7	/solr/collections/source_collection/cdcr/state/buffer
   [junit4]   2> 	7	/solr/collections/source_collection/cdcr/state/process
   [junit4]   2> 	4	/solr/collections/source_collection/state.json
   [junit4]   2> 	2	/solr/collections/source_collection/leader_elect/shard1/election/94398740154089477-core_node1-n_0000000000
   [junit4]   2> 	2	/solr/overseer_elect/election/94398740154089477-127.0.0.1:44120_-n_0000000000
   [junit4]   2> 	2	/solr/collections/tmp_collection/cdcr/state/buffer
   [junit4]   2> 	2	/solr/collections/tmp_collection/cdcr/state/process
   [junit4]   2> 
   [junit4]   2> Maximum concurrent children watches above limit:
   [junit4]   2> 
   [junit4]   2> 	28	/solr/live_nodes
   [junit4]   2> 	2	/solr/overseer/queue
   [junit4]   2> 	2	/solr/overseer/collection-queue-work
   [junit4]   2> 
   [junit4]   2> NOTE: reproduce with: ant test  -Dtestcase=CdcrReplicationHandlerTest -Dtests.method=doTest -Dtests.seed=5A760E747179A7E -Dtests.multiplier=3 -Dtests.slow=true -Dtests.locale=lv_LV -Dtests.timezone=Pacific/Easter -Dtests.asserts=true -Dtests.file.encoding=UTF-8
   [junit4] FAILURE  401s J1 | CdcrReplicationHandlerTest.doTest <<<
   [junit4]    > Throwable #1: java.lang.AssertionError: There are still nodes recoverying - waited for 330 seconds
   [junit4]    > 	at __randomizedtesting.SeedInfo.seed([5A760E747179A7E:A2E3D8432AAC89C7]:0)
   [junit4]    > 	at org.apache.solr.cloud.AbstractDistribZkTestBase.waitForRecoveriesToFinish(AbstractDistribZkTestBase.java:172)
   [junit4]    > 	at org.apache.solr.cloud.AbstractDistribZkTestBase.waitForRecoveriesToFinish(AbstractDistribZkTestBase.java:133)
   [junit4]    > 	at org.apache.solr.cloud.AbstractDistribZkTestBase.waitForRecoveriesToFinish(AbstractDistribZkTestBase.java:128)
   [junit4]    > 	at org.apache.solr.cloud.BaseCdcrDistributedZkTest.waitForRecoveriesToFinish(BaseCdcrDistributedZkTest.java:465)
   [junit4]    > 	at org.apache.solr.cloud.BaseCdcrDistributedZkTest.clearSourceCollection(BaseCdcrDistributedZkTest.java:319)
   [junit4]    > 	at org.apache.solr.cloud.CdcrReplicationHandlerTest.doTestPartialReplication(CdcrReplicationHandlerTest.java:86)
   [junit4]    > 	at org.apache.solr.cloud.CdcrReplicationHandlerTest.doTest(CdcrReplicationHandlerTest.java:51)
   [junit4]    > 	at org.apache.solr.BaseDistributedSearchTestCase$ShardsRepeatRule$ShardsFixedStatement.callStatement(BaseDistributedSearchTestCase.java:963)
   [junit4]    > 	at org.apache.solr.BaseDistributedSearchTestCase$ShardsRepeatRule$ShardsStatement.evaluate(BaseDistributedSearchTestCase.java:938)
   [junit4]    > 	at java.lang.Thread.run(Thread.java:745)
   [junit4]   2> 1491969 INFO  (SUITE-CdcrReplicationHandlerTest-seed#[5A760E747179A7E]-worker) [n:127.0.0.1:33054_ c:source_collection s:shard1 r:core_node2 x:source_collection_shard1_replica2] o.a.s.SolrTestCaseJ4 ###deleteCore
   [junit4]   2> NOTE: leaving temporary files on disk at: /home/jenkins/workspace/Lucene-Solr-trunk-Linux/solr/build/solr-core/test/J1/temp/solr.cloud.CdcrReplicationHandlerTest_5A760E747179A7E-001
   [junit4]   2> NOTE: test params are: codec=Asserting(Lucene53): {_version_=PostingsFormat(name=Memory doPackFST= false), id=FSTOrd50}, docValues:{}, sim=DefaultSimilarity, locale=lv_LV, timezone=Pacific/Easter
   [junit4]   2> NOTE: Linux 3.19.0-26-generic amd64/Oracle Corporation 1.8.0_60 (64-bit)/cpus=12,threads=1,free=37633216,total=525336576
   [junit4]   2> NOTE: All tests run in this JVM: [BJQParserTest, TestSolrDeletionPolicy2, RAMDirectoryFactoryTest, TestCoreContainer, TestWriterPerf, SimpleMLTQParserTest, HttpPartitionTest, TestShardHandlerFactory, ZkStateReaderTest, TestMinMaxOnMultiValuedField, DistributedFacetPivotLargeTest, TestRawResponseWriter, TestHashQParserPlugin, SparseHLLTest, JsonLoaderTest, TestCryptoKeys, TestStressVersions, TestHdfsUpdateLog, DistributedSuggestComponentTest, EchoParamsTest, ReturnFieldsTest, HdfsSyncSliceTest, TestFuzzyAnalyzedSuggestions, CursorMarkTest, OverseerStatusTest, DistributedMLTComponentTest, ConvertedLegacyTest, ShowFileRequestHandlerTest, TestIndexSearcher, CloudExitableDirectoryReaderTest, TestLFUCache, AnalyticsMergeStrategyTest, TestManagedStopFilterFactory, TestCollationFieldDocValues, TestInitParams, TestConfigSetProperties, AddSchemaFieldsUpdateProcessorFactoryTest, BasicFunctionalityTest, BigEndianAscendingWordSerializerTest, DocValuesMissingTest, JSONWriterTest, CdcrReplicationDistributedZkTest, TestFieldTypeResource, ZkCLITest, NoCacheHeaderTest, TestLMJelinekMercerSimilarityFactory, TestSolrConfigHandlerCloud, TestMaxScoreQueryParser, TestConfigSets, StressHdfsTest, TestAnalyzedSuggestions, CollectionStateFormat2Test, TestAuthenticationFramework, TestFoldingMultitermQuery, TestElisionMultitermQuery, TestReplicaProperties, IgnoreCommitOptimizeUpdateProcessorFactoryTest, WordBreakSolrSpellCheckerTest, TestMiniSolrCloudCluster, ScriptEngineTest, TestOmitPositions, CoreMergeIndexesAdminHandlerTest, TestRTGBase, FullHLLTest, TestExactStatsCache, TriLevelCompositeIdRoutingTest, DocValuesMultiTest, TestTrieFacet, LeaderFailoverAfterPartitionTest, TestRecoveryHdfs, DistributedQueryComponentCustomSortTest, ShardRoutingCustomTest, TestPHPSerializedResponseWriter, SolrCloudExampleTest, TestBlobHandler, DistributedTermsComponentTest, DistributedFacetPivotLongTailTest, TestCustomSort, TestFastWriter, UpdateParamsTest, TestSha256AuthenticationProvider, TestDynamicFieldCollectionResource, SuggesterTSTTest, TestOrdValues, TestFieldTypeCollectionResource, SolrCmdDistributorTest, RequiredFieldsTest, AddBlockUpdateTest, CacheHeaderTest, RecoveryAfterSoftCommitTest, ChaosMonkeySafeLeaderTest, BasicDistributedZk2Test, SyncSliceTest, ClusterStateUpdateTest, TestRandomFaceting, ZkSolrClientTest, AutoCommitTest, TestRecovery, TestSolr4Spatial, StatsComponentTest, CurrencyFieldOpenExchangeTest, CurrencyFieldXmlFileTest, SimplePostToolTest, TestCoreDiscovery, AnalysisAfterCoreReloadTest, CoreAdminHandlerTest, PolyFieldTest, FieldMutatingUpdateProcessorTest, TestAtomicUpdateErrorCases, StatelessScriptUpdateProcessorFactoryTest, SolrInfoMBeanTest, IndexBasedSpellCheckerTest, LukeRequestHandlerTest, TestQueryTypes, PrimitiveFieldTypeTest, DocumentBuilderTest, TestIndexingPerformance, FieldAnalysisRequestHandlerTest, IndexSchemaRuntimeFieldTest, SolrPluginUtilsTest, TestPartialUpdateDeduplication, TestComponentsName, TestQuerySenderListener, CopyFieldTest, MultiTermTest, NumericFieldsTest, MinimalSchemaTest, TestLuceneMatchVersion, TestCharFilters, TestXIncludeConfig, TestBM25SimilarityFactory, TestFastOutputStream, TestFastLRUCache, PreAnalyzedFieldTest, TestSuggestSpellingConverter, SpellingQueryConverterTest, DOMUtilTest, TestSolrJ, TestLRUCache, TestDocumentBuilder, SliceStateTest, SystemInfoHandlerTest, UUIDFieldTest, SolrTestCaseJ4Test, TestCrossCoreJoin, TestSimpleTrackingShardHandler, AssignTest, CdcrReplicationHandlerTest]
   [junit4] Completed [433/541] on J1 in 401.31s, 1 test, 1 failure <<< FAILURES!

[...truncated 356 lines...]
BUILD FAILED
/home/jenkins/workspace/Lucene-Solr-trunk-Linux/build.xml:775: The following error occurred while executing this line:
/home/jenkins/workspace/Lucene-Solr-trunk-Linux/build.xml:719: The following error occurred while executing this line:
/home/jenkins/workspace/Lucene-Solr-trunk-Linux/build.xml:59: The following error occurred while executing this line:
/home/jenkins/workspace/Lucene-Solr-trunk-Linux/solr/build.xml:233: The following error occurred while executing this line:
/home/jenkins/workspace/Lucene-Solr-trunk-Linux/solr/common-build.xml:514: The following error occurred while executing this line:
/home/jenkins/workspace/Lucene-Solr-trunk-Linux/lucene/common-build.xml:1432: The following error occurred while executing this line:
/home/jenkins/workspace/Lucene-Solr-trunk-Linux/lucene/common-build.xml:987: There were test failures: 541 suites, 2134 tests, 1 failure, 68 ignored (32 assumptions)

Total time: 46 minutes 26 seconds
Build step 'Invoke Ant' marked build as failure
Archiving artifacts
[WARNINGS] Skipping publisher since build result is FAILURE
Recording test results
Email was triggered for: Failure - Any
Sending email for trigger: Failure - Any



Mime
View raw message