lucene-dev mailing list archives

Site index · List index
Message view « Date » · « Thread »
Top « Date » · « Thread »
From Policeman Jenkins Server <jenk...@thetaphi.de>
Subject [JENKINS] Lucene-Solr-trunk-Windows (64bit/jdk1.8.0_51) - Build # 5111 - Still Failing!
Date Wed, 05 Aug 2015 20:46:04 GMT
Build: http://jenkins.thetaphi.de/job/Lucene-Solr-trunk-Windows/5111/
Java: 64bit/jdk1.8.0_51 -XX:+UseCompressedOops -XX:+UseSerialGC

2 tests failed.
FAILED:  org.apache.lucene.store.TestNativeFSLockFactory.testStressLocks

Error Message:
Captured an uncaught exception in thread: Thread[id=1446, name=Thread-987, state=RUNNABLE,
group=TGRP-TestNativeFSLockFactory]

Stack Trace:
com.carrotsearch.randomizedtesting.UncaughtExceptionError: Captured an uncaught exception
in thread: Thread[id=1446, name=Thread-987, state=RUNNABLE, group=TGRP-TestNativeFSLockFactory]
	at __randomizedtesting.SeedInfo.seed([6CAE129E8CE6E8DD:329F5C63904A20BB]:0)
Caused by: java.lang.AssertionError: hit unexpected NoSuchFileException: file=segments_5
	at __randomizedtesting.SeedInfo.seed([6CAE129E8CE6E8DD]:0)
	at org.apache.lucene.index.IndexFileDeleter.deleteFile(IndexFileDeleter.java:750)
	at org.apache.lucene.index.IndexFileDeleter.deletePendingFiles(IndexFileDeleter.java:515)
	at org.apache.lucene.index.IndexFileDeleter.decRef(IndexFileDeleter.java:636)
	at org.apache.lucene.index.IndexFileDeleter.close(IndexFileDeleter.java:470)
	at org.apache.lucene.index.IndexWriter.rollbackInternal(IndexWriter.java:2080)
	at org.apache.lucene.index.IndexWriter.shutdown(IndexWriter.java:1067)
	at org.apache.lucene.index.IndexWriter.close(IndexWriter.java:1109)
	at org.apache.lucene.store.BaseLockFactoryTestCase$WriterThread.run(BaseLockFactoryTestCase.java:221)


FAILED:  org.apache.lucene.store.TestSimpleFSLockFactory.testStressLocks

Error Message:
IndexWriter hit unexpected exceptions

Stack Trace:
java.lang.AssertionError: IndexWriter hit unexpected exceptions
	at __randomizedtesting.SeedInfo.seed([6CAE129E8CE6E8DD:329F5C63904A20BB]:0)
	at org.junit.Assert.fail(Assert.java:93)
	at org.junit.Assert.assertTrue(Assert.java:43)
	at org.apache.lucene.store.BaseLockFactoryTestCase.testStressLocks(BaseLockFactoryTestCase.java:169)
	at sun.reflect.NativeMethodAccessorImpl.invoke0(Native Method)
	at sun.reflect.NativeMethodAccessorImpl.invoke(NativeMethodAccessorImpl.java:62)
	at sun.reflect.DelegatingMethodAccessorImpl.invoke(DelegatingMethodAccessorImpl.java:43)
	at java.lang.reflect.Method.invoke(Method.java:497)
	at com.carrotsearch.randomizedtesting.RandomizedRunner.invoke(RandomizedRunner.java:1627)
	at com.carrotsearch.randomizedtesting.RandomizedRunner$6.evaluate(RandomizedRunner.java:836)
	at com.carrotsearch.randomizedtesting.RandomizedRunner$7.evaluate(RandomizedRunner.java:872)
	at com.carrotsearch.randomizedtesting.RandomizedRunner$8.evaluate(RandomizedRunner.java:886)
	at org.apache.lucene.util.TestRuleSetupTeardownChained$1.evaluate(TestRuleSetupTeardownChained.java:50)
	at org.apache.lucene.util.AbstractBeforeAfterRule$1.evaluate(AbstractBeforeAfterRule.java:46)
	at org.apache.lucene.util.TestRuleThreadAndTestName$1.evaluate(TestRuleThreadAndTestName.java:49)
	at org.apache.lucene.util.TestRuleIgnoreAfterMaxFailures$1.evaluate(TestRuleIgnoreAfterMaxFailures.java:65)
	at org.apache.lucene.util.TestRuleMarkFailure$1.evaluate(TestRuleMarkFailure.java:48)
	at com.carrotsearch.randomizedtesting.rules.StatementAdapter.evaluate(StatementAdapter.java:36)
	at com.carrotsearch.randomizedtesting.ThreadLeakControl$StatementRunner.run(ThreadLeakControl.java:365)
	at com.carrotsearch.randomizedtesting.ThreadLeakControl.forkTimeoutingTask(ThreadLeakControl.java:798)
	at com.carrotsearch.randomizedtesting.ThreadLeakControl$3.evaluate(ThreadLeakControl.java:458)
	at com.carrotsearch.randomizedtesting.RandomizedRunner.runSingleTest(RandomizedRunner.java:845)
	at com.carrotsearch.randomizedtesting.RandomizedRunner$3.evaluate(RandomizedRunner.java:747)
	at com.carrotsearch.randomizedtesting.RandomizedRunner$4.evaluate(RandomizedRunner.java:781)
	at com.carrotsearch.randomizedtesting.RandomizedRunner$5.evaluate(RandomizedRunner.java:792)
	at org.apache.lucene.util.AbstractBeforeAfterRule$1.evaluate(AbstractBeforeAfterRule.java:46)
	at com.carrotsearch.randomizedtesting.rules.StatementAdapter.evaluate(StatementAdapter.java:36)
	at org.apache.lucene.util.TestRuleStoreClassName$1.evaluate(TestRuleStoreClassName.java:42)
	at com.carrotsearch.randomizedtesting.rules.NoShadowingOrOverridesOnMethodsRule$1.evaluate(NoShadowingOrOverridesOnMethodsRule.java:39)
	at com.carrotsearch.randomizedtesting.rules.NoShadowingOrOverridesOnMethodsRule$1.evaluate(NoShadowingOrOverridesOnMethodsRule.java:39)
	at com.carrotsearch.randomizedtesting.rules.StatementAdapter.evaluate(StatementAdapter.java:36)
	at com.carrotsearch.randomizedtesting.rules.StatementAdapter.evaluate(StatementAdapter.java:36)
	at com.carrotsearch.randomizedtesting.rules.StatementAdapter.evaluate(StatementAdapter.java:36)
	at org.apache.lucene.util.TestRuleAssertionsRequired$1.evaluate(TestRuleAssertionsRequired.java:54)
	at org.apache.lucene.util.TestRuleMarkFailure$1.evaluate(TestRuleMarkFailure.java:48)
	at org.apache.lucene.util.TestRuleIgnoreAfterMaxFailures$1.evaluate(TestRuleIgnoreAfterMaxFailures.java:65)
	at org.apache.lucene.util.TestRuleIgnoreTestSuites$1.evaluate(TestRuleIgnoreTestSuites.java:55)
	at com.carrotsearch.randomizedtesting.rules.StatementAdapter.evaluate(StatementAdapter.java:36)
	at com.carrotsearch.randomizedtesting.ThreadLeakControl$StatementRunner.run(ThreadLeakControl.java:365)
	at java.lang.Thread.run(Thread.java:745)




Build Log:
[...truncated 1501 lines...]
   [junit4] Suite: org.apache.lucene.store.TestNativeFSLockFactory
   [junit4]   2> Srp 05, 2015 3:45:51 ODP. com.carrotsearch.randomizedtesting.RandomizedRunner$QueueUncaughtExceptionsHandler
uncaughtException
   [junit4]   2> WARNING: Uncaught exception in thread: Thread[Thread-987,5,TGRP-TestNativeFSLockFactory]
   [junit4]   2> java.lang.AssertionError: hit unexpected NoSuchFileException: file=segments_5
   [junit4]   2> 	at __randomizedtesting.SeedInfo.seed([6CAE129E8CE6E8DD]:0)
   [junit4]   2> 	at org.apache.lucene.index.IndexFileDeleter.deleteFile(IndexFileDeleter.java:750)
   [junit4]   2> 	at org.apache.lucene.index.IndexFileDeleter.deletePendingFiles(IndexFileDeleter.java:515)
   [junit4]   2> 	at org.apache.lucene.index.IndexFileDeleter.decRef(IndexFileDeleter.java:636)
   [junit4]   2> 	at org.apache.lucene.index.IndexFileDeleter.close(IndexFileDeleter.java:470)
   [junit4]   2> 	at org.apache.lucene.index.IndexWriter.rollbackInternal(IndexWriter.java:2080)
   [junit4]   2> 	at org.apache.lucene.index.IndexWriter.shutdown(IndexWriter.java:1067)
   [junit4]   2> 	at org.apache.lucene.index.IndexWriter.close(IndexWriter.java:1109)
   [junit4]   2> 	at org.apache.lucene.store.BaseLockFactoryTestCase$WriterThread.run(BaseLockFactoryTestCase.java:221)
   [junit4]   2> 
   [junit4]   2> NOTE: reproduce with: ant test  -Dtestcase=TestNativeFSLockFactory -Dtests.method=testStressLocks
-Dtests.seed=6CAE129E8CE6E8DD -Dtests.slow=true -Dtests.locale=cs -Dtests.timezone=America/Winnipeg
-Dtests.asserts=true -Dtests.file.encoding=ISO-8859-1
   [junit4] ERROR   1.03s J0 | TestNativeFSLockFactory.testStressLocks <<<
   [junit4]    > Throwable #1: com.carrotsearch.randomizedtesting.UncaughtExceptionError:
Captured an uncaught exception in thread: Thread[id=1446, name=Thread-987, state=RUNNABLE,
group=TGRP-TestNativeFSLockFactory]
   [junit4]    > 	at __randomizedtesting.SeedInfo.seed([6CAE129E8CE6E8DD:329F5C63904A20BB]:0)
   [junit4]    > Caused by: java.lang.AssertionError: hit unexpected NoSuchFileException:
file=segments_5
   [junit4]    > 	at __randomizedtesting.SeedInfo.seed([6CAE129E8CE6E8DD]:0)
   [junit4]    > 	at org.apache.lucene.index.IndexFileDeleter.deleteFile(IndexFileDeleter.java:750)
   [junit4]    > 	at org.apache.lucene.index.IndexFileDeleter.deletePendingFiles(IndexFileDeleter.java:515)
   [junit4]    > 	at org.apache.lucene.index.IndexFileDeleter.decRef(IndexFileDeleter.java:636)
   [junit4]    > 	at org.apache.lucene.index.IndexFileDeleter.close(IndexFileDeleter.java:470)
   [junit4]    > 	at org.apache.lucene.index.IndexWriter.rollbackInternal(IndexWriter.java:2080)
   [junit4]    > 	at org.apache.lucene.index.IndexWriter.shutdown(IndexWriter.java:1067)
   [junit4]    > 	at org.apache.lucene.index.IndexWriter.close(IndexWriter.java:1109)
   [junit4]    > 	at org.apache.lucene.store.BaseLockFactoryTestCase$WriterThread.run(BaseLockFactoryTestCase.java:221)
   [junit4]   2> NOTE: test params are: codec=Asserting(Lucene53): {content=FST50}, docValues:{},
sim=DefaultSimilarity, locale=cs, timezone=America/Winnipeg
   [junit4]   2> NOTE: Windows 7 6.1 amd64/Oracle Corporation 1.8.0_51 (64-bit)/cpus=3,threads=1,free=65684416,total=115572736
   [junit4]   2> NOTE: All tests run in this JVM: [TestLSBRadixSorter, TestCheckIndex,
TestDocument, TestVersion, TestPerFieldPostingsFormat2, TestBlockPostingsFormat, TestNeverDelete,
TestIndexWriterOutOfFileDescriptors, TestSpanNearQuery, TestMaxTermFrequency, TestSpanMultiTermQueryWrapper,
TestBufferedChecksum, TestTerm, TestBinaryTerms, TestMutableValues, TestScorerPerf, TestIndexWriterFromReader,
TestSleepingLockWrapper, TestEarlyTermination, TestMultiPhraseEnum, TestCharsRef, TestUniqueTermCount,
TestDocCount, TestNumericTokenStream, TestSearchWithThreads, TestQueryWrapperFilter, TestMultiLevelSkipList,
TestConstantScoreQuery, TestNewestSegment, TestDocValuesScoring, LimitedFiniteStringsIteratorTest,
TestTimSorterWorstCase, TestMinimize, TestRecyclingIntBlockAllocator, TestSpanContainQuery,
TestParallelCompositeReader, TestPagedBytes, TestUTF32ToUTF8, TestLucene50FieldInfoFormat,
TestSparseFixedBitSet, TestOrdinalMap, TestStressDeletes, Test2BNumericDocValues, TestSimpleFSDirectory,
TestTopFieldCollector, TestRoaringDocIdSet, TestDisjunctionMaxQuery, TestNoMergeScheduler,
TestIndexableField, TestPackedTokenAttributeImpl, TestDirectoryReaderReopen, TestScoreCachingWrappingScorer,
TestTryDelete, TestTransactions, TestSearch, TestMergedIterator, TestLucene50TermVectorsFormat,
TestConjunctions, TestIntBlockPool, TestWildcard, Test2BTerms, TestTermVectorsWriter, TestIndexWriterMerging,
TestCollectionUtil, TestConcurrentMergeScheduler, TestVirtualMethod, TestBoolean2, TestShardSearching,
TestRollingBuffer, TestBagOfPositions, TestPostingsOffsets, TestReaderClosed, TestBlockPostingsFormat3,
TestStressIndexing2, TestIndexWriterMaxDocs, TestLazyProxSkipping, TestIsCurrent, TestTopDocsCollector,
TestComplexExplanations, TestDuelingCodecs, TestDemo, TestMultiPhraseQuery, TestControlledRealTimeReopenThread,
TestPayloadTermQuery, TestFieldReuse, TestIndexWriterThreadsToSegments, TestOmitPositions,
TestExceedMaxTermLength, TestOperations, TestDeletionPolicy, TestSloppyPhraseQuery2, TestFilterIterator,
TestBytesRefHash, TestMinShouldMatch2, TestCharTermAttributeImpl, TestIndexWriterDelete, TestTermVectorsReader,
TestLockFactory, TestNumericUtils, TestDocBoost, TestIndexWriterWithThreads, TestIndexWriterExceptions,
TestNorms, TestHighCompressionMode, TestDocumentsWriterStallControl, TestTieredMergePolicy,
TestIndexWriterForceMerge, TestLevenshteinAutomata, TestByteSlices, TestTermsEnum, TestWeakIdentityMap,
TestSegmentMerger, TestPhraseQuery, TestFixedBitSet, TestCrash, TestMultiThreadTermVectors,
TestFieldsReader, TestDocValuesIndexing, TestHugeRamFile, TestSpans, TestFlex, TestFastCompressionMode,
TestDocsAndPositions, TestParallelLeafReader, TestForceMergeForever, TestOmitTf, TestTermRangeQuery,
TestDocumentWriter, TestMultiTermConstantScore, TestSpanSearchEquivalence, TestSimpleExplanationsOfNonMatches,
TestSpansAdvanced2, TestComplexExplanationsOfNonMatches, TestPrefixCodedTerms, TestAutomatonQuery,
TestSumDocFreq, TestWindowsMMap, TestWildcardRandom, TestDirectory, TestBooleanQueryVisitSubscorers,
TestSearchForDuplicates, TestSizeBoundedForceMerge, TestIndexFileDeleter, TestCompiledAutomaton,
TestParallelTermEnum, TestElevationComparator, TestPositionIncrement, TestSimilarityProvider,
TestFilterLeafReader, TestDateTools, TestSameTokenSamePosition, TestCachingCollector, TestAutomatonQueryUnicode,
TestRecyclingByteBlockAllocator, TestNamedSPILoader, TestByteBlockPool, TestCharFilter, TestTwoPhaseCommitTool,
TestIndexWriterOnJRECrash, MultiCollectorTest, TestSimpleAttributeImpl, TestIndexCommit, TestPositiveScoresOnlyCollector,
TestReusableStringReader, TestForUtil, TestLucene50CompoundFormat, TestLucene50StoredFieldsFormat,
TestLucene50StoredFieldsFormatHighCompression, TestLucene53NormsFormat, Test2BSortedDocValuesFixedSorted,
Test2BSortedDocValuesOrds, TestAllFilesHaveChecksumFooter, TestDocInverterPerFieldErrorInfo,
TestDuelingCodecsAtNight, TestExitableDirectoryReader, TestIndexReaderClose, TestIndexWriterExceptions2,
TestInfoStream, TestMaxPosition, TestMergeRateLimiter, TestSegmentInfos, TestTermVectors,
TestTerms, TestTragicIndexWriterDeadlock, FuzzyTermOnShortTermsTest, TestApproximationSearchEquivalence,
TestBlendedTermQuery, TestCachingWrapperQuery, TestConjunctionDISI, TestDocValuesRewriteMethod,
TestFilterCachingPolicy, TestIndexSearcher, TestLRUQueryCache, TestMatchNoDocsQuery, TestNeedsScores,
TestQueryRescorer, TestSortRescorer, TestSortedNumericSortField, TestSortedSetSelector, TestSortedSetSortField,
TestUsageTrackingFilterCachingPolicy, TestPayloadBasics, TestPayloadScoreQuery, TestDefaultSimilarity,
TestFilterSpans, TestSpanCollection, TestSpanNotQuery, TestSpanOrQuery, TestSpanTermQuery,
TestSpansEnum, TestNIOFSDirectory, TestNativeFSLockFactory]
   [junit4] Completed [383/401] on J0 in 10.11s, 10 tests, 1 error <<< FAILURES!

[...truncated 1 lines...]
   [junit4] Suite: org.apache.lucene.store.TestSimpleFSLockFactory
   [junit4]   1> Stress Test Index Writer: creation hit unexpected exception: java.nio.file.NoSuchFileException:
C:\Users\JenkinsSlave\workspace\Lucene-Solr-trunk-Windows\lucene\build\core\test\J1\temp\lucene.store.TestSimpleFSLockFactory_6CAE129E8CE6E8DD-001\tempDir-007\segments_8
   [junit4]   1> java.nio.file.NoSuchFileException: C:\Users\JenkinsSlave\workspace\Lucene-Solr-trunk-Windows\lucene\build\core\test\J1\temp\lucene.store.TestSimpleFSLockFactory_6CAE129E8CE6E8DD-001\tempDir-007\segments_8
   [junit4]   1> 	at sun.nio.fs.WindowsException.translateToIOException(WindowsException.java:79)
   [junit4]   1> 	at sun.nio.fs.WindowsException.rethrowAsIOException(WindowsException.java:97)
   [junit4]   1> 	at sun.nio.fs.WindowsException.rethrowAsIOException(WindowsException.java:102)
   [junit4]   1> 	at sun.nio.fs.WindowsFileSystemProvider.newFileChannel(WindowsFileSystemProvider.java:115)
   [junit4]   1> 	at org.apache.lucene.mockfile.FilterFileSystemProvider.newFileChannel(FilterFileSystemProvider.java:203)
   [junit4]   1> 	at org.apache.lucene.mockfile.DisableFsyncFS.newFileChannel(DisableFsyncFS.java:46)
   [junit4]   1> 	at org.apache.lucene.mockfile.FilterFileSystemProvider.newFileChannel(FilterFileSystemProvider.java:203)
   [junit4]   1> 	at org.apache.lucene.mockfile.HandleTrackingFS.newFileChannel(HandleTrackingFS.java:167)
   [junit4]   1> 	at org.apache.lucene.mockfile.HandleTrackingFS.newFileChannel(HandleTrackingFS.java:167)
   [junit4]   1> 	at org.apache.lucene.mockfile.FilterFileSystemProvider.newFileChannel(FilterFileSystemProvider.java:203)
   [junit4]   1> 	at java.nio.channels.FileChannel.open(FileChannel.java:287)
   [junit4]   1> 	at java.nio.channels.FileChannel.open(FileChannel.java:335)
   [junit4]   1> 	at org.apache.lucene.store.NIOFSDirectory.openInput(NIOFSDirectory.java:82)
   [junit4]   1> 	at org.apache.lucene.store.Directory.openChecksumInput(Directory.java:109)
   [junit4]   1> 	at org.apache.lucene.store.RawDirectoryWrapper.openChecksumInput(RawDirectoryWrapper.java:42)
   [junit4]   1> 	at org.apache.lucene.index.SegmentInfos.readCommit(SegmentInfos.java:282)
   [junit4]   1> 	at org.apache.lucene.index.IndexFileDeleter.<init>(IndexFileDeleter.java:168)
   [junit4]   1> 	at org.apache.lucene.index.IndexWriter.<init>(IndexWriter.java:935)
   [junit4]   1> 	at org.apache.lucene.store.BaseLockFactoryTestCase$WriterThread.run(BaseLockFactoryTestCase.java:197)
   [junit4]   2> NOTE: reproduce with: ant test  -Dtestcase=TestSimpleFSLockFactory -Dtests.method=testStressLocks
-Dtests.seed=6CAE129E8CE6E8DD -Dtests.slow=true -Dtests.locale=es_CR -Dtests.timezone=PST8PDT
-Dtests.asserts=true -Dtests.file.encoding=ISO-8859-1
   [junit4] FAILURE 0.96s J1 | TestSimpleFSLockFactory.testStressLocks <<<
   [junit4]    > Throwable #1: java.lang.AssertionError: IndexWriter hit unexpected exceptions
   [junit4]    > 	at __randomizedtesting.SeedInfo.seed([6CAE129E8CE6E8DD:329F5C63904A20BB]:0)
   [junit4]    > 	at org.apache.lucene.store.BaseLockFactoryTestCase.testStressLocks(BaseLockFactoryTestCase.java:169)
   [junit4]    > 	at java.lang.Thread.run(Thread.java:745)
   [junit4]   2> NOTE: leaving temporary files on disk at: C:\Users\JenkinsSlave\workspace\Lucene-Solr-trunk-Windows\lucene\build\core\test\J1\temp\lucene.store.TestSimpleFSLockFactory_6CAE129E8CE6E8DD-001
   [junit4]   2> NOTE: test params are: codec=Asserting(Lucene53): {content=BlockTreeOrds(blocksize=128)},
docValues:{}, sim=RandomSimilarityProvider(queryNorm=true,coord=crazy): {content=DFR I(ne)B2},
locale=es_CR, timezone=PST8PDT
   [junit4]   2> NOTE: Windows 7 6.1 amd64/Oracle Corporation 1.8.0_51 (64-bit)/cpus=3,threads=1,free=105252952,total=247808000
   [junit4]   2> NOTE: All tests run in this JVM: [TestIndexInput, TestSentinelIntSet,
TestTimSorter, TestIndexWriterConfig, TestField, TestPayloads, TestNRTReaderCleanup, TestDirectPacked,
TestIndexWriterCommit, TestReadOnlyIndex, Test2BPagedBytes, TestIndexWriterOutOfMemory, TestPrefixRandom,
TestParallelReaderEmptyIndex, TestSearchAfter, TestAllFilesHaveCodecHeader, TestIndexWriterUnicode,
TestLongPostings, TestDirectoryReader, TestDoc, TestSingleInstanceLockFactory, TestMergeSchedulerExternal,
TestBinaryDocValuesUpdates, TestMatchAllDocsQuery, TestTotalHitCountCollector, Test2BBinaryDocValues,
TestFrequencyTrackingRingBuffer, TestBufferedIndexInput, TestTimeLimitingCollector, TestIndexWriterMergePolicy,
TestStressAdvance, TestNoMergePolicy, TestSameScoresWithThreads, TestPayloadsOnVectors, TestBooleanMinShouldMatch,
TestPhrasePrefixQuery, TestLucene50SegmentInfoFormat, TestSortRandom, TestSegmentTermEnum,
TestFieldCacheRewriteMethod, TestNRTCachingDirectory, TestMmapDirectory, TestSnapshotDeletionPolicy,
TestDateSort, TestSpanFirstQuery, TestMultiMMap, TestSpanExplanationsOfNonMatches, TestThreadedForceMerge,
TestPrefixInBooleanQuery, TestSmallFloat, TestArrayUtil, TestCloseableThreadLocal, TestPersistentSnapshotDeletionPolicy,
TestNRTThreads, TestSearcherManager, TestSloppyPhraseQuery, TestCodecHoldsOpenFiles, TestIntroSorter,
TestReaderWrapperDVTypeCheck, TestIOUtils, TestManyFields, TestDemoParallelLeafReader, TestBooleanQuery,
TestPayloadExplanations, TestFieldValueQuery, TestByteArrayDataInput, TestDocValues, TestBooleanCoord,
TestLogMergePolicy, Test2BPositions, TestBooleanScorer, TestFieldType, TestOmitNorms, TestPayloadSpans,
TestAutomaton, TestFilterDirectory, TestIndexWriterDeleteByQuery, TestNumericRangeQuery32,
TestNGramPhraseQuery, TestRAMDirectory, TestSubScorerFreqs, TestCodecUtil, TestForTooMuchCloning,
TestToken, TestRegexpRandom, TestPrefixQuery, TestMixedDocValuesUpdates, TestNumericDocValuesUpdates,
TestMixedCodecs, TestFilterDirectoryReader, TestSpansAdvanced, TestMultiValuedNumericRangeQuery,
TestMultiFields, TestCachingTokenFilter, Test2BPostings, TestNumericRangeQuery64, TestBagOfPostings,
TestBytesRef, TestConsistentFieldNumbers, TestCrashCausesCorruptIndex, TestIndexWriter, TestPerFieldDocValuesFormat,
TestIndexWriterReader, TestFSTs, TestBytesStore, TestPackedInts, TestAddIndexes, TestBooleanOr,
TestBasics, TestFlushByRamOrCountsPolicy, TestAtomicUpdate, TestTopDocsMerge, TestStressIndexing,
TestRollingUpdates, TestNRTReaderWithThreads, TestPerFieldPostingsFormat, TestSimpleExplanations,
TestRegexpRandom2, TestSegmentReader, TestFastDecompressionMode, TestIndexWriterNRTIsCurrent,
TestSegmentTermDocs, TestSort, TestMultiDocValues, TestSimpleSearchEquivalence, TestCustomSearcherSort,
TestSimilarityBase, TestTermsEnum2, TestDeterminizeLexicon, TestIndexWriterOnDiskFull, TestCustomNorms,
TestTransactionRollback, TestSpanExplanations, TestDeterminism, TestCodecs, TestStressNRT,
TestNearSpansOrdered, TestDocumentsWriterDeleteQueue, TestLiveFieldValues, TestFuzzyQuery,
TestSimilarity2, TestFieldMaskingSpanQuery, TestExternalCodecs, TestNoDeletionPolicy, TestRegexpQuery,
TestPerSegmentDeletes, TestUnicodeUtil, TestTermScorer, TestFileSwitchDirectory, TestDocIdSet,
TestMultiTermQueryRewrites, TestSimilarity, TestSetOnce, TestDateFilter, TestPriorityQueue,
TestBinaryDocument, TestAttributeSource, TestRamUsageEstimator, TestIndexWriterLockRelease,
TestAssertions, TestRollback, TestNot, Test4GBStoredFields, TestIntsRef, TestTermdocPerf,
Test2BPostingsBytes, TestBlockPostingsFormat2, TestLucene50DocValuesFormat, TestRateLimiter,
TestSimpleFSLockFactory]
   [junit4] Completed [384/401] on J1 in 9.11s, 7 tests, 1 failure <<< FAILURES!

[...truncated 68 lines...]
BUILD FAILED
C:\Users\JenkinsSlave\workspace\Lucene-Solr-trunk-Windows\build.xml:716: The following error
occurred while executing this line:
C:\Users\JenkinsSlave\workspace\Lucene-Solr-trunk-Windows\build.xml:660: The following error
occurred while executing this line:
C:\Users\JenkinsSlave\workspace\Lucene-Solr-trunk-Windows\build.xml:59: The following error
occurred while executing this line:
C:\Users\JenkinsSlave\workspace\Lucene-Solr-trunk-Windows\lucene\build.xml:50: The following
error occurred while executing this line:
C:\Users\JenkinsSlave\workspace\Lucene-Solr-trunk-Windows\lucene\common-build.xml:1429: The
following error occurred while executing this line:
C:\Users\JenkinsSlave\workspace\Lucene-Solr-trunk-Windows\lucene\common-build.xml:984: There
were test failures: 401 suites, 3222 tests, 1 error, 1 failure, 55 ignored (51 assumptions)

Total time: 5 minutes 29 seconds
Build step 'Invoke Ant' marked build as failure
Archiving artifacts
Recording test results
Email was triggered for: Failure - Any
Sending email for trigger: Failure - Any



Mime
View raw message