lucene-dev mailing list archives

Site index · List index
Message view « Date » · « Thread »
Top « Date » · « Thread »
From Policeman Jenkins Server <jenk...@thetaphi.de>
Subject [JENKINS] Lucene-Solr-trunk-Linux (32bit/jdk1.8.0_51) - Build # 13705 - Failure!
Date Sun, 02 Aug 2015 20:09:14 GMT
Build: http://jenkins.thetaphi.de/job/Lucene-Solr-trunk-Linux/13705/
Java: 32bit/jdk1.8.0_51 -server -XX:+UseConcMarkSweepGC

1 tests failed.
FAILED:  org.apache.solr.cloud.ChaosMonkeySafeLeaderTest.test

Error Message:
expected:<0> but was:<1>

Stack Trace:
java.lang.AssertionError: expected:<0> but was:<1>
	at __randomizedtesting.SeedInfo.seed([CCCAEA3C17C46C44:449ED5E6B93801BC]:0)
	at org.junit.Assert.fail(Assert.java:93)
	at org.junit.Assert.failNotEquals(Assert.java:647)
	at org.junit.Assert.assertEquals(Assert.java:128)
	at org.junit.Assert.assertEquals(Assert.java:472)
	at org.junit.Assert.assertEquals(Assert.java:456)
	at org.apache.solr.cloud.ChaosMonkeySafeLeaderTest.test(ChaosMonkeySafeLeaderTest.java:156)
	at sun.reflect.NativeMethodAccessorImpl.invoke0(Native Method)
	at sun.reflect.NativeMethodAccessorImpl.invoke(NativeMethodAccessorImpl.java:62)
	at sun.reflect.DelegatingMethodAccessorImpl.invoke(DelegatingMethodAccessorImpl.java:43)
	at java.lang.reflect.Method.invoke(Method.java:497)
	at com.carrotsearch.randomizedtesting.RandomizedRunner.invoke(RandomizedRunner.java:1627)
	at com.carrotsearch.randomizedtesting.RandomizedRunner$6.evaluate(RandomizedRunner.java:836)
	at com.carrotsearch.randomizedtesting.RandomizedRunner$7.evaluate(RandomizedRunner.java:872)
	at com.carrotsearch.randomizedtesting.RandomizedRunner$8.evaluate(RandomizedRunner.java:886)
	at org.apache.solr.BaseDistributedSearchTestCase$ShardsRepeatRule$ShardsFixedStatement.callStatement(BaseDistributedSearchTestCase.java:966)
	at org.apache.solr.BaseDistributedSearchTestCase$ShardsRepeatRule$ShardsStatement.evaluate(BaseDistributedSearchTestCase.java:941)
	at com.carrotsearch.randomizedtesting.rules.SystemPropertiesRestoreRule$1.evaluate(SystemPropertiesRestoreRule.java:57)
	at org.apache.lucene.util.TestRuleSetupTeardownChained$1.evaluate(TestRuleSetupTeardownChained.java:50)
	at org.apache.lucene.util.AbstractBeforeAfterRule$1.evaluate(AbstractBeforeAfterRule.java:46)
	at org.apache.lucene.util.TestRuleThreadAndTestName$1.evaluate(TestRuleThreadAndTestName.java:49)
	at org.apache.lucene.util.TestRuleIgnoreAfterMaxFailures$1.evaluate(TestRuleIgnoreAfterMaxFailures.java:65)
	at org.apache.lucene.util.TestRuleMarkFailure$1.evaluate(TestRuleMarkFailure.java:48)
	at com.carrotsearch.randomizedtesting.rules.StatementAdapter.evaluate(StatementAdapter.java:36)
	at com.carrotsearch.randomizedtesting.ThreadLeakControl$StatementRunner.run(ThreadLeakControl.java:365)
	at com.carrotsearch.randomizedtesting.ThreadLeakControl.forkTimeoutingTask(ThreadLeakControl.java:798)
	at com.carrotsearch.randomizedtesting.ThreadLeakControl$3.evaluate(ThreadLeakControl.java:458)
	at com.carrotsearch.randomizedtesting.RandomizedRunner.runSingleTest(RandomizedRunner.java:845)
	at com.carrotsearch.randomizedtesting.RandomizedRunner$3.evaluate(RandomizedRunner.java:747)
	at com.carrotsearch.randomizedtesting.RandomizedRunner$4.evaluate(RandomizedRunner.java:781)
	at com.carrotsearch.randomizedtesting.RandomizedRunner$5.evaluate(RandomizedRunner.java:792)
	at com.carrotsearch.randomizedtesting.rules.StatementAdapter.evaluate(StatementAdapter.java:36)
	at com.carrotsearch.randomizedtesting.rules.SystemPropertiesRestoreRule$1.evaluate(SystemPropertiesRestoreRule.java:57)
	at org.apache.lucene.util.AbstractBeforeAfterRule$1.evaluate(AbstractBeforeAfterRule.java:46)
	at com.carrotsearch.randomizedtesting.rules.StatementAdapter.evaluate(StatementAdapter.java:36)
	at org.apache.lucene.util.TestRuleStoreClassName$1.evaluate(TestRuleStoreClassName.java:42)
	at com.carrotsearch.randomizedtesting.rules.NoShadowingOrOverridesOnMethodsRule$1.evaluate(NoShadowingOrOverridesOnMethodsRule.java:39)
	at com.carrotsearch.randomizedtesting.rules.NoShadowingOrOverridesOnMethodsRule$1.evaluate(NoShadowingOrOverridesOnMethodsRule.java:39)
	at com.carrotsearch.randomizedtesting.rules.StatementAdapter.evaluate(StatementAdapter.java:36)
	at com.carrotsearch.randomizedtesting.rules.StatementAdapter.evaluate(StatementAdapter.java:36)
	at com.carrotsearch.randomizedtesting.rules.StatementAdapter.evaluate(StatementAdapter.java:36)
	at org.apache.lucene.util.TestRuleAssertionsRequired$1.evaluate(TestRuleAssertionsRequired.java:54)
	at org.apache.lucene.util.TestRuleMarkFailure$1.evaluate(TestRuleMarkFailure.java:48)
	at org.apache.lucene.util.TestRuleIgnoreAfterMaxFailures$1.evaluate(TestRuleIgnoreAfterMaxFailures.java:65)
	at org.apache.lucene.util.TestRuleIgnoreTestSuites$1.evaluate(TestRuleIgnoreTestSuites.java:55)
	at com.carrotsearch.randomizedtesting.rules.StatementAdapter.evaluate(StatementAdapter.java:36)
	at com.carrotsearch.randomizedtesting.ThreadLeakControl$StatementRunner.run(ThreadLeakControl.java:365)
	at java.lang.Thread.run(Thread.java:745)




Build Log:
[...truncated 10001 lines...]
   [junit4] Suite: org.apache.solr.cloud.ChaosMonkeySafeLeaderTest
   [junit4]   2> Creating dataDir: /home/jenkins/workspace/Lucene-Solr-trunk-Linux/solr/build/solr-core/test/J1/temp/solr.cloud.ChaosMonkeySafeLeaderTest_CCCAEA3C17C46C44-001/init-core-data-001
   [junit4]   2> 401692 INFO  (SUITE-ChaosMonkeySafeLeaderTest-seed#[CCCAEA3C17C46C44]-worker) [    ] o.a.s.SolrTestCaseJ4 Randomized ssl (true) and clientAuth (false)
   [junit4]   2> 401692 INFO  (SUITE-ChaosMonkeySafeLeaderTest-seed#[CCCAEA3C17C46C44]-worker) [    ] o.a.s.BaseDistributedSearchTestCase Setting hostContext system property: /
   [junit4]   2> 401695 INFO  (TEST-ChaosMonkeySafeLeaderTest.test-seed#[CCCAEA3C17C46C44]) [    ] o.a.s.c.ZkTestServer STARTING ZK TEST SERVER
   [junit4]   2> 401695 INFO  (Thread-598) [    ] o.a.s.c.ZkTestServer client port:0.0.0.0/0.0.0.0:0
   [junit4]   2> 401695 INFO  (Thread-598) [    ] o.a.s.c.ZkTestServer Starting server
   [junit4]   2> 401795 INFO  (TEST-ChaosMonkeySafeLeaderTest.test-seed#[CCCAEA3C17C46C44]) [    ] o.a.s.c.ZkTestServer start zk server on port:46107
   [junit4]   2> 401795 INFO  (TEST-ChaosMonkeySafeLeaderTest.test-seed#[CCCAEA3C17C46C44]) [    ] o.a.s.c.c.SolrZkClient Using default ZkCredentialsProvider
   [junit4]   2> 401796 INFO  (TEST-ChaosMonkeySafeLeaderTest.test-seed#[CCCAEA3C17C46C44]) [    ] o.a.s.c.c.ConnectionManager Waiting for client to connect to ZooKeeper
   [junit4]   2> 401797 INFO  (zkCallback-246-thread-1) [    ] o.a.s.c.c.ConnectionManager Watcher org.apache.solr.common.cloud.ConnectionManager@64b322 name:ZooKeeperConnection Watcher:127.0.0.1:46107 got event WatchedEvent state:SyncConnected type:None path:null path:null type:None
   [junit4]   2> 401797 INFO  (TEST-ChaosMonkeySafeLeaderTest.test-seed#[CCCAEA3C17C46C44]) [    ] o.a.s.c.c.ConnectionManager Client is connected to ZooKeeper
   [junit4]   2> 401798 INFO  (TEST-ChaosMonkeySafeLeaderTest.test-seed#[CCCAEA3C17C46C44]) [    ] o.a.s.c.c.SolrZkClient Using default ZkACLProvider
   [junit4]   2> 401798 INFO  (TEST-ChaosMonkeySafeLeaderTest.test-seed#[CCCAEA3C17C46C44]) [    ] o.a.s.c.c.SolrZkClient makePath: /solr
   [junit4]   2> 401799 INFO  (TEST-ChaosMonkeySafeLeaderTest.test-seed#[CCCAEA3C17C46C44]) [    ] o.a.s.c.c.SolrZkClient Using default ZkCredentialsProvider
   [junit4]   2> 401799 INFO  (TEST-ChaosMonkeySafeLeaderTest.test-seed#[CCCAEA3C17C46C44]) [    ] o.a.s.c.c.ConnectionManager Waiting for client to connect to ZooKeeper
   [junit4]   2> 401800 INFO  (zkCallback-247-thread-1) [    ] o.a.s.c.c.ConnectionManager Watcher org.apache.solr.common.cloud.ConnectionManager@11d3fb4 name:ZooKeeperConnection Watcher:127.0.0.1:46107/solr got event WatchedEvent state:SyncConnected type:None path:null path:null type:None
   [junit4]   2> 401800 INFO  (TEST-ChaosMonkeySafeLeaderTest.test-seed#[CCCAEA3C17C46C44]) [    ] o.a.s.c.c.ConnectionManager Client is connected to ZooKeeper
   [junit4]   2> 401800 INFO  (TEST-ChaosMonkeySafeLeaderTest.test-seed#[CCCAEA3C17C46C44]) [    ] o.a.s.c.c.SolrZkClient Using default ZkACLProvider
   [junit4]   2> 401800 INFO  (TEST-ChaosMonkeySafeLeaderTest.test-seed#[CCCAEA3C17C46C44]) [    ] o.a.s.c.c.SolrZkClient makePath: /collections/collection1
   [junit4]   2> 401801 INFO  (TEST-ChaosMonkeySafeLeaderTest.test-seed#[CCCAEA3C17C46C44]) [    ] o.a.s.c.c.SolrZkClient makePath: /collections/collection1/shards
   [junit4]   2> 401802 INFO  (TEST-ChaosMonkeySafeLeaderTest.test-seed#[CCCAEA3C17C46C44]) [    ] o.a.s.c.c.SolrZkClient makePath: /collections/control_collection
   [junit4]   2> 401802 INFO  (TEST-ChaosMonkeySafeLeaderTest.test-seed#[CCCAEA3C17C46C44]) [    ] o.a.s.c.c.SolrZkClient makePath: /collections/control_collection/shards
   [junit4]   2> 401803 INFO  (TEST-ChaosMonkeySafeLeaderTest.test-seed#[CCCAEA3C17C46C44]) [    ] o.a.s.c.AbstractZkTestCase put /home/jenkins/workspace/Lucene-Solr-trunk-Linux/solr/core/src/test-files/solr/collection1/conf/solrconfig-tlog.xml to /configs/conf1/solrconfig.xml
   [junit4]   2> 401803 INFO  (TEST-ChaosMonkeySafeLeaderTest.test-seed#[CCCAEA3C17C46C44]) [    ] o.a.s.c.c.SolrZkClient makePath: /configs/conf1/solrconfig.xml
   [junit4]   2> 401804 INFO  (TEST-ChaosMonkeySafeLeaderTest.test-seed#[CCCAEA3C17C46C44]) [    ] o.a.s.c.AbstractZkTestCase put /home/jenkins/workspace/Lucene-Solr-trunk-Linux/solr/core/src/test-files/solr/collection1/conf/schema15.xml to /configs/conf1/schema.xml
   [junit4]   2> 401804 INFO  (TEST-ChaosMonkeySafeLeaderTest.test-seed#[CCCAEA3C17C46C44]) [    ] o.a.s.c.c.SolrZkClient makePath: /configs/conf1/schema.xml
   [junit4]   2> 401804 INFO  (TEST-ChaosMonkeySafeLeaderTest.test-seed#[CCCAEA3C17C46C44]) [    ] o.a.s.c.AbstractZkTestCase put /home/jenkins/workspace/Lucene-Solr-trunk-Linux/solr/core/src/test-files/solr/collection1/conf/solrconfig.snippet.randomindexconfig.xml to /configs/conf1/solrconfig.snippet.randomindexconfig.xml
   [junit4]   2> 401805 INFO  (TEST-ChaosMonkeySafeLeaderTest.test-seed#[CCCAEA3C17C46C44]) [    ] o.a.s.c.c.SolrZkClient makePath: /configs/conf1/solrconfig.snippet.randomindexconfig.xml
   [junit4]   2> 401805 INFO  (TEST-ChaosMonkeySafeLeaderTest.test-seed#[CCCAEA3C17C46C44]) [    ] o.a.s.c.AbstractZkTestCase put /home/jenkins/workspace/Lucene-Solr-trunk-Linux/solr/core/src/test-files/solr/collection1/conf/stopwords.txt to /configs/conf1/stopwords.txt
   [junit4]   2> 401805 INFO  (TEST-ChaosMonkeySafeLeaderTest.test-seed#[CCCAEA3C17C46C44]) [    ] o.a.s.c.c.SolrZkClient makePath: /configs/conf1/stopwords.txt
   [junit4]   2> 401806 INFO  (TEST-ChaosMonkeySafeLeaderTest.test-seed#[CCCAEA3C17C46C44]) [    ] o.a.s.c.AbstractZkTestCase put /home/jenkins/workspace/Lucene-Solr-trunk-Linux/solr/core/src/test-files/solr/collection1/conf/protwords.txt to /configs/conf1/protwords.txt
   [junit4]   2> 401806 INFO  (TEST-ChaosMonkeySafeLeaderTest.test-seed#[CCCAEA3C17C46C44]) [    ] o.a.s.c.c.SolrZkClient makePath: /configs/conf1/protwords.txt
   [junit4]   2> 401807 INFO  (TEST-ChaosMonkeySafeLeaderTest.test-seed#[CCCAEA3C17C46C44]) [    ] o.a.s.c.AbstractZkTestCase put /home/jenkins/workspace/Lucene-Solr-trunk-Linux/solr/core/src/test-files/solr/collection1/conf/currency.xml to /configs/conf1/currency.xml
   [junit4]   2> 401807 INFO  (TEST-ChaosMonkeySafeLeaderTest.test-seed#[CCCAEA3C17C46C44]) [    ] o.a.s.c.c.SolrZkClient makePath: /configs/conf1/currency.xml
   [junit4]   2> 401808 INFO  (TEST-ChaosMonkeySafeLeaderTest.test-seed#[CCCAEA3C17C46C44]) [    ] o.a.s.c.AbstractZkTestCase put /home/jenkins/workspace/Lucene-Solr-trunk-Linux/solr/core/src/test-files/solr/collection1/conf/enumsConfig.xml to /configs/conf1/enumsConfig.xml
   [junit4]   2> 401808 INFO  (TEST-ChaosMonkeySafeLeaderTest.test-seed#[CCCAEA3C17C46C44]) [    ] o.a.s.c.c.SolrZkClient makePath: /configs/conf1/enumsConfig.xml
   [junit4]   2> 401808 INFO  (TEST-ChaosMonkeySafeLeaderTest.test-seed#[CCCAEA3C17C46C44]) [    ] o.a.s.c.AbstractZkTestCase put /home/jenkins/workspace/Lucene-Solr-trunk-Linux/solr/core/src/test-files/solr/collection1/conf/open-exchange-rates.json to /configs/conf1/open-exchange-rates.json
   [junit4]   2> 401809 INFO  (TEST-ChaosMonkeySafeLeaderTest.test-seed#[CCCAEA3C17C46C44]) [    ] o.a.s.c.c.SolrZkClient makePath: /configs/conf1/open-exchange-rates.json
   [junit4]   2> 401809 INFO  (TEST-ChaosMonkeySafeLeaderTest.test-seed#[CCCAEA3C17C46C44]) [    ] o.a.s.c.AbstractZkTestCase put /home/jenkins/workspace/Lucene-Solr-trunk-Linux/solr/core/src/test-files/solr/collection1/conf/mapping-ISOLatin1Accent.txt to /configs/conf1/mapping-ISOLatin1Accent.txt
   [junit4]   2> 401809 INFO  (TEST-ChaosMonkeySafeLeaderTest.test-seed#[CCCAEA3C17C46C44]) [    ] o.a.s.c.c.SolrZkClient makePath: /configs/conf1/mapping-ISOLatin1Accent.txt
   [junit4]   2> 401810 INFO  (TEST-ChaosMonkeySafeLeaderTest.test-seed#[CCCAEA3C17C46C44]) [    ] o.a.s.c.AbstractZkTestCase put /home/jenkins/workspace/Lucene-Solr-trunk-Linux/solr/core/src/test-files/solr/collection1/conf/old_synonyms.txt to /configs/conf1/old_synonyms.txt
   [junit4]   2> 401810 INFO  (TEST-ChaosMonkeySafeLeaderTest.test-seed#[CCCAEA3C17C46C44]) [    ] o.a.s.c.c.SolrZkClient makePath: /configs/conf1/old_synonyms.txt
   [junit4]   2> 401811 INFO  (TEST-ChaosMonkeySafeLeaderTest.test-seed#[CCCAEA3C17C46C44]) [    ] o.a.s.c.AbstractZkTestCase put /home/jenkins/workspace/Lucene-Solr-trunk-Linux/solr/core/src/test-files/solr/collection1/conf/synonyms.txt to /configs/conf1/synonyms.txt
   [junit4]   2> 401811 INFO  (TEST-ChaosMonkeySafeLeaderTest.test-seed#[CCCAEA3C17C46C44]) [    ] o.a.s.c.c.SolrZkClient makePath: /configs/conf1/synonyms.txt
   [junit4]   2> 401812 INFO  (TEST-ChaosMonkeySafeLeaderTest.test-seed#[CCCAEA3C17C46C44]) [    ] o.a.s.c.c.SolrZkClient Using default ZkCredentialsProvider
   [junit4]   2> 401812 INFO  (TEST-ChaosMonkeySafeLeaderTest.test-seed#[CCCAEA3C17C46C44]) [    ] o.a.s.c.c.ConnectionManager Waiting for client to connect to ZooKeeper
   [junit4]   2> 401813 INFO  (zkCallback-248-thread-1) [    ] o.a.s.c.c.ConnectionManager Watcher org.apache.solr.common.cloud.ConnectionManager@13a1cd3 name:ZooKeeperConnection Watcher:127.0.0.1:46107/solr got event WatchedEvent state:SyncConnected type:None path:null path:null type:None
   [junit4]   2> 401813 INFO  (TEST-ChaosMonkeySafeLeaderTest.test-seed#[CCCAEA3C17C46C44]) [    ] o.a.s.c.c.ConnectionManager Client is connected to ZooKeeper
   [junit4]   2> 401814 INFO  (TEST-ChaosMonkeySafeLeaderTest.test-seed#[CCCAEA3C17C46C44]) [    ] o.a.s.c.c.SolrZkClient Using default ZkACLProvider
   [junit4]   2> 401898 INFO  (TEST-ChaosMonkeySafeLeaderTest.test-seed#[CCCAEA3C17C46C44]) [    ] o.a.s.SolrTestCaseJ4 Writing core.properties file to /home/jenkins/workspace/Lucene-Solr-trunk-Linux/solr/build/solr-core/test/J1/temp/solr.cloud.ChaosMonkeySafeLeaderTest_CCCAEA3C17C46C44-001/control-001/cores/collection1
   [junit4]   2> 401899 INFO  (TEST-ChaosMonkeySafeLeaderTest.test-seed#[CCCAEA3C17C46C44]) [    ] o.e.j.s.Server jetty-9.2.11.v20150529
   [junit4]   2> 401900 INFO  (TEST-ChaosMonkeySafeLeaderTest.test-seed#[CCCAEA3C17C46C44]) [    ] o.e.j.s.h.ContextHandler Started o.e.j.s.ServletContextHandler@294921{/,null,AVAILABLE}
   [junit4]   2> 401914 INFO  (TEST-ChaosMonkeySafeLeaderTest.test-seed#[CCCAEA3C17C46C44]) [    ] o.e.j.s.ServerConnector Started ServerConnector@1235e7e{SSL-http/1.1}{127.0.0.1:60310}
   [junit4]   2> 401914 INFO  (TEST-ChaosMonkeySafeLeaderTest.test-seed#[CCCAEA3C17C46C44]) [    ] o.e.j.s.Server Started @403574ms
   [junit4]   2> 401914 INFO  (TEST-ChaosMonkeySafeLeaderTest.test-seed#[CCCAEA3C17C46C44]) [    ] o.a.s.c.s.e.JettySolrRunner Jetty properties: {solr.data.dir=/home/jenkins/workspace/Lucene-Solr-trunk-Linux/solr/build/solr-core/test/J1/temp/solr.cloud.ChaosMonkeySafeLeaderTest_CCCAEA3C17C46C44-001/tempDir-001/control/data, hostContext=/, hostPort=60310, coreRootDirectory=/home/jenkins/workspace/Lucene-Solr-trunk-Linux/solr/build/solr-core/test/J1/temp/solr.cloud.ChaosMonkeySafeLeaderTest_CCCAEA3C17C46C44-001/control-001/cores}
   [junit4]   2> 401916 INFO  (TEST-ChaosMonkeySafeLeaderTest.test-seed#[CCCAEA3C17C46C44]) [    ] o.a.s.s.SolrDispatchFilter SolrDispatchFilter.init(): sun.misc.Launcher$AppClassLoader@e2f2a
   [junit4]   2> 401916 INFO  (TEST-ChaosMonkeySafeLeaderTest.test-seed#[CCCAEA3C17C46C44]) [    ] o.a.s.c.SolrResourceLoader new SolrResourceLoader for directory: '/home/jenkins/workspace/Lucene-Solr-trunk-Linux/solr/build/solr-core/test/J1/temp/solr.cloud.ChaosMonkeySafeLeaderTest_CCCAEA3C17C46C44-001/control-001/'
   [junit4]   2> 401925 INFO  (TEST-ChaosMonkeySafeLeaderTest.test-seed#[CCCAEA3C17C46C44]) [    ] o.a.s.c.c.SolrZkClient Using default ZkCredentialsProvider
   [junit4]   2> 401926 INFO  (TEST-ChaosMonkeySafeLeaderTest.test-seed#[CCCAEA3C17C46C44]) [    ] o.a.s.c.c.ConnectionManager Waiting for client to connect to ZooKeeper
   [junit4]   2> 401927 INFO  (zkCallback-249-thread-1) [    ] o.a.s.c.c.ConnectionManager Watcher org.apache.solr.common.cloud.ConnectionManager@586493 name:ZooKeeperConnection Watcher:127.0.0.1:46107/solr got event WatchedEvent state:SyncConnected type:None path:null path:null type:None
   [junit4]   2> 401927 INFO  (TEST-ChaosMonkeySafeLeaderTest.test-seed#[CCCAEA3C17C46C44]) [    ] o.a.s.c.c.ConnectionManager Client is connected to ZooKeeper
   [junit4]   2> 401928 INFO  (TEST-ChaosMonkeySafeLeaderTest.test-seed#[CCCAEA3C17C46C44]) [    ] o.a.s.c.c.SolrZkClient Using default ZkACLProvider
   [junit4]   2> 401928 INFO  (TEST-ChaosMonkeySafeLeaderTest.test-seed#[CCCAEA3C17C46C44]) [    ] o.a.s.s.SolrDispatchFilter Loading solr.xml from SolrHome (not found in ZooKeeper)
   [junit4]   2> 401928 INFO  (TEST-ChaosMonkeySafeLeaderTest.test-seed#[CCCAEA3C17C46C44]) [    ] o.a.s.c.SolrXmlConfig Loading container configuration from /home/jenkins/workspace/Lucene-Solr-trunk-Linux/solr/build/solr-core/test/J1/temp/solr.cloud.ChaosMonkeySafeLeaderTest_CCCAEA3C17C46C44-001/control-001/solr.xml
   [junit4]   2> 401932 INFO  (TEST-ChaosMonkeySafeLeaderTest.test-seed#[CCCAEA3C17C46C44]) [    ] o.a.s.c.CoresLocator Config-defined core root directory: /home/jenkins/workspace/Lucene-Solr-trunk-Linux/solr/build/solr-core/test/J1/temp/solr.cloud.ChaosMonkeySafeLeaderTest_CCCAEA3C17C46C44-001/control-001/cores
   [junit4]   2> 401932 INFO  (TEST-ChaosMonkeySafeLeaderTest.test-seed#[CCCAEA3C17C46C44]) [    ] o.a.s.c.CoreContainer New CoreContainer 17405469
   [junit4]   2> 401932 INFO  (TEST-ChaosMonkeySafeLeaderTest.test-seed#[CCCAEA3C17C46C44]) [    ] o.a.s.c.CoreContainer Loading cores into CoreContainer [instanceDir=/home/jenkins/workspace/Lucene-Solr-trunk-Linux/solr/build/solr-core/test/J1/temp/solr.cloud.ChaosMonkeySafeLeaderTest_CCCAEA3C17C46C44-001/control-001/]
   [junit4]   2> 401932 INFO  (TEST-ChaosMonkeySafeLeaderTest.test-seed#[CCCAEA3C17C46C44]) [    ] o.a.s.c.CoreContainer loading shared library: /home/jenkins/workspace/Lucene-Solr-trunk-Linux/solr/build/solr-core/test/J1/temp/solr.cloud.ChaosMonkeySafeLeaderTest_CCCAEA3C17C46C44-001/control-001/lib
   [junit4]   2> 401932 WARN  (TEST-ChaosMonkeySafeLeaderTest.test-seed#[CCCAEA3C17C46C44]) [    ] o.a.s.c.SolrResourceLoader Can't find (or read) directory to add to classloader: lib (resolved as: /home/jenkins/workspace/Lucene-Solr-trunk-Linux/solr/build/solr-core/test/J1/temp/solr.cloud.ChaosMonkeySafeLeaderTest_CCCAEA3C17C46C44-001/control-001/lib).
   [junit4]   2> 401937 INFO  (TEST-ChaosMonkeySafeLeaderTest.test-seed#[CCCAEA3C17C46C44]) [    ] o.a.s.h.c.HttpShardHandlerFactory created with socketTimeout : 90000,urlScheme : ,connTimeout : 15000,maxConnectionsPerHost : 20,maxConnections : 10000,corePoolSize : 0,maximumPoolSize : 2147483647,maxThreadIdleTime : 5,sizeOfQueue : -1,fairnessPolicy : false,useRetries : false,
   [junit4]   2> 401939 INFO  (TEST-ChaosMonkeySafeLeaderTest.test-seed#[CCCAEA3C17C46C44]) [    ] o.a.s.u.UpdateShardHandler Creating UpdateShardHandler HTTP client with params: socketTimeout=340000&connTimeout=45000&retry=true
   [junit4]   2> 401940 INFO  (TEST-ChaosMonkeySafeLeaderTest.test-seed#[CCCAEA3C17C46C44]) [    ] o.a.s.l.LogWatcher SLF4J impl is org.slf4j.impl.Log4jLoggerFactory
   [junit4]   2> 401940 INFO  (TEST-ChaosMonkeySafeLeaderTest.test-seed#[CCCAEA3C17C46C44]) [    ] o.a.s.l.LogWatcher Registering Log Listener [Log4j (org.slf4j.impl.Log4jLoggerFactory)]
   [junit4]   2> 401940 INFO  (TEST-ChaosMonkeySafeLeaderTest.test-seed#[CCCAEA3C17C46C44]) [    ] o.a.s.c.ZkContainer Zookeeper client=127.0.0.1:46107/solr
   [junit4]   2> 401941 INFO  (TEST-ChaosMonkeySafeLeaderTest.test-seed#[CCCAEA3C17C46C44]) [    ] o.a.s.c.ZkController zkHost includes chroot
   [junit4]   2> 401941 INFO  (TEST-ChaosMonkeySafeLeaderTest.test-seed#[CCCAEA3C17C46C44]) [    ] o.a.s.c.c.SolrZkClient Using default ZkCredentialsProvider
   [junit4]   2> 401941 INFO  (TEST-ChaosMonkeySafeLeaderTest.test-seed#[CCCAEA3C17C46C44]) [    ] o.a.s.c.c.ConnectionManager Waiting for client to connect to ZooKeeper
   [junit4]   2> 401942 INFO  (zkCallback-251-thread-1) [    ] o.a.s.c.c.ConnectionManager Watcher org.apache.solr.common.cloud.ConnectionManager@9a4ae9 name:ZooKeeperConnection Watcher:127.0.0.1:46107 got event WatchedEvent state:SyncConnected type:None path:null path:null type:None
   [junit4]   2> 401942 INFO  (TEST-ChaosMonkeySafeLeaderTest.test-seed#[CCCAEA3C17C46C44]) [    ] o.a.s.c.c.ConnectionManager Client is connected to ZooKeeper
   [junit4]   2> 401943 INFO  (TEST-ChaosMonkeySafeLeaderTest.test-seed#[CCCAEA3C17C46C44]) [    ] o.a.s.c.c.SolrZkClient Using default ZkACLProvider
   [junit4]   2> 401944 INFO  (TEST-ChaosMonkeySafeLeaderTest.test-seed#[CCCAEA3C17C46C44]) [n:127.0.0.1:60310_    ] o.a.s.c.c.ConnectionManager Waiting for client to connect to ZooKeeper
   [junit4]   2> 401944 INFO  (zkCallback-252-thread-1-processing-n:127.0.0.1:60310_) [n:127.0.0.1:60310_    ] o.a.s.c.c.ConnectionManager Watcher org.apache.solr.common.cloud.ConnectionManager@ecb616 name:ZooKeeperConnection Watcher:127.0.0.1:46107/solr got event WatchedEvent state:SyncConnected type:None path:null path:null type:None
   [junit4]   2> 401944 INFO  (TEST-ChaosMonkeySafeLeaderTest.test-seed#[CCCAEA3C17C46C44]) [n:127.0.0.1:60310_    ] o.a.s.c.c.ConnectionManager Client is connected to ZooKeeper
   [junit4]   2> 401945 INFO  (TEST-ChaosMonkeySafeLeaderTest.test-seed#[CCCAEA3C17C46C44]) [n:127.0.0.1:60310_    ] o.a.s.c.c.SolrZkClient makePath: /overseer/queue
   [junit4]   2> 401946 INFO  (TEST-ChaosMonkeySafeLeaderTest.test-seed#[CCCAEA3C17C46C44]) [n:127.0.0.1:60310_    ] o.a.s.c.c.SolrZkClient makePath: /overseer/collection-queue-work
   [junit4]   2> 401947 INFO  (TEST-ChaosMonkeySafeLeaderTest.test-seed#[CCCAEA3C17C46C44]) [n:127.0.0.1:60310_    ] o.a.s.c.c.SolrZkClient makePath: /overseer/collection-map-running
   [junit4]   2> 401948 INFO  (TEST-ChaosMonkeySafeLeaderTest.test-seed#[CCCAEA3C17C46C44]) [n:127.0.0.1:60310_    ] o.a.s.c.c.SolrZkClient makePath: /overseer/collection-map-completed
   [junit4]   2> 401948 INFO  (TEST-ChaosMonkeySafeLeaderTest.test-seed#[CCCAEA3C17C46C44]) [n:127.0.0.1:60310_    ] o.a.s.c.c.SolrZkClient makePath: /overseer/collection-map-failure
   [junit4]   2> 401949 INFO  (TEST-ChaosMonkeySafeLeaderTest.test-seed#[CCCAEA3C17C46C44]) [n:127.0.0.1:60310_    ] o.a.s.c.c.SolrZkClient makePath: /live_nodes
   [junit4]   2> 401950 INFO  (TEST-ChaosMonkeySafeLeaderTest.test-seed#[CCCAEA3C17C46C44]) [n:127.0.0.1:60310_    ] o.a.s.c.c.SolrZkClient makePath: /aliases.json
   [junit4]   2> 401950 INFO  (TEST-ChaosMonkeySafeLeaderTest.test-seed#[CCCAEA3C17C46C44]) [n:127.0.0.1:60310_    ] o.a.s.c.c.SolrZkClient makePath: /clusterstate.json
   [junit4]   2> 401951 INFO  (TEST-ChaosMonkeySafeLeaderTest.test-seed#[CCCAEA3C17C46C44]) [n:127.0.0.1:60310_    ] o.a.s.c.ZkController Register node as live in ZooKeeper:/live_nodes/127.0.0.1:60310_
   [junit4]   2> 401951 INFO  (TEST-ChaosMonkeySafeLeaderTest.test-seed#[CCCAEA3C17C46C44]) [n:127.0.0.1:60310_    ] o.a.s.c.c.SolrZkClient makePath: /live_nodes/127.0.0.1:60310_
   [junit4]   2> 401953 INFO  (TEST-ChaosMonkeySafeLeaderTest.test-seed#[CCCAEA3C17C46C44]) [n:127.0.0.1:60310_    ] o.a.s.c.c.SolrZkClient makePath: /overseer_elect
   [junit4]   2> 401953 INFO  (TEST-ChaosMonkeySafeLeaderTest.test-seed#[CCCAEA3C17C46C44]) [n:127.0.0.1:60310_    ] o.a.s.c.c.SolrZkClient makePath: /overseer_elect/election
   [junit4]   2> 401954 INFO  (TEST-ChaosMonkeySafeLeaderTest.test-seed#[CCCAEA3C17C46C44]) [n:127.0.0.1:60310_    ] o.a.s.c.Overseer Overseer (id=null) closing
   [junit4]   2> 401954 INFO  (TEST-ChaosMonkeySafeLeaderTest.test-seed#[CCCAEA3C17C46C44]) [n:127.0.0.1:60310_    ] o.a.s.c.LeaderElector Joined leadership election with path: /overseer_elect/election/94276463044329477-127.0.0.1:60310_-n_0000000000
   [junit4]   2> 401954 INFO  (TEST-ChaosMonkeySafeLeaderTest.test-seed#[CCCAEA3C17C46C44]) [n:127.0.0.1:60310_    ] o.a.s.c.OverseerElectionContext I am going to be the leader 127.0.0.1:60310_
   [junit4]   2> 401954 INFO  (TEST-ChaosMonkeySafeLeaderTest.test-seed#[CCCAEA3C17C46C44]) [n:127.0.0.1:60310_    ] o.a.s.c.c.SolrZkClient makePath: /overseer_elect/leader
   [junit4]   2> 401955 INFO  (TEST-ChaosMonkeySafeLeaderTest.test-seed#[CCCAEA3C17C46C44]) [n:127.0.0.1:60310_    ] o.a.s.c.Overseer Overseer (id=94276463044329477-127.0.0.1:60310_-n_0000000000) starting
   [junit4]   2> 401956 INFO  (TEST-ChaosMonkeySafeLeaderTest.test-seed#[CCCAEA3C17C46C44]) [n:127.0.0.1:60310_    ] o.a.s.c.c.SolrZkClient makePath: /overseer/queue-work
   [junit4]   2> 401958 INFO  (TEST-ChaosMonkeySafeLeaderTest.test-seed#[CCCAEA3C17C46C44]) [n:127.0.0.1:60310_    ] o.a.s.c.OverseerAutoReplicaFailoverThread Starting OverseerAutoReplicaFailoverThread autoReplicaFailoverWorkLoopDelay=10000 autoReplicaFailoverWaitAfterExpiration=30000 autoReplicaFailoverBadNodeExpiration=60000
   [junit4]   2> 401958 INFO  (OverseerCollectionProcessor-94276463044329477-127.0.0.1:60310_-n_0000000000) [n:127.0.0.1:60310_    ] o.a.s.c.OverseerCollectionProcessor Process current queue of collection creations
   [junit4]   2> 401958 INFO  (TEST-ChaosMonkeySafeLeaderTest.test-seed#[CCCAEA3C17C46C44]) [n:127.0.0.1:60310_    ] o.a.s.c.c.ZkStateReader Updating cluster state from ZooKeeper... 
   [junit4]   2> 401958 INFO  (OverseerStateUpdate-94276463044329477-127.0.0.1:60310_-n_0000000000) [n:127.0.0.1:60310_    ] o.a.s.c.Overseer Starting to work on the main queue
   [junit4]   2> 401960 INFO  (TEST-ChaosMonkeySafeLeaderTest.test-seed#[CCCAEA3C17C46C44]) [n:127.0.0.1:60310_    ] o.a.s.c.CoreContainer No authentication plugin used.
   [junit4]   2> 401960 INFO  (TEST-ChaosMonkeySafeLeaderTest.test-seed#[CCCAEA3C17C46C44]) [n:127.0.0.1:60310_    ] o.a.s.c.CoreContainer Security conf doesn't exist. Skipping setup for authorization module.
   [junit4]   2> 401961 INFO  (TEST-ChaosMonkeySafeLeaderTest.test-seed#[CCCAEA3C17C46C44]) [n:127.0.0.1:60310_    ] o.a.s.c.CoresLocator Looking for core definitions underneath /home/jenkins/workspace/Lucene-Solr-trunk-Linux/solr/build/solr-core/test/J1/temp/solr.cloud.ChaosMonkeySafeLeaderTest_CCCAEA3C17C46C44-001/control-001/cores
   [junit4]   2> 401961 INFO  (TEST-ChaosMonkeySafeLeaderTest.test-seed#[CCCAEA3C17C46C44]) [n:127.0.0.1:60310_    ] o.a.s.c.SolrCore Created CoreDescriptor: {name=collection1, config=solrconfig.xml, transient=false, schema=schema.xml, loadOnStartup=true, configSetProperties=configsetprops.json, instanceDir=/home/jenkins/workspace/Lucene-Solr-trunk-Linux/solr/build/solr-core/test/J1/temp/solr.cloud.ChaosMonkeySafeLeaderTest_CCCAEA3C17C46C44-001/control-001/cores/collection1, collection=control_collection, absoluteInstDir=/home/jenkins/workspace/Lucene-Solr-trunk-Linux/solr/build/solr-core/test/J1/temp/solr.cloud.ChaosMonkeySafeLeaderTest_CCCAEA3C17C46C44-001/control-001/cores/collection1/, coreNodeName=, dataDir=data/, shard=}
   [junit4]   2> 401961 INFO  (TEST-ChaosMonkeySafeLeaderTest.test-seed#[CCCAEA3C17C46C44]) [n:127.0.0.1:60310_    ] o.a.s.c.CoresLocator Found core collection1 in /home/jenkins/workspace/Lucene-Solr-trunk-Linux/solr/build/solr-core/test/J1/temp/solr.cloud.ChaosMonkeySafeLeaderTest_CCCAEA3C17C46C44-001/control-001/cores/collection1/
   [junit4]   2> 401961 INFO  (TEST-ChaosMonkeySafeLeaderTest.test-seed#[CCCAEA3C17C46C44]) [n:127.0.0.1:60310_    ] o.a.s.c.CoresLocator Found 1 core definitions
   [junit4]   2> 401962 INFO  (coreLoadExecutor-830-thread-1-processing-n:127.0.0.1:60310_) [n:127.0.0.1:60310_ c:control_collection   x:collection1] o.a.s.c.ZkController publishing state=down
   [junit4]   2> 401962 INFO  (TEST-ChaosMonkeySafeLeaderTest.test-seed#[CCCAEA3C17C46C44]) [n:127.0.0.1:60310_    ] o.a.s.s.SolrDispatchFilter user.dir=/home/jenkins/workspace/Lucene-Solr-trunk-Linux/solr/build/solr-core/test/J1
   [junit4]   2> 401962 INFO  (TEST-ChaosMonkeySafeLeaderTest.test-seed#[CCCAEA3C17C46C44]) [n:127.0.0.1:60310_    ] o.a.s.s.SolrDispatchFilter SolrDispatchFilter.init() done
   [junit4]   2> 401962 INFO  (coreLoadExecutor-830-thread-1-processing-n:127.0.0.1:60310_) [n:127.0.0.1:60310_ c:control_collection   x:collection1] o.a.s.c.ZkController numShards not found on descriptor - reading it from system property
   [junit4]   2> 401963 INFO  (zkCallback-252-thread-1-processing-n:127.0.0.1:60310_) [n:127.0.0.1:60310_    ] o.a.s.c.DistributedQueue NodeChildrenChanged fired on path /overseer/queue state SyncConnected
   [junit4]   2> 401963 INFO  (coreLoadExecutor-830-thread-1-processing-n:127.0.0.1:60310_) [n:127.0.0.1:60310_ c:control_collection   x:collection1] o.a.s.c.ZkController look for our core node name
   [junit4]   2> 401963 INFO  (OverseerStateUpdate-94276463044329477-127.0.0.1:60310_-n_0000000000) [n:127.0.0.1:60310_    ] o.a.s.c.Overseer processMessage: queueSize: 1, message = {
   [junit4]   2>   "core":"collection1",
   [junit4]   2>   "roles":null,
   [junit4]   2>   "base_url":"https://127.0.0.1:60310",
   [junit4]   2>   "node_name":"127.0.0.1:60310_",
   [junit4]   2>   "numShards":"1",
   [junit4]   2>   "state":"down",
   [junit4]   2>   "shard":null,
   [junit4]   2>   "collection":"control_collection",
   [junit4]   2>   "operation":"state"} current state version: 0
   [junit4]   2> 401964 INFO  (OverseerStateUpdate-94276463044329477-127.0.0.1:60310_-n_0000000000) [n:127.0.0.1:60310_    ] o.a.s.c.o.ReplicaMutator Update state numShards=1 message={
   [junit4]   2>   "core":"collection1",
   [junit4]   2>   "roles":null,
   [junit4]   2>   "base_url":"https://127.0.0.1:60310",
   [junit4]   2>   "node_name":"127.0.0.1:60310_",
   [junit4]   2>   "numShards":"1",
   [junit4]   2>   "state":"down",
   [junit4]   2>   "shard":null,
   [junit4]   2>   "collection":"control_collection",
   [junit4]   2>   "operation":"state"}
   [junit4]   2> 401964 INFO  (OverseerStateUpdate-94276463044329477-127.0.0.1:60310_-n_0000000000) [n:127.0.0.1:60310_    ] o.a.s.c.o.ClusterStateMutator building a new cName: control_collection
   [junit4]   2> 401964 INFO  (OverseerStateUpdate-94276463044329477-127.0.0.1:60310_-n_0000000000) [n:127.0.0.1:60310_    ] o.a.s.c.o.ReplicaMutator Assigning new node to shard shard=shard1
   [junit4]   2> 401964 INFO  (zkCallback-252-thread-1-processing-n:127.0.0.1:60310_) [n:127.0.0.1:60310_    ] o.a.s.c.c.ZkStateReader A cluster state change: WatchedEvent state:SyncConnected type:NodeDataChanged path:/clusterstate.json, has occurred - updating... (live nodes size: 1)
   [junit4]   2> 401965 INFO  (zkCallback-252-thread-1-processing-n:127.0.0.1:60310_) [n:127.0.0.1:60310_    ] o.a.s.c.c.ZkStateReader Updated cluster state version to 1
   [junit4]   2> 402963 INFO  (coreLoadExecutor-830-thread-1-processing-n:127.0.0.1:60310_) [n:127.0.0.1:60310_ c:control_collection   x:collection1] o.a.s.c.ZkController waiting to find shard id in clusterstate for collection1
   [junit4]   2> 402963 INFO  (coreLoadExecutor-830-thread-1-processing-n:127.0.0.1:60310_) [n:127.0.0.1:60310_ c:control_collection   x:collection1] o.a.s.c.ZkController Check for collection zkNode:control_collection
   [junit4]   2> 402964 INFO  (coreLoadExecutor-830-thread-1-processing-n:127.0.0.1:60310_) [n:127.0.0.1:60310_ c:control_collection   x:collection1] o.a.s.c.ZkController Collection zkNode exists
   [junit4]   2> 402964 INFO  (coreLoadExecutor-830-thread-1-processing-n:127.0.0.1:60310_) [n:127.0.0.1:60310_ c:control_collection   x:collection1] o.a.s.c.c.ZkStateReader Load collection config from:/collections/control_collection
   [junit4]   2> 402964 INFO  (coreLoadExecutor-830-thread-1-processing-n:127.0.0.1:60310_) [n:127.0.0.1:60310_ c:control_collection   x:collection1] o.a.s.c.c.ZkStateReader path=/collections/control_collection configName=conf1 specified config exists in ZooKeeper
   [junit4]   2> 402964 INFO  (coreLoadExecutor-830-thread-1-processing-n:127.0.0.1:60310_) [n:127.0.0.1:60310_ c:control_collection   x:collection1] o.a.s.c.SolrResourceLoader new SolrResourceLoader for directory: '/home/jenkins/workspace/Lucene-Solr-trunk-Linux/solr/build/solr-core/test/J1/temp/solr.cloud.ChaosMonkeySafeLeaderTest_CCCAEA3C17C46C44-001/control-001/cores/collection1/'
   [junit4]   2> 402975 INFO  (coreLoadExecutor-830-thread-1-processing-n:127.0.0.1:60310_) [n:127.0.0.1:60310_ c:control_collection   x:collection1] o.a.s.c.Config loaded config solrconfig.xml with version 0 
   [junit4]   2> 402978 INFO  (coreLoadExecutor-830-thread-1-processing-n:127.0.0.1:60310_) [n:127.0.0.1:60310_ c:control_collection   x:collection1] o.a.s.c.SolrConfig current version of requestparams : -1
   [junit4]   2> 402981 INFO  (coreLoadExecutor-830-thread-1-processing-n:127.0.0.1:60310_) [n:127.0.0.1:60310_ c:control_collection   x:collection1] o.a.s.c.SolrConfig Using Lucene MatchVersion: 6.0.0
   [junit4]   2> 402991 INFO  (coreLoadExecutor-830-thread-1-processing-n:127.0.0.1:60310_) [n:127.0.0.1:60310_ c:control_collection   x:collection1] o.a.s.c.Config Loaded SolrConfig: solrconfig.xml
   [junit4]   2> 402991 INFO  (coreLoadExecutor-830-thread-1-processing-n:127.0.0.1:60310_) [n:127.0.0.1:60310_ c:control_collection   x:collection1] o.a.s.s.IndexSchema Reading Solr Schema from /configs/conf1/schema.xml
   [junit4]   2> 402994 INFO  (coreLoadExecutor-830-thread-1-processing-n:127.0.0.1:60310_) [n:127.0.0.1:60310_ c:control_collection   x:collection1] o.a.s.s.IndexSchema [collection1] Schema name=test
   [junit4]   2> 403059 INFO  (coreLoadExecutor-830-thread-1-processing-n:127.0.0.1:60310_) [n:127.0.0.1:60310_ c:control_collection   x:collection1] o.a.s.s.IndexSchema default search field in schema is text
   [junit4]   2> 403060 INFO  (coreLoadExecutor-830-thread-1-processing-n:127.0.0.1:60310_) [n:127.0.0.1:60310_ c:control_collection   x:collection1] o.a.s.s.IndexSchema unique key field: id
   [junit4]   2> 403061 INFO  (coreLoadExecutor-830-thread-1-processing-n:127.0.0.1:60310_) [n:127.0.0.1:60310_ c:control_collection   x:collection1] o.a.s.s.FileExchangeRateProvider Reloading exchange rates from file currency.xml
   [junit4]   2> 403063 INFO  (coreLoadExecutor-830-thread-1-processing-n:127.0.0.1:60310_) [n:127.0.0.1:60310_ c:control_collection   x:collection1] o.a.s.s.FileExchangeRateProvider Reloading exchange rates from file currency.xml
   [junit4]   2> 403071 INFO  (coreLoadExecutor-830-thread-1-processing-n:127.0.0.1:60310_) [n:127.0.0.1:60310_ c:control_collection   x:collection1] o.a.s.c.ConfigSetProperties Did not find ConfigSet properties, assuming default properties: Can't find resource 'configsetprops.json' in classpath or '/configs/conf1', cwd=/home/jenkins/workspace/Lucene-Solr-trunk-Linux/solr/build/solr-core/test/J1
   [junit4]   2> 403071 INFO  (coreLoadExecutor-830-thread-1-processing-n:127.0.0.1:60310_) [n:127.0.0.1:60310_ c:control_collection   x:collection1] o.a.s.c.CoreContainer Creating SolrCore 'collection1' using configuration from collection control_collection
   [junit4]   2> 403072 INFO  (coreLoadExecutor-830-thread-1-processing-n:127.0.0.1:60310_) [n:127.0.0.1:60310_ c:control_collection s:shard1 r:core_node1 x:collection1] o.a.s.c.SolrCore solr.StandardDirectoryFactory
   [junit4]   2> 403072 INFO  (coreLoadExecutor-830-thread-1-processing-n:127.0.0.1:60310_) [n:127.0.0.1:60310_ c:control_collection s:shard1 r:core_node1 x:collection1] o.a.s.c.SolrCore [[collection1] ] Opening new SolrCore at [/home/jenkins/workspace/Lucene-Solr-trunk-Linux/solr/build/solr-core/test/J1/temp/solr.cloud.ChaosMonkeySafeLeaderTest_CCCAEA3C17C46C44-001/control-001/cores/collection1/], dataDir=[null]
   [junit4]   2> 403072 INFO  (coreLoadExecutor-830-thread-1-processing-n:127.0.0.1:60310_) [n:127.0.0.1:60310_ c:control_collection s:shard1 r:core_node1 x:collection1] o.a.s.c.JmxMonitoredMap JMX monitoring is enabled. Adding Solr mbeans to JMX Server: com.sun.jmx.mbeanserver.JmxMBeanServer@134b69b
   [junit4]   2> 403072 INFO  (coreLoadExecutor-830-thread-1-processing-n:127.0.0.1:60310_) [n:127.0.0.1:60310_ c:control_collection s:shard1 r:core_node1 x:collection1] o.a.s.c.CachingDirectoryFactory return new directory for /home/jenkins/workspace/Lucene-Solr-trunk-Linux/solr/build/solr-core/test/J1/temp/solr.cloud.ChaosMonkeySafeLeaderTest_CCCAEA3C17C46C44-001/control-001/cores/collection1/data
   [junit4]   2> 403072 INFO  (coreLoadExecutor-830-thread-1-processing-n:127.0.0.1:60310_) [n:127.0.0.1:60310_ c:control_collection s:shard1 r:core_node1 x:collection1] o.a.s.c.SolrCore New index directory detected: old=null new=/home/jenkins/workspace/Lucene-Solr-trunk-Linux/solr/build/solr-core/test/J1/temp/solr.cloud.ChaosMonkeySafeLeaderTest_CCCAEA3C17C46C44-001/control-001/cores/collection1/data/index/
   [junit4]   2> 403073 WARN  (coreLoadExecutor-830-thread-1-processing-n:127.0.0.1:60310_) [n:127.0.0.1:60310_ c:control_collection s:shard1 r:core_node1 x:collection1] o.a.s.c.SolrCore [collection1] Solr index directory '/home/jenkins/workspace/Lucene-Solr-trunk-Linux/solr/build/solr-core/test/J1/temp/solr.cloud.ChaosMonkeySafeLeaderTest_CCCAEA3C17C46C44-001/control-001/cores/collection1/data/index' doesn't exist. Creating new index...
   [junit4]   2> 403073 INFO  (coreLoadExecutor-830-thread-1-processing-n:127.0.0.1:60310_) [n:127.0.0.1:60310_ c:control_collection s:shard1 r:core_node1 x:collection1] o.a.s.c.CachingDirectoryFactory return new directory for /home/jenkins/workspace/Lucene-Solr-trunk-Linux/solr/build/solr-core/test/J1/temp/solr.cloud.ChaosMonkeySafeLeaderTest_CCCAEA3C17C46C44-001/control-001/cores/collection1/data/index
   [junit4]   2> 403073 INFO  (coreLoadExecutor-830-thread-1-processing-n:127.0.0.1:60310_) [n:127.0.0.1:60310_ c:control_collection s:shard1 r:core_node1 x:collection1] o.a.s.u.RandomMergePolicy RandomMergePolicy wrapping class org.apache.lucene.index.LogDocMergePolicy: [LogDocMergePolicy: minMergeSize=1000, mergeFactor=33, maxMergeSize=9223372036854775807, maxMergeSizeForForcedMerge=9223372036854775807, calibrateSizeByDeletes=true, maxMergeDocs=2147483647, maxCFSSegmentSizeMB=8.796093022207999E12, noCFSRatio=0.48045013167560136]
   [junit4]   2> 403090 INFO  (coreLoadExecutor-830-thread-1-processing-n:127.0.0.1:60310_) [n:127.0.0.1:60310_ c:control_collection s:shard1 r:core_node1 x:collection1] o.a.s.c.SolrCore SolrDeletionPolicy.onCommit: commits: num=1
   [junit4]   2> 	commit{dir=/home/jenkins/workspace/Lucene-Solr-trunk-Linux/solr/build/solr-core/test/J1/temp/solr.cloud.ChaosMonkeySafeLeaderTest_CCCAEA3C17C46C44-001/control-001/cores/collection1/data/index,segFN=segments_1,generation=1}
   [junit4]   2> 403091 INFO  (coreLoadExecutor-830-thread-1-processing-n:127.0.0.1:60310_) [n:127.0.0.1:60310_ c:control_collection s:shard1 r:core_node1 x:collection1] o.a.s.c.SolrCore newest commit generation = 1
   [junit4]   2> 403091 INFO  (OldIndexDirectoryCleanupThreadForCore-collection1) [n:127.0.0.1:60310_ c:control_collection s:shard1 r:core_node1 x:collection1] o.a.s.c.SolrCore Looking for old index directories to cleanup for core collection1 in /home/jenkins/workspace/Lucene-Solr-trunk-Linux/solr/build/solr-core/test/J1/temp/solr.cloud.ChaosMonkeySafeLeaderTest_CCCAEA3C17C46C44-001/control-001/cores/collection1/data/
   [junit4]   2> 403093 INFO  (coreLoadExecutor-830-thread-1-processing-n:127.0.0.1:60310_) [n:127.0.0.1:60310_ c:control_collection s:shard1 r:core_node1 x:collection1] o.a.s.u.p.UpdateRequestProcessorChain creating updateRequestProcessorChain "nodistrib"
   [junit4]   2> 403093 INFO  (coreLoadExecutor-830-thread-1-processing-n:127.0.0.1:60310_) [n:127.0.0.1:60310_ c:control_collection s:shard1 r:core_node1 x:collection1] o.a.s.u.p.UpdateRequestProcessorChain creating updateRequestProcessorChain "dedupe"
   [junit4]   2> 403093 INFO  (coreLoadExecutor-830-thread-1-processing-n:127.0.0.1:60310_) [n:127.0.0.1:60310_ c:control_collection s:shard1 r:core_node1 x:collection1] o.a.s.u.p.UpdateRequestProcessorChain inserting DistributedUpdateProcessorFactory into updateRequestProcessorChain "dedupe"
   [junit4]   2> 403093 INFO  (coreLoadExecutor-830-thread-1-processing-n:127.0.0.1:60310_) [n:127.0.0.1:60310_ c:control_collection s:shard1 r:core_node1 x:collection1] o.a.s.u.p.UpdateRequestProcessorChain creating updateRequestProcessorChain "stored_sig"
   [junit4]   2> 403093 INFO  (coreLoadExecutor-830-thread-1-processing-n:127.0.0.1:60310_) [n:127.0.0.1:60310_ c:control_collection s:shard1 r:core_node1 x:collection1] o.a.s.u.p.UpdateRequestProcessorChain inserting DistributedUpdateProcessorFactory into updateRequestProcessorChain "stored_sig"
   [junit4]   2> 403094 INFO  (coreLoadExecutor-830-thread-1-processing-n:127.0.0.1:60310_) [n:127.0.0.1:60310_ c:control_collection s:shard1 r:core_node1 x:collection1] o.a.s.u.p.UpdateRequestProcessorChain creating updateRequestProcessorChain "distrib-dup-test-chain-explicit"
   [junit4]   2> 403094 INFO  (coreLoadExecutor-830-thread-1-processing-n:127.0.0.1:60310_) [n:127.0.0.1:60310_ c:control_collection s:shard1 r:core_node1 x:collection1] o.a.s.u.p.UpdateRequestProcessorChain creating updateRequestProcessorChain "distrib-dup-test-chain-implicit"
   [junit4]   2> 403094 INFO  (coreLoadExecutor-830-thread-1-processing-n:127.0.0.1:60310_) [n:127.0.0.1:60310_ c:control_collection s:shard1 r:core_node1 x:collection1] o.a.s.u.p.UpdateRequestProcessorChain inserting DistributedUpdateProcessorFactory into updateRequestProcessorChain "distrib-dup-test-chain-implicit"
   [junit4]   2> 403094 INFO  (coreLoadExecutor-830-thread-1-processing-n:127.0.0.1:60310_) [n:127.0.0.1:60310_ c:control_collection s:shard1 r:core_node1 x:collection1] o.a.s.c.SolrCore no updateRequestProcessorChain defined as default, creating implicit default
   [junit4]   2> 403095 INFO  (coreLoadExecutor-830-thread-1-processing-n:127.0.0.1:60310_) [n:127.0.0.1:60310_ c:control_collection s:shard1 r:core_node1 x:collection1] o.a.s.h.l.XMLLoader xsltCacheLifetimeSeconds=60
   [junit4]   2> 403096 INFO  (coreLoadExecutor-830-thread-1-processing-n:127.0.0.1:60310_) [n:127.0.0.1:60310_ c:control_collection s:shard1 r:core_node1 x:collection1] o.a.s.h.l.XMLLoader xsltCacheLifetimeSeconds=60
   [junit4]   2> 403096 INFO  (coreLoadExecutor-830-thread-1-processing-n:127.0.0.1:60310_) [n:127.0.0.1:60310_ c:control_collection s:shard1 r:core_node1 x:collection1] o.a.s.h.l.XMLLoader xsltCacheLifetimeSeconds=60
   [junit4]   2> 403097 INFO  (coreLoadExecutor-830-thread-1-processing-n:127.0.0.1:60310_) [n:127.0.0.1:60310_ c:control_collection s:shard1 r:core_node1 x:collection1] o.a.s.h.l.XMLLoader xsltCacheLifetimeSeconds=60
   [junit4]   2> 403098 INFO  (coreLoadExecutor-830-thread-1-processing-n:127.0.0.1:60310_) [n:127.0.0.1:60310_ c:control_collection s:shard1 r:core_node1 x:collection1] o.a.s.c.RequestHandlers Registered paths: /admin/mbeans,standard,/update/csv,/update/json/docs,/admin/luke,/admin/segments,/get,/admin/system,/replication,/admin/properties,/config,/schema,/admin/plugins,/admin/logging,/update/json,/admin/threads,/admin/ping,/update,/admin/file
   [junit4]   2> 403099 INFO  (coreLoadExecutor-830-thread-1-processing-n:127.0.0.1:60310_) [n:127.0.0.1:60310_ c:control_collection s:shard1 r:core_node1 x:collection1] o.a.s.c.SolrCore Using default statsCache cache: org.apache.solr.search.stats.LocalStatsCache
   [junit4]   2> 403099 INFO  (coreLoadExecutor-830-thread-1-processing-n:127.0.0.1:60310_) [n:127.0.0.1:60310_ c:control_collection s:shard1 r:core_node1 x:collection1] o.a.s.u.UpdateHandler Using UpdateLog implementation: org.apache.solr.update.UpdateLog
   [junit4]   2> 403099 INFO  (coreLoadExecutor-830-thread-1-processing-n:127.0.0.1:60310_) [n:127.0.0.1:60310_ c:control_collection s:shard1 r:core_node1 x:collection1] o.a.s.u.UpdateLog Initializing UpdateLog: dataDir= defaultSyncLevel=FLUSH numRecordsToKeep=100 maxNumLogsToKeep=10 numVersionBuckets=65536
   [junit4]   2> 403100 INFO  (coreLoadExecutor-830-thread-1-processing-n:127.0.0.1:60310_) [n:127.0.0.1:60310_ c:control_collection s:shard1 r:core_node1 x:collection1] o.a.s.c.SolrCore Hard AutoCommit: disabled
   [junit4]   2> 403100 INFO  (coreLoadExecutor-830-thread-1-processing-n:127.0.0.1:60310_) [n:127.0.0.1:60310_ c:control_collection s:shard1 r:core_node1 x:collection1] o.a.s.c.SolrCore Soft AutoCommit: disabled
   [junit4]   2> 403100 INFO  (coreLoadExecutor-830-thread-1-processing-n:127.0.0.1:60310_) [n:127.0.0.1:60310_ c:control_collection s:shard1 r:core_node1 x:collection1] o.a.s.u.RandomMergePolicy RandomMergePolicy wrapping class org.apache.lucene.index.TieredMergePolicy: [TieredMergePolicy: maxMergeAtOnce=44, maxMergeAtOnceExplicit=13, maxMergedSegmentMB=87.7900390625, floorSegmentMB=1.126953125, forceMergeDeletesPctAllowed=17.549135483664074, segmentsPerTier=47.0, maxCFSSegmentSizeMB=8.796093022207999E12, noCFSRatio=0.35233350130323393
   [junit4]   2> 403101 INFO  (coreLoadExecutor-830-thread-1-processing-n:127.0.0.1:60310_) [n:127.0.0.1:60310_ c:control_collection s:shard1 r:core_node1 x:collection1] o.a.s.c.SolrCore SolrDeletionPolicy.onInit: commits: num=1
   [junit4]   2> 	commit{dir=/home/jenkins/workspace/Lucene-Solr-trunk-Linux/solr/build/solr-core/test/J1/temp/solr.cloud.ChaosMonkeySafeLeaderTest_CCCAEA3C17C46C44-001/control-001/cores/collection1/data/index,segFN=segments_1,generation=1}
   [junit4]   2> 403101 INFO  (coreLoadExecutor-830-thread-1-processing-n:127.0.0.1:60310_) [n:127.0.0.1:60310_ c:control_collection s:shard1 r:core_node1 x:collection1] o.a.s.c.SolrCore newest commit generation = 1
   [junit4]   2> 403101 INFO  (coreLoadExecutor-830-thread-1-processing-n:127.0.0.1:60310_) [n:127.0.0.1:60310_ c:control_collection s:shard1 r:core_node1 x:collection1] o.a.s.s.SolrIndexSearcher Opening Searcher@1e6633a[collection1] main
   [junit4]   2> 403101 INFO  (coreLoadExecutor-830-thread-1-processing-n:127.0.0.1:60310_) [n:127.0.0.1:60310_ c:control_collection s:shard1 r:core_node1 x:collection1] o.a.s.c.c.ZkStateReader Load collection config from:/collections/control_collection
   [junit4]   2> 403101 INFO  (coreLoadExecutor-830-thread-1-processing-n:127.0.0.1:60310_) [n:127.0.0.1:60310_ c:control_collection s:shard1 r:core_node1 x:collection1] o.a.s.c.c.ZkStateReader path=/collections/control_collection configName=conf1 specified config exists in ZooKeeper
   [junit4]   2> 403101 INFO  (coreLoadExecutor-830-thread-1-processing-n:127.0.0.1:60310_) [n:127.0.0.1:60310_ c:control_collection s:shard1 r:core_node1 x:collection1] o.a.s.r.ManagedResourceStorage Setting up ZooKeeper-based storage for the RestManager with znodeBase: /configs/conf1
   [junit4]   2> 403101 INFO  (coreLoadExecutor-830-thread-1-processing-n:127.0.0.1:60310_) [n:127.0.0.1:60310_ c:control_collection s:shard1 r:core_node1 x:collection1] o.a.s.r.ManagedResourceStorage Configured ZooKeeperStorageIO with znodeBase: /configs/conf1
   [junit4]   2> 403102 INFO  (coreLoadExecutor-830-thread-1-processing-n:127.0.0.1:60310_) [n:127.0.0.1:60310_ c:control_collection s:shard1 r:core_node1 x:collection1] o.a.s.r.RestManager Initializing RestManager with initArgs: {}
   [junit4]   2> 403102 INFO  (coreLoadExecutor-830-thread-1-processing-n:127.0.0.1:60310_) [n:127.0.0.1:60310_ c:control_collection s:shard1 r:core_node1 x:collection1] o.a.s.r.ManagedResourceStorage Reading _rest_managed.json using ZooKeeperStorageIO:path=/configs/conf1
   [junit4]   2> 403102 INFO  (coreLoadExecutor-830-thread-1-processing-n:127.0.0.1:60310_) [n:127.0.0.1:60310_ c:control_collection s:shard1 r:core_node1 x:collection1] o.a.s.r.ManagedResourceStorage No data found for znode /configs/conf1/_rest_managed.json
   [junit4]   2> 403102 INFO  (coreLoadExecutor-830-thread-1-processing-n:127.0.0.1:60310_) [n:127.0.0.1:60310_ c:control_collection s:shard1 r:core_node1 x:collection1] o.a.s.r.ManagedResourceStorage Loaded null at path _rest_managed.json using ZooKeeperStorageIO:path=/configs/conf1
   [junit4]   2> 403102 INFO  (coreLoadExecutor-830-thread-1-processing-n:127.0.0.1:60310_) [n:127.0.0.1:60310_ c:control_collection s:shard1 r:core_node1 x:collection1] o.a.s.r.RestManager Initializing 0 registered ManagedResources
   [junit4]   2> 403102 INFO  (coreLoadExecutor-830-thread-1-processing-n:127.0.0.1:60310_) [n:127.0.0.1:60310_ c:control_collection s:shard1 r:core_node1 x:collection1] o.a.s.h.ReplicationHandler Commits will be reserved for  10000
   [junit4]   2> 403103 INFO  (searcherExecutor-831-thread-1-processing-n:127.0.0.1:60310_ x:collection1 s:shard1 c:control_collection r:core_node1) [n:127.0.0.1:60310_ c:control_collection s:shard1 r:core_node1 x:collection1] o.a.s.c.SolrCore [collection1] Registered new searcher Searcher@1e6633a[collection1] main{ExitableDirectoryReader(UninvertingDirectoryReader())}
   [junit4]   2> 403103 INFO  (coreLoadExecutor-830-thread-1-processing-n:127.0.0.1:60310_) [n:127.0.0.1:60310_ c:control_collection s:shard1 r:core_node1 x:collection1] o.a.s.u.UpdateLog Looking up max value of version field to seed version buckets
   [junit4]   2> 403103 INFO  (coreLoadExecutor-830-thread-1-processing-n:127.0.0.1:60310_) [n:127.0.0.1:60310_ c:control_collection s:shard1 r:core_node1 x:collection1] o.a.s.u.VersionInfo Refreshing highest value of _version_ for 65536 version buckets from index
   [junit4]   2> 403103 INFO  (coreLoadExecutor-830-thread-1-processing-n:127.0.0.1:60310_) [n:127.0.0.1:60310_ c:control_collection s:shard1 r:core_node1 x:collection1] o.a.s.u.VersionInfo No terms found for _version_, cannot seed version bucket highest value from index
   [junit4]   2> 403103 INFO  (coreLoadExecutor-830-thread-1-processing-n:127.0.0.1:60310_) [n:127.0.0.1:60310_ c:control_collection s:shard1 r:core_node1 x:collection1] o.a.s.u.UpdateLog Could not find max version in index or recent updates, using new clock 1508423410184617984
   [junit4]   2> 403105 INFO  (coreLoadExecutor-830-thread-1-processing-n:127.0.0.1:60310_) [n:127.0.0.1:60310_ c:control_collection s:shard1 r:core_node1 x:collection1] o.a.s.u.UpdateLog Took 2 ms to seed version buckets with highest version 1508423410184617984
   [junit4]   2> 403105 INFO  (coreLoadExecutor-830-thread-1-processing-n:127.0.0.1:60310_) [n:127.0.0.1:60310_ c:control_collection s:shard1 r:core_node1 x:collection1] o.a.s.c.ZkController watch zkdir /configs/conf1
   [junit4]   2> 403105 INFO  (coreLoadExecutor-830-thread-1-processing-n:127.0.0.1:60310_) [n:127.0.0.1:60310_ c:control_collection s:shard1 r:core_node1 x:collection1] o.a.s.c.CoreContainer registering core: collection1
   [junit4]   2> 403105 INFO  (coreZkRegister-824-thread-1-processing-n:127.0.0.1:60310_ x:collection1 s:shard1 c:control_collection r:core_node1) [n:127.0.0.1:60310_ c:control_collection s:shard1 r:core_node1 x:collection1] o.a.s.c.ZkController Register replica - core:collection1 address:https://127.0.0.1:60310 collection:control_collection shard:shard1
   [junit4]   2> 403106 INFO  (coreZkRegister-824-thread-1-processing-n:127.0.0.1:60310_ x:collection1 s:shard1 c:control_collection r:core_node1) [n:127.0.0.1:60310_ c:control_collection s:shard1 r:core_node1 x:collection1] o.a.s.c.c.SolrZkClient makePath: /collections/control_collection/leader_elect/shard1/election
   [junit4]   2> 403107 INFO  (coreZkRegister-824-thread-1-processing-n:127.0.0.1:60310_ x:collection1 s:shard1 c:control_collection r:core_node1) [n:127.0.0.1:60310_ c:control_collection s:shard1 r:core_node1 x:collection1] o.a.s.c.LeaderElector Joined leadership election with path: /collections/control_collection/leader_elect/shard1/election/94276463044329477-core_node1-n_0000000000
   [junit4]   2> 403108 INFO  (coreZkRegister-824-thread-1-processing-n:127.0.0.1:60310_ x:collection1 s:shard1 c:control_collection r:core_node1) [n:127.0.0.1:60310_ c:control_collection s:shard1 r:core_node1 x:collection1] o.a.s.c.ShardLeaderElectionContext Running the leader process for shard shard1
   [junit4]   2> 403108 INFO  (zkCallback-252-thread-1-processing-n:127.0.0.1:60310_) [n:127.0.0.1:60310_    ] o.a.s.c.DistributedQueue NodeChildrenChanged fired on path /overseer/queue state SyncConnected
   [junit4]   2> 403108 INFO  (coreZkRegister-824-thread-1-processing-n:127.0.0.1:60310_ x:collection1 s:shard1 c:control_collection r:core_node1) [n:127.0.0.1:60310_ c:control_collection s:shard1 r:core_node1 x:collection1] o.a.s.c.ShardLeaderElectionContext Enough replicas found to continue.
   [junit4]   2> 403108 INFO  (coreZkRegister-824-thread-1-processing-n:127.0.0.1:60310_ x:collection1 s:shard1 c:control_collection r:core_node1) [n:127.0.0.1:60310_ c:control_collection s:shard1 r:core_node1 x:collection1] o.a.s.c.ShardLeaderElectionContext I may be the new leader - try and sync
   [junit4]   2> 403108 INFO  (coreZkRegister-824-thread-1-processing-n:127.0.0.1:60310_ x:collection1 s:shard1 c:control_collection r:core_node1) [n:127.0.0.1:60310_ c:control_collection s:shard1 r:core_node1 x:collection1] o.a.s.c.SyncStrategy Sync replicas to https://127.0.0.1:60310/collection1/
   [junit4]   2> 403109 INFO  (coreZkRegister-824-thread-1-processing-n:127.0.0.1:60310_ x:collection1 s:shard1 c:control_collection r:core_node1) [n:127.0.0.1:60310_ c:control_collection s:shard1 r:core_node1 x:collection1] o.a.s.c.SyncStrategy Sync Success - now sync replicas to me
   [junit4]   2> 403109 INFO  (OverseerStateUpdate-94276463044329477-127.0.0.1:60310_-n_0000000000) [n:127.0.0.1:60310_    ] o.a.s.c.Overseer processMessage: queueSize: 1, message = {
   [junit4]   2>   "operation":"leader",
   [junit4]   2>   "shard":"shard1",
   [junit4]   2>   "collection":"control_collection"} current state version: 1
   [junit4]   2> 403109 INFO  (coreZkRegister-824-thread-1-processing-n:127.0.0.1:60310_ x:collection1 s:shard1 c:control_collection r:core_node1) [n:127.0.0.1:60310_ c:control_collection s:shard1 r:core_node1 x:collection1] o.a.s.c.SyncStrategy https://127.0.0.1:60310/collection1/ has no replicas
   [junit4]   2> 403109 INFO  (coreZkRegister-824-thread-1-processing-n:127.0.0.1:60310_ x:collection1 s:shard1 c:control_collection r:core_node1) [n:127.0.0.1:60310_ c:control_collection s:shard1 r:core_node1 x:collection1] o.a.s.c.ShardLeaderElectionContext I am the new leader: https://127.0.0.1:60310/collection1/ shard1
   [junit4]   2> 403109 INFO  (coreZkRegister-824-thread-1-processing-n:127.0.0.1:60310_ x:collection1 s:shard1 c:control_collection r:core_node1) [n:127.0.0.1:60310_ c:control_collection s:shard1 r:core_node1 x:collection1] o.a.s.c.c.SolrZkClient makePath: /collections/control_collection/leaders/shard1
   [junit4]   2> 403110 INFO  (zkCallback-252-thread-1-processing-n:127.0.0.1:60310_) [n:127.0.0.1:60310_    ] o.a.s.c.DistributedQueue NodeChildrenChanged fired on path /overseer/queue state SyncConnected
   [junit4]   2> 403110 INFO  (OverseerStateUpdate-94276463044329477-127.0.0.1:60310_-n_0000000000) [n:127.0.0.1:60310_    ] o.a.s.c.Overseer processMessage: queueSize: 1, message = {
   [junit4]   2>   "operation":"leader",
   [junit4]   2>   "shard":"shard1",
   [junit4]   2>   "collection":"control_collection",
   [junit4]   2>   "base_url":"https://127.0.0.1:60310",
   [junit4]   2>   "core":"collection1",
   [junit4]   2>   "state":"active"} current state version: 1
   [junit4]   2> 403212 INFO  (zkCallback-252-thread-1-processing-n:127.0.0.1:60310_) [n:127.0.0.1:60310_    ] o.a.s.c.c.ZkStateReader A cluster state change: WatchedEvent state:SyncConnected type:NodeDataChanged path:/clusterstate.json, has occurred - updating... (live nodes size: 1)
   [junit4]   2> 403213 INFO  (zkCallback-252-thread-1-processing-n:127.0.0.1:60310_) [n:127.0.0.1:60310_    ] o.a.s.c.c.ZkStateReader Updated cluster state version to 2
   [junit4]   2> 403261 INFO  (coreZkRegister-824-thread-1-processing-n:127.0.0.1:60310_ x:collection1 s:shard1 c:control_collection r:core_node1) [n:127.0.0.1:60310_ c:control_collection s:shard1 r:core_node1 x:collection1] o.a.s.c.ZkController We are https://127.0.0.1:60310/collection1/ and leader is https://127.0.0.1:60310/collection1/
   [junit4]   2> 403261 INFO  (coreZkRegister-824-thread-1-processing-n:127.0.0.1:60310_ x:collection1 s:shard1 c:control_collection r:core_node1) [n:127.0.0.1:60310_ c:control_collection s:shard1 r:core_node1 x:collection1] o.a.s.c.ZkController No LogReplay needed for core=collection1 baseURL=https://127.0.0.1:60310
   [junit4]   2> 403261 INFO  (coreZkRegister-824-thread-1-processing-n:127.0.0.1:60310_ x:collection1 s:shard1 c:control_collection r:core_node1) [n:127.0.0.1:60310_ c:control_collection s:shard1 r:core_node1 x:collection1] o.a.s.c.ZkController I am the leader, no recovery necessary
   [junit4]   2> 403261 INFO  (coreZkRegister-824-thread-1-processing-n:127.0.0.1:60310_ x:collection1 s:shard1 c:control_collection r:core_node1) [n:127.0.0.1:60310_ c:control_collection s:shard1 r:core_node1 x:collection1] o.a.s.c.ZkController publishing state=active
   [junit4]   2> 403261 INFO  (coreZkRegister-824-thread-1-processing-n:127.0.0.1:60310_ x:collection1 s:shard1 c:control_collection r:core_node1) [n:127.0.0.1:60310_ c:control_collection s:shard1 r:core_node1 x:collection1] o.a.s.c.ZkController numShards not found on descriptor - reading it from system property
   [junit4]   2> 403262 INFO  (zkCallback-252-thread-1-processing-n:127.0.0.1:60310_) [n:127.0.0.1:60310_    ] o.a.s.c.DistributedQueue NodeChildrenChanged fired on path /overseer/queue state SyncConnected
   [junit4]   2> 403262 INFO  (OverseerStateUpdate-94276463044329477-127.0.0.1:60310_-n_0000000000) [n:127.0.0.1:60310_    ] o.a.s.c.Overseer processMessage: queueSize: 1, message = {
   [junit4]   2>   "core":"collection1",
   [junit4]   2>   "core_node_name":"core_node1",
   [junit4]   2>   "roles":null,
   [junit4]   2>   "base_url":"https://127.0.0.1:60310",
   [junit4]   2>   "node_name":"127.0.0.1:60310_",
   [junit4]   2>   "numShards":"1",
   [junit4]   2>   "state":"active",
   [junit4]   2>   "shard":"shard1",
   [junit4]   2>   "collection":"control_collection",
   [junit4]   2>   "operation":"state"} current state version: 2
   [junit4]   2> 403262 INFO  (OverseerStateUpdate-94276463044329477-127.0.0.1:60310_-n_0000000000) [n:127.0.0.1:60310_    ] o.a.s.c.o.ReplicaMutator Update state numShards=1 message={
   [junit4]   2>   "core":"collection1",
   [junit4]   2>   "core_node_name":"core_node1",
   [junit4]   2>   "roles":null,
   [junit4]   2>   "base_url":"https://127.0.0.1:60310",
   [junit4]   2>   "node_name":"127.0.0.1:60310_",
   [junit4]   2>   "numShards":"1",
   [junit4]   2>   "state":"active",
   [junit4]   2>   "shard":"shard1",
   [junit4]   2>   "collection":"control_collection",
   [junit4]   2>   "operation":"state"}
   [junit4]   2> 403363 INFO  (zkCallback-252-thread-1-processing-n:127.0.0.1:60310_) [n:127.0.0.1:60310_    ] o.a.s.c.c.ZkStateReader A cluster state change: WatchedEvent state:SyncConnected type:NodeDataChanged path:/clusterstate.json, has occurred - updating... (live nodes size: 1)
   [junit4]   2> 403364 INFO  (zkCallback-252-thread-1-processing-n:127.0.0.1:60310_) [n:127.0.0.1:60310_    ] o.a.s.c.c.ZkStateReader Updated cluster state version to 3
   [junit4]   2> 403465 INFO  (TEST-ChaosMonkeySafeLeaderTest.test-seed#[CCCAEA3C17C46C44]) [    ] o.a.s.c.c.SolrZkClient Using default ZkCredentialsProvider
   [junit4]   2> 403465 INFO  (TEST-ChaosMonkeySafeLeaderTest.test-seed#[CCCAEA3C17C46C44]) [    ] o.a.s.c.c.ConnectionManager Waiting for client to connect to ZooKeeper
   [junit4]   2> 403466 INFO  (zkCallback-254-thread-1) [    ] o.a.s.c.c.ConnectionManager Watcher org.apache.solr.common.cloud.ConnectionManager@111b93d name:ZooKeeperConnection Watcher:127.0.0.1:46107/solr got event WatchedEvent state:SyncConnected type:None path:null path:null type:None
   [junit4]   2> 403466 INFO  (TEST-ChaosMonkeySafeLeaderTest.test-seed#[CCCAEA3C17C46C44]) [    ] o.a.s.c.c.ConnectionManager Client is connected to ZooKeeper
   [junit4]   2> 403466 INFO  (TEST-ChaosMonkeySafeLeaderTest.test-seed#[CCCAEA3C17C46C44]) [    ] o.a.s.c.c.SolrZkClient Using default ZkACLProvider
   [junit4]   2> 403466 INFO  (TEST-ChaosMonkeySafeLeaderTest.test-seed#[CCCAEA3C17C46C44]) [    ] o.a.s.c.c.ZkStateReader Updating cluster state from ZooKeeper... 
   [junit4]   2> 403467 INFO  (TEST-ChaosMonkeySafeLeaderTest.test-seed#[CCCAEA3C17C46C44]) [    ] o.a.s.c.ChaosMonkey monkey: init - expire sessions:false cause connection loss:false
   [junit4]   2> 403532 INFO  (TEST-ChaosMonkeySafeLeaderTest.test-seed#[CCCAEA3C17C46C44]) [    ] o.a.s.SolrTestCaseJ4 Writing core.properties file to /home/jenkins/workspace/Lucene-Solr-trunk-Linux/solr/build/solr-core/test/J1/temp/solr.cloud.ChaosMonkeySafeLeaderTest_CCCAEA3C17C46C44-001/shard-1-001/cores/collection1
   [junit4]   2> 403532 INFO  (TEST-ChaosMonkeySafeLeaderTest.test-seed#[CCCAEA3C17C46C44]) [    ] o.a.s.c.AbstractFullDistribZkTestBase create jetty 1 in directory /home/jenkins/workspace/Lucene-Solr-trunk-Linux/solr/build/solr-core/test/J1/temp/solr.cloud.ChaosMonkeySafeLeaderTest_CCCAEA3C17C46C44-001/shard-1-001
   [junit4]   2> 403533 INFO  (TEST-ChaosMonkeySafeLeaderTest.test-seed#[CCCAEA3C17C46C44]) [    ] o.e.j.s.Server jetty-9.2.11.v20150529
   [junit4]   2> 403534 INFO  (TEST-ChaosMonkeySafeLeaderTest.test-seed#[CCCAEA3C17C46C44]) [    ] o.e.j.s.h.ContextHandler Started o.e.j.s.ServletContextHandler@20558d{/,null,AVAILABLE}
   [junit4]   2> 403540 INFO  (TEST-ChaosMonkeySafeLeaderTest.test-seed#[CCCAEA3C17C46C44]) [    ] o.e.j.s.ServerConnector Started ServerConnector@180dd2f{SSL-http/1.1}{127.0.0.1:50827}
   [junit4]   2> 403540 INFO  (TEST-ChaosMonkeySafeLeaderTest.test-seed#[CCCAEA3C17C46C44]) [    ] o.e.j.s.Server Started @405200ms
   [junit4]   2> 403540 INFO  (TEST-ChaosMonkeySafeLeaderTest.test-seed#[CCCAEA3C17C46C44]) [    ] o.a.s.c.s.e.JettySolrRunner Jetty properties: {solr.data.dir=/home/jenkins/workspace/Lucene-Solr-trunk-Linux/solr/build/solr-core/test/J1/temp/solr.cloud.ChaosMonkeySafeLeaderTest_CCCAEA3C17C46C44-001/tempDir-001/jetty1, solrconfig=solrconfig.xml, hostContext=/, hostPort=50827, coreRootDirectory=/home/jenkins/workspace/Lucene-Solr-trunk-Linux/solr/build/solr-core/test/J1/temp/solr.cloud.ChaosMonkeySafeLeaderTest_CCCAEA3C17C46C44-001/shard-1-001/cores}
   [junit4]   2> 403542 INFO  (TEST-ChaosMonkeySafeLeaderTest.test-seed#[CCCAEA3C17C46C44]) [    ] o.a.s.s.SolrDispatchFilter SolrDispatchFilter.init(): sun.misc.Launcher$AppClassLoader@e2f2a
   [junit4]   2> 403542 INFO  (TEST-ChaosMonkeySafeLeaderTest.test-seed#[CCCAEA3C17C46C44]) [    ] o.a.s.c.SolrResourceLoader new SolrResourceLoader for directory: '/home/jenkins/workspace/Lucene-Solr-trunk-Linux/solr/build/solr-core/test/J1/temp/solr.cloud.ChaosMonkeySafeLeaderTest_CCCAEA3C17C46C44-001/shard-1-001/'
   [junit4]   2> 403556 INFO  (TEST-ChaosMonkeySafeLeaderTest.test-seed#[CCCAEA3C17C46C44]) [    ] o.a.s.c.c.SolrZkClient Using default ZkCredentialsProvider
   [junit4]   2> 403556 INFO  (TEST-ChaosMonkeySafeLeaderTest.test-seed#[CCCAEA3C17C46C44]) [    ] o.a.s.c.c.ConnectionManager Waiting for client to connect to ZooKeeper
   [junit4]   2> 403557 INFO  (zkCallback-255-thread-1) [    ] o.a.s.c.c.ConnectionManager Watcher org.apache.solr.common.cloud.ConnectionManager@add522 name:ZooKeeperConnection Watcher:127.0.0.1:46107/solr got event WatchedEvent state:SyncConnected type:None path:null path:null type:None
   [junit4]   2> 403557 INFO  (TEST-ChaosMonkeySafeLeaderTest.test-seed#[CCCAEA3C17C46C44]) [    ] o.a.s.c.c.ConnectionManager Client is connected to ZooKeeper
   [junit4]   2> 403558 INFO  (TEST-ChaosMonkeySafeLeaderTest.test-seed#[CCCAEA3C17C46C44]) [    ] o.a.s.c.c.SolrZkClient Using default ZkACLProvider
   [junit4]   2> 403558 INFO  (TEST-ChaosMonkeySafeLeaderTest.test-seed#[CCCAEA3C17C46C44]) [    ] o.a.s.s.SolrDispatchFilter Loading solr.xml from SolrHome (not found in ZooKeeper)
   [junit4]   2> 403558 INFO  (TEST-ChaosMonkeySafeLeaderTest.test-seed#[CCCAEA3C17C46C44]) [    ] o.a.s.c.SolrXmlConfig Loading container configuration from /home/jenkins/workspace/Lucene-Solr-trunk-Linux/solr/build/solr-core/test/J1/temp/solr.cloud.ChaosMonkeySafeLeaderTest_CCCAEA3C17C46C44-001/shard-1-001/solr.xml
   [junit4]   2> 403562 INFO  (TEST-ChaosMonkeySafeLeaderTest.test-seed#[CCCAEA3C17C46C44]) [    ] o.a.s.c.CoresLocator Config-defined core root directory: /home/jenkins/workspace/Lucene-Solr-trunk-Linux/solr/build/solr-core/test/J1/temp/solr.cloud.ChaosMonkeySafeLeaderTest_CCCAEA3C17C46C44-001/shard-1-001/cores
   [junit4]   2> 403562 INFO  (TEST-ChaosMonkeySafeLeaderTest.test-seed#[CCCAEA3C17C46C44]) [    ] o.a.s.c.CoreContainer New CoreContainer 15862293
   [junit4]   2> 403562 INFO  (TEST-ChaosMonkeySafeLeaderTest.test-seed#[CCCAEA3C17C46C44]) [    ] o.a.s.c.CoreContainer Loading cores into CoreContainer [instanceDir=/home/jenkins/workspace/Lucene-Solr-trunk-Linux/solr/build/solr-core/test/J1/temp/solr.cloud.ChaosMonkeySafeLeaderTest_CCCAEA3C17C46C44-001/shard-1-001/]
   [junit4]   2> 403562 INFO  (TEST-ChaosMonkeySafeLeaderTest.test-seed#[CCCAEA3C17C46C44]) [    ] o.a.s.c.CoreContainer loading shared library: /home/jenkins/workspace/Lucene-Solr-trunk-Linux/solr/build/solr-core/test/J1/temp/solr.cloud.ChaosMonkeySafeLeaderTest_CCCAEA3C17C46C44-001/shard-1-001/lib
   [junit4]   2> 403562 WARN  (TEST-ChaosMonkeySafeLeaderTest.test-seed#[CCCAEA3C17C46C44]) [    ] o.a.s.c.SolrResourceLoader Can't find (or read) directory to add to classloader: lib (resolved as: /home/jenkins/workspace/Lucene-Solr-trunk-Linux/solr/build/solr-core/test/J1/temp/solr.cloud.ChaosMonkeySafeLeaderTest_CCCAEA3C17C46C44-001/shard-1-001/lib).
   [junit4]   2> 403567 INFO  (TEST-ChaosMonkeySafeLeaderTest.test-seed#[CCCAEA3C17C46C44]) [    ] o.a.s.h.c.HttpShardHandlerFactory created with socketTimeout : 90000,urlScheme : ,connTimeout : 15000,maxConnectionsPerHost : 20,maxConnections : 10000,corePoolSize : 0,maximumPoolSize : 2147483647,maxThreadIdleTime : 5,sizeOfQueue : -1,fairnessPolicy : false,useRetries : false,
   [junit4]   2> 403569 INFO  (TEST-ChaosMonkeySafeLeaderTest.test-seed#[CCCAEA3C17C46C44]) [    ] o.a.s.u.UpdateShardHandler Creating UpdateShardHandler HTTP client with params: socketTimeout=340000&connTimeout=45000&retry=true
   [junit4]   2> 403570 INFO  (TEST-ChaosMonkeySafeLeaderTest.test-seed#[CCCAEA3C17C46C44]) [    ] o.a.s.l.LogWatcher SLF4J impl is org.slf4j.impl.Log4jLoggerFactory
   [junit4]   2> 403570 INFO  (TEST-ChaosMonkeySafeLeaderTest.test-seed#[CCCAEA3C17C46C44]) [    ] o.a.s.l.LogWatcher Registering Log Listener [Log4j (org.slf4j.impl.Log4jLoggerFactory)]
   [junit4]   2> 403570 INFO  (TEST-ChaosMonkeySafeLeaderTest.test-seed#[CCCAEA3C17C46C44]) [    ] o.a.s.c.ZkContainer Zookeeper client=127.0.0.1:46107/solr
   [junit4]   2> 403570 INFO  (TEST-ChaosMonkeySafeLeaderTest.test-seed#[CCCAEA3C17C46C44]) [    ] o.a.s.c.ZkController zkHost includes chroot
   [junit4]   2> 403570 INFO  (TEST-ChaosMonkeySafeLeaderTest.test-seed#[CCCAEA3C17C46C44]) [    ] o.a.s.c.c.SolrZkClient Using default ZkCredentialsProvider
   [junit4]   2> 403572 INFO  (TEST-ChaosMonkeySafeLeaderTest.test-seed#[CCCAEA3C17C46C44]) [    ] o.a.s.c.c.ConnectionManager Waiting for client to connect to ZooKeeper
   [junit4]   2> 403572 INFO  (zkCallback-257-thread-1) [    ] o.a.s.c.c.ConnectionManager Watcher org.apache.solr.common.cloud.ConnectionManager@339978 name:ZooKeeperConnection Watcher:127.0.0.1:46107 got event WatchedEvent state:SyncConnected type:None path:null path:null type:None
   [junit4]   2> 403573 INFO  (TEST-ChaosMonkeySafeLeaderTest.test-seed#[CCCAEA3C17C46C44]) [    ] o.a.s.c.c.ConnectionManager Client is connected to ZooKeeper
   [junit4]   2> 403573 INFO  (TEST-ChaosMonkeySafeLeaderTest.test-seed#[CCCAEA3C17C46C44]) [    ] o.a.s.c.c.SolrZkClient Using default ZkACLProvider
   [junit4]   2> 403574 INFO  (TEST-ChaosMonkeySafeLeaderTest.test-seed#[CCCAEA3C17C46C44]) [n:127.0.0.1:50827_    ] o.a.s.c.c.ConnectionManager Waiting for client to connect to ZooKeeper
   [junit4]   2> 403575 INFO  (zkCallback-258-thread-1-processing-n:127.0.0.1:50827_) [n:127.0.0.1:50827_    ] o.a.s.c.c.ConnectionManager Watcher org.apache.solr.common.cloud.ConnectionManager@1125e79 name:ZooKeeperConnection Watcher:127.0.0.1:46107/solr got event WatchedEvent state:SyncConnected type:None path:null path:null type:None
   [junit4]   2> 403575 INFO  (TEST-ChaosMonkeySafeLeaderTest.test-seed#[CCCAEA3C17C46C44]) [n:127.0.0.1:50827_    ] o.a.s.c.c.ConnectionManager Client is connected to ZooKeeper
   [junit4]   2> 403577 INFO  (TEST-ChaosMonkeySafeLeaderTest.test-seed#[CCCAEA3C17C46C44]) [n:127.0.0.1:50827_    ] o.a.s.c.c.ZkStateReader Updating cluster state from ZooKeeper... 
   [junit4]   2> 404579 INFO  (TEST-ChaosMonkeySafeLeaderTest.test-seed#[CCCAEA3C17C46C44]) [n:127.0.0.1:50827_    ] o.a.s.c.ZkController Register node as live in ZooKeeper:/live_nodes/127.0.0.1:50827_
   [junit4]   2> 404579 INFO  (TEST-ChaosMonkeySafeLeaderTest.test-seed#[CCCAEA3C17C46C44]) [n:127.0.0.1:50827_    ] o.a.s.c.c.SolrZkClient makePath: /live_nodes/127.0.0.1:50827_
   [junit4]   2> 404581 INFO  (TEST-ChaosMonkeySafeLeaderTest.test-seed#[CCCAEA3C17C46C44]) [n:127.0.0.1:50827_    ] o.a.s.c.Overseer Overseer (id=null) closing
   [junit4]   2> 404581 INFO  (TEST-ChaosMonkeySafeLeaderTest.test-seed#[CCCAEA3C17C46C44]) [n:127.0.0.1:50827_    ] o.a.s.c.LeaderElector Joined leadership election with path: /overseer_elect/election/94276463044329481-127.0.0.1:50827_-n_0000000001
   [junit4]   2> 404582 INFO  (TEST-ChaosMonkeySafeLeaderTest.test-seed#[CCCAEA3C17C46C44]) [n:127.0.0.1:50827_    ] o.a.s.c.LeaderElector Watching path /overseer_elect/election/94276463044329477-127.0.0.1:60310_-n_0000000000 to know if I could be the leader
   [junit4]   2> 404582 INFO  (TEST-ChaosMonkeySafeLeaderTest.test-seed#[CCCAEA3C17C46C44]) [n:127.0.0.1:50827_    ] o.a.s.c.CoreContainer No authentication plugin used.
   [junit4]   2> 404582 INFO  (TEST-ChaosMonkeySafeLeaderTest.test-seed#[CCCAEA3C17C46C44]) [n:127.0.0.1:50827_    ] o.a.s.c.CoreContainer Security conf doesn't exist. Skipping setup for authorization module.
   [junit4]   2> 404582 INFO  (TEST-ChaosMonkeySafeLeaderTest.test-seed#[CCCAEA3C17C46C44]) [n:127.0.0.1:50827_    ] o.a.s.c.CoresLocator Looking for core definitions underneath /home/jenkins/workspace/Lucene-Solr-trunk-Linux/solr/build/solr-core/test/J1/temp/solr.cloud.ChaosMonkeySafeLeaderTest_CCCAEA3C17C46C44-001/shard-1-001/cores
   [junit4]   2> 404583 INFO  (TEST-ChaosMonkeySafeLeaderTest.test-seed#[CCCAEA3C17C46C44]) [n:127.0.0.1:50827_    ] o.a.s.c.SolrCore Created CoreDescriptor: {name=collection1, config=solrconfig.xml, transient=false, schema=schema.xml, loadOnStartup=true, configSetProperties=configsetprops.json, instanceDir=/home/jenkins/workspace/Lucene-Solr-trunk-Linux/solr/build/solr-core/test/J1/temp/solr.cloud.ChaosMonkeySafeLeaderTest_CCCAEA3C17C46C44-001/shard-1-001/cores/collection1, collection=collection1, absoluteInstDir=/home/jenkins/workspace/Lucene-Solr-trunk-Linux/solr/build/solr-core/test/J1/temp/solr.cloud.ChaosMonkeySafeLeaderTest_CCCAEA3C17C46C44-001/shard-1-001/cores/collection1/, coreNodeName=, dataDir=data/, shard=}
   [junit4]   2> 404583 INFO  (TEST-ChaosMonkeySafeLeaderTest.test-seed#[CCCAEA3C17C46C44]) [n:127.0.0.1:50827_    ] o.a.s.c.CoresLocator Found core collection1 in /home/jenkins/workspace/Lucene-Solr-trunk-Linux/solr/build/solr-core/test/J1/temp/solr.cloud.ChaosMonkeySafeLeaderTest_CCCAEA3C17C46C44-001/shard-1-001/cores/collection1/
   [junit4]   2> 404583 INFO  (TEST-ChaosMonkeySafeLeaderTest.test-seed#[CCCAEA3C17C46C44]) [n:127.0.0.1:50827_    ] o.a.s.c.CoresLocator Found 1 core definitions
   [junit4]   2> 404584 INFO  (coreLoadExecutor-841-thread-1-processing-n:127.0.0.1:50827_) [n:127.0.0.1:50827_ c:collection1   x:collection1] o.a.s.c.ZkController publishing state=down
   [junit4]   2> 404593 INFO  (coreLoadExecutor-841-thread-1-processing-n:127.0.0.1:50827_) [n:127.0.0.1:50827_ c:collection1   x:collection1] o.a.s.c.ZkController numShards not found on descriptor - reading it from system property
   [junit4]   2> 404593 INFO  (TEST-ChaosMonkeySafeLeaderTest.test-seed#[CCCAEA3C17C46C44]) [n:127.0.0.1:50827_    ] o.a.s.s.SolrDispatchFilter user.dir=/home/jenkins/workspace/Lucene-Solr-trunk-Linux/solr/build/solr-core/test/J1
   [junit4]   2> 404593 INFO  (TEST-ChaosMonkeySafeLeaderTest.test-seed#[CCCAEA3C17C46C44]) [n:127.0.0.1:50827_    ] o.a.s.s.SolrDispatchFilter SolrDispatchFilter.init() done
   [junit4]   2> 404593 INFO  (coreLoadExecutor-841-thread-1-processing-n:127.0.0.1:50827_) [n:127.0.0.1:50827_ c:collection1   x:collection1] o.a.s.c.ZkController look for our core node name
   [junit4]   2> 404593 INFO  (zkCallback-252-thread-1-processing-n:127.0.0.1:60310_) [n:127.0.0.1:60310_    ] o.a.s.c.DistributedQueue NodeChildrenChanged fired on path /overseer/queue state SyncConnected
   [junit4]   2> 404594 INFO  (OverseerStateUpdate-94276463044329477-127.0.0.1:60310_-n_0000000000) [n:127.0.0.1:60310_    ] o.a.s.c.Overseer processMessage: queueSize: 1, message = {
   [junit4]   2>   "core":"collection1",
   [junit4]   2>   "roles":null,
   [junit4]   2>   "base_url":"https://127.0.0.1:50827",
   [junit4]   2>   "node_name":"127.0.0.1:50827_",
   [junit4]   2>   "numShards":"3",
   [junit4]   2>   "state":"down",
   [junit4]   2>   "shard":null,
   [junit4]   2>   "collection":"collection1",
   [junit4]   2>   "operation":"state"} current state version: 3
   [junit4]   2> 404594 INFO  (OverseerStateUpdate-94276463044329477-127.0.0.1:60310_-n_0000000000) [n:127.0.0.1:60310_    ] o.a.s.c.o.ReplicaMutator Update state numShards=3 message={
   [junit4]   2>   "core":"collection1",
   [junit4]   2>   "roles":null,
   [junit4]   2>   "base_url":"https://127.0.0.1:50827",
   [junit4]   2>   "node_name":"127.0.0.1:50827_",
   [junit4]   2>   "numShards":"3",
   [junit4]   2>   "state":"down",
   [junit4]   2>   "shard":null,
   [junit4]   2>   "collection":"collection1",
   [junit4]   2>   "operation":"state"}
   [junit4]   2> 404594 INFO  (OverseerStateUpdate-94276463044329477-127.0.0.1:60310_-n_0000000000) [n:127.0.0.1:60310_    ] o.a.s.c.o.ClusterStateMutator building a new cName: collection1
   [junit4]   2> 404594 INFO  (OverseerStateUpdate-94276463044329477-127.0.0.1:60310_-n_0000000000) [n:127.0.0.1:60310_    ] o.a.s.c.o.ReplicaMutator Assigning new node to shard shard=shard2
   [junit4]   2> 404696 INFO  (zkCallback-252-thread-1-processing-n:127.0.0.1:60310_) [n:127.0.0.1:60310_    ] o.a.s.c.c.ZkStateReader A cluster state change: WatchedEvent state:SyncConnected type:NodeDataChanged path:/clusterstate.json, has occurred - updating... (live nodes size: 2)
   [junit4]   2> 404696 INFO  (zkCallback-254-thread-1) [    ] o.a.s.c.c.ZkStateReader A cluster state change: WatchedEvent state:SyncConnected type:NodeDataChanged path:/clusterstate.json, has occurred - updating... (live nodes size: 2)
   [junit4]   2> 404696 INFO  (zkCallback-258-thread-1-processing-n:127.0.0.1:50827_) [n:127.0.0.1:50827_    ] o.a.s.c.c.ZkStateReader A cluster state change: WatchedEvent state:SyncConnected type:NodeDataChanged path:/clusterstate.json, has occurred - updating... (live nodes size: 2)
   [junit4]   2> 404697 INFO  (zkCallback-254-thread-1) [    ] o.a.s.c.c.ZkStateReader Updated cluster state version to 4
   [junit4]   2> 404697 INFO  (zkCallback-252-thread-1-processing-n:127.0.0.1:60310_) [n:127.0.0.1:60310_    ] o.a.s.c.c.ZkStateReader Updated cluster state version to 4
   [junit4]   2> 404697 INFO  (zkCallback-258-thread-1-processing-n:127.0.0.1:50827_) [n:127.0.0.1:50827_    ] o.a.s.c.c.ZkStateReader Updated cluster state version to 4
   [junit4]   2> 405593 INFO  (coreLoadExecutor-841-thread-1-processing-n:127.0.0.1:50827_) [n:127.0.0.1:50827_ c:collection1   x:collection1] o.a.s.c.ZkController waiting to find shard id in clusterstate for collection1
   [junit4]   2> 405594 INFO  (coreLoadExecutor-841-thread-1-processing-n:127.0.0.1:50827_) [n:127.0.0.1:50827_ c:collection1   x:collection1] o.a.s.c.ZkController Check for collection zkNode:collection1
   [junit4]   2> 405594 INFO  (coreLoadExecutor-841-thread-1-processing-n:127.0.0.1:50827_) [n:127.0.0.1:50827_ c:collection1   x:collection1] o.a.s.c.ZkController Collection zkNode exists
   [junit4]   2> 405594 INFO  (coreLoadExecutor-841-thread-1-processing-n:127.0.0.1:50827_) [n:127.0.0.1:50827_ c:collection1   x:collection1] o.a.s.c.c.ZkStateReader Load collection config from:/collections/collection1
   [junit4]   2> 405594 INFO  (coreLoadExecutor-841-thread-1-processing-n:127.0.0.1:50827_) [n:127.0.0.1:50827_ c:collection1   x:collection1] o.a.s.c.c.ZkStateReader path=/collections/collection1 configName=conf1 specified config exists in ZooKeeper
   [junit4]   2> 405594 INFO  (coreLoadExecutor-841-thread-1-processing-n:127.0.0.1:50827_) [n:127.0.0.1:50827_ c:collection1   x:collection1] o.a.s.c.SolrResourceLoader new SolrResourceLoader for directory: '/home/jenkins/workspace/Lucene-Solr-trunk-Linux/solr/build/solr-core/test/J1/temp/solr.cloud.ChaosMonkeySafeLeaderTest_CCCAEA3C17C46C44-001/shard-1-001/cores/collection1/'
   [junit4]   2> 405603 INFO  (coreLoadExecutor-841-thread-1-processing-n:127.0.0.1:50827_) [n:127.0.0.1:50827_ c:collection1   x:collection1] o.a.s.c.Config loaded config solrconfig.xml with version 0 
   [junit4]   2> 405606 INFO  (coreLoadExecutor-841-thread-1-processing-n:127.0.0.1:50827_) [n:127.0.0.1:50827_ c:collection1   x:collection1] o.a.s.c.SolrConfig current version of requestparams : -1
   [junit4]   2> 405608 INFO  (coreLoadExecutor-841-thread-1-processing-n:127.0.0.1:50827_) [n:127.0.0.1:50827_ c:collection1   x:collection1] o.a.s.c.SolrConfig Using Lucene MatchVersion: 6.0.0
   [junit4]   2> 405616 INFO  (coreLoadExecutor-841-thread-1-processing-n:127.0.0.1:50827_) [n:127.0.0.1:50827_ c:collection1   x:collection1] o.a.s.c.Config Loaded SolrConfig: solrconfig.xml
   [junit4]   2> 405616 INFO  (coreLoadExecutor-841-thread-1-processing-n:127.0.0.1:50827_) [n:127.0.0.1:50827_ c:collection1   x:collection1] o.a.s.s.IndexSchema Reading Solr Schema from /configs/conf1/schema.xml
   [junit4]   2> 405619 INFO  (coreLoadExecutor-841-thread-1-processing-n:127.0.0.1:50827_) [n:127.0.0.1:50827_ c:collection1   x:collection1] o.a.s.s.IndexSchema [collection1] Schema name=test
   [junit4]   2> 405692 INFO  (coreLoadExecutor-841-thread-1-processing-n:127.0.0.1:50827_) [n:127.0.0.1:50827_ c:collection1   x:collection1] o.a.s.s.IndexSchema default search field in schema is text
   [junit4]   2> 405693 INFO  (coreLoadExecutor-841-thread-1-processing-n:127.0.0.1:50827_) [n:127.0.0.1:50827_ c:collection1   x:collection1] o.a.s.s.IndexSchema unique key field: id
   [junit4]   2> 405693 INFO  (coreLoadExecutor-841-thread-1-processing-n:127.0.0.1:50827_) [n:127.0.0.1:50827_ c:collection1   x:collection1] o.a.s.s.FileExchangeRateProvider Reloading exchange rates from file currency.xml
   [junit4]   2> 405695 INFO  (coreLoadExecutor-841-thread-1-processing-n:127.0.0.1:50827_) [n:127.0.0.1:50827_ c:collection1   x:collection1] o.a.s.s.FileExchangeRateProvider Reloading exchange rates from file currency.xml
   [junit4]   2> 405702 INFO  (coreLoadExecutor-841-thread-1-processing-n:127.0.0.1:50827_) [n:127.0.0.1:50827_ c:collection1   x:collection1] o.a.s.c.ConfigSetProperties Did not find ConfigSet properties, assuming default properties: Can't find resource 'configsetprops.json' in classpath or '/configs/conf1', cwd=/home/jenkins/workspace/Lucene-Solr-trunk-Linux/solr/build/solr-core/test/J1
   [junit4]   2> 405702 INFO  (coreLoadExecutor-841-thread-1-processing-n:127.0.0.1:50827_) [n:127.0.0.1:50827_ c:collection1   x:collection1] o.a.s.c.CoreContainer Creating SolrCore 'collection1' using configuration from collection collection1
   [junit4]   2> 405702 INFO  (coreLoadExecutor-841-thread-1-processing-n:127.0.0.1:50827_) [n:127.0.0.1:50827_ c:collection1 s:shard2 r:core_node1 x:collection1] o.a.s.c.SolrCore solr.StandardDirectoryFactory
   [junit4]   2> 405702 INFO  (coreLoadExecutor-841-thread-1-processing-n:127.0.0.1:50827_) [n:127.0.0.1:50827_ c:collection1 s:shard2 r:core_node1 x:collection1] o.a.s.c.SolrCore [[collection1] ] Opening new SolrCore at [/home/jenkins/workspace/Lucene-Solr-trunk-Linux/solr/build/solr-core/test/J1/temp/solr.cloud.ChaosMonkeySafeLeaderTest_CCCAEA3C17C46C44-001/shard-1-001/cores/collection1/], dataDir=[null]
   [junit4]   2> 405703 INFO  (coreLoadExecutor-841-thread-1-processing-n:127.0.0.1:50827_) [n:127.0.0.1:50827_ c:collection1 s:shard2 r:core_node1 x:collection1] o.a.s.c.JmxMonitoredMap JMX monitoring is enabled. Adding Solr mbeans to JMX Server: com.sun.jmx.mbeanserver.JmxMBeanServer@134b69b
   [junit4]   2> 405703 INFO  (coreLoadExecutor-841-thread-1-processing-n:127.0.0.1:50827_) [n:127.0.0.1:50827_ c:collection1 s:shard2 r:core_node1 x:collection1] o.a.s.c.CachingDirectoryFactory return new directory for /home/jenkins/workspace/Lucene-Solr-trunk-Linux/solr/build/solr-core/test/J1/temp/solr.cloud.ChaosMonkeySafeLeaderTest_CCCAEA3C17C46C44-001/shard-1-001/cores/collection1/data
   [junit4]   2> 405703 INFO  (coreLoadExecutor-841-thread-1-processing-n:127.0.0.1:50827_) [n:127.0.0.1:50827_ c:collection1 s:shard2 r:core_node1 x:collection1] o.a.s.c.SolrCore New index directory detected: old=null new=/home/jenkins/workspace/Lucene-Solr-trunk-Linux/solr/build/solr-core/test/J1/temp/solr.cloud.ChaosMonkeySafeLeaderTest_CCCAEA3C17C46C44-001/shard-1-001/cores/collection1/data/index/
   [junit4]   2> 405703 WARN  (coreLoadExecutor-841-thread-1-processing-n:127.0.0.1:50827_) [n:127.0.0.1:50827_ c:collection1 s:shard2 r:core_node1 x:collection1] o.a.s.c.SolrCore [collection1] Solr index directory '/home/jenkins/workspace/Lucene-Solr-trunk-Linux/solr/build/solr-core/test/J1/temp/solr.cloud.ChaosMonkeySafeLeaderTest_CCCAEA3C17C46C44-001/shard-1-001/cores/collection1/data/index' doesn't exist. Creating new index...
   [junit4]   2> 405704 INFO  (coreLoadExecutor-841-thread-1-processing-n:127.0.0.1:50827_) [n:127.0.0.1:50827_ c:collection1 s:shard2 r:core_node1 x:collection1] o.a.s.c.CachingDirectoryFactory return new directory for /home/jenkins/workspace/Lucene-Solr-trunk-Linux/solr/build/solr-core/test/J1/temp/solr.cloud.ChaosMonkeySafeLeaderTest_CCCAEA3C17C46C44-001/shard-1-001/cores/collection1/data/index
   [junit4]   2> 405704 INFO  (coreLoadExecutor-841-thread-1-processing-n:127.0.0.1:50827_) [n:127.0.0.1:50827_ c:collection1 s:shard2 r:core_node1 x:collection1] o.a.s.u.RandomMergePolicy RandomMergePolicy wrapping class org.apache.lucene.index.LogDocMergePolicy: [LogDocMergePolicy: minMergeSize=1000, mergeFactor=33, maxMergeSize=9223372036854775807, maxMergeSizeForForcedMerge=9223372036854775807, calibrateSizeByDeletes=true, maxMergeDocs=2147483647, maxCFSSegmentSizeMB=8.796093022207999E12, noCFSRatio=0.48045013167560136]
   [junit4]   2> 405764 INFO  (coreLoadExecutor-841-thread-1-processing-n:127.0.0.1:50827_) [n:127.0.0.1:50827_ c:collection1 s:shard2 r:core_node1 x:collection1] o.a.s.c.SolrCore SolrDeletionPolicy.onCommit: commits: num=1
   [junit4]   2> 	commit{dir=/home/jenkins/workspace/Lucene-Solr-trunk-Linux/solr/build/solr-core/test/J1/temp/solr.cloud.ChaosMonkeySafeLeaderTest_CCCAEA3C17C46C44-001/shard-1-001/cores/collection1/data/index,segFN=segments_1,generation=1}
   [junit4]   2> 405764 INFO  (coreLoadExecutor-841-thread-1-processing-n:127.0.0.1:50827_) [n:127.0.0.1:50827_ c:collection1 s:shard2 r:core_node1 x:collection1] o.a.s.c.SolrCore newest commit generation = 1
   [junit4]   2> 405765 INFO  (OldIndexDirectoryCleanupThreadForCore-collection1) [n:127.0.0.1:50827_ c:collection1 s:shard2 r:core_node1 x:collection1] o.a.s.c.SolrCore Looking for old index directories to cleanup for core collection1 in /home/jenkins/workspace/Lucene-Solr-trunk-Linux/solr/build/solr-core/test/J1/temp/solr.cloud.ChaosMonkeySafeLeaderTest_CCCAEA3C17C46C44-001/shard-1-001/cores/collection1/data/
   [junit4]   2> 405767 INFO  (coreLoadExecutor-841-thread-1-processing-n:127.0.0.1:50827_) [n:127.0.0.1:50827_ c:collection1 s:shard2 r:core_node1 x:collection1] o.a.s.u.p.UpdateRequestProcessorChain creating updateRequestProcessorChain "nodistrib"
   [junit4]   2> 405768 INFO  (coreLoadExecutor-841-thread-1-processing-n:127.0.0.1:50827_) [n:127.0.0.1:50827_ c:collection1 s:shard2 r:core_node1 x:collection1] o.a.s.u.p.UpdateRequestProcessorChain creating updateRequestProcessorChain "dedupe"
   [junit4]   2> 405768 INFO  (coreLoadExecutor-841-thread-1-processing-n:127.0.0.1:50827_) [n:127.0.0.1:50827_ c:collection1 s:shard2 r:core_node1 x:collection1] o.a.s.u.p.UpdateRequestProcessorChain inserting DistributedUpdateProcessorFactory into updateRequestProcessorChain "dedupe"
   [junit4]   2> 405768 INFO  (coreLoadExecutor-841-thread-1-processing-n:127.0.0.1:50827_) [n:127.0.0.1:50827_ c:collection1 s:shard2 r:core_node1 x:collection1] o.a.s.u.p.UpdateRequestProcessorChain creating updateRequestProcessorChain "stored_sig"
   [junit4]   2> 405782 INFO  (coreLoadExecutor-841-thread-1-processing-n:127.0.0.1:50827_) [n:127.0.0.1:50827_ c:collection1 s:shard2 r:core_node1 x:collection1] o.a.s.u.p.UpdateRequestProcessorChain inserting DistributedUpdateProcessorFactory into updateRequestProcessorChain "stored_sig"
   [junit4]   2> 405782 INFO  (coreLoadExecutor-841-thread-1-processing-n:127.0.0.1:50827_) [n:127.0.0.1:50827_ c:collection1 s:shard2 r:core_node1 x:collection1] o.a.s.u.p.UpdateRequestProcessorChain creating updateRequestProcessorChain "distrib-dup-test-chain-explicit"
   [junit4]   2> 405783 INFO  (coreLoadExecutor-841-thread-1-processing-n:127.0.0.1:50827_) [n:127.0.0.1:50827_ c:collection1 s:shard2 r:core_node1 x:collection1] o.a.s.u.p.UpdateRequestProcessorChain creating updateRequestProcessorChain "distrib-dup-test-chain-implicit"
   [junit4]   2> 405783 INFO  (coreLoadExecutor-841-thread-1-processing-n:127.0.0.1:50827_) [n:127.0.0.1:50827_ c:collection1 s:shard2 r:core_node1 x:collection1] o.a.s.u.p.UpdateRequestProcessorChain inserting DistributedUpdateProcessorFactory into updateRequestProcessorChain "distrib-dup-test-chain-implicit"
   [junit4]   2> 405783 INFO  (coreLoadExecutor-841-thread-1-processing-n:127.0.0.1:50827_) [n:127.0.0.1:50827_ c:collection1 s:shard2 r:core_node1 x:collection1] o.a.s.c.SolrCore no updateRequestProcessorChain defined as default, creating implicit default
   [junit4]   2> 405784 INFO  (coreLoadExecutor-841-thread-1-processing-n:127.0.0.1:50827_) [n:127.0.0.1:50827_ c:collection1 s:shard2 r:core_node1 x:collection1] o.a.s.h.l.XMLLoader xsltCacheLifetimeSeconds=60
   [junit4]   2> 405785 INFO  (coreLoadExecutor-841-thread-1-processing-n:127.0.0.1:50827_) [n:127.0.0.1:50827_ c:collection1 s:shard2 r:core_node1 x:collection1] o.a.s.h.l.XMLLoader xsltCacheLifetimeSeconds=60
   [junit4]   2> 405786 INFO  (coreLoadExecutor-841-thread-1-processing-n:127.0.0.1:50827_) [n:127.0.0.1:50827_ c:collection1 s:shard2 r:core_node1 x:collection1] o.a.s.h.l.XMLLoader xsltCacheLifetimeSeconds=60
   [junit4]   2> 405787 INFO  (coreLoadExecutor-841-thread-1-processing-n:127.0.0.1:50827_) [n:127.0.0.1:50827_ c:collection1 s:shard2 r:core_node1 x:collection1] o.a.s.h.l.XMLLoader xsltCacheLifetimeSeconds=60
   [junit4]   2> 405789 INFO  (coreLoadExecutor-841-thread-1-processing-n:127.0.0.1:50827_) [n:127.0.0.1:50827_ c:collection1 s:shard2 r:core_node1 x:collection1] o.a.s.c.RequestHandlers Registered paths: /admin/mbeans,standard,/update/csv,/update/json/docs,/admin/luke,/admin/segments,/get,/admin/system,/replication,/admin/properties,/config,/schema,/admin/plugins,/admin/logging,/update/json,/admin/threads,/admin/ping,/update,/admin/file
   [junit4]   2> 405790 INFO  (coreLoadExecutor-841-thread-1-processing-n:127.0.0.1:50827_) [n:127.0.0.1:50827_ c:collection1 s:shard2 r:core_node1 x:collection1] o.a.s.c.SolrCore Using default statsCache cache: org.apache.solr.search.stats.LocalStatsCache
   [junit4]   2> 405790 INFO  (coreLoadExecutor-841-thread-1-processing-n:127.0.0.1:50827_) [n:127.0.0.1:50827_ c:collection1 s:shard2 r:core_node1 x:collection1] o.a.s.u.UpdateHandler Using UpdateLog implementation: org.apache.solr.update.UpdateLog
   [junit4]   2> 405791 INFO  (coreLoadExecutor-841-thread-1-processing-n:127.0.0.1:50827_) [n:127.0.0.1:50827_ c:collection1 s:shard2 r:core_node1 x:collection1] o.a.s.u.UpdateLog Initializing UpdateLog: dataDir= defaultSyncLevel=FLUSH numRecordsToKeep=100 maxNumLogsToKeep=10 numVersionBuckets=65536
   [junit4]   2> 405791 INFO  (coreLoadExecutor-841-thread-1-processing-n:127.0.0.1:50827_) [n:127.0.0.1:50827_ c:collection1 s:shard2 r:core_node1 x:collection1] o.a.s.c.SolrCore Hard AutoCommit: disabled
   [junit4]   2> 405791 INFO  (coreLoadExecutor-841-thread-1-processing-n:127.0.0.1:50827_) [n:127.0.0.1:50827_ c:collection1 s:shard2 r:core_node1 x:collection1] o.a.s.c.SolrCore Soft AutoCommit: disabled
   [junit4]   2> 405792 INFO  (coreLoadExecutor-841-thread-1-processing-n:127.0.0.1:50827_) [n:127.0.0.1:50827_ c:collection1 s:shard2 r:core_node1 x:collection1] o.a.s.u.RandomMergePolicy RandomMergePol

[...truncated too long message...]

lection1 s:shard2 r:core_node4 x:collection1] o.a.s.u.DefaultSolrCoreState closing IndexWriter with IndexWriterCloser
   [junit4]   2> 432620 INFO  (TEST-ChaosMonkeySafeLeaderTest.test-seed#[CCCAEA3C17C46C44]) [n:127.0.0.1:59364_ c:collection1 s:shard2 r:core_node4 x:collection1] o.a.s.u.UpdateHandler Committing on IndexWriter close.
   [junit4]   2> 432620 INFO  (zkCallback-270-thread-2-processing-n:127.0.0.1:59364_) [n:127.0.0.1:59364_    ] o.a.s.c.c.ZkStateReader A cluster state change: WatchedEvent state:SyncConnected type:NodeDataChanged path:/clusterstate.json, has occurred - updating... (live nodes size: 1)
   [junit4]   2> 432621 INFO  (zkCallback-270-thread-2-processing-n:127.0.0.1:59364_) [n:127.0.0.1:59364_    ] o.a.s.c.c.ZkStateReader Updated cluster state version to 21
   [junit4]   2> 433762 INFO  (TEST-ChaosMonkeySafeLeaderTest.test-seed#[CCCAEA3C17C46C44]) [n:127.0.0.1:59364_ c:collection1 s:shard2 r:core_node4 x:collection1] o.a.s.c.SolrCore SolrDeletionPolicy.onCommit: commits: num=2
   [junit4]   2> 	commit{dir=/home/jenkins/workspace/Lucene-Solr-trunk-Linux/solr/build/solr-core/test/J1/temp/solr.cloud.ChaosMonkeySafeLeaderTest_CCCAEA3C17C46C44-001/shard-4-001/cores/collection1/data/index,segFN=segments_1,generation=1}
   [junit4]   2> 	commit{dir=/home/jenkins/workspace/Lucene-Solr-trunk-Linux/solr/build/solr-core/test/J1/temp/solr.cloud.ChaosMonkeySafeLeaderTest_CCCAEA3C17C46C44-001/shard-4-001/cores/collection1/data/index,segFN=segments_2,generation=2}
   [junit4]   2> 433762 INFO  (TEST-ChaosMonkeySafeLeaderTest.test-seed#[CCCAEA3C17C46C44]) [n:127.0.0.1:59364_ c:collection1 s:shard2 r:core_node4 x:collection1] o.a.s.c.SolrCore newest commit generation = 2
   [junit4]   2> 433763 INFO  (TEST-ChaosMonkeySafeLeaderTest.test-seed#[CCCAEA3C17C46C44]) [n:127.0.0.1:59364_ c:collection1 s:shard2 r:core_node4 x:collection1] o.a.s.c.SolrCore [collection1] Closing main searcher on request.
   [junit4]   2> 433778 INFO  (TEST-ChaosMonkeySafeLeaderTest.test-seed#[CCCAEA3C17C46C44]) [n:127.0.0.1:59364_ c:collection1 s:shard2 r:core_node4 x:collection1] o.a.s.c.CachingDirectoryFactory Closing StandardDirectoryFactory - 2 directories currently being tracked
   [junit4]   2> 433778 INFO  (TEST-ChaosMonkeySafeLeaderTest.test-seed#[CCCAEA3C17C46C44]) [n:127.0.0.1:59364_ c:collection1 s:shard2 r:core_node4 x:collection1] o.a.s.c.CachingDirectoryFactory looking to close /home/jenkins/workspace/Lucene-Solr-trunk-Linux/solr/build/solr-core/test/J1/temp/solr.cloud.ChaosMonkeySafeLeaderTest_CCCAEA3C17C46C44-001/shard-4-001/cores/collection1/data/index [CachedDir<<refCount=0;path=/home/jenkins/workspace/Lucene-Solr-trunk-Linux/solr/build/solr-core/test/J1/temp/solr.cloud.ChaosMonkeySafeLeaderTest_CCCAEA3C17C46C44-001/shard-4-001/cores/collection1/data/index;done=false>>]
   [junit4]   2> 433778 INFO  (TEST-ChaosMonkeySafeLeaderTest.test-seed#[CCCAEA3C17C46C44]) [n:127.0.0.1:59364_ c:collection1 s:shard2 r:core_node4 x:collection1] o.a.s.c.CachingDirectoryFactory Closing directory: /home/jenkins/workspace/Lucene-Solr-trunk-Linux/solr/build/solr-core/test/J1/temp/solr.cloud.ChaosMonkeySafeLeaderTest_CCCAEA3C17C46C44-001/shard-4-001/cores/collection1/data/index
   [junit4]   2> 433778 INFO  (TEST-ChaosMonkeySafeLeaderTest.test-seed#[CCCAEA3C17C46C44]) [n:127.0.0.1:59364_ c:collection1 s:shard2 r:core_node4 x:collection1] o.a.s.c.CachingDirectoryFactory looking to close /home/jenkins/workspace/Lucene-Solr-trunk-Linux/solr/build/solr-core/test/J1/temp/solr.cloud.ChaosMonkeySafeLeaderTest_CCCAEA3C17C46C44-001/shard-4-001/cores/collection1/data [CachedDir<<refCount=0;path=/home/jenkins/workspace/Lucene-Solr-trunk-Linux/solr/build/solr-core/test/J1/temp/solr.cloud.ChaosMonkeySafeLeaderTest_CCCAEA3C17C46C44-001/shard-4-001/cores/collection1/data;done=false>>]
   [junit4]   2> 433779 INFO  (TEST-ChaosMonkeySafeLeaderTest.test-seed#[CCCAEA3C17C46C44]) [n:127.0.0.1:59364_ c:collection1 s:shard2 r:core_node4 x:collection1] o.a.s.c.CachingDirectoryFactory Closing directory: /home/jenkins/workspace/Lucene-Solr-trunk-Linux/solr/build/solr-core/test/J1/temp/solr.cloud.ChaosMonkeySafeLeaderTest_CCCAEA3C17C46C44-001/shard-4-001/cores/collection1/data
   [junit4]   2> 433779 INFO  (TEST-ChaosMonkeySafeLeaderTest.test-seed#[CCCAEA3C17C46C44]) [n:127.0.0.1:59364_ c:collection1 s:shard2 r:core_node4 x:collection1] o.a.s.c.Overseer Overseer (id=94276463044329490-127.0.0.1:59364_-n_0000000004) closing
   [junit4]   2> 433779 INFO  (OverseerStateUpdate-94276463044329490-127.0.0.1:59364_-n_0000000004) [n:127.0.0.1:59364_    ] o.a.s.c.Overseer Overseer Loop exiting : 127.0.0.1:59364_
   [junit4]   2> 433780 WARN  (zkCallback-270-thread-2-processing-n:127.0.0.1:59364_) [n:127.0.0.1:59364_    ] o.a.s.c.c.ZkStateReader ZooKeeper watch triggered, but Solr cannot talk to ZK
   [junit4]   2> 433783 INFO  (TEST-ChaosMonkeySafeLeaderTest.test-seed#[CCCAEA3C17C46C44]) [    ] o.e.j.s.ServerConnector Stopped ServerConnector@1c42601{SSL-http/1.1}{127.0.0.1:0}
   [junit4]   2> 433783 INFO  (TEST-ChaosMonkeySafeLeaderTest.test-seed#[CCCAEA3C17C46C44]) [    ] o.e.j.s.h.ContextHandler Stopped o.e.j.s.ServletContextHandler@e312e3{/,null,UNAVAILABLE}
   [junit4]   2> 433784 INFO  (TEST-ChaosMonkeySafeLeaderTest.test-seed#[CCCAEA3C17C46C44]) [n:127.0.0.1:59364_ c:collection1 s:shard2 r:core_node4 x:collection1] o.a.s.c.ZkTestServer connecting to 127.0.0.1:46107 46107
   [junit4]   2> 433795 INFO  (Thread-598) [    ] o.a.s.c.ZkTestServer connecting to 127.0.0.1:46107 46107
   [junit4]   2> 433796 WARN  (Thread-598) [    ] o.a.s.c.ZkTestServer Watch limit violations: 
   [junit4]   2> Maximum concurrent create/delete watches above limit:
   [junit4]   2> 
   [junit4]   2> 	6	/solr/aliases.json
   [junit4]   2> 	6	/solr/clusterstate.json
   [junit4]   2> 	5	/solr/configs/conf1
   [junit4]   2> 
   [junit4]   2> Maximum concurrent children watches above limit:
   [junit4]   2> 
   [junit4]   2> 	6	/solr/live_nodes
   [junit4]   2> 	5	/solr/overseer/queue
   [junit4]   2> 	5	/solr/overseer/collection-queue-work
   [junit4]   2> 
   [junit4]   2> NOTE: reproduce with: ant test  -Dtestcase=ChaosMonkeySafeLeaderTest -Dtests.method=test -Dtests.seed=CCCAEA3C17C46C44 -Dtests.multiplier=3 -Dtests.slow=true -Dtests.locale=fr_LU -Dtests.timezone=Asia/Istanbul -Dtests.asserts=true -Dtests.file.encoding=UTF-8
   [junit4] FAILURE 32.1s J1 | ChaosMonkeySafeLeaderTest.test <<<
   [junit4]    > Throwable #1: java.lang.AssertionError: expected:<0> but was:<1>
   [junit4]    > 	at __randomizedtesting.SeedInfo.seed([CCCAEA3C17C46C44:449ED5E6B93801BC]:0)
   [junit4]    > 	at org.apache.solr.cloud.ChaosMonkeySafeLeaderTest.test(ChaosMonkeySafeLeaderTest.java:156)
   [junit4]    > 	at org.apache.solr.BaseDistributedSearchTestCase$ShardsRepeatRule$ShardsFixedStatement.callStatement(BaseDistributedSearchTestCase.java:966)
   [junit4]    > 	at org.apache.solr.BaseDistributedSearchTestCase$ShardsRepeatRule$ShardsStatement.evaluate(BaseDistributedSearchTestCase.java:941)
   [junit4]    > 	at java.lang.Thread.run(Thread.java:745)
   [junit4]   2> 433813 INFO  (SUITE-ChaosMonkeySafeLeaderTest-seed#[CCCAEA3C17C46C44]-worker) [n:127.0.0.1:59364_ c:collection1 s:shard2 r:core_node4 x:collection1] o.a.s.SolrTestCaseJ4 ###deleteCore
   [junit4]   2> NOTE: leaving temporary files on disk at: /home/jenkins/workspace/Lucene-Solr-trunk-Linux/solr/build/solr-core/test/J1/temp/solr.cloud.ChaosMonkeySafeLeaderTest_CCCAEA3C17C46C44-001
   [junit4]   2> Aug 02, 2015 7:44:55 PM com.carrotsearch.randomizedtesting.ThreadLeakControl checkThreadLeaks
   [junit4]   2> WARNING: Will linger awaiting termination of 2 leaked thread(s).
   [junit4]   2> NOTE: test params are: codec=FastCompressingStoredFields(storedFieldsFormat=CompressingStoredFieldsFormat(compressionMode=FAST, chunkSize=5956, maxDocsPerChunk=725, blockSize=9), termVectorsFormat=CompressingTermVectorsFormat(compressionMode=FAST, chunkSize=5956, blockSize=9)), sim=DefaultSimilarity, locale=fr_LU, timezone=Asia/Istanbul
   [junit4]   2> NOTE: Linux 3.16.0-44-generic i386/Oracle Corporation 1.8.0_51 (32-bit)/cpus=12,threads=1,free=35518512,total=183918592
   [junit4]   2> NOTE: All tests run in this JVM: [DistribDocExpirationUpdateProcessorTest, ZkSolrClientTest, TestCoreContainer, ShardSplitTest, TestSolrCoreProperties, ExitableDirectoryReaderTest, WordBreakSolrSpellCheckerTest, TestFastWriter, TestJsonFacets, TestClassNameShortening, TestSolrConfigHandlerConcurrent, SmileWriterTest, AnalysisAfterCoreReloadTest, TestNRTOpen, ConnectionManagerTest, SegmentsInfoRequestHandlerTest, DeleteLastCustomShardedReplicaTest, CurrencyFieldOpenExchangeTest, CacheHeaderTest, BadComponentTest, ClusterStateUpdateTest, ChaosMonkeySafeLeaderTest]
   [junit4] Completed [104/529] on J1 in 32.89s, 1 test, 1 failure <<< FAILURES!

[...truncated 1343 lines...]
BUILD FAILED
/home/jenkins/workspace/Lucene-Solr-trunk-Linux/build.xml:716: The following error occurred while executing this line:
/home/jenkins/workspace/Lucene-Solr-trunk-Linux/build.xml:660: The following error occurred while executing this line:
/home/jenkins/workspace/Lucene-Solr-trunk-Linux/build.xml:59: The following error occurred while executing this line:
/home/jenkins/workspace/Lucene-Solr-trunk-Linux/solr/build.xml:230: The following error occurred while executing this line:
/home/jenkins/workspace/Lucene-Solr-trunk-Linux/solr/common-build.xml:514: The following error occurred while executing this line:
/home/jenkins/workspace/Lucene-Solr-trunk-Linux/lucene/common-build.xml:1429: The following error occurred while executing this line:
/home/jenkins/workspace/Lucene-Solr-trunk-Linux/lucene/common-build.xml:984: There were test failures: 529 suites, 2092 tests, 1 failure, 65 ignored (30 assumptions)

Total time: 51 minutes 15 seconds
Build step 'Invoke Ant' marked build as failure
Archiving artifacts
Recording test results
Email was triggered for: Failure - Any
Sending email for trigger: Failure - Any



Mime
View raw message