lucene-dev mailing list archives

Site index · List index
Message view « Date » · « Thread »
Top « Date » · « Thread »
From Policeman Jenkins Server <jenk...@thetaphi.de>
Subject [JENKINS-EA] Lucene-Solr-trunk-Linux (64bit/jdk1.8.0_60-ea-b24) - Build # 13779 - Failure!
Date Sat, 08 Aug 2015 14:43:53 GMT
Build: http://jenkins.thetaphi.de/job/Lucene-Solr-trunk-Linux/13779/
Java: 64bit/jdk1.8.0_60-ea-b24 -XX:+UseCompressedOops -XX:+UseSerialGC

1 tests failed.
FAILED:  org.apache.solr.cloud.CdcrReplicationHandlerTest.doTest

Error Message:
Captured an uncaught exception in thread: Thread[id=3409, name=RecoveryThread-source_collection_shard1_replica2, state=RUNNABLE, group=TGRP-CdcrReplicationHandlerTest]

Stack Trace:
com.carrotsearch.randomizedtesting.UncaughtExceptionError: Captured an uncaught exception in thread: Thread[id=3409, name=RecoveryThread-source_collection_shard1_replica2, state=RUNNABLE, group=TGRP-CdcrReplicationHandlerTest]
Caused by: org.apache.solr.common.cloud.ZooKeeperException: 
	at __randomizedtesting.SeedInfo.seed([C9505F2D83ABFC2B]:0)
	at org.apache.solr.cloud.RecoveryStrategy.run(RecoveryStrategy.java:234)
Caused by: org.apache.solr.common.SolrException: java.io.FileNotFoundException: /home/jenkins/workspace/Lucene-Solr-trunk-Linux/solr/build/solr-core/test/J0/temp/solr.cloud.CdcrReplicationHandlerTest_C9505F2D83ABFC2B-001/jetty-002/cores/source_collection_shard1_replica2/data/tlog/tlog.0000000000000000007.1508946704600137728 (No such file or directory)
	at org.apache.solr.update.CdcrTransactionLog.reopenOutputStream(CdcrTransactionLog.java:244)
	at org.apache.solr.update.CdcrTransactionLog.incref(CdcrTransactionLog.java:173)
	at org.apache.solr.update.UpdateLog.getRecentUpdates(UpdateLog.java:1079)
	at org.apache.solr.update.UpdateLog.seedBucketsWithHighestVersion(UpdateLog.java:1579)
	at org.apache.solr.update.UpdateLog.seedBucketsWithHighestVersion(UpdateLog.java:1610)
	at org.apache.solr.core.SolrCore.seedVersionBuckets(SolrCore.java:877)
	at org.apache.solr.cloud.RecoveryStrategy.doRecovery(RecoveryStrategy.java:526)
	at org.apache.solr.cloud.RecoveryStrategy.run(RecoveryStrategy.java:227)
Caused by: java.io.FileNotFoundException: /home/jenkins/workspace/Lucene-Solr-trunk-Linux/solr/build/solr-core/test/J0/temp/solr.cloud.CdcrReplicationHandlerTest_C9505F2D83ABFC2B-001/jetty-002/cores/source_collection_shard1_replica2/data/tlog/tlog.0000000000000000007.1508946704600137728 (No such file or directory)
	at java.io.RandomAccessFile.open0(Native Method)
	at java.io.RandomAccessFile.open(RandomAccessFile.java:316)
	at java.io.RandomAccessFile.<init>(RandomAccessFile.java:243)
	at org.apache.solr.update.CdcrTransactionLog.reopenOutputStream(CdcrTransactionLog.java:236)
	... 7 more




Build Log:
[...truncated 10425 lines...]
   [junit4] Suite: org.apache.solr.cloud.CdcrReplicationHandlerTest
   [junit4]   2> Creating dataDir: /home/jenkins/workspace/Lucene-Solr-trunk-Linux/solr/build/solr-core/test/J0/temp/solr.cloud.CdcrReplicationHandlerTest_C9505F2D83ABFC2B-001/init-core-data-001
   [junit4]   2> 375146 INFO  (SUITE-CdcrReplicationHandlerTest-seed#[C9505F2D83ABFC2B]-worker) [    ] o.a.s.SolrTestCaseJ4 Randomized ssl (true) and clientAuth (false)
   [junit4]   2> 375146 INFO  (SUITE-CdcrReplicationHandlerTest-seed#[C9505F2D83ABFC2B]-worker) [    ] o.a.s.BaseDistributedSearchTestCase Setting hostContext system property: /lw/i
   [junit4]   2> 375148 INFO  (TEST-CdcrReplicationHandlerTest.doTest-seed#[C9505F2D83ABFC2B]) [    ] o.a.s.c.ZkTestServer STARTING ZK TEST SERVER
   [junit4]   2> 375148 INFO  (Thread-1191) [    ] o.a.s.c.ZkTestServer client port:0.0.0.0/0.0.0.0:0
   [junit4]   2> 375148 INFO  (Thread-1191) [    ] o.a.s.c.ZkTestServer Starting server
   [junit4]   2> 375248 INFO  (TEST-CdcrReplicationHandlerTest.doTest-seed#[C9505F2D83ABFC2B]) [    ] o.a.s.c.ZkTestServer start zk server on port:57581
   [junit4]   2> 375248 INFO  (TEST-CdcrReplicationHandlerTest.doTest-seed#[C9505F2D83ABFC2B]) [    ] o.a.s.c.c.SolrZkClient Using default ZkCredentialsProvider
   [junit4]   2> 375249 INFO  (TEST-CdcrReplicationHandlerTest.doTest-seed#[C9505F2D83ABFC2B]) [    ] o.a.s.c.c.ConnectionManager Waiting for client to connect to ZooKeeper
   [junit4]   2> 375250 INFO  (zkCallback-421-thread-1) [    ] o.a.s.c.c.ConnectionManager Watcher org.apache.solr.common.cloud.ConnectionManager@1e92fb5 name:ZooKeeperConnection Watcher:127.0.0.1:57581 got event WatchedEvent state:SyncConnected type:None path:null path:null type:None
   [junit4]   2> 375250 INFO  (TEST-CdcrReplicationHandlerTest.doTest-seed#[C9505F2D83ABFC2B]) [    ] o.a.s.c.c.ConnectionManager Client is connected to ZooKeeper
   [junit4]   2> 375251 INFO  (TEST-CdcrReplicationHandlerTest.doTest-seed#[C9505F2D83ABFC2B]) [    ] o.a.s.c.c.SolrZkClient Using default ZkACLProvider
   [junit4]   2> 375251 INFO  (TEST-CdcrReplicationHandlerTest.doTest-seed#[C9505F2D83ABFC2B]) [    ] o.a.s.c.c.SolrZkClient makePath: /solr
   [junit4]   2> 375252 INFO  (TEST-CdcrReplicationHandlerTest.doTest-seed#[C9505F2D83ABFC2B]) [    ] o.a.s.c.c.SolrZkClient Using default ZkCredentialsProvider
   [junit4]   2> 375252 INFO  (TEST-CdcrReplicationHandlerTest.doTest-seed#[C9505F2D83ABFC2B]) [    ] o.a.s.c.c.ConnectionManager Waiting for client to connect to ZooKeeper
   [junit4]   2> 375253 INFO  (zkCallback-422-thread-1) [    ] o.a.s.c.c.ConnectionManager Watcher org.apache.solr.common.cloud.ConnectionManager@12453954 name:ZooKeeperConnection Watcher:127.0.0.1:57581/solr got event WatchedEvent state:SyncConnected type:None path:null path:null type:None
   [junit4]   2> 375253 INFO  (TEST-CdcrReplicationHandlerTest.doTest-seed#[C9505F2D83ABFC2B]) [    ] o.a.s.c.c.ConnectionManager Client is connected to ZooKeeper
   [junit4]   2> 375253 INFO  (TEST-CdcrReplicationHandlerTest.doTest-seed#[C9505F2D83ABFC2B]) [    ] o.a.s.c.c.SolrZkClient Using default ZkACLProvider
   [junit4]   2> 375253 INFO  (TEST-CdcrReplicationHandlerTest.doTest-seed#[C9505F2D83ABFC2B]) [    ] o.a.s.c.c.SolrZkClient makePath: /collections/collection1
   [junit4]   2> 375254 INFO  (TEST-CdcrReplicationHandlerTest.doTest-seed#[C9505F2D83ABFC2B]) [    ] o.a.s.c.c.SolrZkClient makePath: /collections/collection1/shards
   [junit4]   2> 375254 INFO  (TEST-CdcrReplicationHandlerTest.doTest-seed#[C9505F2D83ABFC2B]) [    ] o.a.s.c.c.SolrZkClient makePath: /collections/control_collection
   [junit4]   2> 375254 INFO  (TEST-CdcrReplicationHandlerTest.doTest-seed#[C9505F2D83ABFC2B]) [    ] o.a.s.c.c.SolrZkClient makePath: /collections/control_collection/shards
   [junit4]   2> 375255 INFO  (TEST-CdcrReplicationHandlerTest.doTest-seed#[C9505F2D83ABFC2B]) [    ] o.a.s.c.AbstractZkTestCase put /home/jenkins/workspace/Lucene-Solr-trunk-Linux/solr/core/src/test-files/solr/collection1/conf/solrconfig-cdcr.xml to /configs/conf1/solrconfig.xml
   [junit4]   2> 375255 INFO  (TEST-CdcrReplicationHandlerTest.doTest-seed#[C9505F2D83ABFC2B]) [    ] o.a.s.c.c.SolrZkClient makePath: /configs/conf1/solrconfig.xml
   [junit4]   2> 375256 INFO  (TEST-CdcrReplicationHandlerTest.doTest-seed#[C9505F2D83ABFC2B]) [    ] o.a.s.c.AbstractZkTestCase put /home/jenkins/workspace/Lucene-Solr-trunk-Linux/solr/core/src/test-files/solr/collection1/conf/schema15.xml to /configs/conf1/schema.xml
   [junit4]   2> 375256 INFO  (TEST-CdcrReplicationHandlerTest.doTest-seed#[C9505F2D83ABFC2B]) [    ] o.a.s.c.c.SolrZkClient makePath: /configs/conf1/schema.xml
   [junit4]   2> 375257 INFO  (TEST-CdcrReplicationHandlerTest.doTest-seed#[C9505F2D83ABFC2B]) [    ] o.a.s.c.AbstractZkTestCase put /home/jenkins/workspace/Lucene-Solr-trunk-Linux/solr/core/src/test-files/solr/collection1/conf/solrconfig.snippet.randomindexconfig.xml to /configs/conf1/solrconfig.snippet.randomindexconfig.xml
   [junit4]   2> 375257 INFO  (TEST-CdcrReplicationHandlerTest.doTest-seed#[C9505F2D83ABFC2B]) [    ] o.a.s.c.c.SolrZkClient makePath: /configs/conf1/solrconfig.snippet.randomindexconfig.xml
   [junit4]   2> 375257 INFO  (TEST-CdcrReplicationHandlerTest.doTest-seed#[C9505F2D83ABFC2B]) [    ] o.a.s.c.AbstractZkTestCase put /home/jenkins/workspace/Lucene-Solr-trunk-Linux/solr/core/src/test-files/solr/collection1/conf/stopwords.txt to /configs/conf1/stopwords.txt
   [junit4]   2> 375258 INFO  (TEST-CdcrReplicationHandlerTest.doTest-seed#[C9505F2D83ABFC2B]) [    ] o.a.s.c.c.SolrZkClient makePath: /configs/conf1/stopwords.txt
   [junit4]   2> 375258 INFO  (TEST-CdcrReplicationHandlerTest.doTest-seed#[C9505F2D83ABFC2B]) [    ] o.a.s.c.AbstractZkTestCase put /home/jenkins/workspace/Lucene-Solr-trunk-Linux/solr/core/src/test-files/solr/collection1/conf/protwords.txt to /configs/conf1/protwords.txt
   [junit4]   2> 375258 INFO  (TEST-CdcrReplicationHandlerTest.doTest-seed#[C9505F2D83ABFC2B]) [    ] o.a.s.c.c.SolrZkClient makePath: /configs/conf1/protwords.txt
   [junit4]   2> 375259 INFO  (TEST-CdcrReplicationHandlerTest.doTest-seed#[C9505F2D83ABFC2B]) [    ] o.a.s.c.AbstractZkTestCase put /home/jenkins/workspace/Lucene-Solr-trunk-Linux/solr/core/src/test-files/solr/collection1/conf/currency.xml to /configs/conf1/currency.xml
   [junit4]   2> 375259 INFO  (TEST-CdcrReplicationHandlerTest.doTest-seed#[C9505F2D83ABFC2B]) [    ] o.a.s.c.c.SolrZkClient makePath: /configs/conf1/currency.xml
   [junit4]   2> 375259 INFO  (TEST-CdcrReplicationHandlerTest.doTest-seed#[C9505F2D83ABFC2B]) [    ] o.a.s.c.AbstractZkTestCase put /home/jenkins/workspace/Lucene-Solr-trunk-Linux/solr/core/src/test-files/solr/collection1/conf/enumsConfig.xml to /configs/conf1/enumsConfig.xml
   [junit4]   2> 375259 INFO  (TEST-CdcrReplicationHandlerTest.doTest-seed#[C9505F2D83ABFC2B]) [    ] o.a.s.c.c.SolrZkClient makePath: /configs/conf1/enumsConfig.xml
   [junit4]   2> 375260 INFO  (TEST-CdcrReplicationHandlerTest.doTest-seed#[C9505F2D83ABFC2B]) [    ] o.a.s.c.AbstractZkTestCase put /home/jenkins/workspace/Lucene-Solr-trunk-Linux/solr/core/src/test-files/solr/collection1/conf/open-exchange-rates.json to /configs/conf1/open-exchange-rates.json
   [junit4]   2> 375260 INFO  (TEST-CdcrReplicationHandlerTest.doTest-seed#[C9505F2D83ABFC2B]) [    ] o.a.s.c.c.SolrZkClient makePath: /configs/conf1/open-exchange-rates.json
   [junit4]   2> 375261 INFO  (TEST-CdcrReplicationHandlerTest.doTest-seed#[C9505F2D83ABFC2B]) [    ] o.a.s.c.AbstractZkTestCase put /home/jenkins/workspace/Lucene-Solr-trunk-Linux/solr/core/src/test-files/solr/collection1/conf/mapping-ISOLatin1Accent.txt to /configs/conf1/mapping-ISOLatin1Accent.txt
   [junit4]   2> 375261 INFO  (TEST-CdcrReplicationHandlerTest.doTest-seed#[C9505F2D83ABFC2B]) [    ] o.a.s.c.c.SolrZkClient makePath: /configs/conf1/mapping-ISOLatin1Accent.txt
   [junit4]   2> 375261 INFO  (TEST-CdcrReplicationHandlerTest.doTest-seed#[C9505F2D83ABFC2B]) [    ] o.a.s.c.AbstractZkTestCase put /home/jenkins/workspace/Lucene-Solr-trunk-Linux/solr/core/src/test-files/solr/collection1/conf/old_synonyms.txt to /configs/conf1/old_synonyms.txt
   [junit4]   2> 375261 INFO  (TEST-CdcrReplicationHandlerTest.doTest-seed#[C9505F2D83ABFC2B]) [    ] o.a.s.c.c.SolrZkClient makePath: /configs/conf1/old_synonyms.txt
   [junit4]   2> 375262 INFO  (TEST-CdcrReplicationHandlerTest.doTest-seed#[C9505F2D83ABFC2B]) [    ] o.a.s.c.AbstractZkTestCase put /home/jenkins/workspace/Lucene-Solr-trunk-Linux/solr/core/src/test-files/solr/collection1/conf/synonyms.txt to /configs/conf1/synonyms.txt
   [junit4]   2> 375262 INFO  (TEST-CdcrReplicationHandlerTest.doTest-seed#[C9505F2D83ABFC2B]) [    ] o.a.s.c.c.SolrZkClient makePath: /configs/conf1/synonyms.txt
   [junit4]   2> 375263 INFO  (TEST-CdcrReplicationHandlerTest.doTest-seed#[C9505F2D83ABFC2B]) [    ] o.a.s.c.c.SolrZkClient Using default ZkCredentialsProvider
   [junit4]   2> 375263 INFO  (TEST-CdcrReplicationHandlerTest.doTest-seed#[C9505F2D83ABFC2B]) [    ] o.a.s.c.c.ConnectionManager Waiting for client to connect to ZooKeeper
   [junit4]   2> 375264 INFO  (zkCallback-423-thread-1) [    ] o.a.s.c.c.ConnectionManager Watcher org.apache.solr.common.cloud.ConnectionManager@750df039 name:ZooKeeperConnection Watcher:127.0.0.1:57581/solr got event WatchedEvent state:SyncConnected type:None path:null path:null type:None
   [junit4]   2> 375264 INFO  (TEST-CdcrReplicationHandlerTest.doTest-seed#[C9505F2D83ABFC2B]) [    ] o.a.s.c.c.ConnectionManager Client is connected to ZooKeeper
   [junit4]   2> 375264 INFO  (TEST-CdcrReplicationHandlerTest.doTest-seed#[C9505F2D83ABFC2B]) [    ] o.a.s.c.c.SolrZkClient Using default ZkACLProvider
   [junit4]   2> 375264 INFO  (TEST-CdcrReplicationHandlerTest.doTest-seed#[C9505F2D83ABFC2B]) [    ] o.a.s.SolrTestCaseJ4 ###Starting doTest
   [junit4]   2> 375315 INFO  (TEST-CdcrReplicationHandlerTest.doTest-seed#[C9505F2D83ABFC2B]) [    ] o.a.s.SolrTestCaseJ4 Writing core.properties file to /home/jenkins/workspace/Lucene-Solr-trunk-Linux/solr/build/solr-core/test/J0/temp/solr.cloud.CdcrReplicationHandlerTest_C9505F2D83ABFC2B-001/jetty-001/cores/collection1
   [junit4]   2> 375316 INFO  (TEST-CdcrReplicationHandlerTest.doTest-seed#[C9505F2D83ABFC2B]) [    ] o.e.j.s.Server jetty-9.2.11.v20150529
   [junit4]   2> 375317 INFO  (TEST-CdcrReplicationHandlerTest.doTest-seed#[C9505F2D83ABFC2B]) [    ] o.e.j.s.h.ContextHandler Started o.e.j.s.ServletContextHandler@26154a86{/lw/i,null,AVAILABLE}
   [junit4]   2> 375323 INFO  (TEST-CdcrReplicationHandlerTest.doTest-seed#[C9505F2D83ABFC2B]) [    ] o.e.j.s.ServerConnector Started ServerConnector@5e28212e{SSL-http/1.1}{127.0.0.1:53508}
   [junit4]   2> 375323 INFO  (TEST-CdcrReplicationHandlerTest.doTest-seed#[C9505F2D83ABFC2B]) [    ] o.e.j.s.Server Started @377293ms
   [junit4]   2> 375323 INFO  (TEST-CdcrReplicationHandlerTest.doTest-seed#[C9505F2D83ABFC2B]) [    ] o.a.s.c.s.e.JettySolrRunner Jetty properties: {shards=shard1, hostContext=/lw/i, hostPort=53508, coreRootDirectory=/home/jenkins/workspace/Lucene-Solr-trunk-Linux/solr/build/solr-core/test/J0/temp/solr.cloud.CdcrReplicationHandlerTest_C9505F2D83ABFC2B-001/jetty-001/cores}
   [junit4]   2> 375323 INFO  (TEST-CdcrReplicationHandlerTest.doTest-seed#[C9505F2D83ABFC2B]) [    ] o.a.s.s.SolrDispatchFilter SolrDispatchFilter.init(): sun.misc.Launcher$AppClassLoader@4e0e2f2a
   [junit4]   2> 375323 INFO  (TEST-CdcrReplicationHandlerTest.doTest-seed#[C9505F2D83ABFC2B]) [    ] o.a.s.c.SolrResourceLoader new SolrResourceLoader for directory: '/home/jenkins/workspace/Lucene-Solr-trunk-Linux/solr/build/solr-core/test/J0/temp/solr.cloud.CdcrReplicationHandlerTest_C9505F2D83ABFC2B-001/jetty-001/'
   [junit4]   2> 375333 INFO  (TEST-CdcrReplicationHandlerTest.doTest-seed#[C9505F2D83ABFC2B]) [    ] o.a.s.c.c.SolrZkClient Using default ZkCredentialsProvider
   [junit4]   2> 375333 INFO  (TEST-CdcrReplicationHandlerTest.doTest-seed#[C9505F2D83ABFC2B]) [    ] o.a.s.c.c.ConnectionManager Waiting for client to connect to ZooKeeper
   [junit4]   2> 375334 INFO  (zkCallback-424-thread-1) [    ] o.a.s.c.c.ConnectionManager Watcher org.apache.solr.common.cloud.ConnectionManager@11dc02e3 name:ZooKeeperConnection Watcher:127.0.0.1:57581/solr got event WatchedEvent state:SyncConnected type:None path:null path:null type:None
   [junit4]   2> 375334 INFO  (TEST-CdcrReplicationHandlerTest.doTest-seed#[C9505F2D83ABFC2B]) [    ] o.a.s.c.c.ConnectionManager Client is connected to ZooKeeper
   [junit4]   2> 375334 INFO  (TEST-CdcrReplicationHandlerTest.doTest-seed#[C9505F2D83ABFC2B]) [    ] o.a.s.c.c.SolrZkClient Using default ZkACLProvider
   [junit4]   2> 375335 INFO  (TEST-CdcrReplicationHandlerTest.doTest-seed#[C9505F2D83ABFC2B]) [    ] o.a.s.s.SolrDispatchFilter Loading solr.xml from SolrHome (not found in ZooKeeper)
   [junit4]   2> 375335 INFO  (TEST-CdcrReplicationHandlerTest.doTest-seed#[C9505F2D83ABFC2B]) [    ] o.a.s.c.SolrXmlConfig Loading container configuration from /home/jenkins/workspace/Lucene-Solr-trunk-Linux/solr/build/solr-core/test/J0/temp/solr.cloud.CdcrReplicationHandlerTest_C9505F2D83ABFC2B-001/jetty-001/solr.xml
   [junit4]   2> 375338 INFO  (TEST-CdcrReplicationHandlerTest.doTest-seed#[C9505F2D83ABFC2B]) [    ] o.a.s.c.CoresLocator Config-defined core root directory: /home/jenkins/workspace/Lucene-Solr-trunk-Linux/solr/build/solr-core/test/J0/temp/solr.cloud.CdcrReplicationHandlerTest_C9505F2D83ABFC2B-001/jetty-001/cores
   [junit4]   2> 375338 INFO  (TEST-CdcrReplicationHandlerTest.doTest-seed#[C9505F2D83ABFC2B]) [    ] o.a.s.c.CoreContainer New CoreContainer 1542174862
   [junit4]   2> 375338 INFO  (TEST-CdcrReplicationHandlerTest.doTest-seed#[C9505F2D83ABFC2B]) [    ] o.a.s.c.CoreContainer Loading cores into CoreContainer [instanceDir=/home/jenkins/workspace/Lucene-Solr-trunk-Linux/solr/build/solr-core/test/J0/temp/solr.cloud.CdcrReplicationHandlerTest_C9505F2D83ABFC2B-001/jetty-001/]
   [junit4]   2> 375338 INFO  (TEST-CdcrReplicationHandlerTest.doTest-seed#[C9505F2D83ABFC2B]) [    ] o.a.s.c.CoreContainer loading shared library: /home/jenkins/workspace/Lucene-Solr-trunk-Linux/solr/build/solr-core/test/J0/temp/solr.cloud.CdcrReplicationHandlerTest_C9505F2D83ABFC2B-001/jetty-001/lib
   [junit4]   2> 375339 WARN  (TEST-CdcrReplicationHandlerTest.doTest-seed#[C9505F2D83ABFC2B]) [    ] o.a.s.c.SolrResourceLoader Can't find (or read) directory to add to classloader: lib (resolved as: /home/jenkins/workspace/Lucene-Solr-trunk-Linux/solr/build/solr-core/test/J0/temp/solr.cloud.CdcrReplicationHandlerTest_C9505F2D83ABFC2B-001/jetty-001/lib).
   [junit4]   2> 375343 INFO  (TEST-CdcrReplicationHandlerTest.doTest-seed#[C9505F2D83ABFC2B]) [    ] o.a.s.h.c.HttpShardHandlerFactory created with socketTimeout : 90000,urlScheme : ,connTimeout : 15000,maxConnectionsPerHost : 20,maxConnections : 10000,corePoolSize : 0,maximumPoolSize : 2147483647,maxThreadIdleTime : 5,sizeOfQueue : -1,fairnessPolicy : false,useRetries : false,
   [junit4]   2> 375345 INFO  (TEST-CdcrReplicationHandlerTest.doTest-seed#[C9505F2D83ABFC2B]) [    ] o.a.s.u.UpdateShardHandler Creating UpdateShardHandler HTTP client with params: socketTimeout=340000&connTimeout=45000&retry=true
   [junit4]   2> 375346 INFO  (TEST-CdcrReplicationHandlerTest.doTest-seed#[C9505F2D83ABFC2B]) [    ] o.a.s.l.LogWatcher SLF4J impl is org.slf4j.impl.Log4jLoggerFactory
   [junit4]   2> 375346 INFO  (TEST-CdcrReplicationHandlerTest.doTest-seed#[C9505F2D83ABFC2B]) [    ] o.a.s.l.LogWatcher Registering Log Listener [Log4j (org.slf4j.impl.Log4jLoggerFactory)]
   [junit4]   2> 375346 INFO  (TEST-CdcrReplicationHandlerTest.doTest-seed#[C9505F2D83ABFC2B]) [    ] o.a.s.c.ZkContainer Zookeeper client=127.0.0.1:57581/solr
   [junit4]   2> 375346 INFO  (TEST-CdcrReplicationHandlerTest.doTest-seed#[C9505F2D83ABFC2B]) [    ] o.a.s.c.ZkController zkHost includes chroot
   [junit4]   2> 375346 INFO  (TEST-CdcrReplicationHandlerTest.doTest-seed#[C9505F2D83ABFC2B]) [    ] o.a.s.c.c.SolrZkClient Using default ZkCredentialsProvider
   [junit4]   2> 375346 INFO  (TEST-CdcrReplicationHandlerTest.doTest-seed#[C9505F2D83ABFC2B]) [    ] o.a.s.c.c.ConnectionManager Waiting for client to connect to ZooKeeper
   [junit4]   2> 375347 INFO  (zkCallback-426-thread-1) [    ] o.a.s.c.c.ConnectionManager Watcher org.apache.solr.common.cloud.ConnectionManager@1bb395ac name:ZooKeeperConnection Watcher:127.0.0.1:57581 got event WatchedEvent state:SyncConnected type:None path:null path:null type:None
   [junit4]   2> 375348 INFO  (TEST-CdcrReplicationHandlerTest.doTest-seed#[C9505F2D83ABFC2B]) [    ] o.a.s.c.c.ConnectionManager Client is connected to ZooKeeper
   [junit4]   2> 375348 INFO  (TEST-CdcrReplicationHandlerTest.doTest-seed#[C9505F2D83ABFC2B]) [    ] o.a.s.c.c.SolrZkClient Using default ZkACLProvider
   [junit4]   2> 375349 INFO  (TEST-CdcrReplicationHandlerTest.doTest-seed#[C9505F2D83ABFC2B]) [n:127.0.0.1:53508_lw%2Fi    ] o.a.s.c.c.ConnectionManager Waiting for client to connect to ZooKeeper
   [junit4]   2> 375349 INFO  (zkCallback-427-thread-1-processing-n:127.0.0.1:53508_lw%2Fi) [n:127.0.0.1:53508_lw%2Fi    ] o.a.s.c.c.ConnectionManager Watcher org.apache.solr.common.cloud.ConnectionManager@4a990137 name:ZooKeeperConnection Watcher:127.0.0.1:57581/solr got event WatchedEvent state:SyncConnected type:None path:null path:null type:None
   [junit4]   2> 375349 INFO  (TEST-CdcrReplicationHandlerTest.doTest-seed#[C9505F2D83ABFC2B]) [n:127.0.0.1:53508_lw%2Fi    ] o.a.s.c.c.ConnectionManager Client is connected to ZooKeeper
   [junit4]   2> 375350 INFO  (TEST-CdcrReplicationHandlerTest.doTest-seed#[C9505F2D83ABFC2B]) [n:127.0.0.1:53508_lw%2Fi    ] o.a.s.c.c.SolrZkClient makePath: /overseer/queue
   [junit4]   2> 375351 INFO  (TEST-CdcrReplicationHandlerTest.doTest-seed#[C9505F2D83ABFC2B]) [n:127.0.0.1:53508_lw%2Fi    ] o.a.s.c.c.SolrZkClient makePath: /overseer/collection-queue-work
   [junit4]   2> 375351 INFO  (TEST-CdcrReplicationHandlerTest.doTest-seed#[C9505F2D83ABFC2B]) [n:127.0.0.1:53508_lw%2Fi    ] o.a.s.c.c.SolrZkClient makePath: /overseer/collection-map-running
   [junit4]   2> 375352 INFO  (TEST-CdcrReplicationHandlerTest.doTest-seed#[C9505F2D83ABFC2B]) [n:127.0.0.1:53508_lw%2Fi    ] o.a.s.c.c.SolrZkClient makePath: /overseer/collection-map-completed
   [junit4]   2> 375353 INFO  (TEST-CdcrReplicationHandlerTest.doTest-seed#[C9505F2D83ABFC2B]) [n:127.0.0.1:53508_lw%2Fi    ] o.a.s.c.c.SolrZkClient makePath: /overseer/collection-map-failure
   [junit4]   2> 375354 INFO  (TEST-CdcrReplicationHandlerTest.doTest-seed#[C9505F2D83ABFC2B]) [n:127.0.0.1:53508_lw%2Fi    ] o.a.s.c.c.SolrZkClient makePath: /live_nodes
   [junit4]   2> 375354 INFO  (TEST-CdcrReplicationHandlerTest.doTest-seed#[C9505F2D83ABFC2B]) [n:127.0.0.1:53508_lw%2Fi    ] o.a.s.c.c.SolrZkClient makePath: /aliases.json
   [junit4]   2> 375355 INFO  (TEST-CdcrReplicationHandlerTest.doTest-seed#[C9505F2D83ABFC2B]) [n:127.0.0.1:53508_lw%2Fi    ] o.a.s.c.c.SolrZkClient makePath: /clusterstate.json
   [junit4]   2> 375355 INFO  (TEST-CdcrReplicationHandlerTest.doTest-seed#[C9505F2D83ABFC2B]) [n:127.0.0.1:53508_lw%2Fi    ] o.a.s.c.c.SolrZkClient makePath: /security.json
   [junit4]   2> 375355 INFO  (TEST-CdcrReplicationHandlerTest.doTest-seed#[C9505F2D83ABFC2B]) [n:127.0.0.1:53508_lw%2Fi    ] o.a.s.c.ZkController Register node as live in ZooKeeper:/live_nodes/127.0.0.1:53508_lw%2Fi
   [junit4]   2> 375356 INFO  (TEST-CdcrReplicationHandlerTest.doTest-seed#[C9505F2D83ABFC2B]) [n:127.0.0.1:53508_lw%2Fi    ] o.a.s.c.c.SolrZkClient makePath: /live_nodes/127.0.0.1:53508_lw%2Fi
   [junit4]   2> 375356 INFO  (TEST-CdcrReplicationHandlerTest.doTest-seed#[C9505F2D83ABFC2B]) [n:127.0.0.1:53508_lw%2Fi    ] o.a.s.c.c.SolrZkClient makePath: /overseer_elect
   [junit4]   2> 375356 INFO  (TEST-CdcrReplicationHandlerTest.doTest-seed#[C9505F2D83ABFC2B]) [n:127.0.0.1:53508_lw%2Fi    ] o.a.s.c.c.SolrZkClient makePath: /overseer_elect/election
   [junit4]   2> 375357 INFO  (TEST-CdcrReplicationHandlerTest.doTest-seed#[C9505F2D83ABFC2B]) [n:127.0.0.1:53508_lw%2Fi    ] o.a.s.c.Overseer Overseer (id=null) closing
   [junit4]   2> 375357 INFO  (TEST-CdcrReplicationHandlerTest.doTest-seed#[C9505F2D83ABFC2B]) [n:127.0.0.1:53508_lw%2Fi    ] o.a.s.c.LeaderElector Joined leadership election with path: /overseer_elect/election/94309167103934469-127.0.0.1:53508_lw%2Fi-n_0000000000
   [junit4]   2> 375357 INFO  (TEST-CdcrReplicationHandlerTest.doTest-seed#[C9505F2D83ABFC2B]) [n:127.0.0.1:53508_lw%2Fi    ] o.a.s.c.OverseerElectionContext I am going to be the leader 127.0.0.1:53508_lw%2Fi
   [junit4]   2> 375357 INFO  (TEST-CdcrReplicationHandlerTest.doTest-seed#[C9505F2D83ABFC2B]) [n:127.0.0.1:53508_lw%2Fi    ] o.a.s.c.c.SolrZkClient makePath: /overseer_elect/leader
   [junit4]   2> 375358 INFO  (TEST-CdcrReplicationHandlerTest.doTest-seed#[C9505F2D83ABFC2B]) [n:127.0.0.1:53508_lw%2Fi    ] o.a.s.c.Overseer Overseer (id=94309167103934469-127.0.0.1:53508_lw%2Fi-n_0000000000) starting
   [junit4]   2> 375359 INFO  (TEST-CdcrReplicationHandlerTest.doTest-seed#[C9505F2D83ABFC2B]) [n:127.0.0.1:53508_lw%2Fi    ] o.a.s.c.c.SolrZkClient makePath: /overseer/queue-work
   [junit4]   2> 375360 INFO  (TEST-CdcrReplicationHandlerTest.doTest-seed#[C9505F2D83ABFC2B]) [n:127.0.0.1:53508_lw%2Fi    ] o.a.s.c.OverseerAutoReplicaFailoverThread Starting OverseerAutoReplicaFailoverThread autoReplicaFailoverWorkLoopDelay=10000 autoReplicaFailoverWaitAfterExpiration=30000 autoReplicaFailoverBadNodeExpiration=60000
   [junit4]   2> 375361 INFO  (TEST-CdcrReplicationHandlerTest.doTest-seed#[C9505F2D83ABFC2B]) [n:127.0.0.1:53508_lw%2Fi    ] o.a.s.c.c.ZkStateReader Updating cluster state from ZooKeeper... 
   [junit4]   2> 375361 INFO  (OverseerCollectionProcessor-94309167103934469-127.0.0.1:53508_lw%2Fi-n_0000000000) [n:127.0.0.1:53508_lw%2Fi    ] o.a.s.c.OverseerProcessor Process current queue of overseer operations
   [junit4]   2> 375361 INFO  (OverseerStateUpdate-94309167103934469-127.0.0.1:53508_lw%2Fi-n_0000000000) [n:127.0.0.1:53508_lw%2Fi    ] o.a.s.c.Overseer Starting to work on the main queue
   [junit4]   2> 375371 INFO  (TEST-CdcrReplicationHandlerTest.doTest-seed#[C9505F2D83ABFC2B]) [n:127.0.0.1:53508_lw%2Fi    ] o.a.s.c.CoreContainer Security conf doesn't exist. Skipping setup for authorization module.
   [junit4]   2> 375371 INFO  (TEST-CdcrReplicationHandlerTest.doTest-seed#[C9505F2D83ABFC2B]) [n:127.0.0.1:53508_lw%2Fi    ] o.a.s.c.CoreContainer No authentication plugin used.
   [junit4]   2> 375372 INFO  (TEST-CdcrReplicationHandlerTest.doTest-seed#[C9505F2D83ABFC2B]) [n:127.0.0.1:53508_lw%2Fi    ] o.a.s.c.CoresLocator Looking for core definitions underneath /home/jenkins/workspace/Lucene-Solr-trunk-Linux/solr/build/solr-core/test/J0/temp/solr.cloud.CdcrReplicationHandlerTest_C9505F2D83ABFC2B-001/jetty-001/cores
   [junit4]   2> 375372 INFO  (TEST-CdcrReplicationHandlerTest.doTest-seed#[C9505F2D83ABFC2B]) [n:127.0.0.1:53508_lw%2Fi    ] o.a.s.c.SolrCore Created CoreDescriptor: {name=collection1, config=solrconfig.xml, transient=false, schema=schema.xml, loadOnStartup=true, configSetProperties=configsetprops.json, instanceDir=/home/jenkins/workspace/Lucene-Solr-trunk-Linux/solr/build/solr-core/test/J0/temp/solr.cloud.CdcrReplicationHandlerTest_C9505F2D83ABFC2B-001/jetty-001/cores/collection1, collection=tmp_collection, absoluteInstDir=/home/jenkins/workspace/Lucene-Solr-trunk-Linux/solr/build/solr-core/test/J0/temp/solr.cloud.CdcrReplicationHandlerTest_C9505F2D83ABFC2B-001/jetty-001/cores/collection1/, coreNodeName=, dataDir=data/, shard=}
   [junit4]   2> 375373 INFO  (TEST-CdcrReplicationHandlerTest.doTest-seed#[C9505F2D83ABFC2B]) [n:127.0.0.1:53508_lw%2Fi    ] o.a.s.c.CoresLocator Found core collection1 in /home/jenkins/workspace/Lucene-Solr-trunk-Linux/solr/build/solr-core/test/J0/temp/solr.cloud.CdcrReplicationHandlerTest_C9505F2D83ABFC2B-001/jetty-001/cores/collection1/
   [junit4]   2> 375373 INFO  (TEST-CdcrReplicationHandlerTest.doTest-seed#[C9505F2D83ABFC2B]) [n:127.0.0.1:53508_lw%2Fi    ] o.a.s.c.CoresLocator Found 1 core definitions
   [junit4]   2> 375373 INFO  (TEST-CdcrReplicationHandlerTest.doTest-seed#[C9505F2D83ABFC2B]) [n:127.0.0.1:53508_lw%2Fi    ] o.a.s.s.SolrDispatchFilter user.dir=/home/jenkins/workspace/Lucene-Solr-trunk-Linux/solr/build/solr-core/test/J0
   [junit4]   2> 375373 INFO  (coreLoadExecutor-1181-thread-1-processing-n:127.0.0.1:53508_lw%2Fi) [n:127.0.0.1:53508_lw%2Fi c:tmp_collection   x:collection1] o.a.s.c.ZkController publishing state=down
   [junit4]   2> 375373 INFO  (coreLoadExecutor-1181-thread-1-processing-n:127.0.0.1:53508_lw%2Fi) [n:127.0.0.1:53508_lw%2Fi c:tmp_collection   x:collection1] o.a.s.c.ZkController numShards not found on descriptor - reading it from system property
   [junit4]   2> 375373 INFO  (TEST-CdcrReplicationHandlerTest.doTest-seed#[C9505F2D83ABFC2B]) [n:127.0.0.1:53508_lw%2Fi    ] o.a.s.s.SolrDispatchFilter SolrDispatchFilter.init() done
   [junit4]   2> 375374 INFO  (coreLoadExecutor-1181-thread-1-processing-n:127.0.0.1:53508_lw%2Fi) [n:127.0.0.1:53508_lw%2Fi c:tmp_collection   x:collection1] o.a.s.c.ZkController look for our core node name
   [junit4]   2> 375374 INFO  (zkCallback-427-thread-1-processing-n:127.0.0.1:53508_lw%2Fi) [n:127.0.0.1:53508_lw%2Fi    ] o.a.s.c.DistributedQueue NodeChildrenChanged fired on path /overseer/queue state SyncConnected
   [junit4]   2> 375374 INFO  (OverseerStateUpdate-94309167103934469-127.0.0.1:53508_lw%2Fi-n_0000000000) [n:127.0.0.1:53508_lw%2Fi    ] o.a.s.c.Overseer processMessage: queueSize: 1, message = {
   [junit4]   2>   "core":"collection1",
   [junit4]   2>   "roles":null,
   [junit4]   2>   "base_url":"https://127.0.0.1:53508/lw/i",
   [junit4]   2>   "node_name":"127.0.0.1:53508_lw%2Fi",
   [junit4]   2>   "numShards":"1",
   [junit4]   2>   "state":"down",
   [junit4]   2>   "shard":null,
   [junit4]   2>   "collection":"tmp_collection",
   [junit4]   2>   "operation":"state"} current state version: 0
   [junit4]   2> 375375 INFO  (OverseerStateUpdate-94309167103934469-127.0.0.1:53508_lw%2Fi-n_0000000000) [n:127.0.0.1:53508_lw%2Fi    ] o.a.s.c.o.ReplicaMutator Update state numShards=1 message={
   [junit4]   2>   "core":"collection1",
   [junit4]   2>   "roles":null,
   [junit4]   2>   "base_url":"https://127.0.0.1:53508/lw/i",
   [junit4]   2>   "node_name":"127.0.0.1:53508_lw%2Fi",
   [junit4]   2>   "numShards":"1",
   [junit4]   2>   "state":"down",
   [junit4]   2>   "shard":null,
   [junit4]   2>   "collection":"tmp_collection",
   [junit4]   2>   "operation":"state"}
   [junit4]   2> 375375 INFO  (OverseerStateUpdate-94309167103934469-127.0.0.1:53508_lw%2Fi-n_0000000000) [n:127.0.0.1:53508_lw%2Fi    ] o.a.s.c.o.ClusterStateMutator building a new cName: tmp_collection
   [junit4]   2> 375375 INFO  (OverseerStateUpdate-94309167103934469-127.0.0.1:53508_lw%2Fi-n_0000000000) [n:127.0.0.1:53508_lw%2Fi    ] o.a.s.c.o.ReplicaMutator Assigning new node to shard shard=shard1
   [junit4]   2> 375375 INFO  (zkCallback-427-thread-1-processing-n:127.0.0.1:53508_lw%2Fi) [n:127.0.0.1:53508_lw%2Fi    ] o.a.s.c.c.ZkStateReader A cluster state change: WatchedEvent state:SyncConnected type:NodeDataChanged path:/clusterstate.json, has occurred - updating... (live nodes size: 1)
   [junit4]   2> 376374 INFO  (coreLoadExecutor-1181-thread-1-processing-n:127.0.0.1:53508_lw%2Fi) [n:127.0.0.1:53508_lw%2Fi c:tmp_collection   x:collection1] o.a.s.c.ZkController waiting to find shard id in clusterstate for collection1
   [junit4]   2> 376374 INFO  (coreLoadExecutor-1181-thread-1-processing-n:127.0.0.1:53508_lw%2Fi) [n:127.0.0.1:53508_lw%2Fi c:tmp_collection   x:collection1] o.a.s.c.ZkController Check for collection zkNode:tmp_collection
   [junit4]   2> 376375 INFO  (coreLoadExecutor-1181-thread-1-processing-n:127.0.0.1:53508_lw%2Fi) [n:127.0.0.1:53508_lw%2Fi c:tmp_collection   x:collection1] o.a.s.c.ZkController Creating collection in ZooKeeper:tmp_collection
   [junit4]   2> 376375 INFO  (coreLoadExecutor-1181-thread-1-processing-n:127.0.0.1:53508_lw%2Fi) [n:127.0.0.1:53508_lw%2Fi c:tmp_collection   x:collection1] o.a.s.c.ZkController Looking for collection configName
   [junit4]   2> 376375 INFO  (coreLoadExecutor-1181-thread-1-processing-n:127.0.0.1:53508_lw%2Fi) [n:127.0.0.1:53508_lw%2Fi c:tmp_collection   x:collection1] o.a.s.c.ZkController Only one config set found in zk - using it:conf1
   [junit4]   2> 376375 INFO  (coreLoadExecutor-1181-thread-1-processing-n:127.0.0.1:53508_lw%2Fi) [n:127.0.0.1:53508_lw%2Fi c:tmp_collection   x:collection1] o.a.s.c.c.SolrZkClient makePath: /collections/tmp_collection
   [junit4]   2> 376376 INFO  (coreLoadExecutor-1181-thread-1-processing-n:127.0.0.1:53508_lw%2Fi) [n:127.0.0.1:53508_lw%2Fi c:tmp_collection   x:collection1] o.a.s.c.c.ZkStateReader Load collection config from:/collections/tmp_collection
   [junit4]   2> 376376 INFO  (coreLoadExecutor-1181-thread-1-processing-n:127.0.0.1:53508_lw%2Fi) [n:127.0.0.1:53508_lw%2Fi c:tmp_collection   x:collection1] o.a.s.c.c.ZkStateReader path=/collections/tmp_collection configName=conf1 specified config exists in ZooKeeper
   [junit4]   2> 376376 INFO  (coreLoadExecutor-1181-thread-1-processing-n:127.0.0.1:53508_lw%2Fi) [n:127.0.0.1:53508_lw%2Fi c:tmp_collection   x:collection1] o.a.s.c.SolrResourceLoader new SolrResourceLoader for directory: '/home/jenkins/workspace/Lucene-Solr-trunk-Linux/solr/build/solr-core/test/J0/temp/solr.cloud.CdcrReplicationHandlerTest_C9505F2D83ABFC2B-001/jetty-001/cores/collection1/'
   [junit4]   2> 376384 INFO  (coreLoadExecutor-1181-thread-1-processing-n:127.0.0.1:53508_lw%2Fi) [n:127.0.0.1:53508_lw%2Fi c:tmp_collection   x:collection1] o.a.s.c.Config loaded config solrconfig.xml with version 0 
   [junit4]   2> 376387 INFO  (coreLoadExecutor-1181-thread-1-processing-n:127.0.0.1:53508_lw%2Fi) [n:127.0.0.1:53508_lw%2Fi c:tmp_collection   x:collection1] o.a.s.c.SolrConfig current version of requestparams : -1
   [junit4]   2> 376388 INFO  (coreLoadExecutor-1181-thread-1-processing-n:127.0.0.1:53508_lw%2Fi) [n:127.0.0.1:53508_lw%2Fi c:tmp_collection   x:collection1] o.a.s.c.SolrConfig Using Lucene MatchVersion: 6.0.0
   [junit4]   2> 376392 INFO  (coreLoadExecutor-1181-thread-1-processing-n:127.0.0.1:53508_lw%2Fi) [n:127.0.0.1:53508_lw%2Fi c:tmp_collection   x:collection1] o.a.s.c.Config Loaded SolrConfig: solrconfig.xml
   [junit4]   2> 376392 INFO  (coreLoadExecutor-1181-thread-1-processing-n:127.0.0.1:53508_lw%2Fi) [n:127.0.0.1:53508_lw%2Fi c:tmp_collection   x:collection1] o.a.s.s.IndexSchema Reading Solr Schema from /configs/conf1/schema.xml
   [junit4]   2> 376395 INFO  (coreLoadExecutor-1181-thread-1-processing-n:127.0.0.1:53508_lw%2Fi) [n:127.0.0.1:53508_lw%2Fi c:tmp_collection   x:collection1] o.a.s.s.IndexSchema [collection1] Schema name=test
   [junit4]   2> 376446 INFO  (coreLoadExecutor-1181-thread-1-processing-n:127.0.0.1:53508_lw%2Fi) [n:127.0.0.1:53508_lw%2Fi c:tmp_collection   x:collection1] o.a.s.s.IndexSchema default search field in schema is text
   [junit4]   2> 376447 INFO  (coreLoadExecutor-1181-thread-1-processing-n:127.0.0.1:53508_lw%2Fi) [n:127.0.0.1:53508_lw%2Fi c:tmp_collection   x:collection1] o.a.s.s.IndexSchema unique key field: id
   [junit4]   2> 376447 INFO  (coreLoadExecutor-1181-thread-1-processing-n:127.0.0.1:53508_lw%2Fi) [n:127.0.0.1:53508_lw%2Fi c:tmp_collection   x:collection1] o.a.s.s.FileExchangeRateProvider Reloading exchange rates from file currency.xml
   [junit4]   2> 376449 INFO  (coreLoadExecutor-1181-thread-1-processing-n:127.0.0.1:53508_lw%2Fi) [n:127.0.0.1:53508_lw%2Fi c:tmp_collection   x:collection1] o.a.s.s.FileExchangeRateProvider Reloading exchange rates from file currency.xml
   [junit4]   2> 376457 INFO  (coreLoadExecutor-1181-thread-1-processing-n:127.0.0.1:53508_lw%2Fi) [n:127.0.0.1:53508_lw%2Fi c:tmp_collection   x:collection1] o.a.s.c.ConfigSetProperties Did not find ConfigSet properties, assuming default properties: Can't find resource 'configsetprops.json' in classpath or '/configs/conf1', cwd=/home/jenkins/workspace/Lucene-Solr-trunk-Linux/solr/build/solr-core/test/J0
   [junit4]   2> 376457 INFO  (coreLoadExecutor-1181-thread-1-processing-n:127.0.0.1:53508_lw%2Fi) [n:127.0.0.1:53508_lw%2Fi c:tmp_collection   x:collection1] o.a.s.c.CoreContainer Creating SolrCore 'collection1' using configuration from collection tmp_collection
   [junit4]   2> 376457 INFO  (coreLoadExecutor-1181-thread-1-processing-n:127.0.0.1:53508_lw%2Fi) [n:127.0.0.1:53508_lw%2Fi c:tmp_collection s:shard1 r:core_node1 x:collection1] o.a.s.c.SolrCore solr.StandardDirectoryFactory
   [junit4]   2> 376461 INFO  (coreLoadExecutor-1181-thread-1-processing-n:127.0.0.1:53508_lw%2Fi) [n:127.0.0.1:53508_lw%2Fi c:tmp_collection s:shard1 r:core_node1 x:collection1] o.a.s.c.SolrCore [[collection1] ] Opening new SolrCore at [/home/jenkins/workspace/Lucene-Solr-trunk-Linux/solr/build/solr-core/test/J0/temp/solr.cloud.CdcrReplicationHandlerTest_C9505F2D83ABFC2B-001/jetty-001/cores/collection1/], dataDir=[null]
   [junit4]   2> 376461 INFO  (coreLoadExecutor-1181-thread-1-processing-n:127.0.0.1:53508_lw%2Fi) [n:127.0.0.1:53508_lw%2Fi c:tmp_collection s:shard1 r:core_node1 x:collection1] o.a.s.c.JmxMonitoredMap JMX monitoring is enabled. Adding Solr mbeans to JMX Server: com.sun.jmx.mbeanserver.JmxMBeanServer@350560c5
   [junit4]   2> 376461 INFO  (coreLoadExecutor-1181-thread-1-processing-n:127.0.0.1:53508_lw%2Fi) [n:127.0.0.1:53508_lw%2Fi c:tmp_collection s:shard1 r:core_node1 x:collection1] o.a.s.c.CachingDirectoryFactory return new directory for /home/jenkins/workspace/Lucene-Solr-trunk-Linux/solr/build/solr-core/test/J0/temp/solr.cloud.CdcrReplicationHandlerTest_C9505F2D83ABFC2B-001/jetty-001/cores/collection1/data
   [junit4]   2> 376461 INFO  (coreLoadExecutor-1181-thread-1-processing-n:127.0.0.1:53508_lw%2Fi) [n:127.0.0.1:53508_lw%2Fi c:tmp_collection s:shard1 r:core_node1 x:collection1] o.a.s.c.SolrCore New index directory detected: old=null new=/home/jenkins/workspace/Lucene-Solr-trunk-Linux/solr/build/solr-core/test/J0/temp/solr.cloud.CdcrReplicationHandlerTest_C9505F2D83ABFC2B-001/jetty-001/cores/collection1/data/index/
   [junit4]   2> 376462 WARN  (coreLoadExecutor-1181-thread-1-processing-n:127.0.0.1:53508_lw%2Fi) [n:127.0.0.1:53508_lw%2Fi c:tmp_collection s:shard1 r:core_node1 x:collection1] o.a.s.c.SolrCore [collection1] Solr index directory '/home/jenkins/workspace/Lucene-Solr-trunk-Linux/solr/build/solr-core/test/J0/temp/solr.cloud.CdcrReplicationHandlerTest_C9505F2D83ABFC2B-001/jetty-001/cores/collection1/data/index' doesn't exist. Creating new index...
   [junit4]   2> 376462 INFO  (coreLoadExecutor-1181-thread-1-processing-n:127.0.0.1:53508_lw%2Fi) [n:127.0.0.1:53508_lw%2Fi c:tmp_collection s:shard1 r:core_node1 x:collection1] o.a.s.c.CachingDirectoryFactory return new directory for /home/jenkins/workspace/Lucene-Solr-trunk-Linux/solr/build/solr-core/test/J0/temp/solr.cloud.CdcrReplicationHandlerTest_C9505F2D83ABFC2B-001/jetty-001/cores/collection1/data/index
   [junit4]   2> 376462 INFO  (coreLoadExecutor-1181-thread-1-processing-n:127.0.0.1:53508_lw%2Fi) [n:127.0.0.1:53508_lw%2Fi c:tmp_collection s:shard1 r:core_node1 x:collection1] o.a.s.u.RandomMergePolicy RandomMergePolicy wrapping class org.apache.lucene.index.AlcoholicMergePolicy: [AlcoholicMergePolicy: minMergeSize=0, mergeFactor=10, maxMergeSize=1513773527, maxMergeSizeForForcedMerge=9223372036854775807, calibrateSizeByDeletes=true, maxMergeDocs=2147483647, maxCFSSegmentSizeMB=8.796093022207999E12, noCFSRatio=0.1]
   [junit4]   2> 376527 INFO  (coreLoadExecutor-1181-thread-1-processing-n:127.0.0.1:53508_lw%2Fi) [n:127.0.0.1:53508_lw%2Fi c:tmp_collection s:shard1 r:core_node1 x:collection1] o.a.s.c.SolrCore SolrDeletionPolicy.onCommit: commits: num=1
   [junit4]   2> 	commit{dir=/home/jenkins/workspace/Lucene-Solr-trunk-Linux/solr/build/solr-core/test/J0/temp/solr.cloud.CdcrReplicationHandlerTest_C9505F2D83ABFC2B-001/jetty-001/cores/collection1/data/index,segFN=segments_1,generation=1}
   [junit4]   2> 376527 INFO  (coreLoadExecutor-1181-thread-1-processing-n:127.0.0.1:53508_lw%2Fi) [n:127.0.0.1:53508_lw%2Fi c:tmp_collection s:shard1 r:core_node1 x:collection1] o.a.s.c.SolrCore newest commit generation = 1
   [junit4]   2> 376527 INFO  (OldIndexDirectoryCleanupThreadForCore-collection1) [n:127.0.0.1:53508_lw%2Fi c:tmp_collection s:shard1 r:core_node1 x:collection1] o.a.s.c.SolrCore Looking for old index directories to cleanup for core collection1 in /home/jenkins/workspace/Lucene-Solr-trunk-Linux/solr/build/solr-core/test/J0/temp/solr.cloud.CdcrReplicationHandlerTest_C9505F2D83ABFC2B-001/jetty-001/cores/collection1/data/
   [junit4]   2> 376530 INFO  (coreLoadExecutor-1181-thread-1-processing-n:127.0.0.1:53508_lw%2Fi) [n:127.0.0.1:53508_lw%2Fi c:tmp_collection s:shard1 r:core_node1 x:collection1] o.a.s.u.p.UpdateRequestProcessorChain creating updateRequestProcessorChain "cdcr-processor-chain"
   [junit4]   2> 376538 INFO  (coreLoadExecutor-1181-thread-1-processing-n:127.0.0.1:53508_lw%2Fi) [n:127.0.0.1:53508_lw%2Fi c:tmp_collection s:shard1 r:core_node1 x:collection1] o.a.s.c.SolrCore no updateRequestProcessorChain defined as default, creating implicit default
   [junit4]   2> 376539 INFO  (coreLoadExecutor-1181-thread-1-processing-n:127.0.0.1:53508_lw%2Fi) [n:127.0.0.1:53508_lw%2Fi c:tmp_collection s:shard1 r:core_node1 x:collection1] o.a.s.h.l.XMLLoader xsltCacheLifetimeSeconds=60
   [junit4]   2> 376540 INFO  (coreLoadExecutor-1181-thread-1-processing-n:127.0.0.1:53508_lw%2Fi) [n:127.0.0.1:53508_lw%2Fi c:tmp_collection s:shard1 r:core_node1 x:collection1] o.a.s.h.l.XMLLoader xsltCacheLifetimeSeconds=60
   [junit4]   2> 376540 INFO  (coreLoadExecutor-1181-thread-1-processing-n:127.0.0.1:53508_lw%2Fi) [n:127.0.0.1:53508_lw%2Fi c:tmp_collection s:shard1 r:core_node1 x:collection1] o.a.s.h.l.XMLLoader xsltCacheLifetimeSeconds=60
   [junit4]   2> 376541 INFO  (coreLoadExecutor-1181-thread-1-processing-n:127.0.0.1:53508_lw%2Fi) [n:127.0.0.1:53508_lw%2Fi c:tmp_collection s:shard1 r:core_node1 x:collection1] o.a.s.h.l.XMLLoader xsltCacheLifetimeSeconds=60
   [junit4]   2> 376547 INFO  (coreLoadExecutor-1181-thread-1-processing-n:127.0.0.1:53508_lw%2Fi) [n:127.0.0.1:53508_lw%2Fi c:tmp_collection s:shard1 r:core_node1 x:collection1] o.a.s.c.RequestHandlers Registered paths: /admin/mbeans,standard,/update/csv,/update/json/docs,/admin/luke,/admin/segments,/get,/admin/system,/replication,/admin/properties,/config,/schema,/admin/plugins,/admin/logging,/update/json,/admin/threads,/admin/ping,/cdcr,/update,/admin/file
   [junit4]   2> 376547 INFO  (coreLoadExecutor-1181-thread-1-processing-n:127.0.0.1:53508_lw%2Fi) [n:127.0.0.1:53508_lw%2Fi c:tmp_collection s:shard1 r:core_node1 x:collection1] o.a.s.c.SolrCore Using default statsCache cache: org.apache.solr.search.stats.LocalStatsCache
   [junit4]   2> 376557 INFO  (coreLoadExecutor-1181-thread-1-processing-n:127.0.0.1:53508_lw%2Fi) [n:127.0.0.1:53508_lw%2Fi c:tmp_collection s:shard1 r:core_node1 x:collection1] o.a.s.u.UpdateHandler Using UpdateLog implementation: org.apache.solr.update.CdcrUpdateLog
   [junit4]   2> 376557 INFO  (coreLoadExecutor-1181-thread-1-processing-n:127.0.0.1:53508_lw%2Fi) [n:127.0.0.1:53508_lw%2Fi c:tmp_collection s:shard1 r:core_node1 x:collection1] o.a.s.u.UpdateLog Initializing UpdateLog: dataDir= defaultSyncLevel=FLUSH numRecordsToKeep=100 maxNumLogsToKeep=10 numVersionBuckets=65536
   [junit4]   2> 376558 INFO  (coreLoadExecutor-1181-thread-1-processing-n:127.0.0.1:53508_lw%2Fi) [n:127.0.0.1:53508_lw%2Fi c:tmp_collection s:shard1 r:core_node1 x:collection1] o.a.s.c.SolrCore Hard AutoCommit: disabled
   [junit4]   2> 376558 INFO  (coreLoadExecutor-1181-thread-1-processing-n:127.0.0.1:53508_lw%2Fi) [n:127.0.0.1:53508_lw%2Fi c:tmp_collection s:shard1 r:core_node1 x:collection1] o.a.s.c.SolrCore Soft AutoCommit: disabled
   [junit4]   2> 376558 INFO  (coreLoadExecutor-1181-thread-1-processing-n:127.0.0.1:53508_lw%2Fi) [n:127.0.0.1:53508_lw%2Fi c:tmp_collection s:shard1 r:core_node1 x:collection1] o.a.s.u.RandomMergePolicy RandomMergePolicy wrapping class org.apache.lucene.index.LogByteSizeMergePolicy: [LogByteSizeMergePolicy: minMergeSize=1677721, mergeFactor=38, maxMergeSize=2147483648, maxMergeSizeForForcedMerge=9223372036854775807, calibrateSizeByDeletes=true, maxMergeDocs=2147483647, maxCFSSegmentSizeMB=8.796093022207999E12, noCFSRatio=0.0]
   [junit4]   2> 376559 INFO  (coreLoadExecutor-1181-thread-1-processing-n:127.0.0.1:53508_lw%2Fi) [n:127.0.0.1:53508_lw%2Fi c:tmp_collection s:shard1 r:core_node1 x:collection1] o.a.s.c.SolrCore SolrDeletionPolicy.onInit: commits: num=1
   [junit4]   2> 	commit{dir=/home/jenkins/workspace/Lucene-Solr-trunk-Linux/solr/build/solr-core/test/J0/temp/solr.cloud.CdcrReplicationHandlerTest_C9505F2D83ABFC2B-001/jetty-001/cores/collection1/data/index,segFN=segments_1,generation=1}
   [junit4]   2> 376559 INFO  (coreLoadExecutor-1181-thread-1-processing-n:127.0.0.1:53508_lw%2Fi) [n:127.0.0.1:53508_lw%2Fi c:tmp_collection s:shard1 r:core_node1 x:collection1] o.a.s.c.SolrCore newest commit generation = 1
   [junit4]   2> 376559 INFO  (coreLoadExecutor-1181-thread-1-processing-n:127.0.0.1:53508_lw%2Fi) [n:127.0.0.1:53508_lw%2Fi c:tmp_collection s:shard1 r:core_node1 x:collection1] o.a.s.s.SolrIndexSearcher Opening Searcher@2928a157[collection1] main
   [junit4]   2> 376559 INFO  (coreLoadExecutor-1181-thread-1-processing-n:127.0.0.1:53508_lw%2Fi) [n:127.0.0.1:53508_lw%2Fi c:tmp_collection s:shard1 r:core_node1 x:collection1] o.a.s.c.c.ZkStateReader Load collection config from:/collections/tmp_collection
   [junit4]   2> 376559 INFO  (coreLoadExecutor-1181-thread-1-processing-n:127.0.0.1:53508_lw%2Fi) [n:127.0.0.1:53508_lw%2Fi c:tmp_collection s:shard1 r:core_node1 x:collection1] o.a.s.c.c.ZkStateReader path=/collections/tmp_collection configName=conf1 specified config exists in ZooKeeper
   [junit4]   2> 376560 INFO  (coreLoadExecutor-1181-thread-1-processing-n:127.0.0.1:53508_lw%2Fi) [n:127.0.0.1:53508_lw%2Fi c:tmp_collection s:shard1 r:core_node1 x:collection1] o.a.s.r.ManagedResourceStorage Setting up ZooKeeper-based storage for the RestManager with znodeBase: /configs/conf1
   [junit4]   2> 376560 INFO  (coreLoadExecutor-1181-thread-1-processing-n:127.0.0.1:53508_lw%2Fi) [n:127.0.0.1:53508_lw%2Fi c:tmp_collection s:shard1 r:core_node1 x:collection1] o.a.s.r.ManagedResourceStorage Configured ZooKeeperStorageIO with znodeBase: /configs/conf1
   [junit4]   2> 376560 INFO  (coreLoadExecutor-1181-thread-1-processing-n:127.0.0.1:53508_lw%2Fi) [n:127.0.0.1:53508_lw%2Fi c:tmp_collection s:shard1 r:core_node1 x:collection1] o.a.s.r.RestManager Initializing RestManager with initArgs: {}
   [junit4]   2> 376560 INFO  (coreLoadExecutor-1181-thread-1-processing-n:127.0.0.1:53508_lw%2Fi) [n:127.0.0.1:53508_lw%2Fi c:tmp_collection s:shard1 r:core_node1 x:collection1] o.a.s.r.ManagedResourceStorage Reading _rest_managed.json using ZooKeeperStorageIO:path=/configs/conf1
   [junit4]   2> 376560 INFO  (coreLoadExecutor-1181-thread-1-processing-n:127.0.0.1:53508_lw%2Fi) [n:127.0.0.1:53508_lw%2Fi c:tmp_collection s:shard1 r:core_node1 x:collection1] o.a.s.r.ManagedResourceStorage No data found for znode /configs/conf1/_rest_managed.json
   [junit4]   2> 376560 INFO  (coreLoadExecutor-1181-thread-1-processing-n:127.0.0.1:53508_lw%2Fi) [n:127.0.0.1:53508_lw%2Fi c:tmp_collection s:shard1 r:core_node1 x:collection1] o.a.s.r.ManagedResourceStorage Loaded null at path _rest_managed.json using ZooKeeperStorageIO:path=/configs/conf1
   [junit4]   2> 376560 INFO  (coreLoadExecutor-1181-thread-1-processing-n:127.0.0.1:53508_lw%2Fi) [n:127.0.0.1:53508_lw%2Fi c:tmp_collection s:shard1 r:core_node1 x:collection1] o.a.s.r.RestManager Initializing 0 registered ManagedResources
   [junit4]   2> 376560 INFO  (coreLoadExecutor-1181-thread-1-processing-n:127.0.0.1:53508_lw%2Fi) [n:127.0.0.1:53508_lw%2Fi c:tmp_collection s:shard1 r:core_node1 x:collection1] o.a.s.h.ReplicationHandler Commits will be reserved for  10000
   [junit4]   2> 376563 INFO  (coreLoadExecutor-1181-thread-1-processing-n:127.0.0.1:53508_lw%2Fi) [n:127.0.0.1:53508_lw%2Fi c:tmp_collection s:shard1 r:core_node1 x:collection1] o.a.s.c.c.SolrZkClient makePath: /collections/tmp_collection/cdcr/state
   [junit4]   2> 376564 INFO  (coreLoadExecutor-1181-thread-1-processing-n:127.0.0.1:53508_lw%2Fi) [n:127.0.0.1:53508_lw%2Fi c:tmp_collection s:shard1 r:core_node1 x:collection1] o.a.s.h.CdcrBufferStateManager Created znode /collections/tmp_collection/cdcr/state/buffer
   [junit4]   2> 376566 INFO  (coreLoadExecutor-1181-thread-1-processing-n:127.0.0.1:53508_lw%2Fi) [n:127.0.0.1:53508_lw%2Fi c:tmp_collection s:shard1 r:core_node1 x:collection1] o.a.s.h.CdcrProcessStateManager Created znode /collections/tmp_collection/cdcr/state/process
   [junit4]   2> 376576 INFO  (searcherExecutor-1182-thread-1-processing-n:127.0.0.1:53508_lw%2Fi x:collection1 s:shard1 c:tmp_collection r:core_node1) [n:127.0.0.1:53508_lw%2Fi c:tmp_collection s:shard1 r:core_node1 x:collection1] o.a.s.c.SolrCore [collection1] Registered new searcher Searcher@2928a157[collection1] main{ExitableDirectoryReader(UninvertingDirectoryReader())}
   [junit4]   2> 376576 INFO  (coreLoadExecutor-1181-thread-1-processing-n:127.0.0.1:53508_lw%2Fi) [n:127.0.0.1:53508_lw%2Fi c:tmp_collection s:shard1 r:core_node1 x:collection1] o.a.s.u.UpdateLog Looking up max value of version field to seed version buckets
   [junit4]   2> 376576 INFO  (coreLoadExecutor-1181-thread-1-processing-n:127.0.0.1:53508_lw%2Fi) [n:127.0.0.1:53508_lw%2Fi c:tmp_collection s:shard1 r:core_node1 x:collection1] o.a.s.u.VersionInfo Refreshing highest value of _version_ for 65536 version buckets from index
   [junit4]   2> 376577 INFO  (coreLoadExecutor-1181-thread-1-processing-n:127.0.0.1:53508_lw%2Fi) [n:127.0.0.1:53508_lw%2Fi c:tmp_collection s:shard1 r:core_node1 x:collection1] o.a.s.u.VersionInfo No terms found for _version_, cannot seed version bucket highest value from index
   [junit4]   2> 376577 INFO  (coreLoadExecutor-1181-thread-1-processing-n:127.0.0.1:53508_lw%2Fi) [n:127.0.0.1:53508_lw%2Fi c:tmp_collection s:shard1 r:core_node1 x:collection1] o.a.s.u.UpdateLog Could not find max version in index or recent updates, using new clock 1508946675160317952
   [junit4]   2> 376578 INFO  (coreLoadExecutor-1181-thread-1-processing-n:127.0.0.1:53508_lw%2Fi) [n:127.0.0.1:53508_lw%2Fi c:tmp_collection s:shard1 r:core_node1 x:collection1] o.a.s.u.UpdateLog Took 2.0ms to seed version buckets with highest version 1508946675160317952
   [junit4]   2> 376578 INFO  (coreLoadExecutor-1181-thread-1-processing-n:127.0.0.1:53508_lw%2Fi) [n:127.0.0.1:53508_lw%2Fi c:tmp_collection s:shard1 r:core_node1 x:collection1] o.a.s.c.ZkController watch zkdir /configs/conf1
   [junit4]   2> 376579 INFO  (coreLoadExecutor-1181-thread-1-processing-n:127.0.0.1:53508_lw%2Fi) [n:127.0.0.1:53508_lw%2Fi c:tmp_collection s:shard1 r:core_node1 x:collection1] o.a.s.c.CoreContainer registering core: collection1
   [junit4]   2> 376579 INFO  (coreZkRegister-1175-thread-1-processing-n:127.0.0.1:53508_lw%2Fi x:collection1 s:shard1 c:tmp_collection r:core_node1) [n:127.0.0.1:53508_lw%2Fi c:tmp_collection s:shard1 r:core_node1 x:collection1] o.a.s.c.ZkController Register replica - core:collection1 address:https://127.0.0.1:53508/lw/i collection:tmp_collection shard:shard1
   [junit4]   2> 376579 INFO  (coreZkRegister-1175-thread-1-processing-n:127.0.0.1:53508_lw%2Fi x:collection1 s:shard1 c:tmp_collection r:core_node1) [n:127.0.0.1:53508_lw%2Fi c:tmp_collection s:shard1 r:core_node1 x:collection1] o.a.s.c.c.SolrZkClient makePath: /collections/tmp_collection/leader_elect/shard1/election
   [junit4]   2> 376581 INFO  (coreZkRegister-1175-thread-1-processing-n:127.0.0.1:53508_lw%2Fi x:collection1 s:shard1 c:tmp_collection r:core_node1) [n:127.0.0.1:53508_lw%2Fi c:tmp_collection s:shard1 r:core_node1 x:collection1] o.a.s.c.LeaderElector Joined leadership election with path: /collections/tmp_collection/leader_elect/shard1/election/94309167103934469-core_node1-n_0000000000
   [junit4]   2> 376581 INFO  (coreZkRegister-1175-thread-1-processing-n:127.0.0.1:53508_lw%2Fi x:collection1 s:shard1 c:tmp_collection r:core_node1) [n:127.0.0.1:53508_lw%2Fi c:tmp_collection s:shard1 r:core_node1 x:collection1] o.a.s.c.ShardLeaderElectionContext Running the leader process for shard shard1
   [junit4]   2> 376582 INFO  (zkCallback-427-thread-1-processing-n:127.0.0.1:53508_lw%2Fi) [n:127.0.0.1:53508_lw%2Fi    ] o.a.s.c.DistributedQueue NodeChildrenChanged fired on path /overseer/queue state SyncConnected
   [junit4]   2> 376582 INFO  (coreZkRegister-1175-thread-1-processing-n:127.0.0.1:53508_lw%2Fi x:collection1 s:shard1 c:tmp_collection r:core_node1) [n:127.0.0.1:53508_lw%2Fi c:tmp_collection s:shard1 r:core_node1 x:collection1] o.a.s.c.ShardLeaderElectionContext Enough replicas found to continue.
   [junit4]   2> 376582 INFO  (coreZkRegister-1175-thread-1-processing-n:127.0.0.1:53508_lw%2Fi x:collection1 s:shard1 c:tmp_collection r:core_node1) [n:127.0.0.1:53508_lw%2Fi c:tmp_collection s:shard1 r:core_node1 x:collection1] o.a.s.c.ShardLeaderElectionContext I may be the new leader - try and sync
   [junit4]   2> 376582 INFO  (OverseerStateUpdate-94309167103934469-127.0.0.1:53508_lw%2Fi-n_0000000000) [n:127.0.0.1:53508_lw%2Fi    ] o.a.s.c.Overseer processMessage: queueSize: 1, message = {
   [junit4]   2>   "operation":"leader",
   [junit4]   2>   "shard":"shard1",
   [junit4]   2>   "collection":"tmp_collection"} current state version: 1
   [junit4]   2> 376582 INFO  (coreZkRegister-1175-thread-1-processing-n:127.0.0.1:53508_lw%2Fi x:collection1 s:shard1 c:tmp_collection r:core_node1) [n:127.0.0.1:53508_lw%2Fi c:tmp_collection s:shard1 r:core_node1 x:collection1] o.a.s.c.SyncStrategy Sync replicas to https://127.0.0.1:53508/lw/i/collection1/
   [junit4]   2> 376582 INFO  (coreZkRegister-1175-thread-1-processing-n:127.0.0.1:53508_lw%2Fi x:collection1 s:shard1 c:tmp_collection r:core_node1) [n:127.0.0.1:53508_lw%2Fi c:tmp_collection s:shard1 r:core_node1 x:collection1] o.a.s.c.SyncStrategy Sync Success - now sync replicas to me
   [junit4]   2> 376583 INFO  (coreZkRegister-1175-thread-1-processing-n:127.0.0.1:53508_lw%2Fi x:collection1 s:shard1 c:tmp_collection r:core_node1) [n:127.0.0.1:53508_lw%2Fi c:tmp_collection s:shard1 r:core_node1 x:collection1] o.a.s.c.SyncStrategy https://127.0.0.1:53508/lw/i/collection1/ has no replicas
   [junit4]   2> 376583 INFO  (coreZkRegister-1175-thread-1-processing-n:127.0.0.1:53508_lw%2Fi x:collection1 s:shard1 c:tmp_collection r:core_node1) [n:127.0.0.1:53508_lw%2Fi c:tmp_collection s:shard1 r:core_node1 x:collection1] o.a.s.c.ShardLeaderElectionContext I am the new leader: https://127.0.0.1:53508/lw/i/collection1/ shard1
   [junit4]   2> 376583 INFO  (coreZkRegister-1175-thread-1-processing-n:127.0.0.1:53508_lw%2Fi x:collection1 s:shard1 c:tmp_collection r:core_node1) [n:127.0.0.1:53508_lw%2Fi c:tmp_collection s:shard1 r:core_node1 x:collection1] o.a.s.c.c.SolrZkClient makePath: /collections/tmp_collection/leaders/shard1
   [junit4]   2> 376584 INFO  (zkCallback-427-thread-1-processing-n:127.0.0.1:53508_lw%2Fi) [n:127.0.0.1:53508_lw%2Fi    ] o.a.s.h.CdcrProcessStateManager Received new leader state @ tmp_collection:shard1
   [junit4]   2> 376584 INFO  (zkCallback-427-thread-2-processing-n:127.0.0.1:53508_lw%2Fi) [n:127.0.0.1:53508_lw%2Fi    ] o.a.s.c.DistributedQueue NodeChildrenChanged fired on path /overseer/queue state SyncConnected
   [junit4]   2> 376585 INFO  (OverseerStateUpdate-94309167103934469-127.0.0.1:53508_lw%2Fi-n_0000000000) [n:127.0.0.1:53508_lw%2Fi    ] o.a.s.c.Overseer processMessage: queueSize: 1, message = {
   [junit4]   2>   "operation":"leader",
   [junit4]   2>   "shard":"shard1",
   [junit4]   2>   "collection":"tmp_collection",
   [junit4]   2>   "base_url":"https://127.0.0.1:53508/lw/i",
   [junit4]   2>   "core":"collection1",
   [junit4]   2>   "state":"active"} current state version: 1
   [junit4]   2> 376686 INFO  (zkCallback-427-thread-1-processing-n:127.0.0.1:53508_lw%2Fi) [n:127.0.0.1:53508_lw%2Fi    ] o.a.s.c.c.ZkStateReader A cluster state change: WatchedEvent state:SyncConnected type:NodeDataChanged path:/clusterstate.json, has occurred - updating... (live nodes size: 1)
   [junit4]   2> 376735 INFO  (coreZkRegister-1175-thread-1-processing-n:127.0.0.1:53508_lw%2Fi x:collection1 s:shard1 c:tmp_collection r:core_node1) [n:127.0.0.1:53508_lw%2Fi c:tmp_collection s:shard1 r:core_node1 x:collection1] o.a.s.c.ZkController We are https://127.0.0.1:53508/lw/i/collection1/ and leader is https://127.0.0.1:53508/lw/i/collection1/
   [junit4]   2> 376735 INFO  (coreZkRegister-1175-thread-1-processing-n:127.0.0.1:53508_lw%2Fi x:collection1 s:shard1 c:tmp_collection r:core_node1) [n:127.0.0.1:53508_lw%2Fi c:tmp_collection s:shard1 r:core_node1 x:collection1] o.a.s.c.ZkController No LogReplay needed for core=collection1 baseURL=https://127.0.0.1:53508/lw/i
   [junit4]   2> 376735 INFO  (coreZkRegister-1175-thread-1-processing-n:127.0.0.1:53508_lw%2Fi x:collection1 s:shard1 c:tmp_collection r:core_node1) [n:127.0.0.1:53508_lw%2Fi c:tmp_collection s:shard1 r:core_node1 x:collection1] o.a.s.c.ZkController I am the leader, no recovery necessary
   [junit4]   2> 376736 INFO  (coreZkRegister-1175-thread-1-processing-n:127.0.0.1:53508_lw%2Fi x:collection1 s:shard1 c:tmp_collection r:core_node1) [n:127.0.0.1:53508_lw%2Fi c:tmp_collection s:shard1 r:core_node1 x:collection1] o.a.s.c.ZkController publishing state=active
   [junit4]   2> 376736 INFO  (coreZkRegister-1175-thread-1-processing-n:127.0.0.1:53508_lw%2Fi x:collection1 s:shard1 c:tmp_collection r:core_node1) [n:127.0.0.1:53508_lw%2Fi c:tmp_collection s:shard1 r:core_node1 x:collection1] o.a.s.c.ZkController numShards not found on descriptor - reading it from system property
   [junit4]   2> 376736 INFO  (zkCallback-427-thread-1-processing-n:127.0.0.1:53508_lw%2Fi) [n:127.0.0.1:53508_lw%2Fi    ] o.a.s.c.DistributedQueue NodeChildrenChanged fired on path /overseer/queue state SyncConnected
   [junit4]   2> 376737 INFO  (OverseerStateUpdate-94309167103934469-127.0.0.1:53508_lw%2Fi-n_0000000000) [n:127.0.0.1:53508_lw%2Fi    ] o.a.s.c.Overseer processMessage: queueSize: 1, message = {
   [junit4]   2>   "core":"collection1",
   [junit4]   2>   "core_node_name":"core_node1",
   [junit4]   2>   "roles":null,
   [junit4]   2>   "base_url":"https://127.0.0.1:53508/lw/i",
   [junit4]   2>   "node_name":"127.0.0.1:53508_lw%2Fi",
   [junit4]   2>   "numShards":"1",
   [junit4]   2>   "state":"active",
   [junit4]   2>   "shard":"shard1",
   [junit4]   2>   "collection":"tmp_collection",
   [junit4]   2>   "operation":"state"} current state version: 2
   [junit4]   2> 376737 INFO  (OverseerStateUpdate-94309167103934469-127.0.0.1:53508_lw%2Fi-n_0000000000) [n:127.0.0.1:53508_lw%2Fi    ] o.a.s.c.o.ReplicaMutator Update state numShards=1 message={
   [junit4]   2>   "core":"collection1",
   [junit4]   2>   "core_node_name":"core_node1",
   [junit4]   2>   "roles":null,
   [junit4]   2>   "base_url":"https://127.0.0.1:53508/lw/i",
   [junit4]   2>   "node_name":"127.0.0.1:53508_lw%2Fi",
   [junit4]   2>   "numShards":"1",
   [junit4]   2>   "state":"active",
   [junit4]   2>   "shard":"shard1",
   [junit4]   2>   "collection":"tmp_collection",
   [junit4]   2>   "operation":"state"}
   [junit4]   2> 376838 INFO  (zkCallback-427-thread-1-processing-n:127.0.0.1:53508_lw%2Fi) [n:127.0.0.1:53508_lw%2Fi    ] o.a.s.c.c.ZkStateReader A cluster state change: WatchedEvent state:SyncConnected type:NodeDataChanged path:/clusterstate.json, has occurred - updating... (live nodes size: 1)
   [junit4]   2> 376955 INFO  (TEST-CdcrReplicationHandlerTest.doTest-seed#[C9505F2D83ABFC2B]) [    ] o.a.s.SolrTestCaseJ4 Writing core.properties file to /home/jenkins/workspace/Lucene-Solr-trunk-Linux/solr/build/solr-core/test/J0/temp/solr.cloud.CdcrReplicationHandlerTest_C9505F2D83ABFC2B-001/jetty-002/cores/collection1
   [junit4]   2> 376957 INFO  (TEST-CdcrReplicationHandlerTest.doTest-seed#[C9505F2D83ABFC2B]) [    ] o.e.j.s.Server jetty-9.2.11.v20150529
   [junit4]   2> 376958 INFO  (TEST-CdcrReplicationHandlerTest.doTest-seed#[C9505F2D83ABFC2B]) [    ] o.e.j.s.h.ContextHandler Started o.e.j.s.ServletContextHandler@137d7ecb{/lw/i,null,AVAILABLE}
   [junit4]   2> 376962 INFO  (TEST-CdcrReplicationHandlerTest.doTest-seed#[C9505F2D83ABFC2B]) [    ] o.e.j.s.ServerConnector Started ServerConnector@39efa2f7{SSL-http/1.1}{127.0.0.1:43857}
   [junit4]   2> 376962 INFO  (TEST-CdcrReplicationHandlerTest.doTest-seed#[C9505F2D83ABFC2B]) [    ] o.e.j.s.Server Started @378933ms
   [junit4]   2> 376962 INFO  (TEST-CdcrReplicationHandlerTest.doTest-seed#[C9505F2D83ABFC2B]) [    ] o.a.s.c.s.e.JettySolrRunner Jetty properties: {shards=shard2, hostContext=/lw/i, hostPort=43857, coreRootDirectory=/home/jenkins/workspace/Lucene-Solr-trunk-Linux/solr/build/solr-core/test/J0/temp/solr.cloud.CdcrReplicationHandlerTest_C9505F2D83ABFC2B-001/jetty-002/cores}
   [junit4]   2> 376963 INFO  (TEST-CdcrReplicationHandlerTest.doTest-seed#[C9505F2D83ABFC2B]) [    ] o.a.s.s.SolrDispatchFilter SolrDispatchFilter.init(): sun.misc.Launcher$AppClassLoader@4e0e2f2a
   [junit4]   2> 376963 INFO  (TEST-CdcrReplicationHandlerTest.doTest-seed#[C9505F2D83ABFC2B]) [    ] o.a.s.c.SolrResourceLoader new SolrResourceLoader for directory: '/home/jenkins/workspace/Lucene-Solr-trunk-Linux/solr/build/solr-core/test/J0/temp/solr.cloud.CdcrReplicationHandlerTest_C9505F2D83ABFC2B-001/jetty-002/'
   [junit4]   2> 376988 INFO  (TEST-CdcrReplicationHandlerTest.doTest-seed#[C9505F2D83ABFC2B]) [    ] o.a.s.c.c.SolrZkClient Using default ZkCredentialsProvider
   [junit4]   2> 376989 INFO  (TEST-CdcrReplicationHandlerTest.doTest-seed#[C9505F2D83ABFC2B]) [    ] o.a.s.c.c.ConnectionManager Waiting for client to connect to ZooKeeper
   [junit4]   2> 376989 INFO  (zkCallback-428-thread-1) [    ] o.a.s.c.c.ConnectionManager Watcher org.apache.solr.common.cloud.ConnectionManager@519d4411 name:ZooKeeperConnection Watcher:127.0.0.1:57581/solr got event WatchedEvent state:SyncConnected type:None path:null path:null type:None
   [junit4]   2> 376990 INFO  (TEST-CdcrReplicationHandlerTest.doTest-seed#[C9505F2D83ABFC2B]) [    ] o.a.s.c.c.ConnectionManager Client is connected to ZooKeeper
   [junit4]   2> 376990 INFO  (TEST-CdcrReplicationHandlerTest.doTest-seed#[C9505F2D83ABFC2B]) [    ] o.a.s.c.c.SolrZkClient Using default ZkACLProvider
   [junit4]   2> 376991 INFO  (TEST-CdcrReplicationHandlerTest.doTest-seed#[C9505F2D83ABFC2B]) [    ] o.a.s.s.SolrDispatchFilter Loading solr.xml from SolrHome (not found in ZooKeeper)
   [junit4]   2> 376991 INFO  (TEST-CdcrReplicationHandlerTest.doTest-seed#[C9505F2D83ABFC2B]) [    ] o.a.s.c.SolrXmlConfig Loading container configuration from /home/jenkins/workspace/Lucene-Solr-trunk-Linux/solr/build/solr-core/test/J0/temp/solr.cloud.CdcrReplicationHandlerTest_C9505F2D83ABFC2B-001/jetty-002/solr.xml
   [junit4]   2> 376995 INFO  (TEST-CdcrReplicationHandlerTest.doTest-seed#[C9505F2D83ABFC2B]) [    ] o.a.s.c.CoresLocator Config-defined core root directory: /home/jenkins/workspace/Lucene-Solr-trunk-Linux/solr/build/solr-core/test/J0/temp/solr.cloud.CdcrReplicationHandlerTest_C9505F2D83ABFC2B-001/jetty-002/cores
   [junit4]   2> 376995 INFO  (TEST-CdcrReplicationHandlerTest.doTest-seed#[C9505F2D83ABFC2B]) [    ] o.a.s.c.CoreContainer New CoreContainer 1511706000
   [junit4]   2> 376995 INFO  (TEST-CdcrReplicationHandlerTest.doTest-seed#[C9505F2D83ABFC2B]) [    ] o.a.s.c.CoreContainer Loading cores into CoreContainer [instanceDir=/home/jenkins/workspace/Lucene-Solr-trunk-Linux/solr/build/solr-core/test/J0/temp/solr.cloud.CdcrReplicationHandlerTest_C9505F2D83ABFC2B-001/jetty-002/]
   [junit4]   2> 376995 INFO  (TEST-CdcrReplicationHandlerTest.doTest-seed#[C9505F2D83ABFC2B]) [    ] o.a.s.c.CoreContainer loading shared library: /home/jenkins/workspace/Lucene-Solr-trunk-Linux/solr/build/solr-core/test/J0/temp/solr.cloud.CdcrReplicationHandlerTest_C9505F2D83ABFC2B-001/jetty-002/lib
   [junit4]   2> 376996 WARN  (TEST-CdcrReplicationHandlerTest.doTest-seed#[C9505F2D83ABFC2B]) [    ] o.a.s.c.SolrResourceLoader Can't find (or read) directory to add to classloader: lib (resolved as: /home/jenkins/workspace/Lucene-Solr-trunk-Linux/solr/build/solr-core/test/J0/temp/solr.cloud.CdcrReplicationHandlerTest_C9505F2D83ABFC2B-001/jetty-002/lib).
   [junit4]   2> 377002 INFO  (TEST-CdcrReplicationHandlerTest.doTest-seed#[C9505F2D83ABFC2B]) [    ] o.a.s.h.c.HttpShardHandlerFactory created with socketTimeout : 90000,urlScheme : ,connTimeout : 15000,maxConnectionsPerHost : 20,maxConnections : 10000,corePoolSize : 0,maximumPoolSize : 2147483647,maxThreadIdleTime : 5,sizeOfQueue : -1,fairnessPolicy : false,useRetries : false,
   [junit4]   2> 377004 INFO  (TEST-CdcrReplicationHandlerTest.doTest-seed#[C9505F2D83ABFC2B]) [    ] o.a.s.u.UpdateShardHandler Creating UpdateShardHandler HTTP client with params: socketTimeout=340000&connTimeout=45000&retry=true
   [junit4]   2> 377006 INFO  (TEST-CdcrReplicationHandlerTest.doTest-seed#[C9505F2D83ABFC2B]) [    ] o.a.s.l.LogWatcher SLF4J impl is org.slf4j.impl.Log4jLoggerFactory
   [junit4]   2> 377006 INFO  (TEST-CdcrReplicationHandlerTest.doTest-seed#[C9505F2D83ABFC2B]) [    ] o.a.s.l.LogWatcher Registering Log Listener [Log4j (org.slf4j.impl.Log4jLoggerFactory)]
   [junit4]   2> 377006 INFO  (TEST-CdcrReplicationHandlerTest.doTest-seed#[C9505F2D83ABFC2B]) [    ] o.a.s.c.ZkContainer Zookeeper client=127.0.0.1:57581/solr
   [junit4]   2> 377006 INFO  (TEST-CdcrReplicationHandlerTest.doTest-seed#[C9505F2D83ABFC2B]) [    ] o.a.s.c.ZkController zkHost includes chroot
   [junit4]   2> 377006 INFO  (TEST-CdcrReplicationHandlerTest.doTest-seed#[C9505F2D83ABFC2B]) [    ] o.a.s.c.c.SolrZkClient Using default ZkCredentialsProvider
   [junit4]   2> 377007 INFO  (TEST-CdcrReplicationHandlerTest.doTest-seed#[C9505F2D83ABFC2B]) [    ] o.a.s.c.c.ConnectionManager Waiting for client to connect to ZooKeeper
   [junit4]   2> 377007 INFO  (zkCallback-430-thread-1) [    ] o.a.s.c.c.ConnectionManager Watcher org.apache.solr.common.cloud.ConnectionManager@1c55dbb1 name:ZooKeeperConnection Watcher:127.0.0.1:57581 got event WatchedEvent state:SyncConnected type:None path:null path:null type:None
   [junit4]   2> 377008 INFO  (TEST-CdcrReplicationHandlerTest.doTest-seed#[C9505F2D83ABFC2B]) [    ] o.a.s.c.c.ConnectionManager Client is connected to ZooKeeper
   [junit4]   2> 377009 INFO  (TEST-CdcrReplicationHandlerTest.doTest-seed#[C9505F2D83ABFC2B]) [    ] o.a.s.c.c.SolrZkClient Using default ZkACLProvider
   [junit4]   2> 377009 INFO  (TEST-CdcrReplicationHandlerTest.doTest-seed#[C9505F2D83ABFC2B]) [n:127.0.0.1:43857_lw%2Fi    ] o.a.s.c.c.ConnectionManager Waiting for client to connect to ZooKeeper
   [junit4]   2> 377010 INFO  (zkCallback-431-thread-1-processing-n:127.0.0.1:43857_lw%2Fi) [n:127.0.0.1:43857_lw%2Fi    ] o.a.s.c.c.ConnectionManager Watcher org.apache.solr.common.cloud.ConnectionManager@3fd3eee8 name:ZooKeeperConnection Watcher:127.0.0.1:57581/solr got event WatchedEvent state:SyncConnected type:None path:null path:null type:None
   [junit4]   2> 377010 INFO  (TEST-CdcrReplicationHandlerTest.doTest-seed#[C9505F2D83ABFC2B]) [n:127.0.0.1:43857_lw%2Fi    ] o.a.s.c.c.ConnectionManager Client is connected to ZooKeeper
   [junit4]   2> 377012 INFO  (TEST-CdcrReplicationHandlerTest.doTest-seed#[C9505F2D83ABFC2B]) [n:127.0.0.1:43857_lw%2Fi    ] o.a.s.c.c.ZkStateReader Updating cluster state from ZooKeeper... 
   [junit4]   2> 378013 INFO  (TEST-CdcrReplicationHandlerTest.doTest-seed#[C9505F2D83ABFC2B]) [n:127.0.0.1:43857_lw%2Fi    ] o.a.s.c.ZkController Register node as live in ZooKeeper:/live_nodes/127.0.0.1:43857_lw%2Fi
   [junit4]   2> 378014 INFO  (TEST-CdcrReplicationHandlerTest.doTest-seed#[C9505F2D83ABFC2B]) [n:127.0.0.1:43857_lw%2Fi    ] o.a.s.c.c.SolrZkClient makePath: /live_nodes/127.0.0.1:43857_lw%2Fi
   [junit4]   2> 378015 INFO  (zkCallback-427-thread-1-processing-n:127.0.0.1:53508_lw%2Fi) [n:127.0.0.1:53508_lw%2Fi    ] o.a.s.c.c.ZkStateReader A live node change: WatchedEvent state:SyncConnected type:NodeChildrenChanged path:/live_nodes, has occurred - updating... (live nodes size: 1)
   [junit4]   2> 378015 INFO  (zkCallback-431-thread-1-processing-n:127.0.0.1:43857_lw%2Fi) [n:127.0.0.1:43857_lw%2Fi    ] o.a.s.c.c.ZkStateReader A live node change: WatchedEvent state:SyncConnected type:NodeChildrenChanged path:/live_nodes, has occurred - updating... (live nodes size: 1)
   [junit4]   2> 378015 INFO  (TEST-CdcrReplicationHandlerTest.doTest-seed#[C9505F2D83ABFC2B]) [n:127.0.0.1:43857_lw%2Fi    ] o.a.s.c.Overseer Overseer (id=null) closing
   [junit4]   2> 378015 INFO  (TEST-CdcrReplicationHandlerTest.doTest-seed#[C9505F2D83ABFC2B]) [n:127.0.0.1:43857_lw%2Fi    ] o.a.s.c.LeaderElector Joined leadership election with path: /overseer_elect/election/94309167103934472-127.0.0.1:43857_lw%2Fi-n_0000000001
   [junit4]   2> 378016 INFO  (TEST-CdcrReplicationHandlerTest.doTest-seed#[C9505F2D83ABFC2B]) [n:127.0.0.1:43857_lw%2Fi    ] o.a.s.c.LeaderElector Watching path /overseer_elect/election/94309167103934469-127.0.0.1:53508_lw%2Fi-n_0000000000 to know if I could be the leader
   [junit4]   2> 378032 INFO  (TEST-CdcrReplicationHandlerTest.doTest-seed#[C9505F2D83ABFC2B]) [n:127.0.0.1:43857_lw%2Fi    ] o.a.s.c.CoreContainer Security conf doesn't exist. Skipping setup for authorization module.
   [junit4]   2> 378033 INFO  (TEST-CdcrReplicationHandlerTest.doTest-seed#[C9505F2D83ABFC2B]) [n:127.0.0.1:43857_lw%2Fi    ] o.a.s.c.CoreContainer No authentication plugin used.
   [junit4]   2> 378033 INFO  (TEST-CdcrReplicationHandlerTest.doTest-seed#[C9505F2D83ABFC2B]) [n:127.0.0.1:43857_lw%2Fi    ] o.a.s.c.CoresLocator Looking for core definitions underneath /home/jenkins/workspace/Lucene-Solr-trunk-Linux/solr/build/solr-core/test/J0/temp/solr.cloud.CdcrReplicationHandlerTest_C9505F2D83ABFC2B-001/jetty-002/cores
   [junit4]   2> 378034 INFO  (TEST-CdcrReplicationHandlerTest.doTest-seed#[C9505F2D83ABFC2B]) [n:127.0.0.1:43857_lw%2Fi    ] o.a.s.c.SolrCore Created CoreDescriptor: {name=collection1, config=solrconfig.xml, transient=false, schema=schema.xml, loadOnStartup=true, configSetProperties=configsetprops.json, instanceDir=/home/jenkins/workspace/Lucene-Solr-trunk-Linux/solr/build/solr-core/test/J0/temp/solr.cloud.CdcrReplicationHandlerTest_C9505F2D83ABFC2B-001/jetty-002/cores/collection1, collection=tmp_collection, absoluteInstDir=/home/jenkins/workspace/Lucene-Solr-trunk-Linux/solr/build/solr-core/test/J0/temp/solr.cloud.CdcrReplicationHandlerTest_C9505F2D83ABFC2B-001/jetty-002/cores/collection1/, coreNodeName=, dataDir=data/, shard=}
   [junit4]   2> 378034 INFO  (TEST-CdcrReplicationHandlerTest.doTest-seed#[C9505F2D83ABFC2B]) [n:127.0.0.1:43857_lw%2Fi    ] o.a.s.c.CoresLocator Found core collection1 in /home/jenkins/workspace/Lucene-Solr-trunk-Linux/solr/build/solr-core/test/J0/temp/solr.cloud.CdcrReplicationHandlerTest_C9505F2D83ABFC2B-001/jetty-002/cores/collection1/
   [junit4]   2> 378034 INFO  (TEST-CdcrReplicationHandlerTest.doTest-seed#[C9505F2D83ABFC2B]) [n:127.0.0.1:43857_lw%2Fi    ] o.a.s.c.CoresLocator Found 1 core definitions
   [junit4]   2> 378035 INFO  (TEST-CdcrReplicationHandlerTest.doTest-seed#[C9505F2D83ABFC2B]) [n:127.0.0.1:43857_lw%2Fi    ] o.a.s.s.SolrDispatchFilter user.dir=/home/jenkins/workspace/Lucene-Solr-trunk-Linux/solr/build/solr-core/test/J0
   [junit4]   2> 378035 INFO  (TEST-CdcrReplicationHandlerTest.doTest-seed#[C9505F2D83ABFC2B]) [n:127.0.0.1:43857_lw%2Fi    ] o.a.s.s.SolrDispatchFilter SolrDispatchFilter.init() done
   [junit4]   2> 378035 INFO  (coreLoadExecutor-1193-thread-1-processing-n:127.0.0.1:43857_lw%2Fi) [n:127.0.0.1:43857_lw%2Fi c:tmp_collection   x:collection1] o.a.s.c.ZkController publishing state=down
   [junit4]   2> 378035 INFO  (coreLoadExecutor-1193-thread-1-processing-n:127.0.0.1:43857_lw%2Fi) [n:127.0.0.1:43857_lw%2Fi c:tmp_collection   x:collection1] o.a.s.c.ZkController numShards not found on descriptor - reading it from system property
   [junit4]   2> 378035 INFO  (coreLoadExecutor-1193-thread-1-processing-n:127.0.0.1:43857_lw%2Fi) [n:127.0.0.1:43857_lw%2Fi c:tmp_collection   x:collection1] o.a.s.c.ZkController Registering watch for collection tmp_collection
   [junit4]   2> 378036 INFO  (zkCallback-427-thread-1-processing-n:127.0.0.1:53508_lw%2Fi) [n:127.0.0.1:53508_lw%2Fi    ] o.a.s.c.DistributedQueue NodeChildrenChanged fired on path /overseer/queue state SyncConnected
   [junit4]   2> 378036 INFO  (coreLoadExecutor-1193-thread-1-processing-n:127.0.0.1:43857_lw%2Fi) [n:127.0.0.1:43857_lw%2Fi c:tmp_collection   x:collection1] o.a.s.c.c.ZkStateReader addZkWatch tmp_collection
   [junit4]   2> 378036 INFO  (coreLoadExecutor-1193-thread-1-processing-n:127.0.0.1:43857_lw%2Fi) [n:127.0.0.1:43857_lw%2Fi c:tmp_collection   x:collection1] o.a.s.c.c.ZkStateReader Deleting data for tmp_collection
   [junit4]   2> 378036 INFO  (OverseerStateUpdate-94309167103934469-127.0.0.1:53508_lw%2Fi-n_0000000000) [n:127.0.0.1:53508_lw%2Fi    ] o.a.s.c.Overseer processMessage: queueSize: 1, message = {
   [junit4]   2>   "core":"collection1",
   [junit4]   2>   "roles":null,
   [junit4]   2>   "base_url":"https://127.0.0.1:43857/lw/i",
   [junit4]   2>   "node_name":"127.0.0.1:43857_lw%2Fi",
   [junit4]   2>   "numShards":"1",
   [junit4]   2>   "state":"down",
   [junit4]   2>   "shard":null,
   [junit4]   2>   "collection":"tmp_collection",
   [junit4]   2>   "operation":"state"} current state version: 3
   [junit4]   2> 378036 INFO  (coreLoadExecutor-1193-thread-1-processing-n:127.0.0.1:43857_lw%2Fi) [n:127.0.0.1:43857_lw%2Fi c:tmp_collection   x:collection1] o.a.s.c.ZkController look for our core node name
   [junit4]   2> 378036 INFO  (OverseerStateUpdate-94309167103934469-127.0.0.1:53508_lw%2Fi-n_0000000000) [n:127.0.0.1:53508_lw%2Fi    ] o.a.s.c.o.ReplicaMutator Update state numShards=1 message={
   [junit4]   2>   "core":"collection1",
   [junit4]   2>   "roles":null,
   [junit4]   2>   "base_url":"https://127.0.0.1:43857/lw/i",
   [junit4]   2>   "node_name":"127.0.0.1:43857_lw%2Fi",
   [junit4]   2>   "numShards":"1",
   [junit4]   2>   "state":"down",
   [junit4]   2>   "shard":null,
   [junit4]   2>   "collection":"tmp_collection",
   [junit4]   2>   "operation":"state"}
   [junit4]   2> 378036 INFO  (OverseerStateUpdate-94309167103934469-127.0.0.1:53508_lw%2Fi-n_0000000000) [n:127.0.0.1:53508_lw%2Fi    ] o.a.s.c.o.ReplicaMutator Collection already exists with numShards=1
   [junit4]   2> 378037 INFO  (OverseerStateUpdate-94309167103934469-127.0.0.1:53508_lw%2Fi-n_0000000000) [n:127.0.0.1:53508_lw%2Fi    ] o.a.s.c.o.ReplicaMutator Assigning new node to shard shard=shard1
   [junit4]   2> 378138 INFO  (zkCallback-427-thread-1-processing-n:127.0.0.1:53508_lw%2Fi) [n:127.0.0.1:53508_lw%2Fi    ] o.a.s.c.c.ZkStateReader A cluster state change: WatchedEvent state:SyncConnected type:NodeDataChanged path:/clusterstate.json, has occurred - updating... (live nodes size: 2)
   [junit4]   2> 378138 INFO  (zkCallback-431-thread-1-processing-n:127.0.0.1:43857_lw%2Fi) [n:127.0.0.1:43857_lw%2Fi    ] o.a.s.c.c.ZkStateReader A cluster state change: WatchedEvent state:SyncConnected type:NodeDataChanged path:/clusterstate.json, has occurred - updating... (live nodes size: 2)
   [junit4]   2> 379036 INFO  (coreLoadExecutor-1193-thread-1-processing-n:127.0.0.1:43857_lw%2Fi) [n:127.0.0.1:43857_lw%2Fi c:tmp_collection   x:collection1] o.a.s.c.ZkController waiting to find shard id in clusterstate for collection1
   [junit4]   2> 379036 INFO  (coreLoadExecutor-1193-thread-1-processing-n:127.0.0.1:43857_lw%2Fi) [n:127.0.0.1:43857_lw%2Fi c:tmp_collection   x:collection1] o.a.s.c.ZkController Check for collection zkNode:tmp_collection
   [junit4]   2> 379037 INFO  (coreLoadExecutor-1193-thread-1-processing-n:127.0.0.1:43857_lw%2Fi) [n:127.0.0.1:43857_lw%2Fi c:tmp_collection   x:collection1] o.a.s.c.ZkController Collection zkNode exists
   [junit4]   2> 379037 INFO  (coreLoadExecutor-1193-thread-1-processing-n:127.0.0.1:43857_lw%2Fi) [n:127.0.0.1:43857_lw%2Fi c:tmp_collection   x:collection1] o.a.s.c.c.ZkStateReader Load collection config from:/collections/tmp_collection
   [junit4]   2> 379037 INFO  (coreLoadExecutor-1193-thread-1-processing-n:127.0.0.1:43857_lw%2Fi) [n:127.0.0.1:43857_lw%2Fi c:tmp_collection   x:collection1] o.a.s.c.c.ZkStateReader path=/collections/tmp_collection configName=conf1 specified config exists in ZooKeeper
   [junit4]   2> 379037 INFO  (coreLoadExecutor-1193-thread-1-processing-n:127.0.0.1:43857_lw%2Fi) [n:127.0.0.1:43857_lw%2Fi c:tmp_collection   x:collection1] o.a.s.c.SolrResourceLoader new SolrResourceLoader for directory: '/home/jenkins/workspace/Lucene-Solr-trunk-Linux/solr/build/solr-core/test/J0/temp/solr.cloud.CdcrReplicationHandlerTest_C9505F2D83ABFC2B-001/jetty-002/cores/collection1/'
   [junit4]   2> 379045 INFO  (coreLoadExecutor-1193-thread-1-processing-n:127.0.0.1:43857_lw%2Fi) [n:127.0.0.1:43857_lw%2Fi c:tmp_collection   x:collection1] o.a.s.c.Config loaded config solrconfig.xml with version 0 
   [junit4]   2> 379047 INFO  (coreLoadExecutor-1193-thread-1-processing-n:127.0.0.1:43857_lw%2Fi) [n:127.0.0.1:43857_lw%2Fi c:tmp_collection   x:collection1] o.a.s.c.SolrConfig current version of requestparams : -1
   [junit4]   2> 379049 INFO  (coreLoadExecutor-1193-thread-1-processing-n:127.0.0.1:43857_lw%2Fi) [n:127.0.0.1:43857_lw%2Fi c:tmp_collection   x:collection1] o.a.s.c.SolrConfig Using Lucene MatchVersion: 6.0.0
   [junit4]   2> 379053 INFO  (coreLoadExecutor-1193-thread-1-processing-n:127.0.0.1:43857_lw%2Fi) [n:127.0.0.1:43857_lw%2Fi c:tmp_collection   x:collection1] o.a.s.c.Config Loaded SolrConfig: solrconfig.xml
   [junit4]   2> 379054 INFO  (coreLoadExecutor-1193-thread-1-processing-n:127.0.0.1:43857_lw%2Fi) [n:127.0.0.1:43857_lw%2Fi c:tmp_collection   x:collection1] o.a.s.s.IndexSchema Reading Solr Schema from /configs/conf1/schema.xml
   [junit4]   2> 379057 INFO  (coreLoadExecutor-1193-thread-1-processing-n:127.0.0.1:43857_lw%2Fi) [n:127.0.0.1:43857_lw%2Fi c:tmp_collection   x:collection1] o.a.s.s.IndexSchema [collection1] Schema name=test
   [junit4]   2> 379113 INFO  (coreLoadExecutor-1193-thread-1-processing-n:127.0.0.1:43857_lw%2Fi) [n:127.0.0.1:43857_lw%2Fi c:tmp_collection   x:collection1] o.a.s.s.IndexSchema default search field in schema is text
   [junit4]   2> 379113 INFO  (coreLoadExecutor-1193-thread-1-processing-n:127.0.0.1:43857_lw%2Fi) [n:127.0.0.1:43857_lw%2Fi c:tmp_collection   x:collection1] o.a.s.s.IndexSchema unique key field: id
   [junit4]   2> 379114 INFO  (coreLoadExecutor-1193-thread-1-processing-n:127.0.0.1:43857_lw%2Fi) [n:127.0.0.1:43857_lw%2Fi c:tmp_collection   x:collection1] o.a.s.s.FileExchangeRateProvider Reloading exchange rates from file currency.xml
   [junit4]   2> 379115 INFO  (coreLoadExecutor-1193-thread-1-processing-n:127.0.0.1:43857_lw%2Fi) [n:127.0.0.1:43857_lw%2Fi c:tmp_collection   x:collection1] o.a.s.s.FileExchangeRateProvider Reloading exchange rates from file currency.xml
   [junit4]   2> 379122 INFO  (coreLoadExecutor-1193-thread-1-processing-n:127.0.0.1:43857_lw%2Fi) [n:127.0.0.1:43857_lw%2Fi c:tmp_collection   x:collection1] o.a.s.c.ConfigSetProperties Did not find ConfigSet properties, assuming default properties: Can't find resource 'configsetprops.json' in classpath or '/configs/conf1', cwd=/home/jenkins/workspace/Lucene-Solr-trunk-Linux/solr/build/solr-core/test/J0
   [junit4]   2> 379122 INFO  (coreLoadExecutor-1193-thread-1-processing-n:127.0.0.1:43857_lw%2Fi) [n:127.0.0.1:43857_lw%2Fi c:tmp_collection   x:collection1] o.a.s.c.CoreContainer Creating SolrCore 'collection1' using configuration from collection tmp_collection
   [junit4]   2> 379122 INFO  (coreLoadExecutor-1193-thread-1-processing-n:127.0.0.1:43857_lw%2Fi) [n:127.0.0.1:43857_lw%2Fi c:tmp_collection s:shard1 r:core_node2 x:collection1] o.a.s.c.SolrCore solr.StandardDirectoryFactory
   [junit4]   2> 379122 INFO  (coreLoadExecutor-1193-thread-1-processing-n:127.0.0.1:43857_lw%2Fi) [n:127.0.0.1:43857_lw%2Fi c:tmp_collection s:shard1 r:core_node2 x:collection1] o.a.s.c.SolrCore [[collection1] ] Opening new SolrCore at [/home/jenkins/workspace/Lucene-Solr-trunk-Linux/solr/build/solr-core/test/J0/temp/solr.cloud.CdcrReplicationHandlerTest_C9505F2D83ABFC2B-001/jetty-002/cores/collection1/], dataDir=[null]
   [junit4]   2> 379122 INFO  (coreLoadExecutor-1193-thread-1-processing-n:127.0.0.1:43857_lw%2Fi) [n:127.0.0.1:43857_lw%2Fi c:tmp_collection s:shard1 r:core_node2 x:collection1] o.a.s.c.JmxMonitoredMap JMX monitoring is enabled. Adding Solr mbeans to JMX Server: com.sun.jmx.mbeanserver.JmxMBeanServer@350560c5
   [junit4]   2> 379123 INFO  (coreLoadExecutor-1193-thread-1-processing-n:127.0.0.1:43857_lw%2Fi) [n:127.0.0.1:43857_lw%2Fi c:tmp_collection s:shard1 r:core_node2 x:collection1] o.a.s.c.CachingDirectoryFactory return new directory for /home/jenkins/workspace/Lucene-Solr-trunk-Linux/solr/build/solr-core/test/J0/temp/solr.cloud.CdcrReplicationHandlerTest_C9505F2D83ABFC2B-001/jetty-002/cores/collection1/data
   [junit4]   2> 379123 INFO  (coreLoadExecutor-1193-thread-1-processing-n:127.0.0.1:43857_lw%2Fi) [n:127.0.0.1:43857_lw%2Fi c:tmp_collection s:shard1 r:core_node2 x:collection1] o.a.s.c.SolrCore New index directory detected: old=null new=/home/jenkins/workspace/Lucene-Solr-trunk-Linux/solr/build/solr-core/test/J0/temp/solr.cloud.CdcrReplicationHandlerTest_C9505F2D83ABFC2B-001/jetty-002/cores/collection1/data/index/
   [junit4]   2> 379123 WARN  (coreLoadExecutor-1193-thread-1-processing-n:127.0.0.1:43857_lw%2Fi) [n:127.0.0.1:43857_lw%2Fi c:tmp_collection s:shard1 r:core_node2 x:collection1] o.a.s.c.SolrCore [collection1] Solr index directory '/home/jenkins/workspace/Lucene-Solr-trunk-Linux/solr/build/solr-core/test/J0/temp/solr.cloud.CdcrReplicationHandlerTest_C9505F2D83ABFC2B-001/jetty-002/cores/collection1/data/index' doesn't exist. Creating new index...
   [junit4]   2> 379123 INFO  (coreLoadExecutor-1193-thread-1-processing-n:127.0.0.1:43857_lw%2Fi) [n:127.0.0.1:43857_lw%2Fi c:tmp_collection s:shard1 r:core_node2 x:collection1] o.a.s.c.CachingDirectoryFactory return new directory for /home/jenkins/workspace/Lucene-Solr-trunk-Linux/solr/build/solr-core/test/J0/temp/solr.cloud.CdcrReplicationHandlerTest_C9505F2D83ABFC2B-001/jetty-002/cores/collection1/data/index
   [junit4]   2> 379124 INFO  (coreLoadExecutor-1193-thread-1-processing-n:127.0.0.1:43857_lw%2Fi) [n:127.0.0.1:43857_lw%2Fi c:tmp_collection s:shard1 r:core_node2 x:collection1] o.a.s.u.RandomMergePolicy RandomMergePolicy wrapping class org.apache.lucene.index.AlcoholicMergePolicy: [AlcoholicMergePolicy: minMergeSize=0, mergeFactor=10, maxMergeSize=1513773527, maxMergeSizeForForcedMerge=9223372036854775807, calibrateSizeByDeletes=true, maxMergeDocs=2147483647, maxCFSSegmentSizeMB=8.796093022207999E12, noCFSRatio=0.1]
   [junit4]   2> 379192 INFO  (coreLoadExecutor-1193-thread-1-processing-n:127.0.0.1:43857_lw%2Fi) [n:127.0.0.1:43857_lw%2Fi c:tmp_collection s:shard1 r:core_node2 x:collection1] o.a.s.c.SolrCore SolrDeletionPolicy.onCommit: commits: num=1
   [junit4]   2> 	commit{dir=/home/jenkins/workspace/Lucene-Solr-trunk-Linux/solr/build/solr-core/test/J0/temp/solr.cloud.CdcrReplicationHandlerTest_C9505F2D83ABFC2B-001/jetty-002/cores/collection1/data/index,segFN=segments_1,generation=1}
   [junit4]   2> 379192 INFO  (coreLoadExecutor-1193-thread-1-processing-n:127.0.0.1:43857_lw%2Fi) [n:127.0.0.1:43857_lw%2Fi c:tmp_collection s:shard1 r:core_node2 x:collection1] o.a.s.c.SolrCore newest commit generation = 1
   [junit4]   2> 379192 INFO  (OldIndexDirectoryCleanupThreadForCore-collection1) [n:127.0.0.1:43857_lw%2Fi c:tmp_collection s:shard1 r:core_node2 x:collection1] o.a.s.c.SolrCore Looking for old index directories to cleanup for core collection1 in /home/jenkins/workspace/Lucene-Solr-trunk-Linux/solr/build/solr-core/test/J0/temp/solr.cloud.CdcrReplicationHandlerTest_C9505F2D83ABFC2B-001/jetty-002/cores/collection1/data/
   [junit4]   2> 379195 INFO  (coreLoadExecutor-1193-thread-1-processing-n:127.0.0.1:43857_lw%2Fi) [n:127.0.0.1:43857_lw%2Fi c:tmp_collection s:shard1 r:core_node2 x:collection1] o.a.s.u.p.UpdateRequestProcessorChain creating updateRequestProcessorChain "cdcr-processor-chain"
   [junit4]   2> 379195 INFO  (coreLoadExecutor-1193-thread-1-processing-n:127.0.0.1:43857_lw%2Fi) [n:127.0.0.1:43857_lw%2Fi c:tmp_collection s:shard1 r:core_node2 x:collection1] o.a.s.c.SolrCore no updateRequestProcessorChain defined as default, creating implicit default
   [junit4]   2> 379197 INFO  (coreLoadExecutor-1193-thread-1-processing-n:127.0.0.1:43857_lw%2Fi) [n:127.0.0.1:43857_lw%2Fi c:tmp_collection s:shard1 r:core_node2 x:collection1] o.a.s.h.l.XMLLoader xsltCacheLifetimeSeconds=60
   [junit4]   2> 379197 INFO  (coreLoadExecutor-1193-thread-1-processing-n:127.0.0.1:43857_lw%2Fi) [n:127.0.0.1:43857_lw%2Fi c:tmp_collection s:shard1 r:core_node2 x:collection1] o.a.s.h.l.XMLLoader xsltCacheLifetimeSeconds=60
   [junit4]   2> 379198 INFO  (coreLoadExecutor-1193-thread-1-processing-n:127.0.0.1:43857_lw%2Fi) [n:127.0.0.1:43857_lw%2Fi c:tmp_collection s:shard1 r:core_node2 x:collection1] o.a.s.h.l.XMLLoader xsltCacheLifetimeSeconds=60
   [junit4]   2> 379198 INFO  (coreLoadExecutor-1193-thread-1-processing-n:127.0.0.1:43857_lw%2Fi) [n:127.0.0.1:43857_lw%2Fi c:tmp_collection s:shard1 r:core_node2 x:collection1] o.a.s.h.l.XMLLoader xsltCacheLifetimeSeconds=60
   [junit4]   2> 379202 INFO  (coreLoadExecutor-1193-thread-1-processing-n:127.0.0.1:43857_lw%2Fi) [n:127.0.0.1:43857_lw%2Fi c:tmp_collection s:shard1 r:core_node2 x:collection1] o.a.s.c.RequestHandlers Registered paths: /admin/mbeans,standard,/update/csv,/update/json/docs,/admin/luke,/admin/segments,/get,/admin/system,/replication,/admin/properties,/config,/schema,/admin/plugins,/admin/logging,/update/json,/admin/threads,/admin/ping,/cdcr,/update,/admin/file
   [junit4]   2> 379202 INFO  (coreLoadExecutor-1193-thread-1-processing-n:127.0.0.1:43857_lw%2Fi) [n:127.0.0.1:43857_lw%2Fi c:tmp_collection s:shard1 r:core_node2 x:collection1] o.a.s.c.SolrCore Using default statsCache cache: org.apache.solr.search.stats.LocalStatsCache
   [junit4]   2> 379202 INFO  (coreLoadExecutor-1193-thread-1-processing-n:127.0.0.1:43857_lw%2Fi) [n:127.0.0.1:43857_lw%2Fi c:tmp_collection s:shard1 r:core_node2 x:collection1] o.a.s.u.UpdateHandler Using UpdateLog implementation: org.apache.solr.update.CdcrUpdateLog
   [junit4]   2> 379202 INFO  (coreLoadExecutor-1193-thread-1-processing-n:127.0.0.1:43857_lw%2Fi) [n:127.0.0.1:43857_lw%2Fi c:tmp_collection s:shard1 r:core_node2 x:collection1] o.a.s.u.UpdateLog Initializing UpdateLog: dataDir= defaultSyncLevel=FLUSH numRecordsToKeep=100 maxNumLogsToKeep=10 numVersionBuckets=65536
   [junit4]   2> 379203 INFO  (coreLoadExecutor-1193-thread-1-processing-n:127.0.0.1:43857_lw%2Fi) [n:127.0.0.1:43857_lw%2Fi c:tmp_collection s:shard1 r:core_node2 x:collection1] o.a.s.c.SolrCore Hard AutoCommit: disabled
   [junit4]   2> 379203 INFO  (coreLoadExecutor-1193-thread-1-processing-n:127.0.0.1:43857_lw%2Fi) [n:127.0.0.1:43857_lw%2Fi c:tmp_collection s:shard1 r:core_node2 x:collection1] o.a.s.c.SolrCore Soft AutoCommit: disabled
   [junit4]   2> 379204 INFO  (coreLoadExecutor-1193-thread-1-processing-n:127.0.0.1:43857_lw%2Fi) [n:127.0.0.1:43857_lw%2Fi c:tmp_collection s:shard1 r:core_node2 x:collection1] o.a.s.u.RandomMergePolicy RandomMergePolicy wrapping class org.apache.lucene.index.LogByteSizeMergePolicy: [LogByteSizeMergePolicy: minMergeSize=1677721, mergeFactor=38, maxMergeSize=2147483648, maxMergeSizeForForcedMerge=9223372036854775807, calibrateSizeByDeletes=true, maxMergeDocs=2147483647, maxCFSSegmentSizeMB=8.796093022207999E12, noCFSRatio=0.0]
   [junit4]   2> 379204 INFO  (coreLoadExecutor-1193-thread-1-processing-n:127.0.0.1:43857_lw%2Fi) [n:127.0.0.1:43857_lw%2Fi c:tmp_collection s:shard1 r:core_node2 x:collection1] o.a.s.c.SolrCore SolrDeletionPolicy.onInit: commits: num=1
   [junit4]   2> 	commit{dir=/home/jenkins/workspace/Lucene-Solr-trunk-Linux/solr/build/solr-core/test/J0/temp/solr.cloud.CdcrReplicationHandlerTest_C9505F2D83ABFC2B-001/jetty-002/cores/collection1/data/index,segFN=segments_1,generation=1}
   [junit4]   2> 379204 INFO  (coreLoadExecutor-1193-thread-1-processing-n:127.0.0.1:43857_lw%2Fi) [n:127.0.0.1:43857_lw%2Fi c:tmp_collection s:shard1 r:core_node2 x:collection1] o.a.s.c.SolrCore newest commit generation = 1
   [junit4]   2> 379205 INFO  (coreLoadExecutor-1193-thread-1-processing-n:127.0.0.1:43857_lw%2Fi) [n:127.0.0.1:43857_lw%2Fi c:tmp_collection s:shard1 r:core_node2 x:collection1] o.a.s.s.SolrIndexSearcher Opening Searcher@15a76876[collection1] main
   [junit4]   2> 379205 INFO  (coreLoadExecutor-1193-thread-1-processing-n:127.0.0.1:43857_lw%2Fi) [n:127.0.0.1:43857_lw%2Fi c:tmp_collection s:shard1 r:core_node2 x:collection1] o.a.s.c.c.ZkStateReader Load collection config from:/collections/tmp_collection
   [junit4]   2> 379205 INFO  (coreLoadExecutor-1193-thread-1-processing-n:127.0.0.1:43857_lw%2Fi) [n:127.0.0.1:43857_lw%2Fi c:tmp_collection s:shard1 r:core_node2 x:collection1] o.a.s.c.c.ZkStateReader path=/collections/tmp_collection configName=conf1 specified config exists in ZooKeeper
   [junit4]   2> 379205 INFO  (coreLoadExecutor-1193-thread-1-processing-n:127.0.0.1:43857_lw%2Fi) [n:127.0.0.1:43857_lw%2Fi c:tmp_collection s:shard1 r:core_node2 x:collection1] o.a.s.r.ManagedResourceStorage Setting up ZooKeeper-based storage for the RestManager with znodeBase: /configs/conf1
   [junit4]   2> 379206 INFO  (coreLoadExecutor-1193-thread-1-processing-n:127.0.0.1:43857_lw%2Fi) [n:127.0.0.1:43857_lw%2Fi c:tmp_collection s:shard1 r:core_node2 x:collection1] o.a.s.r.ManagedResourceStorage Configured ZooKeeperStorageIO with znodeBase: /configs/conf1
   [junit4]   2> 379206 INFO  (coreLoadExecutor-1193-thread-1-processing-n:127.0.0.1:43857_lw%2Fi) [n:127.0.0.1:43857_lw%2Fi c:tmp_collection s:shard1 r:core_node2 x:collection1] o.a.s.r.RestManager Initializing RestManager with initArgs: {}
   [junit4]   2> 379206 INFO  (coreLoadExecutor-1193-thread-1-processing-n:127.0.0.1:43857_lw%2Fi) [n:127.0.0.1:43857_lw%2Fi c:tmp_collection s:shard1 r:core_node2 x:collection1] o.a.s.r.ManagedResourceStorage Reading _rest_managed.json using ZooKeeperStorageIO:path=/configs/conf1
   [junit4]   2> 379206 INFO  (coreLoadExecutor-1193-thread-1-processing-n:127.0.0.1:43857_lw%2Fi) [n:127.0.0.1:43857_lw%2Fi c:tmp_collection s:shard1 r:core_node2 x:collection1] o.a.s.r.ManagedResourceStorage No data found for znode /configs/conf1/_rest_managed.json
   [junit4]   2> 379206 INFO  (coreLoadExecutor-1193-thread-1-processing-n:127.0.0.1:43857_lw%2Fi) [n:127.0.0.1:43857_lw%2Fi c:tmp_collection s:shard1 r:core_node2 x:collection1] o.a.s.r.ManagedResourceStorage Loaded null at path _rest_managed.json using ZooKeeperStorageIO:path=/configs/conf1
   [junit4]   2> 379206 INFO  (coreLoadExecutor-1193-thread-1-processing-n:127.0.0.1:43857_lw%2Fi) [n:127.0.0.1:43857_lw%2Fi c:tmp_collection s:shard1 r:core_node2 x:collection1] o.a.s

[...truncated too long message...]

t4]   2> 	at org.apache.solr.common.cloud.ZkStateReader.getClusterProps(ZkStateReader.java:725)
   [junit4]   2> 	... 3 more
   [junit4]   2> 
   [junit4]   2> 803641 INFO  (zkCallback-531-thread-3-processing-n:127.0.0.1:43857_lw%2Fi) [n:127.0.0.1:43857_lw%2Fi    ] o.a.s.c.c.ZkStateReader A live node change: WatchedEvent state:SyncConnected type:NodeChildrenChanged path:/live_nodes, has occurred - updating... (live nodes size: 1)
   [junit4]   2> 803642 WARN  (zkCallback-531-thread-3-processing-n:127.0.0.1:43857_lw%2Fi) [n:127.0.0.1:43857_lw%2Fi    ] o.a.s.c.c.ZkStateReader ZooKeeper watch triggered, but Solr cannot talk to ZK
   [junit4]   2> 803643 INFO  (TEST-CdcrReplicationHandlerTest.doTest-seed#[C9505F2D83ABFC2B]) [    ] o.e.j.s.ServerConnector Stopped ServerConnector@727b04ef{SSL-http/1.1}{127.0.0.1:43857}
   [junit4]   2> 803643 INFO  (TEST-CdcrReplicationHandlerTest.doTest-seed#[C9505F2D83ABFC2B]) [    ] o.e.j.s.h.ContextHandler Stopped o.e.j.s.ServletContextHandler@8fabfb5{/lw/i,null,UNAVAILABLE}
   [junit4]   2> 803644 INFO  (TEST-CdcrReplicationHandlerTest.doTest-seed#[C9505F2D83ABFC2B]) [n:127.0.0.1:53508_lw%2Fi c:source_collection s:shard1 r:core_node1 x:source_collection_shard1_replica1] o.a.s.SolrTestCaseJ4 ###Ending doTest
   [junit4]   2> 803645 INFO  (TEST-CdcrReplicationHandlerTest.doTest-seed#[C9505F2D83ABFC2B]) [n:127.0.0.1:53508_lw%2Fi c:source_collection s:shard1 r:core_node1 x:source_collection_shard1_replica1] o.a.s.c.ZkTestServer connecting to 127.0.0.1:57581 57581
   [junit4]   2> 803718 INFO  (Thread-1191) [    ] o.a.s.c.ZkTestServer connecting to 127.0.0.1:57581 57581
   [junit4]   2> 803719 WARN  (Thread-1191) [    ] o.a.s.c.ZkTestServer Watch limit violations: 
   [junit4]   2> Maximum concurrent create/delete watches above limit:
   [junit4]   2> 
   [junit4]   2> 	43	/solr/aliases.json
   [junit4]   2> 	8	/solr/configs/conf1
   [junit4]   2> 	5	/solr/collections/source_collection/leaders/shard1
   [junit4]   2> 	4	/solr/security.json
   [junit4]   2> 	2	/solr/collections/tmp_collection/leaders/shard1
   [junit4]   2> 
   [junit4]   2> Maximum concurrent data watches above limit:
   [junit4]   2> 
   [junit4]   2> 	43	/solr/clusterstate.json
   [junit4]   2> 	7	/solr/collections/source_collection/cdcr/state/buffer
   [junit4]   2> 	7	/solr/collections/source_collection/cdcr/state/process
   [junit4]   2> 	4	/solr/collections/source_collection/state.json
   [junit4]   2> 	3	/solr/overseer_elect/election/94309167103934469-127.0.0.1:53508_lw%2Fi-n_0000000000
   [junit4]   2> 	3	/solr/collections/source_collection/leader_elect/shard1/election/94309167103934469-core_node2-n_0000000000
   [junit4]   2> 	2	/solr/collections/tmp_collection/cdcr/state/buffer
   [junit4]   2> 	2	/solr/collections/tmp_collection/cdcr/state/process
   [junit4]   2> 
   [junit4]   2> Maximum concurrent children watches above limit:
   [junit4]   2> 
   [junit4]   2> 	41	/solr/live_nodes
   [junit4]   2> 
   [junit4]   2> NOTE: reproduce with: ant test  -Dtestcase=CdcrReplicationHandlerTest -Dtests.method=doTest -Dtests.seed=C9505F2D83ABFC2B -Dtests.multiplier=3 -Dtests.slow=true -Dtests.locale=es_BO -Dtests.timezone=America/Kentucky/Monticello -Dtests.asserts=true -Dtests.file.encoding=UTF-8
   [junit4] ERROR    429s J0 | CdcrReplicationHandlerTest.doTest <<<
   [junit4]    > Throwable #1: java.lang.AssertionError: There are still nodes recoverying - waited for 330 seconds
   [junit4]    > 	at org.apache.solr.cloud.AbstractDistribZkTestBase.waitForRecoveriesToFinish(AbstractDistribZkTestBase.java:172)
   [junit4]    > 	at org.apache.solr.cloud.AbstractDistribZkTestBase.waitForRecoveriesToFinish(AbstractDistribZkTestBase.java:133)
   [junit4]    > 	at org.apache.solr.cloud.AbstractDistribZkTestBase.waitForRecoveriesToFinish(AbstractDistribZkTestBase.java:128)
   [junit4]    > 	at org.apache.solr.cloud.BaseCdcrDistributedZkTest.waitForRecoveriesToFinish(BaseCdcrDistributedZkTest.java:465)
   [junit4]    > 	at org.apache.solr.cloud.BaseCdcrDistributedZkTest.restartServer(BaseCdcrDistributedZkTest.java:506)
   [junit4]    > 	at org.apache.solr.cloud.CdcrReplicationHandlerTest.doTestPartialReplication(CdcrReplicationHandlerTest.java:109)
   [junit4]    > 	at org.apache.solr.cloud.CdcrReplicationHandlerTest.doTest(CdcrReplicationHandlerTest.java:51)
   [junit4]    > 	at org.apache.solr.BaseDistributedSearchTestCase$ShardsRepeatRule$ShardsFixedStatement.callStatement(BaseDistributedSearchTestCase.java:963)
   [junit4]    > 	at org.apache.solr.BaseDistributedSearchTestCase$ShardsRepeatRule$ShardsStatement.evaluate(BaseDistributedSearchTestCase.java:938)
   [junit4]    > 	at java.lang.Thread.run(Thread.java:745)Throwable #2: com.carrotsearch.randomizedtesting.UncaughtExceptionError: Captured an uncaught exception in thread: Thread[id=3409, name=RecoveryThread-source_collection_shard1_replica2, state=RUNNABLE, group=TGRP-CdcrReplicationHandlerTest]
   [junit4]    > Caused by: org.apache.solr.common.cloud.ZooKeeperException: 
   [junit4]    > 	at __randomizedtesting.SeedInfo.seed([C9505F2D83ABFC2B]:0)
   [junit4]    > 	at org.apache.solr.cloud.RecoveryStrategy.run(RecoveryStrategy.java:234)
   [junit4]    > Caused by: org.apache.solr.common.SolrException: java.io.FileNotFoundException: /home/jenkins/workspace/Lucene-Solr-trunk-Linux/solr/build/solr-core/test/J0/temp/solr.cloud.CdcrReplicationHandlerTest_C9505F2D83ABFC2B-001/jetty-002/cores/source_collection_shard1_replica2/data/tlog/tlog.0000000000000000007.1508946704600137728 (No such file or directory)
   [junit4]    > 	at org.apache.solr.update.CdcrTransactionLog.reopenOutputStream(CdcrTransactionLog.java:244)
   [junit4]    > 	at org.apache.solr.update.CdcrTransactionLog.incref(CdcrTransactionLog.java:173)
   [junit4]    > 	at org.apache.solr.update.UpdateLog.getRecentUpdates(UpdateLog.java:1079)
   [junit4]    > 	at org.apache.solr.update.UpdateLog.seedBucketsWithHighestVersion(UpdateLog.java:1579)
   [junit4]    > 	at org.apache.solr.update.UpdateLog.seedBucketsWithHighestVersion(UpdateLog.java:1610)
   [junit4]    > 	at org.apache.solr.core.SolrCore.seedVersionBuckets(SolrCore.java:877)
   [junit4]    > 	at org.apache.solr.cloud.RecoveryStrategy.doRecovery(RecoveryStrategy.java:526)
   [junit4]    > 	at org.apache.solr.cloud.RecoveryStrategy.run(RecoveryStrategy.java:227)
   [junit4]    > Caused by: java.io.FileNotFoundException: /home/jenkins/workspace/Lucene-Solr-trunk-Linux/solr/build/solr-core/test/J0/temp/solr.cloud.CdcrReplicationHandlerTest_C9505F2D83ABFC2B-001/jetty-002/cores/source_collection_shard1_replica2/data/tlog/tlog.0000000000000000007.1508946704600137728 (No such file or directory)
   [junit4]    > 	at java.io.RandomAccessFile.open0(Native Method)
   [junit4]    > 	at java.io.RandomAccessFile.open(RandomAccessFile.java:316)
   [junit4]    > 	at java.io.RandomAccessFile.<init>(RandomAccessFile.java:243)
   [junit4]    > 	at org.apache.solr.update.CdcrTransactionLog.reopenOutputStream(CdcrTransactionLog.java:236)
   [junit4]    > 	... 7 more
   [junit4]   2> 803726 INFO  (SUITE-CdcrReplicationHandlerTest-seed#[C9505F2D83ABFC2B]-worker) [n:127.0.0.1:53508_lw%2Fi c:source_collection s:shard1 r:core_node1 x:source_collection_shard1_replica1] o.a.s.SolrTestCaseJ4 ###deleteCore
   [junit4]   2> NOTE: leaving temporary files on disk at: /home/jenkins/workspace/Lucene-Solr-trunk-Linux/solr/build/solr-core/test/J0/temp/solr.cloud.CdcrReplicationHandlerTest_C9505F2D83ABFC2B-001
   [junit4]   2> Aug 08, 2015 2:28:36 PM com.carrotsearch.randomizedtesting.ThreadLeakControl checkThreadLeaks
   [junit4]   2> WARNING: Will linger awaiting termination of 2 leaked thread(s).
   [junit4]   2> NOTE: test params are: codec=CheapBastard, sim=DefaultSimilarity, locale=es_BO, timezone=America/Kentucky/Monticello
   [junit4]   2> NOTE: Linux 3.16.0-44-generic amd64/Oracle Corporation 1.8.0_60-ea (64-bit)/cpus=12,threads=1,free=136221032,total=508952576
   [junit4]   2> NOTE: All tests run in this JVM: [TestSolr4Spatial, LeaderInitiatedRecoveryOnCommitTest, AliasIntegrationTest, TestJsonRequest, TestPostingsSolrHighlighter, TestScoreJoinQPNoScore, TestFieldResource, BufferStoreTest, ConcurrentDeleteAndCreateCollectionTest, CloudMLTQParserTest, TestAuthenticationFramework, FacetPivotSmallTest, TestSearcherReuse, DataDrivenBlockJoinTest, SaslZkACLProviderTest, UUIDFieldTest, CSVRequestHandlerTest, DeleteReplicaTest, LeaderElectionIntegrationTest, DistributedSpellCheckComponentTest, AsyncCallRequestStatusResponseTest, RankQueryTest, TriLevelCompositeIdRoutingTest, DeleteShardTest, TestRemoteStreaming, TestIntervalFaceting, SuggesterFSTTest, TestMissingGroups, TimeZoneUtilsTest, AddSchemaFieldsUpdateProcessorFactoryTest, TestJoin, CdcrReplicationHandlerTest]
   [junit4] Completed [217/539] on J0 in 428.85s, 1 test, 1 error <<< FAILURES!

[...truncated 1004 lines...]
BUILD FAILED
/home/jenkins/workspace/Lucene-Solr-trunk-Linux/build.xml:716: The following error occurred while executing this line:
/home/jenkins/workspace/Lucene-Solr-trunk-Linux/build.xml:660: The following error occurred while executing this line:
/home/jenkins/workspace/Lucene-Solr-trunk-Linux/build.xml:59: The following error occurred while executing this line:
/home/jenkins/workspace/Lucene-Solr-trunk-Linux/solr/build.xml:230: The following error occurred while executing this line:
/home/jenkins/workspace/Lucene-Solr-trunk-Linux/solr/common-build.xml:514: The following error occurred while executing this line:
/home/jenkins/workspace/Lucene-Solr-trunk-Linux/lucene/common-build.xml:1429: The following error occurred while executing this line:
/home/jenkins/workspace/Lucene-Solr-trunk-Linux/lucene/common-build.xml:984: There were test failures: 539 suites, 2126 tests, 1 error, 67 ignored (31 assumptions)

Total time: 46 minutes 41 seconds
Build step 'Invoke Ant' marked build as failure
Archiving artifacts
Recording test results
Email was triggered for: Failure - Any
Sending email for trigger: Failure - Any



Mime
View raw message