lucene-dev mailing list archives

Site index · List index
Message view « Date » · « Thread »
Top « Date » · « Thread »
From Policeman Jenkins Server <jenk...@thetaphi.de>
Subject [JENKINS-EA] Lucene-Solr-5.x-Linux (64bit/jdk1.8.0_60-ea-b24) - Build # 13504 - Failure!
Date Sat, 01 Aug 2015 07:12:56 GMT
Build: http://jenkins.thetaphi.de/job/Lucene-Solr-5.x-Linux/13504/
Java: 64bit/jdk1.8.0_60-ea-b24 -XX:+UseCompressedOops -XX:+UseParallelGC

1 tests failed.
FAILED:  org.apache.solr.cloud.ChaosMonkeySafeLeaderTest.test

Error Message:
expected:<0> but was:<2>

Stack Trace:
java.lang.AssertionError: expected:<0> but was:<2>
	at __randomizedtesting.SeedInfo.seed([6A612C46F47745DB:E235139C5A8B2823]:0)
	at org.junit.Assert.fail(Assert.java:93)
	at org.junit.Assert.failNotEquals(Assert.java:647)
	at org.junit.Assert.assertEquals(Assert.java:128)
	at org.junit.Assert.assertEquals(Assert.java:472)
	at org.junit.Assert.assertEquals(Assert.java:456)
	at org.apache.solr.cloud.ChaosMonkeySafeLeaderTest.test(ChaosMonkeySafeLeaderTest.java:156)
	at sun.reflect.NativeMethodAccessorImpl.invoke0(Native Method)
	at sun.reflect.NativeMethodAccessorImpl.invoke(NativeMethodAccessorImpl.java:62)
	at sun.reflect.DelegatingMethodAccessorImpl.invoke(DelegatingMethodAccessorImpl.java:43)
	at java.lang.reflect.Method.invoke(Method.java:497)
	at com.carrotsearch.randomizedtesting.RandomizedRunner.invoke(RandomizedRunner.java:1627)
	at com.carrotsearch.randomizedtesting.RandomizedRunner$6.evaluate(RandomizedRunner.java:836)
	at com.carrotsearch.randomizedtesting.RandomizedRunner$7.evaluate(RandomizedRunner.java:872)
	at com.carrotsearch.randomizedtesting.RandomizedRunner$8.evaluate(RandomizedRunner.java:886)
	at org.apache.solr.BaseDistributedSearchTestCase$ShardsRepeatRule$ShardsFixedStatement.callStatement(BaseDistributedSearchTestCase.java:966)
	at org.apache.solr.BaseDistributedSearchTestCase$ShardsRepeatRule$ShardsStatement.evaluate(BaseDistributedSearchTestCase.java:941)
	at com.carrotsearch.randomizedtesting.rules.SystemPropertiesRestoreRule$1.evaluate(SystemPropertiesRestoreRule.java:57)
	at org.apache.lucene.util.TestRuleSetupTeardownChained$1.evaluate(TestRuleSetupTeardownChained.java:50)
	at org.apache.lucene.util.AbstractBeforeAfterRule$1.evaluate(AbstractBeforeAfterRule.java:46)
	at org.apache.lucene.util.TestRuleThreadAndTestName$1.evaluate(TestRuleThreadAndTestName.java:49)
	at org.apache.lucene.util.TestRuleIgnoreAfterMaxFailures$1.evaluate(TestRuleIgnoreAfterMaxFailures.java:65)
	at org.apache.lucene.util.TestRuleMarkFailure$1.evaluate(TestRuleMarkFailure.java:48)
	at com.carrotsearch.randomizedtesting.rules.StatementAdapter.evaluate(StatementAdapter.java:36)
	at com.carrotsearch.randomizedtesting.ThreadLeakControl$StatementRunner.run(ThreadLeakControl.java:365)
	at com.carrotsearch.randomizedtesting.ThreadLeakControl.forkTimeoutingTask(ThreadLeakControl.java:798)
	at com.carrotsearch.randomizedtesting.ThreadLeakControl$3.evaluate(ThreadLeakControl.java:458)
	at com.carrotsearch.randomizedtesting.RandomizedRunner.runSingleTest(RandomizedRunner.java:845)
	at com.carrotsearch.randomizedtesting.RandomizedRunner$3.evaluate(RandomizedRunner.java:747)
	at com.carrotsearch.randomizedtesting.RandomizedRunner$4.evaluate(RandomizedRunner.java:781)
	at com.carrotsearch.randomizedtesting.RandomizedRunner$5.evaluate(RandomizedRunner.java:792)
	at com.carrotsearch.randomizedtesting.rules.StatementAdapter.evaluate(StatementAdapter.java:36)
	at com.carrotsearch.randomizedtesting.rules.SystemPropertiesRestoreRule$1.evaluate(SystemPropertiesRestoreRule.java:57)
	at org.apache.lucene.util.AbstractBeforeAfterRule$1.evaluate(AbstractBeforeAfterRule.java:46)
	at com.carrotsearch.randomizedtesting.rules.StatementAdapter.evaluate(StatementAdapter.java:36)
	at org.apache.lucene.util.TestRuleStoreClassName$1.evaluate(TestRuleStoreClassName.java:42)
	at com.carrotsearch.randomizedtesting.rules.NoShadowingOrOverridesOnMethodsRule$1.evaluate(NoShadowingOrOverridesOnMethodsRule.java:39)
	at com.carrotsearch.randomizedtesting.rules.NoShadowingOrOverridesOnMethodsRule$1.evaluate(NoShadowingOrOverridesOnMethodsRule.java:39)
	at com.carrotsearch.randomizedtesting.rules.StatementAdapter.evaluate(StatementAdapter.java:36)
	at com.carrotsearch.randomizedtesting.rules.StatementAdapter.evaluate(StatementAdapter.java:36)
	at com.carrotsearch.randomizedtesting.rules.StatementAdapter.evaluate(StatementAdapter.java:36)
	at org.apache.lucene.util.TestRuleAssertionsRequired$1.evaluate(TestRuleAssertionsRequired.java:54)
	at org.apache.lucene.util.TestRuleMarkFailure$1.evaluate(TestRuleMarkFailure.java:48)
	at org.apache.lucene.util.TestRuleIgnoreAfterMaxFailures$1.evaluate(TestRuleIgnoreAfterMaxFailures.java:65)
	at org.apache.lucene.util.TestRuleIgnoreTestSuites$1.evaluate(TestRuleIgnoreTestSuites.java:55)
	at com.carrotsearch.randomizedtesting.rules.StatementAdapter.evaluate(StatementAdapter.java:36)
	at com.carrotsearch.randomizedtesting.ThreadLeakControl$StatementRunner.run(ThreadLeakControl.java:365)
	at java.lang.Thread.run(Thread.java:745)




Build Log:
[...truncated 10526 lines...]
   [junit4] Suite: org.apache.solr.cloud.ChaosMonkeySafeLeaderTest
   [junit4]   2> Creating dataDir: /home/jenkins/workspace/Lucene-Solr-5.x-Linux/solr/build/solr-core/test/J1/temp/solr.cloud.ChaosMonkeySafeLeaderTest_6A612C46F47745DB-001/init-core-data-001
   [junit4]   2> 441761 INFO  (SUITE-ChaosMonkeySafeLeaderTest-seed#[6A612C46F47745DB]-worker) [    ] o.a.s.SolrTestCaseJ4 Randomized ssl (true) and clientAuth (false)
   [junit4]   2> 441761 INFO  (SUITE-ChaosMonkeySafeLeaderTest-seed#[6A612C46F47745DB]-worker) [    ] o.a.s.BaseDistributedSearchTestCase Setting hostContext system property: /
   [junit4]   2> 441764 INFO  (TEST-ChaosMonkeySafeLeaderTest.test-seed#[6A612C46F47745DB]) [    ] o.a.s.c.ZkTestServer STARTING ZK TEST SERVER
   [junit4]   2> 441764 INFO  (Thread-1458) [    ] o.a.s.c.ZkTestServer client port:0.0.0.0/0.0.0.0:0
   [junit4]   2> 441764 INFO  (Thread-1458) [    ] o.a.s.c.ZkTestServer Starting server
   [junit4]   2> 441864 INFO  (TEST-ChaosMonkeySafeLeaderTest.test-seed#[6A612C46F47745DB]) [    ] o.a.s.c.ZkTestServer start zk server on port:58145
   [junit4]   2> 441864 INFO  (TEST-ChaosMonkeySafeLeaderTest.test-seed#[6A612C46F47745DB]) [    ] o.a.s.c.c.SolrZkClient Using default ZkCredentialsProvider
   [junit4]   2> 441864 INFO  (TEST-ChaosMonkeySafeLeaderTest.test-seed#[6A612C46F47745DB]) [    ] o.a.s.c.c.ConnectionManager Waiting for client to connect to ZooKeeper
   [junit4]   2> 441869 INFO  (zkCallback-296-thread-1) [    ] o.a.s.c.c.ConnectionManager Watcher org.apache.solr.common.cloud.ConnectionManager@60db750b name:ZooKeeperConnection Watcher:127.0.0.1:58145 got event WatchedEvent state:SyncConnected type:None path:null path:null type:None
   [junit4]   2> 441869 INFO  (TEST-ChaosMonkeySafeLeaderTest.test-seed#[6A612C46F47745DB]) [    ] o.a.s.c.c.ConnectionManager Client is connected to ZooKeeper
   [junit4]   2> 441869 INFO  (TEST-ChaosMonkeySafeLeaderTest.test-seed#[6A612C46F47745DB]) [    ] o.a.s.c.c.SolrZkClient Using default ZkACLProvider
   [junit4]   2> 441869 INFO  (TEST-ChaosMonkeySafeLeaderTest.test-seed#[6A612C46F47745DB]) [    ] o.a.s.c.c.SolrZkClient makePath: /solr
   [junit4]   2> 441872 WARN  (NIOServerCxn.Factory:0.0.0.0/0.0.0.0:0) [    ] o.a.z.s.NIOServerCnxn caught end of stream exception
   [junit4]   2> EndOfStreamException: Unable to read additional data from client sessionid 0x14ee80ab3420000, likely client has closed socket
   [junit4]   2> 	at org.apache.zookeeper.server.NIOServerCnxn.doIO(NIOServerCnxn.java:228)
   [junit4]   2> 	at org.apache.zookeeper.server.NIOServerCnxnFactory.run(NIOServerCnxnFactory.java:208)
   [junit4]   2> 	at java.lang.Thread.run(Thread.java:745)
   [junit4]   2> 441872 INFO  (TEST-ChaosMonkeySafeLeaderTest.test-seed#[6A612C46F47745DB]) [    ] o.a.s.c.c.SolrZkClient Using default ZkCredentialsProvider
   [junit4]   2> 441873 INFO  (TEST-ChaosMonkeySafeLeaderTest.test-seed#[6A612C46F47745DB]) [    ] o.a.s.c.c.ConnectionManager Waiting for client to connect to ZooKeeper
   [junit4]   2> 441878 INFO  (zkCallback-297-thread-1) [    ] o.a.s.c.c.ConnectionManager Watcher org.apache.solr.common.cloud.ConnectionManager@70bc3915 name:ZooKeeperConnection Watcher:127.0.0.1:58145/solr got event WatchedEvent state:SyncConnected type:None path:null path:null type:None
   [junit4]   2> 441878 INFO  (TEST-ChaosMonkeySafeLeaderTest.test-seed#[6A612C46F47745DB]) [    ] o.a.s.c.c.ConnectionManager Client is connected to ZooKeeper
   [junit4]   2> 441878 INFO  (TEST-ChaosMonkeySafeLeaderTest.test-seed#[6A612C46F47745DB]) [    ] o.a.s.c.c.SolrZkClient Using default ZkACLProvider
   [junit4]   2> 441878 INFO  (TEST-ChaosMonkeySafeLeaderTest.test-seed#[6A612C46F47745DB]) [    ] o.a.s.c.c.SolrZkClient makePath: /collections/collection1
   [junit4]   2> 441880 INFO  (TEST-ChaosMonkeySafeLeaderTest.test-seed#[6A612C46F47745DB]) [    ] o.a.s.c.c.SolrZkClient makePath: /collections/collection1/shards
   [junit4]   2> 441881 INFO  (TEST-ChaosMonkeySafeLeaderTest.test-seed#[6A612C46F47745DB]) [    ] o.a.s.c.c.SolrZkClient makePath: /collections/control_collection
   [junit4]   2> 441881 INFO  (TEST-ChaosMonkeySafeLeaderTest.test-seed#[6A612C46F47745DB]) [    ] o.a.s.c.c.SolrZkClient makePath: /collections/control_collection/shards
   [junit4]   2> 441882 INFO  (TEST-ChaosMonkeySafeLeaderTest.test-seed#[6A612C46F47745DB]) [    ] o.a.s.c.AbstractZkTestCase put /home/jenkins/workspace/Lucene-Solr-5.x-Linux/solr/core/src/test-files/solr/collection1/conf/solrconfig-tlog.xml to /configs/conf1/solrconfig.xml
   [junit4]   2> 441882 INFO  (TEST-ChaosMonkeySafeLeaderTest.test-seed#[6A612C46F47745DB]) [    ] o.a.s.c.c.SolrZkClient makePath: /configs/conf1/solrconfig.xml
   [junit4]   2> 441883 INFO  (TEST-ChaosMonkeySafeLeaderTest.test-seed#[6A612C46F47745DB]) [    ] o.a.s.c.AbstractZkTestCase put /home/jenkins/workspace/Lucene-Solr-5.x-Linux/solr/core/src/test-files/solr/collection1/conf/schema15.xml to /configs/conf1/schema.xml
   [junit4]   2> 441884 INFO  (TEST-ChaosMonkeySafeLeaderTest.test-seed#[6A612C46F47745DB]) [    ] o.a.s.c.c.SolrZkClient makePath: /configs/conf1/schema.xml
   [junit4]   2> 441884 INFO  (TEST-ChaosMonkeySafeLeaderTest.test-seed#[6A612C46F47745DB]) [    ] o.a.s.c.AbstractZkTestCase put /home/jenkins/workspace/Lucene-Solr-5.x-Linux/solr/core/src/test-files/solr/collection1/conf/solrconfig.snippet.randomindexconfig.xml to /configs/conf1/solrconfig.snippet.randomindexconfig.xml
   [junit4]   2> 441884 INFO  (TEST-ChaosMonkeySafeLeaderTest.test-seed#[6A612C46F47745DB]) [    ] o.a.s.c.c.SolrZkClient makePath: /configs/conf1/solrconfig.snippet.randomindexconfig.xml
   [junit4]   2> 441885 INFO  (TEST-ChaosMonkeySafeLeaderTest.test-seed#[6A612C46F47745DB]) [    ] o.a.s.c.AbstractZkTestCase put /home/jenkins/workspace/Lucene-Solr-5.x-Linux/solr/core/src/test-files/solr/collection1/conf/stopwords.txt to /configs/conf1/stopwords.txt
   [junit4]   2> 441885 INFO  (TEST-ChaosMonkeySafeLeaderTest.test-seed#[6A612C46F47745DB]) [    ] o.a.s.c.c.SolrZkClient makePath: /configs/conf1/stopwords.txt
   [junit4]   2> 441886 INFO  (TEST-ChaosMonkeySafeLeaderTest.test-seed#[6A612C46F47745DB]) [    ] o.a.s.c.AbstractZkTestCase put /home/jenkins/workspace/Lucene-Solr-5.x-Linux/solr/core/src/test-files/solr/collection1/conf/protwords.txt to /configs/conf1/protwords.txt
   [junit4]   2> 441886 INFO  (TEST-ChaosMonkeySafeLeaderTest.test-seed#[6A612C46F47745DB]) [    ] o.a.s.c.c.SolrZkClient makePath: /configs/conf1/protwords.txt
   [junit4]   2> 441887 INFO  (TEST-ChaosMonkeySafeLeaderTest.test-seed#[6A612C46F47745DB]) [    ] o.a.s.c.AbstractZkTestCase put /home/jenkins/workspace/Lucene-Solr-5.x-Linux/solr/core/src/test-files/solr/collection1/conf/currency.xml to /configs/conf1/currency.xml
   [junit4]   2> 441887 INFO  (TEST-ChaosMonkeySafeLeaderTest.test-seed#[6A612C46F47745DB]) [    ] o.a.s.c.c.SolrZkClient makePath: /configs/conf1/currency.xml
   [junit4]   2> 441887 INFO  (TEST-ChaosMonkeySafeLeaderTest.test-seed#[6A612C46F47745DB]) [    ] o.a.s.c.AbstractZkTestCase put /home/jenkins/workspace/Lucene-Solr-5.x-Linux/solr/core/src/test-files/solr/collection1/conf/enumsConfig.xml to /configs/conf1/enumsConfig.xml
   [junit4]   2> 441888 INFO  (TEST-ChaosMonkeySafeLeaderTest.test-seed#[6A612C46F47745DB]) [    ] o.a.s.c.c.SolrZkClient makePath: /configs/conf1/enumsConfig.xml
   [junit4]   2> 441888 INFO  (TEST-ChaosMonkeySafeLeaderTest.test-seed#[6A612C46F47745DB]) [    ] o.a.s.c.AbstractZkTestCase put /home/jenkins/workspace/Lucene-Solr-5.x-Linux/solr/core/src/test-files/solr/collection1/conf/open-exchange-rates.json to /configs/conf1/open-exchange-rates.json
   [junit4]   2> 441888 INFO  (TEST-ChaosMonkeySafeLeaderTest.test-seed#[6A612C46F47745DB]) [    ] o.a.s.c.c.SolrZkClient makePath: /configs/conf1/open-exchange-rates.json
   [junit4]   2> 441889 INFO  (TEST-ChaosMonkeySafeLeaderTest.test-seed#[6A612C46F47745DB]) [    ] o.a.s.c.AbstractZkTestCase put /home/jenkins/workspace/Lucene-Solr-5.x-Linux/solr/core/src/test-files/solr/collection1/conf/mapping-ISOLatin1Accent.txt to /configs/conf1/mapping-ISOLatin1Accent.txt
   [junit4]   2> 441889 INFO  (TEST-ChaosMonkeySafeLeaderTest.test-seed#[6A612C46F47745DB]) [    ] o.a.s.c.c.SolrZkClient makePath: /configs/conf1/mapping-ISOLatin1Accent.txt
   [junit4]   2> 441890 INFO  (TEST-ChaosMonkeySafeLeaderTest.test-seed#[6A612C46F47745DB]) [    ] o.a.s.c.AbstractZkTestCase put /home/jenkins/workspace/Lucene-Solr-5.x-Linux/solr/core/src/test-files/solr/collection1/conf/old_synonyms.txt to /configs/conf1/old_synonyms.txt
   [junit4]   2> 441890 INFO  (TEST-ChaosMonkeySafeLeaderTest.test-seed#[6A612C46F47745DB]) [    ] o.a.s.c.c.SolrZkClient makePath: /configs/conf1/old_synonyms.txt
   [junit4]   2> 441892 INFO  (TEST-ChaosMonkeySafeLeaderTest.test-seed#[6A612C46F47745DB]) [    ] o.a.s.c.AbstractZkTestCase put /home/jenkins/workspace/Lucene-Solr-5.x-Linux/solr/core/src/test-files/solr/collection1/conf/synonyms.txt to /configs/conf1/synonyms.txt
   [junit4]   2> 441892 INFO  (TEST-ChaosMonkeySafeLeaderTest.test-seed#[6A612C46F47745DB]) [    ] o.a.s.c.c.SolrZkClient makePath: /configs/conf1/synonyms.txt
   [junit4]   2> 441893 INFO  (TEST-ChaosMonkeySafeLeaderTest.test-seed#[6A612C46F47745DB]) [    ] o.a.s.c.c.SolrZkClient Using default ZkCredentialsProvider
   [junit4]   2> 441894 INFO  (TEST-ChaosMonkeySafeLeaderTest.test-seed#[6A612C46F47745DB]) [    ] o.a.s.c.c.ConnectionManager Waiting for client to connect to ZooKeeper
   [junit4]   2> 441896 INFO  (zkCallback-298-thread-1) [    ] o.a.s.c.c.ConnectionManager Watcher org.apache.solr.common.cloud.ConnectionManager@8c24b7c name:ZooKeeperConnection Watcher:127.0.0.1:58145/solr got event WatchedEvent state:SyncConnected type:None path:null path:null type:None
   [junit4]   2> 441896 INFO  (TEST-ChaosMonkeySafeLeaderTest.test-seed#[6A612C46F47745DB]) [    ] o.a.s.c.c.ConnectionManager Client is connected to ZooKeeper
   [junit4]   2> 441896 INFO  (TEST-ChaosMonkeySafeLeaderTest.test-seed#[6A612C46F47745DB]) [    ] o.a.s.c.c.SolrZkClient Using default ZkACLProvider
   [junit4]   2> 441968 INFO  (TEST-ChaosMonkeySafeLeaderTest.test-seed#[6A612C46F47745DB]) [    ] o.a.s.SolrTestCaseJ4 Writing core.properties file to /home/jenkins/workspace/Lucene-Solr-5.x-Linux/solr/build/solr-core/test/J1/temp/solr.cloud.ChaosMonkeySafeLeaderTest_6A612C46F47745DB-001/control-001/cores/collection1
   [junit4]   2> 441969 INFO  (TEST-ChaosMonkeySafeLeaderTest.test-seed#[6A612C46F47745DB]) [    ] o.e.j.s.Server jetty-9.2.11.v20150529
   [junit4]   2> 441970 INFO  (TEST-ChaosMonkeySafeLeaderTest.test-seed#[6A612C46F47745DB]) [    ] o.e.j.s.h.ContextHandler Started o.e.j.s.ServletContextHandler@2d3ee48d{/,null,AVAILABLE}
   [junit4]   2> 441978 INFO  (TEST-ChaosMonkeySafeLeaderTest.test-seed#[6A612C46F47745DB]) [    ] o.e.j.s.ServerConnector Started ServerConnector@1edb2099{SSL-http/1.1}{127.0.0.1:50465}
   [junit4]   2> 441979 INFO  (TEST-ChaosMonkeySafeLeaderTest.test-seed#[6A612C46F47745DB]) [    ] o.e.j.s.Server Started @443537ms
   [junit4]   2> 441979 INFO  (TEST-ChaosMonkeySafeLeaderTest.test-seed#[6A612C46F47745DB]) [    ] o.a.s.c.s.e.JettySolrRunner Jetty properties: {solr.data.dir=/home/jenkins/workspace/Lucene-Solr-5.x-Linux/solr/build/solr-core/test/J1/temp/solr.cloud.ChaosMonkeySafeLeaderTest_6A612C46F47745DB-001/tempDir-001/control/data, hostContext=/, hostPort=50465, coreRootDirectory=/home/jenkins/workspace/Lucene-Solr-5.x-Linux/solr/build/solr-core/test/J1/../../../../../../../../../home/jenkins/workspace/Lucene-Solr-5.x-Linux/solr/build/solr-core/test/J1/temp/solr.cloud.ChaosMonkeySafeLeaderTest_6A612C46F47745DB-001/control-001/cores}
   [junit4]   2> 441980 INFO  (TEST-ChaosMonkeySafeLeaderTest.test-seed#[6A612C46F47745DB]) [    ] o.a.s.s.SolrDispatchFilter SolrDispatchFilter.init(): sun.misc.Launcher$AppClassLoader@4e0e2f2a
   [junit4]   2> 441981 INFO  (TEST-ChaosMonkeySafeLeaderTest.test-seed#[6A612C46F47745DB]) [    ] o.a.s.c.SolrResourceLoader new SolrResourceLoader for directory: '/home/jenkins/workspace/Lucene-Solr-5.x-Linux/solr/build/solr-core/test/J1/../../../../../../../../../home/jenkins/workspace/Lucene-Solr-5.x-Linux/solr/build/solr-core/test/J1/temp/solr.cloud.ChaosMonkeySafeLeaderTest_6A612C46F47745DB-001/control-001/'
   [junit4]   2> 442002 INFO  (TEST-ChaosMonkeySafeLeaderTest.test-seed#[6A612C46F47745DB]) [    ] o.a.s.c.SolrXmlConfig Loading container configuration from /home/jenkins/workspace/Lucene-Solr-5.x-Linux/solr/build/solr-core/test/J1/../../../../../../../../../home/jenkins/workspace/Lucene-Solr-5.x-Linux/solr/build/solr-core/test/J1/temp/solr.cloud.ChaosMonkeySafeLeaderTest_6A612C46F47745DB-001/control-001/solr.xml
   [junit4]   2> 442008 INFO  (TEST-ChaosMonkeySafeLeaderTest.test-seed#[6A612C46F47745DB]) [    ] o.a.s.c.CoresLocator Config-defined core root directory: /home/jenkins/workspace/Lucene-Solr-5.x-Linux/solr/build/solr-core/test/J1/../../../../../../../../../home/jenkins/workspace/Lucene-Solr-5.x-Linux/solr/build/solr-core/test/J1/temp/solr.cloud.ChaosMonkeySafeLeaderTest_6A612C46F47745DB-001/control-001/cores
   [junit4]   2> 442009 INFO  (TEST-ChaosMonkeySafeLeaderTest.test-seed#[6A612C46F47745DB]) [    ] o.a.s.c.CoreContainer New CoreContainer 1609489829
   [junit4]   2> 442009 INFO  (TEST-ChaosMonkeySafeLeaderTest.test-seed#[6A612C46F47745DB]) [    ] o.a.s.c.CoreContainer Loading cores into CoreContainer [instanceDir=/home/jenkins/workspace/Lucene-Solr-5.x-Linux/solr/build/solr-core/test/J1/../../../../../../../../../home/jenkins/workspace/Lucene-Solr-5.x-Linux/solr/build/solr-core/test/J1/temp/solr.cloud.ChaosMonkeySafeLeaderTest_6A612C46F47745DB-001/control-001/]
   [junit4]   2> 442009 INFO  (TEST-ChaosMonkeySafeLeaderTest.test-seed#[6A612C46F47745DB]) [    ] o.a.s.c.CoreContainer loading shared library: /home/jenkins/workspace/Lucene-Solr-5.x-Linux/solr/build/solr-core/test/J1/../../../../../../../../../home/jenkins/workspace/Lucene-Solr-5.x-Linux/solr/build/solr-core/test/J1/temp/solr.cloud.ChaosMonkeySafeLeaderTest_6A612C46F47745DB-001/control-001/lib
   [junit4]   2> 442009 WARN  (TEST-ChaosMonkeySafeLeaderTest.test-seed#[6A612C46F47745DB]) [    ] o.a.s.c.SolrResourceLoader Can't find (or read) directory to add to classloader: lib (resolved as: /home/jenkins/workspace/Lucene-Solr-5.x-Linux/solr/build/solr-core/test/J1/../../../../../../../../../home/jenkins/workspace/Lucene-Solr-5.x-Linux/solr/build/solr-core/test/J1/temp/solr.cloud.ChaosMonkeySafeLeaderTest_6A612C46F47745DB-001/control-001/lib).
   [junit4]   2> 442017 INFO  (TEST-ChaosMonkeySafeLeaderTest.test-seed#[6A612C46F47745DB]) [    ] o.a.s.h.c.HttpShardHandlerFactory created with socketTimeout : 90000,urlScheme : ,connTimeout : 15000,maxConnectionsPerHost : 20,maxConnections : 10000,corePoolSize : 0,maximumPoolSize : 2147483647,maxThreadIdleTime : 5,sizeOfQueue : -1,fairnessPolicy : false,useRetries : false,
   [junit4]   2> 442019 INFO  (TEST-ChaosMonkeySafeLeaderTest.test-seed#[6A612C46F47745DB]) [    ] o.a.s.u.UpdateShardHandler Creating UpdateShardHandler HTTP client with params: socketTimeout=340000&connTimeout=45000&retry=true
   [junit4]   2> 442021 INFO  (TEST-ChaosMonkeySafeLeaderTest.test-seed#[6A612C46F47745DB]) [    ] o.a.s.l.LogWatcher SLF4J impl is org.slf4j.impl.Log4jLoggerFactory
   [junit4]   2> 442021 INFO  (TEST-ChaosMonkeySafeLeaderTest.test-seed#[6A612C46F47745DB]) [    ] o.a.s.l.LogWatcher Registering Log Listener [Log4j (org.slf4j.impl.Log4jLoggerFactory)]
   [junit4]   2> 442021 INFO  (TEST-ChaosMonkeySafeLeaderTest.test-seed#[6A612C46F47745DB]) [    ] o.a.s.c.ZkContainer Zookeeper client=127.0.0.1:58145/solr
   [junit4]   2> 442021 INFO  (TEST-ChaosMonkeySafeLeaderTest.test-seed#[6A612C46F47745DB]) [    ] o.a.s.c.ZkController zkHost includes chroot
   [junit4]   2> 442021 INFO  (TEST-ChaosMonkeySafeLeaderTest.test-seed#[6A612C46F47745DB]) [    ] o.a.s.c.c.SolrZkClient Using default ZkCredentialsProvider
   [junit4]   2> 442022 INFO  (TEST-ChaosMonkeySafeLeaderTest.test-seed#[6A612C46F47745DB]) [    ] o.a.s.c.c.ConnectionManager Waiting for client to connect to ZooKeeper
   [junit4]   2> 442025 INFO  (zkCallback-300-thread-1) [    ] o.a.s.c.c.ConnectionManager Watcher org.apache.solr.common.cloud.ConnectionManager@19927637 name:ZooKeeperConnection Watcher:127.0.0.1:58145 got event WatchedEvent state:SyncConnected type:None path:null path:null type:None
   [junit4]   2> 442026 INFO  (TEST-ChaosMonkeySafeLeaderTest.test-seed#[6A612C46F47745DB]) [    ] o.a.s.c.c.ConnectionManager Client is connected to ZooKeeper
   [junit4]   2> 442026 INFO  (TEST-ChaosMonkeySafeLeaderTest.test-seed#[6A612C46F47745DB]) [    ] o.a.s.c.c.SolrZkClient Using default ZkACLProvider
   [junit4]   2> 442028 INFO  (TEST-ChaosMonkeySafeLeaderTest.test-seed#[6A612C46F47745DB]) [n:127.0.0.1:50465_    ] o.a.s.c.c.ConnectionManager Waiting for client to connect to ZooKeeper
   [junit4]   2> 442031 INFO  (zkCallback-301-thread-1-processing-n:127.0.0.1:50465_) [n:127.0.0.1:50465_    ] o.a.s.c.c.ConnectionManager Watcher org.apache.solr.common.cloud.ConnectionManager@7bda47ef name:ZooKeeperConnection Watcher:127.0.0.1:58145/solr got event WatchedEvent state:SyncConnected type:None path:null path:null type:None
   [junit4]   2> 442031 INFO  (TEST-ChaosMonkeySafeLeaderTest.test-seed#[6A612C46F47745DB]) [n:127.0.0.1:50465_    ] o.a.s.c.c.ConnectionManager Client is connected to ZooKeeper
   [junit4]   2> 442032 INFO  (TEST-ChaosMonkeySafeLeaderTest.test-seed#[6A612C46F47745DB]) [n:127.0.0.1:50465_    ] o.a.s.c.c.SolrZkClient makePath: /overseer/queue
   [junit4]   2> 442033 INFO  (TEST-ChaosMonkeySafeLeaderTest.test-seed#[6A612C46F47745DB]) [n:127.0.0.1:50465_    ] o.a.s.c.c.SolrZkClient makePath: /overseer/collection-queue-work
   [junit4]   2> 442035 INFO  (TEST-ChaosMonkeySafeLeaderTest.test-seed#[6A612C46F47745DB]) [n:127.0.0.1:50465_    ] o.a.s.c.c.SolrZkClient makePath: /overseer/collection-map-running
   [junit4]   2> 442047 INFO  (TEST-ChaosMonkeySafeLeaderTest.test-seed#[6A612C46F47745DB]) [n:127.0.0.1:50465_    ] o.a.s.c.c.SolrZkClient makePath: /overseer/collection-map-completed
   [junit4]   2> 442048 INFO  (TEST-ChaosMonkeySafeLeaderTest.test-seed#[6A612C46F47745DB]) [n:127.0.0.1:50465_    ] o.a.s.c.c.SolrZkClient makePath: /overseer/collection-map-failure
   [junit4]   2> 442050 INFO  (TEST-ChaosMonkeySafeLeaderTest.test-seed#[6A612C46F47745DB]) [n:127.0.0.1:50465_    ] o.a.s.c.c.SolrZkClient makePath: /live_nodes
   [junit4]   2> 442051 INFO  (TEST-ChaosMonkeySafeLeaderTest.test-seed#[6A612C46F47745DB]) [n:127.0.0.1:50465_    ] o.a.s.c.c.SolrZkClient makePath: /aliases.json
   [junit4]   2> 442052 INFO  (TEST-ChaosMonkeySafeLeaderTest.test-seed#[6A612C46F47745DB]) [n:127.0.0.1:50465_    ] o.a.s.c.c.SolrZkClient makePath: /clusterstate.json
   [junit4]   2> 442053 INFO  (TEST-ChaosMonkeySafeLeaderTest.test-seed#[6A612C46F47745DB]) [n:127.0.0.1:50465_    ] o.a.s.c.ZkController Register node as live in ZooKeeper:/live_nodes/127.0.0.1:50465_
   [junit4]   2> 442053 INFO  (TEST-ChaosMonkeySafeLeaderTest.test-seed#[6A612C46F47745DB]) [n:127.0.0.1:50465_    ] o.a.s.c.c.SolrZkClient makePath: /live_nodes/127.0.0.1:50465_
   [junit4]   2> 442054 INFO  (TEST-ChaosMonkeySafeLeaderTest.test-seed#[6A612C46F47745DB]) [n:127.0.0.1:50465_    ] o.a.s.c.c.SolrZkClient makePath: /overseer_elect
   [junit4]   2> 442055 INFO  (TEST-ChaosMonkeySafeLeaderTest.test-seed#[6A612C46F47745DB]) [n:127.0.0.1:50465_    ] o.a.s.c.c.SolrZkClient makePath: /overseer_elect/election
   [junit4]   2> 442055 INFO  (TEST-ChaosMonkeySafeLeaderTest.test-seed#[6A612C46F47745DB]) [n:127.0.0.1:50465_    ] o.a.s.c.Overseer Overseer (id=null) closing
   [junit4]   2> 442056 INFO  (TEST-ChaosMonkeySafeLeaderTest.test-seed#[6A612C46F47745DB]) [n:127.0.0.1:50465_    ] o.a.s.c.LeaderElector Joined leadership election with path: /overseer_elect/election/94267774876123140-127.0.0.1:50465_-n_0000000000
   [junit4]   2> 442056 INFO  (TEST-ChaosMonkeySafeLeaderTest.test-seed#[6A612C46F47745DB]) [n:127.0.0.1:50465_    ] o.a.s.c.OverseerElectionContext I am going to be the leader 127.0.0.1:50465_
   [junit4]   2> 442056 INFO  (TEST-ChaosMonkeySafeLeaderTest.test-seed#[6A612C46F47745DB]) [n:127.0.0.1:50465_    ] o.a.s.c.c.SolrZkClient makePath: /overseer_elect/leader
   [junit4]   2> 442057 INFO  (TEST-ChaosMonkeySafeLeaderTest.test-seed#[6A612C46F47745DB]) [n:127.0.0.1:50465_    ] o.a.s.c.Overseer Overseer (id=94267774876123140-127.0.0.1:50465_-n_0000000000) starting
   [junit4]   2> 442058 INFO  (TEST-ChaosMonkeySafeLeaderTest.test-seed#[6A612C46F47745DB]) [n:127.0.0.1:50465_    ] o.a.s.c.c.SolrZkClient makePath: /overseer/queue-work
   [junit4]   2> 442061 INFO  (TEST-ChaosMonkeySafeLeaderTest.test-seed#[6A612C46F47745DB]) [n:127.0.0.1:50465_    ] o.a.s.c.OverseerAutoReplicaFailoverThread Starting OverseerAutoReplicaFailoverThread autoReplicaFailoverWorkLoopDelay=10000 autoReplicaFailoverWaitAfterExpiration=30000 autoReplicaFailoverBadNodeExpiration=60000
   [junit4]   2> 442062 INFO  (TEST-ChaosMonkeySafeLeaderTest.test-seed#[6A612C46F47745DB]) [n:127.0.0.1:50465_    ] o.a.s.c.c.ZkStateReader Updating cluster state from ZooKeeper... 
   [junit4]   2> 442062 INFO  (OverseerCollectionProcessor-94267774876123140-127.0.0.1:50465_-n_0000000000) [n:127.0.0.1:50465_    ] o.a.s.c.OverseerCollectionProcessor Process current queue of collection creations
   [junit4]   2> 442062 INFO  (OverseerStateUpdate-94267774876123140-127.0.0.1:50465_-n_0000000000) [n:127.0.0.1:50465_    ] o.a.s.c.Overseer Starting to work on the main queue
   [junit4]   2> 442064 INFO  (TEST-ChaosMonkeySafeLeaderTest.test-seed#[6A612C46F47745DB]) [n:127.0.0.1:50465_    ] o.a.s.c.CoreContainer No authentication plugin used.
   [junit4]   2> 442065 INFO  (TEST-ChaosMonkeySafeLeaderTest.test-seed#[6A612C46F47745DB]) [n:127.0.0.1:50465_    ] o.a.s.c.CoreContainer Security conf doesn't exist. Skipping setup for authorization module.
   [junit4]   2> 442065 INFO  (TEST-ChaosMonkeySafeLeaderTest.test-seed#[6A612C46F47745DB]) [n:127.0.0.1:50465_    ] o.a.s.c.CoresLocator Looking for core definitions underneath /home/jenkins/workspace/Lucene-Solr-5.x-Linux/solr/build/solr-core/test/J1/../../../../../../../../../home/jenkins/workspace/Lucene-Solr-5.x-Linux/solr/build/solr-core/test/J1/temp/solr.cloud.ChaosMonkeySafeLeaderTest_6A612C46F47745DB-001/control-001/cores
   [junit4]   2> 442066 INFO  (TEST-ChaosMonkeySafeLeaderTest.test-seed#[6A612C46F47745DB]) [n:127.0.0.1:50465_    ] o.a.s.c.SolrCore Created CoreDescriptor: {name=collection1, config=solrconfig.xml, transient=false, schema=schema.xml, loadOnStartup=true, configSetProperties=configsetprops.json, instanceDir=/home/jenkins/workspace/Lucene-Solr-5.x-Linux/solr/build/solr-core/test/J1/../../../../../../../../../home/jenkins/workspace/Lucene-Solr-5.x-Linux/solr/build/solr-core/test/J1/temp/solr.cloud.ChaosMonkeySafeLeaderTest_6A612C46F47745DB-001/control-001/cores/collection1, collection=control_collection, absoluteInstDir=/home/jenkins/workspace/Lucene-Solr-5.x-Linux/solr/build/solr-core/test/J1/../../../../../../../../../home/jenkins/workspace/Lucene-Solr-5.x-Linux/solr/build/solr-core/test/J1/temp/solr.cloud.ChaosMonkeySafeLeaderTest_6A612C46F47745DB-001/control-001/cores/collection1/, coreNodeName=, dataDir=data/, shard=}
   [junit4]   2> 442066 INFO  (TEST-ChaosMonkeySafeLeaderTest.test-seed#[6A612C46F47745DB]) [n:127.0.0.1:50465_    ] o.a.s.c.CoresLocator Found core collection1 in /home/jenkins/workspace/Lucene-Solr-5.x-Linux/solr/build/solr-core/test/J1/../../../../../../../../../home/jenkins/workspace/Lucene-Solr-5.x-Linux/solr/build/solr-core/test/J1/temp/solr.cloud.ChaosMonkeySafeLeaderTest_6A612C46F47745DB-001/control-001/cores/collection1/
   [junit4]   2> 442066 INFO  (TEST-ChaosMonkeySafeLeaderTest.test-seed#[6A612C46F47745DB]) [n:127.0.0.1:50465_    ] o.a.s.c.CoresLocator Found 1 core definitions
   [junit4]   2> 442066 INFO  (TEST-ChaosMonkeySafeLeaderTest.test-seed#[6A612C46F47745DB]) [n:127.0.0.1:50465_    ] o.a.s.s.SolrDispatchFilter user.dir=/home/jenkins/workspace/Lucene-Solr-5.x-Linux/solr/build/solr-core/test/J1
   [junit4]   2> 442067 INFO  (coreLoadExecutor-1591-thread-1-processing-n:127.0.0.1:50465_) [n:127.0.0.1:50465_ c:control_collection   x:collection1] o.a.s.c.ZkController publishing state=down
   [junit4]   2> 442067 INFO  (coreLoadExecutor-1591-thread-1-processing-n:127.0.0.1:50465_) [n:127.0.0.1:50465_ c:control_collection   x:collection1] o.a.s.c.ZkController numShards not found on descriptor - reading it from system property
   [junit4]   2> 442067 INFO  (TEST-ChaosMonkeySafeLeaderTest.test-seed#[6A612C46F47745DB]) [n:127.0.0.1:50465_    ] o.a.s.s.SolrDispatchFilter SolrDispatchFilter.init() done
   [junit4]   2> 442067 INFO  (zkCallback-301-thread-1-processing-n:127.0.0.1:50465_) [n:127.0.0.1:50465_    ] o.a.s.c.DistributedQueue NodeChildrenChanged fired on path /overseer/queue state SyncConnected
   [junit4]   2> 442067 INFO  (coreLoadExecutor-1591-thread-1-processing-n:127.0.0.1:50465_) [n:127.0.0.1:50465_ c:control_collection   x:collection1] o.a.s.c.ZkController look for our core node name
   [junit4]   2> 442067 INFO  (OverseerStateUpdate-94267774876123140-127.0.0.1:50465_-n_0000000000) [n:127.0.0.1:50465_    ] o.a.s.c.Overseer processMessage: queueSize: 1, message = {
   [junit4]   2>   "core":"collection1",
   [junit4]   2>   "roles":null,
   [junit4]   2>   "base_url":"https://127.0.0.1:50465",
   [junit4]   2>   "node_name":"127.0.0.1:50465_",
   [junit4]   2>   "numShards":"1",
   [junit4]   2>   "state":"down",
   [junit4]   2>   "shard":null,
   [junit4]   2>   "collection":"control_collection",
   [junit4]   2>   "operation":"state"} current state version: 0
   [junit4]   2> 442068 INFO  (OverseerStateUpdate-94267774876123140-127.0.0.1:50465_-n_0000000000) [n:127.0.0.1:50465_    ] o.a.s.c.o.ReplicaMutator Update state numShards=1 message={
   [junit4]   2>   "core":"collection1",
   [junit4]   2>   "roles":null,
   [junit4]   2>   "base_url":"https://127.0.0.1:50465",
   [junit4]   2>   "node_name":"127.0.0.1:50465_",
   [junit4]   2>   "numShards":"1",
   [junit4]   2>   "state":"down",
   [junit4]   2>   "shard":null,
   [junit4]   2>   "collection":"control_collection",
   [junit4]   2>   "operation":"state"}
   [junit4]   2> 442068 INFO  (OverseerStateUpdate-94267774876123140-127.0.0.1:50465_-n_0000000000) [n:127.0.0.1:50465_    ] o.a.s.c.o.ClusterStateMutator building a new cName: control_collection
   [junit4]   2> 442068 INFO  (OverseerStateUpdate-94267774876123140-127.0.0.1:50465_-n_0000000000) [n:127.0.0.1:50465_    ] o.a.s.c.o.ReplicaMutator Assigning new node to shard shard=shard1
   [junit4]   2> 442071 INFO  (zkCallback-301-thread-1-processing-n:127.0.0.1:50465_) [n:127.0.0.1:50465_    ] o.a.s.c.c.ZkStateReader A cluster state change: WatchedEvent state:SyncConnected type:NodeDataChanged path:/clusterstate.json, has occurred - updating... (live nodes size: 1)
   [junit4]   2> 442072 INFO  (zkCallback-301-thread-1-processing-n:127.0.0.1:50465_) [n:127.0.0.1:50465_    ] o.a.s.c.c.ZkStateReader Updated cluster state version to 1
   [junit4]   2> 443067 INFO  (coreLoadExecutor-1591-thread-1-processing-n:127.0.0.1:50465_) [n:127.0.0.1:50465_ c:control_collection   x:collection1] o.a.s.c.ZkController waiting to find shard id in clusterstate for collection1
   [junit4]   2> 443067 INFO  (coreLoadExecutor-1591-thread-1-processing-n:127.0.0.1:50465_) [n:127.0.0.1:50465_ c:control_collection   x:collection1] o.a.s.c.ZkController Check for collection zkNode:control_collection
   [junit4]   2> 443068 INFO  (coreLoadExecutor-1591-thread-1-processing-n:127.0.0.1:50465_) [n:127.0.0.1:50465_ c:control_collection   x:collection1] o.a.s.c.ZkController Collection zkNode exists
   [junit4]   2> 443068 INFO  (coreLoadExecutor-1591-thread-1-processing-n:127.0.0.1:50465_) [n:127.0.0.1:50465_ c:control_collection   x:collection1] o.a.s.c.c.ZkStateReader Load collection config from:/collections/control_collection
   [junit4]   2> 443068 INFO  (coreLoadExecutor-1591-thread-1-processing-n:127.0.0.1:50465_) [n:127.0.0.1:50465_ c:control_collection   x:collection1] o.a.s.c.c.ZkStateReader path=/collections/control_collection configName=conf1 specified config exists in ZooKeeper
   [junit4]   2> 443068 INFO  (coreLoadExecutor-1591-thread-1-processing-n:127.0.0.1:50465_) [n:127.0.0.1:50465_ c:control_collection   x:collection1] o.a.s.c.SolrResourceLoader new SolrResourceLoader for directory: '/home/jenkins/workspace/Lucene-Solr-5.x-Linux/solr/build/solr-core/test/J1/../../../../../../../../../home/jenkins/workspace/Lucene-Solr-5.x-Linux/solr/build/solr-core/test/J1/temp/solr.cloud.ChaosMonkeySafeLeaderTest_6A612C46F47745DB-001/control-001/cores/collection1/'
   [junit4]   2> 443079 INFO  (coreLoadExecutor-1591-thread-1-processing-n:127.0.0.1:50465_) [n:127.0.0.1:50465_ c:control_collection   x:collection1] o.a.s.c.Config loaded config solrconfig.xml with version 0 
   [junit4]   2> 443097 INFO  (coreLoadExecutor-1591-thread-1-processing-n:127.0.0.1:50465_) [n:127.0.0.1:50465_ c:control_collection   x:collection1] o.a.s.c.SolrConfig current version of requestparams : -1
   [junit4]   2> 443100 INFO  (coreLoadExecutor-1591-thread-1-processing-n:127.0.0.1:50465_) [n:127.0.0.1:50465_ c:control_collection   x:collection1] o.a.s.c.SolrConfig Using Lucene MatchVersion: 5.3.0
   [junit4]   2> 443105 INFO  (coreLoadExecutor-1591-thread-1-processing-n:127.0.0.1:50465_) [n:127.0.0.1:50465_ c:control_collection   x:collection1] o.a.s.c.Config Loaded SolrConfig: solrconfig.xml
   [junit4]   2> 443105 INFO  (coreLoadExecutor-1591-thread-1-processing-n:127.0.0.1:50465_) [n:127.0.0.1:50465_ c:control_collection   x:collection1] o.a.s.s.IndexSchema Reading Solr Schema from /configs/conf1/schema.xml
   [junit4]   2> 443109 INFO  (coreLoadExecutor-1591-thread-1-processing-n:127.0.0.1:50465_) [n:127.0.0.1:50465_ c:control_collection   x:collection1] o.a.s.s.IndexSchema [collection1] Schema name=test
   [junit4]   2> 443161 INFO  (coreLoadExecutor-1591-thread-1-processing-n:127.0.0.1:50465_) [n:127.0.0.1:50465_ c:control_collection   x:collection1] o.a.s.s.IndexSchema default search field in schema is text
   [junit4]   2> 443162 INFO  (coreLoadExecutor-1591-thread-1-processing-n:127.0.0.1:50465_) [n:127.0.0.1:50465_ c:control_collection   x:collection1] o.a.s.s.IndexSchema unique key field: id
   [junit4]   2> 443163 INFO  (coreLoadExecutor-1591-thread-1-processing-n:127.0.0.1:50465_) [n:127.0.0.1:50465_ c:control_collection   x:collection1] o.a.s.s.FileExchangeRateProvider Reloading exchange rates from file currency.xml
   [junit4]   2> 443165 INFO  (coreLoadExecutor-1591-thread-1-processing-n:127.0.0.1:50465_) [n:127.0.0.1:50465_ c:control_collection   x:collection1] o.a.s.s.FileExchangeRateProvider Reloading exchange rates from file currency.xml
   [junit4]   2> 443173 INFO  (coreLoadExecutor-1591-thread-1-processing-n:127.0.0.1:50465_) [n:127.0.0.1:50465_ c:control_collection   x:collection1] o.a.s.c.ConfigSetProperties Did not find ConfigSet properties, assuming default properties: Can't find resource 'configsetprops.json' in classpath or '/configs/conf1', cwd=/home/jenkins/workspace/Lucene-Solr-5.x-Linux/solr/build/solr-core/test/J1
   [junit4]   2> 443173 INFO  (coreLoadExecutor-1591-thread-1-processing-n:127.0.0.1:50465_) [n:127.0.0.1:50465_ c:control_collection   x:collection1] o.a.s.c.CoreContainer Creating SolrCore 'collection1' using configuration from collection control_collection
   [junit4]   2> 443173 INFO  (coreLoadExecutor-1591-thread-1-processing-n:127.0.0.1:50465_) [n:127.0.0.1:50465_ c:control_collection s:shard1 r:core_node1 x:collection1] o.a.s.c.SolrCore solr.StandardDirectoryFactory
   [junit4]   2> 443178 INFO  (coreLoadExecutor-1591-thread-1-processing-n:127.0.0.1:50465_) [n:127.0.0.1:50465_ c:control_collection s:shard1 r:core_node1 x:collection1] o.a.s.c.SolrCore [[collection1] ] Opening new SolrCore at [/home/jenkins/workspace/Lucene-Solr-5.x-Linux/solr/build/solr-core/test/J1/../../../../../../../../../home/jenkins/workspace/Lucene-Solr-5.x-Linux/solr/build/solr-core/test/J1/temp/solr.cloud.ChaosMonkeySafeLeaderTest_6A612C46F47745DB-001/control-001/cores/collection1/], dataDir=[null]
   [junit4]   2> 443179 INFO  (coreLoadExecutor-1591-thread-1-processing-n:127.0.0.1:50465_) [n:127.0.0.1:50465_ c:control_collection s:shard1 r:core_node1 x:collection1] o.a.s.c.JmxMonitoredMap JMX monitoring is enabled. Adding Solr mbeans to JMX Server: com.sun.jmx.mbeanserver.JmxMBeanServer@2bc927f5
   [junit4]   2> 443179 INFO  (coreLoadExecutor-1591-thread-1-processing-n:127.0.0.1:50465_) [n:127.0.0.1:50465_ c:control_collection s:shard1 r:core_node1 x:collection1] o.a.s.c.CachingDirectoryFactory return new directory for /home/jenkins/workspace/Lucene-Solr-5.x-Linux/solr/build/solr-core/test/J1/temp/solr.cloud.ChaosMonkeySafeLeaderTest_6A612C46F47745DB-001/control-001/cores/collection1/data
   [junit4]   2> 443179 INFO  (coreLoadExecutor-1591-thread-1-processing-n:127.0.0.1:50465_) [n:127.0.0.1:50465_ c:control_collection s:shard1 r:core_node1 x:collection1] o.a.s.c.SolrCore New index directory detected: old=null new=/home/jenkins/workspace/Lucene-Solr-5.x-Linux/solr/build/solr-core/test/J1/temp/solr.cloud.ChaosMonkeySafeLeaderTest_6A612C46F47745DB-001/control-001/cores/collection1/data/index/
   [junit4]   2> 443180 WARN  (coreLoadExecutor-1591-thread-1-processing-n:127.0.0.1:50465_) [n:127.0.0.1:50465_ c:control_collection s:shard1 r:core_node1 x:collection1] o.a.s.c.SolrCore [collection1] Solr index directory '/home/jenkins/workspace/Lucene-Solr-5.x-Linux/solr/build/solr-core/test/J1/temp/solr.cloud.ChaosMonkeySafeLeaderTest_6A612C46F47745DB-001/control-001/cores/collection1/data/index' doesn't exist. Creating new index...
   [junit4]   2> 443180 INFO  (coreLoadExecutor-1591-thread-1-processing-n:127.0.0.1:50465_) [n:127.0.0.1:50465_ c:control_collection s:shard1 r:core_node1 x:collection1] o.a.s.c.CachingDirectoryFactory return new directory for /home/jenkins/workspace/Lucene-Solr-5.x-Linux/solr/build/solr-core/test/J1/temp/solr.cloud.ChaosMonkeySafeLeaderTest_6A612C46F47745DB-001/control-001/cores/collection1/data/index
   [junit4]   2> 443180 INFO  (coreLoadExecutor-1591-thread-1-processing-n:127.0.0.1:50465_) [n:127.0.0.1:50465_ c:control_collection s:shard1 r:core_node1 x:collection1] o.a.s.u.RandomMergePolicy RandomMergePolicy wrapping class org.apache.lucene.index.LogDocMergePolicy: [LogDocMergePolicy: minMergeSize=1000, mergeFactor=42, maxMergeSize=9223372036854775807, maxMergeSizeForForcedMerge=9223372036854775807, calibrateSizeByDeletes=false, maxMergeDocs=2147483647, maxCFSSegmentSizeMB=8.796093022207999E12, noCFSRatio=0.0]
   [junit4]   2> 443206 INFO  (coreLoadExecutor-1591-thread-1-processing-n:127.0.0.1:50465_) [n:127.0.0.1:50465_ c:control_collection s:shard1 r:core_node1 x:collection1] o.a.s.c.SolrCore SolrDeletionPolicy.onCommit: commits: num=1
   [junit4]   2> 	commit{dir=/home/jenkins/workspace/Lucene-Solr-5.x-Linux/solr/build/solr-core/test/J1/temp/solr.cloud.ChaosMonkeySafeLeaderTest_6A612C46F47745DB-001/control-001/cores/collection1/data/index,segFN=segments_1,generation=1}
   [junit4]   2> 443206 INFO  (coreLoadExecutor-1591-thread-1-processing-n:127.0.0.1:50465_) [n:127.0.0.1:50465_ c:control_collection s:shard1 r:core_node1 x:collection1] o.a.s.c.SolrCore newest commit generation = 1
   [junit4]   2> 443207 INFO  (OldIndexDirectoryCleanupThreadForCore-collection1) [n:127.0.0.1:50465_ c:control_collection s:shard1 r:core_node1 x:collection1] o.a.s.c.SolrCore Looking for old index directories to cleanup for core collection1 in /home/jenkins/workspace/Lucene-Solr-5.x-Linux/solr/build/solr-core/test/J1/temp/solr.cloud.ChaosMonkeySafeLeaderTest_6A612C46F47745DB-001/control-001/cores/collection1/data/
   [junit4]   2> 443209 INFO  (coreLoadExecutor-1591-thread-1-processing-n:127.0.0.1:50465_) [n:127.0.0.1:50465_ c:control_collection s:shard1 r:core_node1 x:collection1] o.a.s.u.p.UpdateRequestProcessorChain creating updateRequestProcessorChain "nodistrib"
   [junit4]   2> 443209 INFO  (coreLoadExecutor-1591-thread-1-processing-n:127.0.0.1:50465_) [n:127.0.0.1:50465_ c:control_collection s:shard1 r:core_node1 x:collection1] o.a.s.u.p.UpdateRequestProcessorChain creating updateRequestProcessorChain "dedupe"
   [junit4]   2> 443209 INFO  (coreLoadExecutor-1591-thread-1-processing-n:127.0.0.1:50465_) [n:127.0.0.1:50465_ c:control_collection s:shard1 r:core_node1 x:collection1] o.a.s.u.p.UpdateRequestProcessorChain inserting DistributedUpdateProcessorFactory into updateRequestProcessorChain "dedupe"
   [junit4]   2> 443209 INFO  (coreLoadExecutor-1591-thread-1-processing-n:127.0.0.1:50465_) [n:127.0.0.1:50465_ c:control_collection s:shard1 r:core_node1 x:collection1] o.a.s.u.p.UpdateRequestProcessorChain creating updateRequestProcessorChain "stored_sig"
   [junit4]   2> 443210 INFO  (coreLoadExecutor-1591-thread-1-processing-n:127.0.0.1:50465_) [n:127.0.0.1:50465_ c:control_collection s:shard1 r:core_node1 x:collection1] o.a.s.u.p.UpdateRequestProcessorChain inserting DistributedUpdateProcessorFactory into updateRequestProcessorChain "stored_sig"
   [junit4]   2> 443210 INFO  (coreLoadExecutor-1591-thread-1-processing-n:127.0.0.1:50465_) [n:127.0.0.1:50465_ c:control_collection s:shard1 r:core_node1 x:collection1] o.a.s.u.p.UpdateRequestProcessorChain creating updateRequestProcessorChain "distrib-dup-test-chain-explicit"
   [junit4]   2> 443210 INFO  (coreLoadExecutor-1591-thread-1-processing-n:127.0.0.1:50465_) [n:127.0.0.1:50465_ c:control_collection s:shard1 r:core_node1 x:collection1] o.a.s.u.p.UpdateRequestProcessorChain creating updateRequestProcessorChain "distrib-dup-test-chain-implicit"
   [junit4]   2> 443210 INFO  (coreLoadExecutor-1591-thread-1-processing-n:127.0.0.1:50465_) [n:127.0.0.1:50465_ c:control_collection s:shard1 r:core_node1 x:collection1] o.a.s.u.p.UpdateRequestProcessorChain inserting DistributedUpdateProcessorFactory into updateRequestProcessorChain "distrib-dup-test-chain-implicit"
   [junit4]   2> 443210 INFO  (coreLoadExecutor-1591-thread-1-processing-n:127.0.0.1:50465_) [n:127.0.0.1:50465_ c:control_collection s:shard1 r:core_node1 x:collection1] o.a.s.c.SolrCore no updateRequestProcessorChain defined as default, creating implicit default
   [junit4]   2> 443212 INFO  (coreLoadExecutor-1591-thread-1-processing-n:127.0.0.1:50465_) [n:127.0.0.1:50465_ c:control_collection s:shard1 r:core_node1 x:collection1] o.a.s.h.l.XMLLoader xsltCacheLifetimeSeconds=60
   [junit4]   2> 443212 INFO  (coreLoadExecutor-1591-thread-1-processing-n:127.0.0.1:50465_) [n:127.0.0.1:50465_ c:control_collection s:shard1 r:core_node1 x:collection1] o.a.s.h.l.XMLLoader xsltCacheLifetimeSeconds=60
   [junit4]   2> 443213 INFO  (coreLoadExecutor-1591-thread-1-processing-n:127.0.0.1:50465_) [n:127.0.0.1:50465_ c:control_collection s:shard1 r:core_node1 x:collection1] o.a.s.h.l.XMLLoader xsltCacheLifetimeSeconds=60
   [junit4]   2> 443213 INFO  (coreLoadExecutor-1591-thread-1-processing-n:127.0.0.1:50465_) [n:127.0.0.1:50465_ c:control_collection s:shard1 r:core_node1 x:collection1] o.a.s.h.l.XMLLoader xsltCacheLifetimeSeconds=60
   [junit4]   2> 443215 INFO  (coreLoadExecutor-1591-thread-1-processing-n:127.0.0.1:50465_) [n:127.0.0.1:50465_ c:control_collection s:shard1 r:core_node1 x:collection1] o.a.s.c.RequestHandlers Registered paths: /admin/mbeans,standard,/update/csv,/update/json/docs,/admin/luke,/admin/segments,/get,/admin/system,/replication,/admin/properties,/config,/schema,/admin/plugins,/admin/logging,/update/json,/admin/threads,/admin/ping,/update,/admin/file
   [junit4]   2> 443224 INFO  (coreLoadExecutor-1591-thread-1-processing-n:127.0.0.1:50465_) [n:127.0.0.1:50465_ c:control_collection s:shard1 r:core_node1 x:collection1] o.a.s.c.SolrCore Using default statsCache cache: org.apache.solr.search.stats.LocalStatsCache
   [junit4]   2> 443225 INFO  (coreLoadExecutor-1591-thread-1-processing-n:127.0.0.1:50465_) [n:127.0.0.1:50465_ c:control_collection s:shard1 r:core_node1 x:collection1] o.a.s.u.UpdateHandler Using UpdateLog implementation: org.apache.solr.update.UpdateLog
   [junit4]   2> 443225 INFO  (coreLoadExecutor-1591-thread-1-processing-n:127.0.0.1:50465_) [n:127.0.0.1:50465_ c:control_collection s:shard1 r:core_node1 x:collection1] o.a.s.u.UpdateLog Initializing UpdateLog: dataDir= defaultSyncLevel=FLUSH numRecordsToKeep=100 maxNumLogsToKeep=10 numVersionBuckets=65536
   [junit4]   2> 443225 INFO  (coreLoadExecutor-1591-thread-1-processing-n:127.0.0.1:50465_) [n:127.0.0.1:50465_ c:control_collection s:shard1 r:core_node1 x:collection1] o.a.s.c.SolrCore Hard AutoCommit: disabled
   [junit4]   2> 443225 INFO  (coreLoadExecutor-1591-thread-1-processing-n:127.0.0.1:50465_) [n:127.0.0.1:50465_ c:control_collection s:shard1 r:core_node1 x:collection1] o.a.s.c.SolrCore Soft AutoCommit: disabled
   [junit4]   2> 443226 INFO  (coreLoadExecutor-1591-thread-1-processing-n:127.0.0.1:50465_) [n:127.0.0.1:50465_ c:control_collection s:shard1 r:core_node1 x:collection1] o.a.s.u.RandomMergePolicy RandomMergePolicy wrapping class org.apache.lucene.index.TieredMergePolicy: [TieredMergePolicy: maxMergeAtOnce=24, maxMergeAtOnceExplicit=16, maxMergedSegmentMB=30.1103515625, floorSegmentMB=1.5849609375, forceMergeDeletesPctAllowed=3.0875294289388657, segmentsPerTier=49.0, maxCFSSegmentSizeMB=8.796093022207999E12, noCFSRatio=0.0
   [junit4]   2> 443226 INFO  (coreLoadExecutor-1591-thread-1-processing-n:127.0.0.1:50465_) [n:127.0.0.1:50465_ c:control_collection s:shard1 r:core_node1 x:collection1] o.a.s.c.SolrCore SolrDeletionPolicy.onInit: commits: num=1
   [junit4]   2> 	commit{dir=/home/jenkins/workspace/Lucene-Solr-5.x-Linux/solr/build/solr-core/test/J1/temp/solr.cloud.ChaosMonkeySafeLeaderTest_6A612C46F47745DB-001/control-001/cores/collection1/data/index,segFN=segments_1,generation=1}
   [junit4]   2> 443226 INFO  (coreLoadExecutor-1591-thread-1-processing-n:127.0.0.1:50465_) [n:127.0.0.1:50465_ c:control_collection s:shard1 r:core_node1 x:collection1] o.a.s.c.SolrCore newest commit generation = 1
   [junit4]   2> 443227 INFO  (coreLoadExecutor-1591-thread-1-processing-n:127.0.0.1:50465_) [n:127.0.0.1:50465_ c:control_collection s:shard1 r:core_node1 x:collection1] o.a.s.s.SolrIndexSearcher Opening Searcher@6e94f311[collection1] main
   [junit4]   2> 443227 INFO  (coreLoadExecutor-1591-thread-1-processing-n:127.0.0.1:50465_) [n:127.0.0.1:50465_ c:control_collection s:shard1 r:core_node1 x:collection1] o.a.s.c.c.ZkStateReader Load collection config from:/collections/control_collection
   [junit4]   2> 443229 INFO  (coreLoadExecutor-1591-thread-1-processing-n:127.0.0.1:50465_) [n:127.0.0.1:50465_ c:control_collection s:shard1 r:core_node1 x:collection1] o.a.s.c.c.ZkStateReader path=/collections/control_collection configName=conf1 specified config exists in ZooKeeper
   [junit4]   2> 443229 INFO  (coreLoadExecutor-1591-thread-1-processing-n:127.0.0.1:50465_) [n:127.0.0.1:50465_ c:control_collection s:shard1 r:core_node1 x:collection1] o.a.s.r.ManagedResourceStorage Setting up ZooKeeper-based storage for the RestManager with znodeBase: /configs/conf1
   [junit4]   2> 443229 INFO  (coreLoadExecutor-1591-thread-1-processing-n:127.0.0.1:50465_) [n:127.0.0.1:50465_ c:control_collection s:shard1 r:core_node1 x:collection1] o.a.s.r.ManagedResourceStorage Configured ZooKeeperStorageIO with znodeBase: /configs/conf1
   [junit4]   2> 443229 INFO  (coreLoadExecutor-1591-thread-1-processing-n:127.0.0.1:50465_) [n:127.0.0.1:50465_ c:control_collection s:shard1 r:core_node1 x:collection1] o.a.s.r.RestManager Initializing RestManager with initArgs: {}
   [junit4]   2> 443229 INFO  (coreLoadExecutor-1591-thread-1-processing-n:127.0.0.1:50465_) [n:127.0.0.1:50465_ c:control_collection s:shard1 r:core_node1 x:collection1] o.a.s.r.ManagedResourceStorage Reading _rest_managed.json using ZooKeeperStorageIO:path=/configs/conf1
   [junit4]   2> 443229 INFO  (coreLoadExecutor-1591-thread-1-processing-n:127.0.0.1:50465_) [n:127.0.0.1:50465_ c:control_collection s:shard1 r:core_node1 x:collection1] o.a.s.r.ManagedResourceStorage No data found for znode /configs/conf1/_rest_managed.json
   [junit4]   2> 443230 INFO  (coreLoadExecutor-1591-thread-1-processing-n:127.0.0.1:50465_) [n:127.0.0.1:50465_ c:control_collection s:shard1 r:core_node1 x:collection1] o.a.s.r.ManagedResourceStorage Loaded null at path _rest_managed.json using ZooKeeperStorageIO:path=/configs/conf1
   [junit4]   2> 443230 INFO  (coreLoadExecutor-1591-thread-1-processing-n:127.0.0.1:50465_) [n:127.0.0.1:50465_ c:control_collection s:shard1 r:core_node1 x:collection1] o.a.s.r.RestManager Initializing 0 registered ManagedResources
   [junit4]   2> 443230 INFO  (coreLoadExecutor-1591-thread-1-processing-n:127.0.0.1:50465_) [n:127.0.0.1:50465_ c:control_collection s:shard1 r:core_node1 x:collection1] o.a.s.h.ReplicationHandler Commits will be reserved for  10000
   [junit4]   2> 443231 INFO  (searcherExecutor-1592-thread-1-processing-n:127.0.0.1:50465_ x:collection1 s:shard1 c:control_collection r:core_node1) [n:127.0.0.1:50465_ c:control_collection s:shard1 r:core_node1 x:collection1] o.a.s.c.SolrCore [collection1] Registered new searcher Searcher@6e94f311[collection1] main{ExitableDirectoryReader(UninvertingDirectoryReader())}
   [junit4]   2> 443231 INFO  (coreLoadExecutor-1591-thread-1-processing-n:127.0.0.1:50465_) [n:127.0.0.1:50465_ c:control_collection s:shard1 r:core_node1 x:collection1] o.a.s.u.UpdateLog Looking up max value of version field to seed version buckets
   [junit4]   2> 443231 INFO  (coreLoadExecutor-1591-thread-1-processing-n:127.0.0.1:50465_) [n:127.0.0.1:50465_ c:control_collection s:shard1 r:core_node1 x:collection1] o.a.s.u.VersionInfo Refreshing highest value of _version_ for 65536 version buckets from index
   [junit4]   2> 443231 INFO  (coreLoadExecutor-1591-thread-1-processing-n:127.0.0.1:50465_) [n:127.0.0.1:50465_ c:control_collection s:shard1 r:core_node1 x:collection1] o.a.s.u.VersionInfo No terms found for _version_, cannot seed version bucket highest value from index
   [junit4]   2> 443231 INFO  (coreLoadExecutor-1591-thread-1-processing-n:127.0.0.1:50465_) [n:127.0.0.1:50465_ c:control_collection s:shard1 r:core_node1 x:collection1] o.a.s.u.UpdateLog Could not find max version in index or recent updates, using new clock 1508284399554134016
   [junit4]   2> 443233 INFO  (coreLoadExecutor-1591-thread-1-processing-n:127.0.0.1:50465_) [n:127.0.0.1:50465_ c:control_collection s:shard1 r:core_node1 x:collection1] o.a.s.u.UpdateLog Took 2 ms to seed version buckets with highest version 1508284399554134016
   [junit4]   2> 443233 INFO  (coreLoadExecutor-1591-thread-1-processing-n:127.0.0.1:50465_) [n:127.0.0.1:50465_ c:control_collection s:shard1 r:core_node1 x:collection1] o.a.s.c.ZkController watch zkdir /configs/conf1
   [junit4]   2> 443233 INFO  (coreLoadExecutor-1591-thread-1-processing-n:127.0.0.1:50465_) [n:127.0.0.1:50465_ c:control_collection s:shard1 r:core_node1 x:collection1] o.a.s.c.CoreContainer registering core: collection1
   [junit4]   2> 443233 INFO  (coreZkRegister-1585-thread-1-processing-n:127.0.0.1:50465_ x:collection1 s:shard1 c:control_collection r:core_node1) [n:127.0.0.1:50465_ c:control_collection s:shard1 r:core_node1 x:collection1] o.a.s.c.ZkController Register replica - core:collection1 address:https://127.0.0.1:50465 collection:control_collection shard:shard1
   [junit4]   2> 443234 INFO  (coreZkRegister-1585-thread-1-processing-n:127.0.0.1:50465_ x:collection1 s:shard1 c:control_collection r:core_node1) [n:127.0.0.1:50465_ c:control_collection s:shard1 r:core_node1 x:collection1] o.a.s.c.c.SolrZkClient makePath: /collections/control_collection/leader_elect/shard1/election
   [junit4]   2> 443236 INFO  (coreZkRegister-1585-thread-1-processing-n:127.0.0.1:50465_ x:collection1 s:shard1 c:control_collection r:core_node1) [n:127.0.0.1:50465_ c:control_collection s:shard1 r:core_node1 x:collection1] o.a.s.c.LeaderElector Joined leadership election with path: /collections/control_collection/leader_elect/shard1/election/94267774876123140-core_node1-n_0000000000
   [junit4]   2> 443238 INFO  (coreZkRegister-1585-thread-1-processing-n:127.0.0.1:50465_ x:collection1 s:shard1 c:control_collection r:core_node1) [n:127.0.0.1:50465_ c:control_collection s:shard1 r:core_node1 x:collection1] o.a.s.c.ShardLeaderElectionContext Running the leader process for shard shard1
   [junit4]   2> 443238 INFO  (zkCallback-301-thread-1-processing-n:127.0.0.1:50465_) [n:127.0.0.1:50465_    ] o.a.s.c.DistributedQueue NodeChildrenChanged fired on path /overseer/queue state SyncConnected
   [junit4]   2> 443239 INFO  (coreZkRegister-1585-thread-1-processing-n:127.0.0.1:50465_ x:collection1 s:shard1 c:control_collection r:core_node1) [n:127.0.0.1:50465_ c:control_collection s:shard1 r:core_node1 x:collection1] o.a.s.c.ShardLeaderElectionContext Enough replicas found to continue.
   [junit4]   2> 443239 INFO  (coreZkRegister-1585-thread-1-processing-n:127.0.0.1:50465_ x:collection1 s:shard1 c:control_collection r:core_node1) [n:127.0.0.1:50465_ c:control_collection s:shard1 r:core_node1 x:collection1] o.a.s.c.ShardLeaderElectionContext I may be the new leader - try and sync
   [junit4]   2> 443239 INFO  (coreZkRegister-1585-thread-1-processing-n:127.0.0.1:50465_ x:collection1 s:shard1 c:control_collection r:core_node1) [n:127.0.0.1:50465_ c:control_collection s:shard1 r:core_node1 x:collection1] o.a.s.c.SyncStrategy Sync replicas to https://127.0.0.1:50465/collection1/
   [junit4]   2> 443239 INFO  (coreZkRegister-1585-thread-1-processing-n:127.0.0.1:50465_ x:collection1 s:shard1 c:control_collection r:core_node1) [n:127.0.0.1:50465_ c:control_collection s:shard1 r:core_node1 x:collection1] o.a.s.c.SyncStrategy Sync Success - now sync replicas to me
   [junit4]   2> 443239 INFO  (coreZkRegister-1585-thread-1-processing-n:127.0.0.1:50465_ x:collection1 s:shard1 c:control_collection r:core_node1) [n:127.0.0.1:50465_ c:control_collection s:shard1 r:core_node1 x:collection1] o.a.s.c.SyncStrategy https://127.0.0.1:50465/collection1/ has no replicas
   [junit4]   2> 443239 INFO  (OverseerStateUpdate-94267774876123140-127.0.0.1:50465_-n_0000000000) [n:127.0.0.1:50465_    ] o.a.s.c.Overseer processMessage: queueSize: 1, message = {
   [junit4]   2>   "operation":"leader",
   [junit4]   2>   "shard":"shard1",
   [junit4]   2>   "collection":"control_collection"} current state version: 1
   [junit4]   2> 443239 INFO  (coreZkRegister-1585-thread-1-processing-n:127.0.0.1:50465_ x:collection1 s:shard1 c:control_collection r:core_node1) [n:127.0.0.1:50465_ c:control_collection s:shard1 r:core_node1 x:collection1] o.a.s.c.ShardLeaderElectionContext I am the new leader: https://127.0.0.1:50465/collection1/ shard1
   [junit4]   2> 443240 INFO  (coreZkRegister-1585-thread-1-processing-n:127.0.0.1:50465_ x:collection1 s:shard1 c:control_collection r:core_node1) [n:127.0.0.1:50465_ c:control_collection s:shard1 r:core_node1 x:collection1] o.a.s.c.c.SolrZkClient makePath: /collections/control_collection/leaders/shard1
   [junit4]   2> 443242 INFO  (zkCallback-301-thread-1-processing-n:127.0.0.1:50465_) [n:127.0.0.1:50465_    ] o.a.s.c.DistributedQueue NodeChildrenChanged fired on path /overseer/queue state SyncConnected
   [junit4]   2> 443243 INFO  (OverseerStateUpdate-94267774876123140-127.0.0.1:50465_-n_0000000000) [n:127.0.0.1:50465_    ] o.a.s.c.Overseer processMessage: queueSize: 1, message = {
   [junit4]   2>   "operation":"leader",
   [junit4]   2>   "shard":"shard1",
   [junit4]   2>   "collection":"control_collection",
   [junit4]   2>   "base_url":"https://127.0.0.1:50465",
   [junit4]   2>   "core":"collection1",
   [junit4]   2>   "state":"active"} current state version: 1
   [junit4]   2> 443344 INFO  (zkCallback-301-thread-1-processing-n:127.0.0.1:50465_) [n:127.0.0.1:50465_    ] o.a.s.c.c.ZkStateReader A cluster state change: WatchedEvent state:SyncConnected type:NodeDataChanged path:/clusterstate.json, has occurred - updating... (live nodes size: 1)
   [junit4]   2> 443345 INFO  (zkCallback-301-thread-1-processing-n:127.0.0.1:50465_) [n:127.0.0.1:50465_    ] o.a.s.c.c.ZkStateReader Updated cluster state version to 2
   [junit4]   2> 443393 INFO  (coreZkRegister-1585-thread-1-processing-n:127.0.0.1:50465_ x:collection1 s:shard1 c:control_collection r:core_node1) [n:127.0.0.1:50465_ c:control_collection s:shard1 r:core_node1 x:collection1] o.a.s.c.ZkController We are https://127.0.0.1:50465/collection1/ and leader is https://127.0.0.1:50465/collection1/
   [junit4]   2> 443393 INFO  (coreZkRegister-1585-thread-1-processing-n:127.0.0.1:50465_ x:collection1 s:shard1 c:control_collection r:core_node1) [n:127.0.0.1:50465_ c:control_collection s:shard1 r:core_node1 x:collection1] o.a.s.c.ZkController No LogReplay needed for core=collection1 baseURL=https://127.0.0.1:50465
   [junit4]   2> 443393 INFO  (coreZkRegister-1585-thread-1-processing-n:127.0.0.1:50465_ x:collection1 s:shard1 c:control_collection r:core_node1) [n:127.0.0.1:50465_ c:control_collection s:shard1 r:core_node1 x:collection1] o.a.s.c.ZkController I am the leader, no recovery necessary
   [junit4]   2> 443393 INFO  (coreZkRegister-1585-thread-1-processing-n:127.0.0.1:50465_ x:collection1 s:shard1 c:control_collection r:core_node1) [n:127.0.0.1:50465_ c:control_collection s:shard1 r:core_node1 x:collection1] o.a.s.c.ZkController publishing state=active
   [junit4]   2> 443393 INFO  (coreZkRegister-1585-thread-1-processing-n:127.0.0.1:50465_ x:collection1 s:shard1 c:control_collection r:core_node1) [n:127.0.0.1:50465_ c:control_collection s:shard1 r:core_node1 x:collection1] o.a.s.c.ZkController numShards not found on descriptor - reading it from system property
   [junit4]   2> 443394 INFO  (zkCallback-301-thread-1-processing-n:127.0.0.1:50465_) [n:127.0.0.1:50465_    ] o.a.s.c.DistributedQueue NodeChildrenChanged fired on path /overseer/queue state SyncConnected
   [junit4]   2> 443395 INFO  (OverseerStateUpdate-94267774876123140-127.0.0.1:50465_-n_0000000000) [n:127.0.0.1:50465_    ] o.a.s.c.Overseer processMessage: queueSize: 1, message = {
   [junit4]   2>   "core":"collection1",
   [junit4]   2>   "core_node_name":"core_node1",
   [junit4]   2>   "roles":null,
   [junit4]   2>   "base_url":"https://127.0.0.1:50465",
   [junit4]   2>   "node_name":"127.0.0.1:50465_",
   [junit4]   2>   "numShards":"1",
   [junit4]   2>   "state":"active",
   [junit4]   2>   "shard":"shard1",
   [junit4]   2>   "collection":"control_collection",
   [junit4]   2>   "operation":"state"} current state version: 2
   [junit4]   2> 443395 INFO  (OverseerStateUpdate-94267774876123140-127.0.0.1:50465_-n_0000000000) [n:127.0.0.1:50465_    ] o.a.s.c.o.ReplicaMutator Update state numShards=1 message={
   [junit4]   2>   "core":"collection1",
   [junit4]   2>   "core_node_name":"core_node1",
   [junit4]   2>   "roles":null,
   [junit4]   2>   "base_url":"https://127.0.0.1:50465",
   [junit4]   2>   "node_name":"127.0.0.1:50465_",
   [junit4]   2>   "numShards":"1",
   [junit4]   2>   "state":"active",
   [junit4]   2>   "shard":"shard1",
   [junit4]   2>   "collection":"control_collection",
   [junit4]   2>   "operation":"state"}
   [junit4]   2> 443497 INFO  (zkCallback-301-thread-1-processing-n:127.0.0.1:50465_) [n:127.0.0.1:50465_    ] o.a.s.c.c.ZkStateReader A cluster state change: WatchedEvent state:SyncConnected type:NodeDataChanged path:/clusterstate.json, has occurred - updating... (live nodes size: 1)
   [junit4]   2> 443498 INFO  (zkCallback-301-thread-1-processing-n:127.0.0.1:50465_) [n:127.0.0.1:50465_    ] o.a.s.c.c.ZkStateReader Updated cluster state version to 3
   [junit4]   2> 443570 INFO  (TEST-ChaosMonkeySafeLeaderTest.test-seed#[6A612C46F47745DB]) [    ] o.a.s.c.c.SolrZkClient Using default ZkCredentialsProvider
   [junit4]   2> 443571 INFO  (TEST-ChaosMonkeySafeLeaderTest.test-seed#[6A612C46F47745DB]) [    ] o.a.s.c.c.ConnectionManager Waiting for client to connect to ZooKeeper
   [junit4]   2> 443573 INFO  (zkCallback-303-thread-1) [    ] o.a.s.c.c.ConnectionManager Watcher org.apache.solr.common.cloud.ConnectionManager@6b59e985 name:ZooKeeperConnection Watcher:127.0.0.1:58145/solr got event WatchedEvent state:SyncConnected type:None path:null path:null type:None
   [junit4]   2> 443573 INFO  (TEST-ChaosMonkeySafeLeaderTest.test-seed#[6A612C46F47745DB]) [    ] o.a.s.c.c.ConnectionManager Client is connected to ZooKeeper
   [junit4]   2> 443574 INFO  (TEST-ChaosMonkeySafeLeaderTest.test-seed#[6A612C46F47745DB]) [    ] o.a.s.c.c.SolrZkClient Using default ZkACLProvider
   [junit4]   2> 443574 INFO  (TEST-ChaosMonkeySafeLeaderTest.test-seed#[6A612C46F47745DB]) [    ] o.a.s.c.c.ZkStateReader Updating cluster state from ZooKeeper... 
   [junit4]   2> 443576 INFO  (TEST-ChaosMonkeySafeLeaderTest.test-seed#[6A612C46F47745DB]) [    ] o.a.s.c.ChaosMonkey monkey: init - expire sessions:false cause connection loss:false
   [junit4]   2> 443626 INFO  (TEST-ChaosMonkeySafeLeaderTest.test-seed#[6A612C46F47745DB]) [    ] o.a.s.SolrTestCaseJ4 Writing core.properties file to /home/jenkins/workspace/Lucene-Solr-5.x-Linux/solr/build/solr-core/test/J1/temp/solr.cloud.ChaosMonkeySafeLeaderTest_6A612C46F47745DB-001/shard-1-001/cores/collection1
   [junit4]   2> 443627 INFO  (TEST-ChaosMonkeySafeLeaderTest.test-seed#[6A612C46F47745DB]) [    ] o.a.s.c.AbstractFullDistribZkTestBase create jetty 1 in directory /home/jenkins/workspace/Lucene-Solr-5.x-Linux/solr/build/solr-core/test/J1/temp/solr.cloud.ChaosMonkeySafeLeaderTest_6A612C46F47745DB-001/shard-1-001
   [junit4]   2> 443628 INFO  (TEST-ChaosMonkeySafeLeaderTest.test-seed#[6A612C46F47745DB]) [    ] o.e.j.s.Server jetty-9.2.11.v20150529
   [junit4]   2> 443629 INFO  (TEST-ChaosMonkeySafeLeaderTest.test-seed#[6A612C46F47745DB]) [    ] o.e.j.s.h.ContextHandler Started o.e.j.s.ServletContextHandler@38852664{/,null,AVAILABLE}
   [junit4]   2> 443633 INFO  (TEST-ChaosMonkeySafeLeaderTest.test-seed#[6A612C46F47745DB]) [    ] o.e.j.s.ServerConnector Started ServerConnector@22bea6e6{SSL-http/1.1}{127.0.0.1:48741}
   [junit4]   2> 443634 INFO  (TEST-ChaosMonkeySafeLeaderTest.test-seed#[6A612C46F47745DB]) [    ] o.e.j.s.Server Started @445191ms
   [junit4]   2> 443634 INFO  (TEST-ChaosMonkeySafeLeaderTest.test-seed#[6A612C46F47745DB]) [    ] o.a.s.c.s.e.JettySolrRunner Jetty properties: {solr.data.dir=/home/jenkins/workspace/Lucene-Solr-5.x-Linux/solr/build/solr-core/test/J1/temp/solr.cloud.ChaosMonkeySafeLeaderTest_6A612C46F47745DB-001/tempDir-001/jetty1, solrconfig=solrconfig.xml, hostContext=/, hostPort=48741, coreRootDirectory=/home/jenkins/workspace/Lucene-Solr-5.x-Linux/solr/build/solr-core/test/J1/../../../../../../../../../home/jenkins/workspace/Lucene-Solr-5.x-Linux/solr/build/solr-core/test/J1/temp/solr.cloud.ChaosMonkeySafeLeaderTest_6A612C46F47745DB-001/shard-1-001/cores}
   [junit4]   2> 443635 INFO  (TEST-ChaosMonkeySafeLeaderTest.test-seed#[6A612C46F47745DB]) [    ] o.a.s.s.SolrDispatchFilter SolrDispatchFilter.init(): sun.misc.Launcher$AppClassLoader@4e0e2f2a
   [junit4]   2> 443635 INFO  (TEST-ChaosMonkeySafeLeaderTest.test-seed#[6A612C46F47745DB]) [    ] o.a.s.c.SolrResourceLoader new SolrResourceLoader for directory: '/home/jenkins/workspace/Lucene-Solr-5.x-Linux/solr/build/solr-core/test/J1/../../../../../../../../../home/jenkins/workspace/Lucene-Solr-5.x-Linux/solr/build/solr-core/test/J1/temp/solr.cloud.ChaosMonkeySafeLeaderTest_6A612C46F47745DB-001/shard-1-001/'
   [junit4]   2> 443649 INFO  (TEST-ChaosMonkeySafeLeaderTest.test-seed#[6A612C46F47745DB]) [    ] o.a.s.c.SolrXmlConfig Loading container configuration from /home/jenkins/workspace/Lucene-Solr-5.x-Linux/solr/build/solr-core/test/J1/../../../../../../../../../home/jenkins/workspace/Lucene-Solr-5.x-Linux/solr/build/solr-core/test/J1/temp/solr.cloud.ChaosMonkeySafeLeaderTest_6A612C46F47745DB-001/shard-1-001/solr.xml
   [junit4]   2> 443652 INFO  (TEST-ChaosMonkeySafeLeaderTest.test-seed#[6A612C46F47745DB]) [    ] o.a.s.c.CoresLocator Config-defined core root directory: /home/jenkins/workspace/Lucene-Solr-5.x-Linux/solr/build/solr-core/test/J1/../../../../../../../../../home/jenkins/workspace/Lucene-Solr-5.x-Linux/solr/build/solr-core/test/J1/temp/solr.cloud.ChaosMonkeySafeLeaderTest_6A612C46F47745DB-001/shard-1-001/cores
   [junit4]   2> 443653 INFO  (TEST-ChaosMonkeySafeLeaderTest.test-seed#[6A612C46F47745DB]) [    ] o.a.s.c.CoreContainer New CoreContainer 1766706097
   [junit4]   2> 443653 INFO  (TEST-ChaosMonkeySafeLeaderTest.test-seed#[6A612C46F47745DB]) [    ] o.a.s.c.CoreContainer Loading cores into CoreContainer [instanceDir=/home/jenkins/workspace/Lucene-Solr-5.x-Linux/solr/build/solr-core/test/J1/../../../../../../../../../home/jenkins/workspace/Lucene-Solr-5.x-Linux/solr/build/solr-core/test/J1/temp/solr.cloud.ChaosMonkeySafeLeaderTest_6A612C46F47745DB-001/shard-1-001/]
   [junit4]   2> 443653 INFO  (TEST-ChaosMonkeySafeLeaderTest.test-seed#[6A612C46F47745DB]) [    ] o.a.s.c.CoreContainer loading shared library: /home/jenkins/workspace/Lucene-Solr-5.x-Linux/solr/build/solr-core/test/J1/../../../../../../../../../home/jenkins/workspace/Lucene-Solr-5.x-Linux/solr/build/solr-core/test/J1/temp/solr.cloud.ChaosMonkeySafeLeaderTest_6A612C46F47745DB-001/shard-1-001/lib
   [junit4]   2> 443653 WARN  (TEST-ChaosMonkeySafeLeaderTest.test-seed#[6A612C46F47745DB]) [    ] o.a.s.c.SolrResourceLoader Can't find (or read) directory to add to classloader: lib (resolved as: /home/jenkins/workspace/Lucene-Solr-5.x-Linux/solr/build/solr-core/test/J1/../../../../../../../../../home/jenkins/workspace/Lucene-Solr-5.x-Linux/solr/build/solr-core/test/J1/temp/solr.cloud.ChaosMonkeySafeLeaderTest_6A612C46F47745DB-001/shard-1-001/lib).
   [junit4]   2> 443658 INFO  (TEST-ChaosMonkeySafeLeaderTest.test-seed#[6A612C46F47745DB]) [    ] o.a.s.h.c.HttpShardHandlerFactory created with socketTimeout : 90000,urlScheme : ,connTimeout : 15000,maxConnectionsPerHost : 20,maxConnections : 10000,corePoolSize : 0,maximumPoolSize : 2147483647,maxThreadIdleTime : 5,sizeOfQueue : -1,fairnessPolicy : false,useRetries : false,
   [junit4]   2> 443660 INFO  (TEST-ChaosMonkeySafeLeaderTest.test-seed#[6A612C46F47745DB]) [    ] o.a.s.u.UpdateShardHandler Creating UpdateShardHandler HTTP client with params: socketTimeout=340000&connTimeout=45000&retry=true
   [junit4]   2> 443661 INFO  (TEST-ChaosMonkeySafeLeaderTest.test-seed#[6A612C46F47745DB]) [    ] o.a.s.l.LogWatcher SLF4J impl is org.slf4j.impl.Log4jLoggerFactory
   [junit4]   2> 443661 INFO  (TEST-ChaosMonkeySafeLeaderTest.test-seed#[6A612C46F47745DB]) [    ] o.a.s.l.LogWatcher Registering Log Listener [Log4j (org.slf4j.impl.Log4jLoggerFactory)]
   [junit4]   2> 443661 INFO  (TEST-ChaosMonkeySafeLeaderTest.test-seed#[6A612C46F47745DB]) [    ] o.a.s.c.ZkContainer Zookeeper client=127.0.0.1:58145/solr
   [junit4]   2> 443661 INFO  (TEST-ChaosMonkeySafeLeaderTest.test-seed#[6A612C46F47745DB]) [    ] o.a.s.c.ZkController zkHost includes chroot
   [junit4]   2> 443661 INFO  (TEST-ChaosMonkeySafeLeaderTest.test-seed#[6A612C46F47745DB]) [    ] o.a.s.c.c.SolrZkClient Using default ZkCredentialsProvider
   [junit4]   2> 443662 INFO  (TEST-ChaosMonkeySafeLeaderTest.test-seed#[6A612C46F47745DB]) [    ] o.a.s.c.c.ConnectionManager Waiting for client to connect to ZooKeeper
   [junit4]   2> 443664 INFO  (zkCallback-305-thread-1) [    ] o.a.s.c.c.ConnectionManager Watcher org.apache.solr.common.cloud.ConnectionManager@fa3e131 name:ZooKeeperConnection Watcher:127.0.0.1:58145 got event WatchedEvent state:SyncConnected type:None path:null path:null type:None
   [junit4]   2> 443666 INFO  (TEST-ChaosMonkeySafeLeaderTest.test-seed#[6A612C46F47745DB]) [    ] o.a.s.c.c.ConnectionManager Client is connected to ZooKeeper
   [junit4]   2> 443666 INFO  (TEST-ChaosMonkeySafeLeaderTest.test-seed#[6A612C46F47745DB]) [    ] o.a.s.c.c.SolrZkClient Using default ZkACLProvider
   [junit4]   2> 443668 INFO  (TEST-ChaosMonkeySafeLeaderTest.test-seed#[6A612C46F47745DB]) [n:127.0.0.1:48741_    ] o.a.s.c.c.ConnectionManager Waiting for client to connect to ZooKeeper
   [junit4]   2> 443670 INFO  (zkCallback-306-thread-1-processing-n:127.0.0.1:48741_) [n:127.0.0.1:48741_    ] o.a.s.c.c.ConnectionManager Watcher org.apache.solr.common.cloud.ConnectionManager@389c48f7 name:ZooKeeperConnection Watcher:127.0.0.1:58145/solr got event WatchedEvent state:SyncConnected type:None path:null path:null type:None
   [junit4]   2> 443670 INFO  (TEST-ChaosMonkeySafeLeaderTest.test-seed#[6A612C46F47745DB]) [n:127.0.0.1:48741_    ] o.a.s.c.c.ConnectionManager Client is connected to ZooKeeper
   [junit4]   2> 443673 INFO  (TEST-ChaosMonkeySafeLeaderTest.test-seed#[6A612C46F47745DB]) [n:127.0.0.1:48741_    ] o.a.s.c.c.ZkStateReader Updating cluster state from ZooKeeper... 
   [junit4]   2> 444675 INFO  (TEST-ChaosMonkeySafeLeaderTest.test-seed#[6A612C46F47745DB]) [n:127.0.0.1:48741_    ] o.a.s.c.ZkController Register node as live in ZooKeeper:/live_nodes/127.0.0.1:48741_
   [junit4]   2> 444675 INFO  (TEST-ChaosMonkeySafeLeaderTest.test-seed#[6A612C46F47745DB]) [n:127.0.0.1:48741_    ] o.a.s.c.c.SolrZkClient makePath: /live_nodes/127.0.0.1:48741_
   [junit4]   2> 444677 INFO  (TEST-ChaosMonkeySafeLeaderTest.test-seed#[6A612C46F47745DB]) [n:127.0.0.1:48741_    ] o.a.s.c.Overseer Overseer (id=null) closing
   [junit4]   2> 444677 INFO  (TEST-ChaosMonkeySafeLeaderTest.test-seed#[6A612C46F47745DB]) [n:127.0.0.1:48741_    ] o.a.s.c.LeaderElector Joined leadership election with path: /overseer_elect/election/94267774876123143-127.0.0.1:48741_-n_0000000001
   [junit4]   2> 444678 INFO  (TEST-ChaosMonkeySafeLeaderTest.test-seed#[6A612C46F47745DB]) [n:127.0.0.1:48741_    ] o.a.s.c.LeaderElector Watching path /overseer_elect/election/94267774876123140-127.0.0.1:50465_-n_0000000000 to know if I could be the leader
   [junit4]   2> 444678 INFO  (TEST-ChaosMonkeySafeLeaderTest.test-seed#[6A612C46F47745DB]) [n:127.0.0.1:48741_    ] o.a.s.c.CoreContainer No authentication plugin used.
   [junit4]   2> 444678 INFO  (TEST-ChaosMonkeySafeLeaderTest.test-seed#[6A612C46F47745DB]) [n:127.0.0.1:48741_    ] o.a.s.c.CoreContainer Security conf doesn't exist. Skipping setup for authorization module.
   [junit4]   2> 444678 INFO  (TEST-ChaosMonkeySafeLeaderTest.test-seed#[6A612C46F47745DB]) [n:127.0.0.1:48741_    ] o.a.s.c.CoresLocator Looking for core definitions underneath /home/jenkins/workspace/Lucene-Solr-5.x-Linux/solr/build/solr-core/test/J1/../../../../../../../../../home/jenkins/workspace/Lucene-Solr-5.x-Linux/solr/build/solr-core/test/J1/temp/solr.cloud.ChaosMonkeySafeLeaderTest_6A612C46F47745DB-001/shard-1-001/cores
   [junit4]   2> 444679 INFO  (TEST-ChaosMonkeySafeLeaderTest.test-seed#[6A612C46F47745DB]) [n:127.0.0.1:48741_    ] o.a.s.c.SolrCore Created CoreDescriptor: {name=collection1, config=solrconfig.xml, transient=false, schema=schema.xml, loadOnStartup=true, configSetProperties=configsetprops.json, instanceDir=/home/jenkins/workspace/Lucene-Solr-5.x-Linux/solr/build/solr-core/test/J1/../../../../../../../../../home/jenkins/workspace/Lucene-Solr-5.x-Linux/solr/build/solr-core/test/J1/temp/solr.cloud.ChaosMonkeySafeLeaderTest_6A612C46F47745DB-001/shard-1-001/cores/collection1, collection=collection1, absoluteInstDir=/home/jenkins/workspace/Lucene-Solr-5.x-Linux/solr/build/solr-core/test/J1/../../../../../../../../../home/jenkins/workspace/Lucene-Solr-5.x-Linux/solr/build/solr-core/test/J1/temp/solr.cloud.ChaosMonkeySafeLeaderTest_6A612C46F47745DB-001/shard-1-001/cores/collection1/, coreNodeName=, dataDir=data/, shard=}
   [junit4]   2> 444679 INFO  (TEST-ChaosMonkeySafeLeaderTest.test-seed#[6A612C46F47745DB]) [n:127.0.0.1:48741_    ] o.a.s.c.CoresLocator Found core collection1 in /home/jenkins/workspace/Lucene-Solr-5.x-Linux/solr/build/solr-core/test/J1/../../../../../../../../../home/jenkins/workspace/Lucene-Solr-5.x-Linux/solr/build/solr-core/test/J1/temp/solr.cloud.ChaosMonkeySafeLeaderTest_6A612C46F47745DB-001/shard-1-001/cores/collection1/
   [junit4]   2> 444679 INFO  (TEST-ChaosMonkeySafeLeaderTest.test-seed#[6A612C46F47745DB]) [n:127.0.0.1:48741_    ] o.a.s.c.CoresLocator Found 1 core definitions
   [junit4]   2> 444680 INFO  (TEST-ChaosMonkeySafeLeaderTest.test-seed#[6A612C46F47745DB]) [n:127.0.0.1:48741_    ] o.a.s.s.SolrDispatchFilter user.dir=/home/jenkins/workspace/Lucene-Solr-5.x-Linux/solr/build/solr-core/test/J1
   [junit4]   2> 444680 INFO  (coreLoadExecutor-1602-thread-1-processing-n:127.0.0.1:48741_) [n:127.0.0.1:48741_ c:collection1   x:collection1] o.a.s.c.ZkController publishing state=down
   [junit4]   2> 444680 INFO  (coreLoadExecutor-1602-thread-1-processing-n:127.0.0.1:48741_) [n:127.0.0.1:48741_ c:collection1   x:collection1] o.a.s.c.ZkController numShards not found on descriptor - reading it from system property
   [junit4]   2> 444680 INFO  (TEST-ChaosMonkeySafeLeaderTest.test-seed#[6A612C46F47745DB]) [n:127.0.0.1:48741_    ] o.a.s.s.SolrDispatchFilter SolrDispatchFilter.init() done
   [junit4]   2> 444681 INFO  (coreLoadExecutor-1602-thread-1-processing-n:127.0.0.1:48741_) [n:127.0.0.1:48741_ c:collection1   x:collection1] o.a.s.c.ZkController look for our core node name
   [junit4]   2> 444681 INFO  (zkCallback-301-thread-1-processing-n:127.0.0.1:50465_) [n:127.0.0.1:50465_    ] o.a.s.c.DistributedQueue NodeChildrenChanged fired on path /overseer/queue state SyncConnected
   [junit4]   2> 444681 INFO  (OverseerStateUpdate-94267774876123140-127.0.0.1:50465_-n_0000000000) [n:127.0.0.1:50465_    ] o.a.s.c.Overseer processMessage: queueSize: 1, message = {
   [junit4]   2>   "core":"collection1",
   [junit4]   2>   "roles":null,
   [junit4]   2>   "base_url":"https://127.0.0.1:48741",
   [junit4]   2>   "node_name":"127.0.0.1:48741_",
   [junit4]   2>   "numShards":"3",
   [junit4]   2>   "state":"down",
   [junit4]   2>   "shard":null,
   [junit4]   2>   "collection":"collection1",
   [junit4]   2>   "operation":"state"} current state version: 3
   [junit4]   2> 444682 INFO  (OverseerStateUpdate-94267774876123140-127.0.0.1:50465_-n_0000000000) [n:127.0.0.1:50465_    ] o.a.s.c.o.ReplicaMutator Update state numShards=3 message={
   [junit4]   2>   "core":"collection1",
   [junit4]   2>   "roles":null,
   [junit4]   2>   "base_url":"https://127.0.0.1:48741",
   [junit4]   2>   "node_name":"127.0.0.1:48741_",
   [junit4]   2>   "numShards":"3",
   [junit4]   2>   "state":"down",
   [junit4]   2>   "shard":null,
   [junit4]   2>   "collection":"collection1",
   [junit4]   2>   "operation":"state"}
   [junit4]   2> 444682 INFO  (OverseerStateUpdate-94267774876123140-127.0.0.1:50465_-n_0000000000) [n:127.0.0.1:50465_    ] o.a.s.c.o.ClusterStateMutator building a new cName: collection1
   [junit4]   2> 444682 INFO  (OverseerStateUpdate-94267774876123140-127.0.0.1:50465_-n_0000000000) [n:127.0.0.1:50465_    ] o.a.s.c.o.ReplicaMutator Assigning new node to shard shard=shard2
   [junit4]   2> 444783 INFO  (zkCallback-303-thread-1) [    ] o.a.s.c.c.ZkStateReader A cluster state change: WatchedEvent state:SyncConnected type:NodeDataChanged path:/clusterstate.json, has occurred - updating... (live nodes size: 2)
   [junit4]   2> 444783 INFO  (zkCallback-301-thread-1-processing-n:127.0.0.1:50465_) [n:127.0.0.1:50465_    ] o.a.s.c.c.ZkStateReader A cluster state change: WatchedEvent state:SyncConnected type:NodeDataChanged path:/clusterstate.json, has occurred - updating... (live nodes size: 2)
   [junit4]   2> 444783 INFO  (zkCallback-306-thread-1-processing-n:127.0.0.1:48741_) [n:127.0.0.1:48741_    ] o.a.s.c.c.ZkStateReader A cluster state change: WatchedEvent state:SyncConnected type:NodeDataChanged path:/clusterstate.json, has occurred - updating... (live nodes size: 2)
   [junit4]   2> 444785 INFO  (zkCallback-303-thread-1) [    ] o.a.s.c.c.ZkStateReader Updated cluster state version to 4
   [junit4]   2> 444785 INFO  (zkCallback-301-thread-1-processing-n:127.0.0.1:50465_) [n:127.0.0.1:50465_    ] o.a.s.c.c.ZkStateReader Updated cluster state version to 4
   [junit4]   2> 444786 INFO  (zkCallback-306-thread-1-processing-n:127.0.0.1:48741_) [n:127.0.0.1:48741_    ] o.a.s.c.c.ZkStateReader Updated cluster state version to 4
   [junit4]   2> 445681 INFO  (coreLoadExecutor-1602-thread-1-processing-n:127.0.0.1:48741_) [n:127.0.0.1:48741_ c:collection1   x:collection1] o.a.s.c.ZkController waiting to find shard id in clusterstate for collection1
   [junit4]   2> 445681 INFO  (coreLoadExecutor-1602-thread-1-processing-n:127.0.0.1:48741_) [n:127.0.0.1:48741_ c:collection1   x:collection1] o.a.s.c.ZkController Check for collection zkNode:collection1
   [junit4]   2> 445681 INFO  (coreLoadExecutor-1602-thread-1-processing-n:127.0.0.1:48741_) [n:127.0.0.1:48741_ c:collection1   x:collection1] o.a.s.c.ZkController Collection zkNode exists
   [junit4]   2> 445681 INFO  (coreLoadExecutor-1602-thread-1-processing-n:127.0.0.1:48741_) [n:127.0.0.1:48741_ c:collection1   x:collection1] o.a.s.c.c.ZkStateReader Load collection config from:/collections/collection1
   [junit4]   2> 445682 INFO  (coreLoadExecutor-1602-thread-1-processing-n:127.0.0.1:48741_) [n:127.0.0.1:48741_ c:collection1   x:collection1] o.a.s.c.c.ZkStateReader path=/collections/collection1 configName=conf1 specified config exists in ZooKeeper
   [junit4]   2> 445682 INFO  (coreLoadExecutor-1602-thread-1-processing-n:127.0.0.1:48741_) [n:127.0.0.1:48741_ c:collection1   x:collection1] o.a.s.c.SolrResourceLoader new SolrResourceLoader for directory: '/home/jenkins/workspace/Lucene-Solr-5.x-Linux/solr/build/solr-core/test/J1/../../../../../../../../../home/jenkins/workspace/Lucene-Solr-5.x-Linux/solr/build/solr-core/test/J1/temp/solr.cloud.ChaosMonkeySafeLeaderTest_6A612C46F47745DB-001/shard-1-001/cores/collection1/'
   [junit4]   2> 445694 INFO  (coreLoadExecutor-1602-thread-1-processing-n:127.0.0.1:48741_) [n:127.0.0.1:48741_ c:collection1   x:collection1] o.a.s.c.Config loaded config solrconfig.xml with version 0 
   [junit4]   2> 445697 INFO  (coreLoadExecutor-1602-thread-1-processing-n:127.0.0.1:48741_) [n:127.0.0.1:48741_ c:collection1   x:collection1] o.a.s.c.SolrConfig current version of requestparams : -1
   [junit4]   2> 445700 INFO  (coreLoadExecutor-1602-thread-1-processing-n:127.0.0.1:48741_) [n:127.0.0.1:48741_ c:collection1   x:collection1] o.a.s.c.SolrConfig Using Lucene MatchVersion: 5.3.0
   [junit4]   2> 445705 INFO  (coreLoadExecutor-1602-thread-1-processing-n:127.0.0.1:48741_) [n:127.0.0.1:48741_ c:collection1   x:collection1] o.a.s.c.Config Loaded SolrConfig: solrconfig.xml
   [junit4]   2> 445706 INFO  (coreLoadExecutor-1602-thread-1-processing-n:127.0.0.1:48741_) [n:127.0.0.1:48741_ c:collection1   x:collection1] o.a.s.s.IndexSchema Reading Solr Schema from /configs/conf1/schema.xml
   [junit4]   2> 445709 INFO  (coreLoadExecutor-1602-thread-1-processing-n:127.0.0.1:48741_) [n:127.0.0.1:48741_ c:collection1   x:collection1] o.a.s.s.IndexSchema [collection1] Schema name=test
   [junit4]   2> 445764 INFO  (coreLoadExecutor-1602-thread-1-processing-n:127.0.0.1:48741_) [n:127.0.0.1:48741_ c:collection1   x:collection1] o.a.s.s.IndexSchema default search field in schema is text
   [junit4]   2> 445765 INFO  (coreLoadExecutor-1602-thread-1-processing-n:127.0.0.1:48741_) [n:127.0.0.1:48741_ c:collection1   x:collection1] o.a.s.s.IndexSchema unique key field: id
   [junit4]   2> 445765 INFO  (coreLoadExecutor-1602-thread-1-processing-n:127.0.0.1:48741_) [n:127.0.0.1:48741_ c:collection1   x:collection1] o.a.s.s.FileExchangeRateProvider Reloading exchange rates from file currency.xml
   [junit4]   2> 445767 INFO  (coreLoadExecutor-1602-thread-1-processing-n:127.0.0.1:48741_) [n:127.0.0.1:48741_ c:collection1   x:collection1] o.a.s.s.FileExchangeRateProvider Reloading exchange rates from file currency.xml
   [junit4]   2> 445775 INFO  (coreLoadExecutor-1602-thread-1-processing-n:127.0.0.1:48741_) [n:127.0.0.1:48741_ c:collection1   x:collection1] o.a.s.c.ConfigSetProperties Did not find ConfigSet properties, assuming default properties: Can't find resource 'configsetprops.json' in classpath or '/configs/conf1', cwd=/home/jenkins/workspace/Lucene-Solr-5.x-Linux/solr/build/solr-core/test/J1
   [junit4]   2> 445775 INFO  (coreLoadExecutor-1602-thread-1-processing-n:127.0.0.1:48741_) [n:127.0.0.1:48741_ c:collection1   x:collection1] o.a.s.c.CoreContainer Creating SolrCore 'collection1' using configuration from collection collection1
   [junit4]   2> 445775 INFO  (coreLoadExecutor-1602-thread-1-processing-n:127.0.0.1:48741_) [n:127.0.0.1:48741_ c:collection1 s:shard2 r:core_node1 x:collection1] o.a.s.c.SolrCore solr.StandardDirectoryFactory
   [junit4]   2> 445775 INFO  (coreLoadExecutor-1602-thread-1-processing-n:127.0.0.1:48741_) [n:127.0.0.1:48741_ c:collection1 s:shard2 r:core_node1 x:collection1] o.a.s.c.SolrCore [[collection1] ] Opening new SolrCore at [/home/jenkins/workspace/Lucene-Solr-5.x-Linux/solr/build/solr-core/test/J1/../../../../../../../../../home/jenkins/workspace/Lucene-Solr-5.x-Linux/solr/build/solr-core/test/J1/temp/solr.cloud.ChaosMonkeySafeLeaderTest_6A612C46F47745DB-001/shard-1-001/cores/collection1/], dataDir=[null]
   [junit4]   2> 445776 INFO  (coreLoadExecutor-1602-thread-1-processing-n:127.0.0.1:48741_) [n:127.0.0.1:48741_ c:collection1 s:shard2 r:core_node1 x:collection1] o.a.s.c.JmxMonitoredMap JMX monitoring is enabled. Adding Solr mbeans to JMX Server: com.sun.jmx.mbeanserver.JmxMBeanServer@2bc927f5
   [junit4]   2> 445776 INFO  (coreLoadExecutor-1602-thread-1-processing-n:127.0.0.1:48741_) [n:127.0.0.1:48741_ c:collection1 s:shard2 r:core_node1 x:collection1] o.a.s.c.CachingDirectoryFactory return new directory for /home/jenkins/workspace/Lucene-Solr-5.x-Linux/solr/build/solr-core/test/J1/temp/solr.cloud.ChaosMonkeySafeLeaderTest_6A612C46F47745DB-001/shard-1-001/cores/collection1/data
   [junit4]   2> 445776 INFO  (coreLoadExecutor-1602-thread-1-processing-n:127.0.0.1:48741_) [n:127.0.0.1:48741_ c:collection1 s:shard2 r:core_node1 x:collection1] o.a.s.c.SolrCore New index directory detected: old=null new=/home/jenkins/workspace/Lucene-Solr-5.x-Linux/solr/build/solr-core/test/J1/temp/solr.cloud.ChaosMonkeySafeLeaderTest_6A612C46F47745DB-001/shard-1-001/cores/collection1/data/index/
   [junit4]   2> 445776 WARN  (coreLoadExecutor-1602-thread-1-processing-n:127.0.0.1:48741_) [n:127.0.0.1:48741_ c:collection1 s:shard2 r:core_node1 x:collection1] o.a.s.c.SolrCore [collection1] Solr index directory '/home/jenkins/workspace/Lucene-Solr-5.x-Linux/solr/build/solr-core/test/J1/temp/solr.cloud.ChaosMonkeySafeLeaderTest_6A612C46F47745DB-001/shard-1-001/cores/collection1/data/index' doesn't exist. Creating new index...
   [junit4]   2> 445777 INFO  (coreLoadExecutor-1602-thread-1-processing-n:127.0.0.1:48741_) [n:127.0.0.1:48741_ c:collection1 s:shard2 r:core_node1 x:collection1] o.a.s.c.CachingDirectoryFactory return new directory for /home/jenkins/workspace/Lucene-Solr-5.x-Linux/solr/build/solr-core/test/J1/temp/solr.cloud.ChaosMonkeySafeLeaderTest_6A612C46F47745DB-001/shard-1-001/cores/collection1/data/index
   [junit4]   2> 445777 INFO  (coreLoadExecutor-1602-thread-1-processing-n:127.0.0.1:48741_) [n:127.0.0.1:48741_ c:collection1 s:shard2 r:core_node1 x:collection1] o.a.s.u.RandomMergePolicy RandomMergePolicy wrapping class org.apache.lucene.index.LogDocMergePolicy: [LogDocMergePolicy: minMergeSize=1000, mergeFactor=42, maxMergeSize=9223372036854775807, maxMergeSizeForForcedMerge=9223372036854775807, calibrateSizeByDeletes=false, maxMergeDocs=2147483647, maxCFSSegmentSizeMB=8.796093022207999E12, noCFSRatio=0.0]
   [junit4]   2> 445813 INFO  (coreLoadExecutor-1602-thread-1-processing-n:127.0.0.1:48741_) [n:127.0.0.1:48741_ c:collection1 s:shard2 r:core_node1 x:collection1] o.a.s.c.SolrCore SolrDeletionPolicy.onCommit: commits: num=1
   [junit4]   2> 	commit{dir=/home/jenkins/workspace/Lucene-Solr-5.x-Linux/solr/build/solr-core/test/J1/temp/solr.cloud.ChaosMonkeySafeLeaderTest_6A612C46F47745DB-001/shard-1-001/cores/collection1/data/index,segFN=segments_1,generation=1}
   [junit4]   2> 445813 INFO  (coreLoadExecutor-1602-thread-1-processing-n:127.0.0.1:48741_) [n:127.0.0.1:48741_ c:collection1 s:shard2 r:core_node1 x:collection1] o.a.s.c.SolrCore newest commit generation = 1
   [junit4]   2> 445814 INFO  (OldIndexDirectoryCleanupThreadForCore-collection1) [n:127.0.0.1:48741_ c:collection1 s:shard2 r:core_node1 x:collection1] o.a.s.c.SolrCore Looking for old index directories to cleanup for core collection1 in /home/jenkins/workspace/Lucene-Solr-5.x-Linux/solr/build/solr-core/test/J1/temp/solr.cloud.ChaosMonkeySafeLeaderTest_6A612C46F47745DB-001/shard-1-001/cores/collection1/data/
   [junit4]   2> 445816 INFO  (coreLoadExecutor-1602-thread-1-processing-n:127.0.0.1:48741_) [n:127.0.0.1:48741_ c:collection1 s:shard2 r:core_node1 x:collection1] o.a.s.u.p.UpdateRequestProcessorChain creating updateRequestProcessorChain "nodistrib"
   [junit4]   2> 445817 INFO  (coreLoadExecutor-1602-thread-1-processing-n:127.0.0.1:48741_) [n:127.0.0.1:48741_ c:collection1 s:shard2 r:core_node1 x:collection1] o.a.s.u.p.UpdateRequestProcessorChain creating updateRequestProcessorChain "dedupe"
   [junit4]   2> 445817 INFO  (coreLoadExecutor-1602-thread-1-processing-n:127.0.0.1:48741_) [n:127.0.0.1:48741_ c:collection1 s:shard2 r:core_node1 x:collection1] o.a.s.u.p.UpdateRequestProcessorChain inserting DistributedUpdateProcessorFactory into updateRequestProcessorChain "dedupe"
   [junit4]   2> 445817 INFO  (coreLoadExecutor-1602-thread-1-processing-n:127.0.0.1:48741_) [n:127.0.0.1:48741_ c:collection1 s:shard2 r:core_node1 x:collection1] o.a.s.u.p.UpdateRequestProcessorChain creating updateRequestProcessorChain "stored_sig"
   [junit4]   2> 445817 INFO  (coreLoadExecutor-1602-thread-1-processing-n:127.0.0.1:48741_) [n:127.0.0.1:48741_ c:collection1 s:shard2 r:core_node1 x:collection1] o.a.s.u.p.UpdateRequestProcessorChain inserting DistributedUpdateProcessorFactory into updateRequestProcessorChain "stored_sig"
   [junit4]   2> 445817 INFO  (coreLoadExecutor-1602-thread-1-processing-n:127.0.0.1:48741_) [n:127.0.0.1:48741_ c:collection1 s:shard2 r:core_node1 x:collection1] o.a.s.u.p.UpdateRequestProcessorChain creating updateRequestProcessorChain "distrib-dup-test-chain-explicit"
   [junit4]   2> 445817 INFO  (coreLoadExecutor-1602-thread-1-processing-n:127.0.0.1:48741_) [n:127.0.0.1:48741_ c:collection1 s:shard2 r:core_node1 x:collection1] o.a.s.u.p.UpdateRequestProcessorChain creating updateRequestProcessorChain "distrib-dup-test-chain-implicit"
   [junit4]   2> 445817 INFO  (coreLoadExecutor-1602-thread-1-processing-n:127.0.0.1:48741_) [n:127.0.0.1:48741_ c:collection1 s:shard2 r:core_node1 x:collection1] o.a.s.u.p.UpdateRequestProcessorChain inserting DistributedUpdateProcessorFactory into updateRequestProcessorChain "distrib-dup-test-chain-implicit"
   [junit4]   2> 445817 INFO  (coreLoadExecutor-1602-thread-1-processing-n:127.0.0.1:48741_) [n:127.0.0.1:48741_ c:collection1 s:shard2 r:core_node1 x:collection1] o.a.s.c.SolrCore no updateRequestProcessorChain defined as default, creating implicit default
   [junit4]   2> 445819 INFO  (coreLoadExecutor-1602-thread-1-processing-n:127.0.0.1:48741_) [n:127.0.0.1:48741_ c:collection1 s:shard2 r:core_node1 x:collection1] o.a.s.h.l.XMLLoader xsltCacheLifetimeSeconds=60
   [junit4]   2> 445819 INFO  (coreLoadExecutor-1602-thread-1-processing-n:127.0.0.1:48741_) [n:127.0.0.1:48741_ c:collection1 s:shard2 r:core_node1 x:collection1] o.a.s.h.l.XMLLoader xsltCacheLifetimeSeconds=60
   [junit4]   2> 445820 INFO  (coreLoadExecutor-1602-thread-1-processing-n:127.0.0.1:48741_) [n:127.0.0.1:48741_ c:collection1 s:shard2 r:core_node1 x:collection1] o.a.s.h.l.XMLLoader xsltCacheLifetimeSeconds=60
   [junit4]   2> 445820 INFO  (coreLoadExecutor-1602-thread-1-processing-n:127.0.0.1:48741_) [n:127.0.0.1:48741_ c:collection1 s:shard2 r:core_node1 x:collection1] o.a.s.h.l.XMLLoader xsltCacheLifetimeSeconds=60
   [junit4]   2> 445823 INFO  (coreLoadExecutor-1602-thread-1-processing-n:127.0.0.1:48741_) [n:127.0.0.1:48741_ c:collection1 s:shard2 r:core_node1 x:collection1] o.a.s.c.RequestHandlers Registered paths: /admin/mbeans,standard,/update/csv,/update/json/docs,/admin/luke,/admin/segments,/get,/admin/system,/replication,/admin/properties,/config,/schema,/admin/plugins,/admin/logging,/update/json,/admin/threads,/admin/ping,/update,/admin/file
   [junit4]   2> 445824 INFO  (coreLoadExecutor-1602-thread-1-processing-n:127.0.0.1:48741_) [n:127.0.0.1:48741_ c:collection1 s:shard2 r:core_node1 x:collection1] o.a.s.c.SolrCore Using default statsCache cache: org.apache.solr.search.stats.LocalStatsCache
   [junit4]   2> 445824 INFO  (coreLoadExecutor-1602-thread-1-processing-n:127.0.0.1:48741_) [n:127.0.0.1:48741_ c:collection1 s:shard2 r:core_node1 x:collection1] o.a.s.u.UpdateHandler Using UpdateLog implementatio

[...truncated too long message...]

tory: /home/jenkins/workspace/Lucene-Solr-5.x-Linux/solr/build/solr-core/test/J1/temp/solr.cloud.ChaosMonkeySafeLeaderTest_6A612C46F47745DB-001/shard-4-001/cores/collection1/data
   [junit4]   2> 480376 INFO  (zkCallback-315-thread-1-processing-n:127.0.0.1:45705_) [n:127.0.0.1:45705_ c:collection1 s:shard2 r:core_node4 x:collection1] o.a.s.c.CachingDirectoryFactory looking to close /home/jenkins/workspace/Lucene-Solr-5.x-Linux/solr/build/solr-core/test/J1/temp/solr.cloud.ChaosMonkeySafeLeaderTest_6A612C46F47745DB-001/shard-4-001/cores/collection1/data/index [CachedDir<<refCount=0;path=/home/jenkins/workspace/Lucene-Solr-5.x-Linux/solr/build/solr-core/test/J1/temp/solr.cloud.ChaosMonkeySafeLeaderTest_6A612C46F47745DB-001/shard-4-001/cores/collection1/data/index;done=false>>]
   [junit4]   2> 480376 INFO  (zkCallback-315-thread-1-processing-n:127.0.0.1:45705_) [n:127.0.0.1:45705_ c:collection1 s:shard2 r:core_node4 x:collection1] o.a.s.c.CachingDirectoryFactory Closing directory: /home/jenkins/workspace/Lucene-Solr-5.x-Linux/solr/build/solr-core/test/J1/temp/solr.cloud.ChaosMonkeySafeLeaderTest_6A612C46F47745DB-001/shard-4-001/cores/collection1/data/index
   [junit4]   2> 480376 WARN  (zkCallback-315-thread-1-processing-n:127.0.0.1:45705_) [n:127.0.0.1:45705_ c:collection1 s:shard2 r:core_node4 x:collection1] o.a.s.c.LeaderElector 
   [junit4]   2> org.apache.solr.common.SolrException: SolrCore not found:collection1 in []
   [junit4]   2> 	at org.apache.solr.cloud.ShardLeaderElectionContext.runLeaderProcess(ElectionContext.java:207)
   [junit4]   2> 	at org.apache.solr.cloud.LeaderElector.runIamLeaderProcess(LeaderElector.java:199)
   [junit4]   2> 	at org.apache.solr.cloud.LeaderElector.checkIfIamLeader(LeaderElector.java:159)
   [junit4]   2> 	at org.apache.solr.cloud.LeaderElector.joinElection(LeaderElector.java:348)
   [junit4]   2> 	at org.apache.solr.cloud.LeaderElector.joinElection(LeaderElector.java:257)
   [junit4]   2> 	at org.apache.solr.cloud.ShardLeaderElectionContext.rejoinLeaderElection(ElectionContext.java:481)
   [junit4]   2> 	at org.apache.solr.cloud.ShardLeaderElectionContext.runLeaderProcess(ElectionContext.java:238)
   [junit4]   2> 	at org.apache.solr.cloud.LeaderElector.runIamLeaderProcess(LeaderElector.java:199)
   [junit4]   2> 	at org.apache.solr.cloud.LeaderElector.checkIfIamLeader(LeaderElector.java:159)
   [junit4]   2> 	at org.apache.solr.cloud.LeaderElector.joinElection(LeaderElector.java:348)
   [junit4]   2> 	at org.apache.solr.cloud.LeaderElector.joinElection(LeaderElector.java:257)
   [junit4]   2> 	at org.apache.solr.cloud.ShardLeaderElectionContext.rejoinLeaderElection(ElectionContext.java:481)
   [junit4]   2> 	at org.apache.solr.cloud.ShardLeaderElectionContext.runLeaderProcess(ElectionContext.java:238)
   [junit4]   2> 	at org.apache.solr.cloud.LeaderElector.runIamLeaderProcess(LeaderElector.java:199)
   [junit4]   2> 	at org.apache.solr.cloud.LeaderElector.checkIfIamLeader(LeaderElector.java:159)
   [junit4]   2> 	at org.apache.solr.cloud.LeaderElector.access$200(LeaderElector.java:56)
   [junit4]   2> 	at org.apache.solr.cloud.LeaderElector$ElectionWatcher.process(LeaderElector.java:390)
   [junit4]   2> 	at org.apache.solr.common.cloud.SolrZkClient$3$1.run(SolrZkClient.java:264)
   [junit4]   2> 	at java.util.concurrent.Executors$RunnableAdapter.call(Executors.java:511)
   [junit4]   2> 	at java.util.concurrent.FutureTask.run(FutureTask.java:266)
   [junit4]   2> 	at org.apache.solr.common.util.ExecutorUtil$MDCAwareThreadPoolExecutor$1.run(ExecutorUtil.java:209)
   [junit4]   2> 	at java.util.concurrent.ThreadPoolExecutor.runWorker(ThreadPoolExecutor.java:1142)
   [junit4]   2> 	at java.util.concurrent.ThreadPoolExecutor$Worker.run(ThreadPoolExecutor.java:617)
   [junit4]   2> 	at java.lang.Thread.run(Thread.java:745)
   [junit4]   2> 480377 INFO  (TEST-ChaosMonkeySafeLeaderTest.test-seed#[6A612C46F47745DB]) [    ] o.e.j.s.ServerConnector Stopped ServerConnector@5352ffdc{SSL-http/1.1}{127.0.0.1:0}
   [junit4]   2> 480378 INFO  (TEST-ChaosMonkeySafeLeaderTest.test-seed#[6A612C46F47745DB]) [    ] o.e.j.s.h.ContextHandler Stopped o.e.j.s.ServletContextHandler@76963da8{/,null,UNAVAILABLE}
   [junit4]   2> 480379 INFO  (TEST-ChaosMonkeySafeLeaderTest.test-seed#[6A612C46F47745DB]) [n:127.0.0.1:45705_ c:collection1 s:shard2 r:core_node4 x:collection1] o.a.s.c.ZkTestServer connecting to 127.0.0.1:58145 58145
   [junit4]   2> 480484 INFO  (Thread-1458) [    ] o.a.s.c.ZkTestServer connecting to 127.0.0.1:58145 58145
   [junit4]   2> 480485 WARN  (Thread-1458) [    ] o.a.s.c.ZkTestServer Watch limit violations: 
   [junit4]   2> Maximum concurrent create/delete watches above limit:
   [junit4]   2> 
   [junit4]   2> 	6	/solr/aliases.json
   [junit4]   2> 	6	/solr/clusterstate.json
   [junit4]   2> 	5	/solr/configs/conf1
   [junit4]   2> 
   [junit4]   2> Maximum concurrent children watches above limit:
   [junit4]   2> 
   [junit4]   2> 	6	/solr/live_nodes
   [junit4]   2> 	5	/solr/overseer/collection-queue-work
   [junit4]   2> 	4	/solr/overseer/queue
   [junit4]   2> 
   [junit4]   2> NOTE: reproduce with: ant test  -Dtestcase=ChaosMonkeySafeLeaderTest -Dtests.method=test -Dtests.seed=6A612C46F47745DB -Dtests.multiplier=3 -Dtests.slow=true -Dtests.locale=sr_ME_#Latn -Dtests.timezone=Indian/Antananarivo -Dtests.asserts=true -Dtests.file.encoding=ISO-8859-1
   [junit4] FAILURE 38.7s J1 | ChaosMonkeySafeLeaderTest.test <<<
   [junit4]    > Throwable #1: java.lang.AssertionError: expected:<0> but was:<2>
   [junit4]    > 	at __randomizedtesting.SeedInfo.seed([6A612C46F47745DB:E235139C5A8B2823]:0)
   [junit4]    > 	at org.apache.solr.cloud.ChaosMonkeySafeLeaderTest.test(ChaosMonkeySafeLeaderTest.java:156)
   [junit4]    > 	at org.apache.solr.BaseDistributedSearchTestCase$ShardsRepeatRule$ShardsFixedStatement.callStatement(BaseDistributedSearchTestCase.java:966)
   [junit4]    > 	at org.apache.solr.BaseDistributedSearchTestCase$ShardsRepeatRule$ShardsStatement.evaluate(BaseDistributedSearchTestCase.java:941)
   [junit4]    > 	at java.lang.Thread.run(Thread.java:745)
   [junit4]   2> 480491 INFO  (SUITE-ChaosMonkeySafeLeaderTest-seed#[6A612C46F47745DB]-worker) [n:127.0.0.1:45705_ c:collection1 s:shard2 r:core_node4 x:collection1] o.a.s.SolrTestCaseJ4 ###deleteCore
   [junit4]   2> NOTE: leaving temporary files on disk at: /home/jenkins/workspace/Lucene-Solr-5.x-Linux/solr/build/solr-core/test/J1/temp/solr.cloud.ChaosMonkeySafeLeaderTest_6A612C46F47745DB-001
   [junit4]   2> Aug 01, 2015 6:55:30 AM com.carrotsearch.randomizedtesting.ThreadLeakControl checkThreadLeaks
   [junit4]   2> WARNING: Will linger awaiting termination of 1 leaked thread(s).
   [junit4]   2> NOTE: test params are: codec=Asserting(Lucene53): {rnd_b=BlockTreeOrds(blocksize=128), _version_=PostingsFormat(name=Asserting), a_t=PostingsFormat(name=Asserting), a_i=BlockTreeOrds(blocksize=128), id=BlockTreeOrds(blocksize=128)}, docValues:{}, sim=DefaultSimilarity, locale=sr_ME_#Latn, timezone=Indian/Antananarivo
   [junit4]   2> NOTE: Linux 3.16.0-44-generic amd64/Oracle Corporation 1.8.0_60-ea (64-bit)/cpus=12,threads=1,free=265458680,total=524288000
   [junit4]   2> NOTE: All tests run in this JVM: [CoreAdminCreateDiscoverTest, TestCoreDiscovery, TestAtomicUpdateErrorCases, TestSchemaVersionResource, HdfsCollectionsAPIDistributedZkTest, LukeRequestHandlerTest, TestSolrQueryParserDefaultOperatorResource, HdfsUnloadDistributedZkTest, BigEndianAscendingWordSerializerTest, CacheHeaderTest, TestValueSourceCache, ScriptEngineTest, InfoHandlerTest, TestIndexSearcher, WordBreakSolrSpellCheckerTest, TestSmileRequest, CursorPagingTest, TestWriterPerf, DistributedVersionInfoTest, TestExactStatsCache, TestRecoveryHdfs, OutOfBoxZkACLAndCredentialsProvidersTest, CollectionStateFormat2Test, ActionThrottleTest, NoCacheHeaderTest, RemoteQueryErrorTest, TestOmitPositions, RecoveryAfterSoftCommitTest, TestManagedResource, ZkSolrClientTest, SolrPluginUtilsTest, UpdateParamsTest, PreAnalyzedFieldTest, BadComponentTest, DeleteLastCustomShardedReplicaTest, TestStressVersions, TestReRankQParserPlugin, BasicFunctionalityTest, CoreAdminRequestStatusTest, TestCharFilters, TestConfigSetImmutable, TestFastLRUCache, TestConfigSets, RankQueryTest, RequestLoggingTest, FileUtilsTest, DistribJoinFromCollectionTest, TestLMDirichletSimilarityFactory, TestLMJelinekMercerSimilarityFactory, TestInitParams, IndexSchemaRuntimeFieldTest, LeaderInitiatedRecoveryOnCommitTest, TestJsonRequest, RAMDirectoryFactoryTest, TestSolrXml, SharedFSAutoReplicaFailoverTest, FieldMutatingUpdateProcessorTest, TestImplicitCoreProperties, TestPHPSerializedResponseWriter, DeleteReplicaTest, TestLFUCache, MergeStrategyTest, TestFieldTypeResource, ChaosMonkeySafeLeaderTest]
   [junit4] Completed [171/522] on J1 in 39.00s, 1 test, 1 failure <<< FAILURES!

[...truncated 1107 lines...]
BUILD FAILED
/home/jenkins/workspace/Lucene-Solr-5.x-Linux/build.xml:726: The following error occurred while executing this line:
/home/jenkins/workspace/Lucene-Solr-5.x-Linux/build.xml:670: The following error occurred while executing this line:
/home/jenkins/workspace/Lucene-Solr-5.x-Linux/build.xml:59: The following error occurred while executing this line:
/home/jenkins/workspace/Lucene-Solr-5.x-Linux/solr/build.xml:230: The following error occurred while executing this line:
/home/jenkins/workspace/Lucene-Solr-5.x-Linux/solr/common-build.xml:524: The following error occurred while executing this line:
/home/jenkins/workspace/Lucene-Solr-5.x-Linux/lucene/common-build.xml:1449: The following error occurred while executing this line:
/home/jenkins/workspace/Lucene-Solr-5.x-Linux/lucene/common-build.xml:1003: There were test failures: 522 suites, 2078 tests, 1 failure, 65 ignored (30 assumptions)

Total time: 44 minutes 51 seconds
Build step 'Invoke Ant' marked build as failure
Archiving artifacts
Recording test results
Email was triggered for: Failure - Any
Sending email for trigger: Failure - Any



Mime
View raw message