lucene-dev mailing list archives

Site index · List index
Message view « Date » · « Thread »
Top « Date » · « Thread »
From Policeman Jenkins Server <jenk...@thetaphi.de>
Subject [JENKINS] Lucene-Solr-5.x-Linux (32bit/jdk1.8.0_60) - Build # 13742 - Failure!
Date Thu, 27 Aug 2015 15:31:43 GMT
Build: http://jenkins.thetaphi.de/job/Lucene-Solr-5.x-Linux/13742/
Java: 32bit/jdk1.8.0_60 -client -XX:+UseConcMarkSweepGC

1 tests failed.
FAILED:  org.apache.solr.cloud.TestRandomRequestDistribution.testRequestTracking

Error Message:
Shard a1x2_shard1_replica2 received all 10 requests

Stack Trace:
java.lang.AssertionError: Shard a1x2_shard1_replica2 received all 10 requests
	at __randomizedtesting.SeedInfo.seed([F34AEF95DCD41CE0:BB76B65528DF0D76]:0)
	at org.junit.Assert.fail(Assert.java:93)
	at org.junit.Assert.assertTrue(Assert.java:43)
	at org.apache.solr.cloud.TestRandomRequestDistribution.testRequestTracking(TestRandomRequestDistribution.java:109)
	at sun.reflect.NativeMethodAccessorImpl.invoke0(Native Method)
	at sun.reflect.NativeMethodAccessorImpl.invoke(NativeMethodAccessorImpl.java:62)
	at sun.reflect.DelegatingMethodAccessorImpl.invoke(DelegatingMethodAccessorImpl.java:43)
	at java.lang.reflect.Method.invoke(Method.java:497)
	at com.carrotsearch.randomizedtesting.RandomizedRunner.invoke(RandomizedRunner.java:1627)
	at com.carrotsearch.randomizedtesting.RandomizedRunner$6.evaluate(RandomizedRunner.java:836)
	at com.carrotsearch.randomizedtesting.RandomizedRunner$7.evaluate(RandomizedRunner.java:872)
	at com.carrotsearch.randomizedtesting.RandomizedRunner$8.evaluate(RandomizedRunner.java:886)
	at org.apache.solr.BaseDistributedSearchTestCase$ShardsRepeatRule$ShardsFixedStatement.callStatement(BaseDistributedSearchTestCase.java:963)
	at org.apache.solr.BaseDistributedSearchTestCase$ShardsRepeatRule$ShardsStatement.evaluate(BaseDistributedSearchTestCase.java:938)
	at com.carrotsearch.randomizedtesting.rules.SystemPropertiesRestoreRule$1.evaluate(SystemPropertiesRestoreRule.java:57)
	at org.apache.lucene.util.TestRuleSetupTeardownChained$1.evaluate(TestRuleSetupTeardownChained.java:50)
	at org.apache.lucene.util.AbstractBeforeAfterRule$1.evaluate(AbstractBeforeAfterRule.java:46)
	at org.apache.lucene.util.TestRuleThreadAndTestName$1.evaluate(TestRuleThreadAndTestName.java:49)
	at org.apache.lucene.util.TestRuleIgnoreAfterMaxFailures$1.evaluate(TestRuleIgnoreAfterMaxFailures.java:65)
	at org.apache.lucene.util.TestRuleMarkFailure$1.evaluate(TestRuleMarkFailure.java:48)
	at com.carrotsearch.randomizedtesting.rules.StatementAdapter.evaluate(StatementAdapter.java:36)
	at com.carrotsearch.randomizedtesting.ThreadLeakControl$StatementRunner.run(ThreadLeakControl.java:365)
	at com.carrotsearch.randomizedtesting.ThreadLeakControl.forkTimeoutingTask(ThreadLeakControl.java:798)
	at com.carrotsearch.randomizedtesting.ThreadLeakControl$3.evaluate(ThreadLeakControl.java:458)
	at com.carrotsearch.randomizedtesting.RandomizedRunner.runSingleTest(RandomizedRunner.java:845)
	at com.carrotsearch.randomizedtesting.RandomizedRunner$3.evaluate(RandomizedRunner.java:747)
	at com.carrotsearch.randomizedtesting.RandomizedRunner$4.evaluate(RandomizedRunner.java:781)
	at com.carrotsearch.randomizedtesting.RandomizedRunner$5.evaluate(RandomizedRunner.java:792)
	at com.carrotsearch.randomizedtesting.rules.StatementAdapter.evaluate(StatementAdapter.java:36)
	at com.carrotsearch.randomizedtesting.rules.SystemPropertiesRestoreRule$1.evaluate(SystemPropertiesRestoreRule.java:57)
	at org.apache.lucene.util.AbstractBeforeAfterRule$1.evaluate(AbstractBeforeAfterRule.java:46)
	at com.carrotsearch.randomizedtesting.rules.StatementAdapter.evaluate(StatementAdapter.java:36)
	at org.apache.lucene.util.TestRuleStoreClassName$1.evaluate(TestRuleStoreClassName.java:42)
	at com.carrotsearch.randomizedtesting.rules.NoShadowingOrOverridesOnMethodsRule$1.evaluate(NoShadowingOrOverridesOnMethodsRule.java:39)
	at com.carrotsearch.randomizedtesting.rules.NoShadowingOrOverridesOnMethodsRule$1.evaluate(NoShadowingOrOverridesOnMethodsRule.java:39)
	at com.carrotsearch.randomizedtesting.rules.StatementAdapter.evaluate(StatementAdapter.java:36)
	at com.carrotsearch.randomizedtesting.rules.StatementAdapter.evaluate(StatementAdapter.java:36)
	at com.carrotsearch.randomizedtesting.rules.StatementAdapter.evaluate(StatementAdapter.java:36)
	at org.apache.lucene.util.TestRuleAssertionsRequired$1.evaluate(TestRuleAssertionsRequired.java:54)
	at org.apache.lucene.util.TestRuleMarkFailure$1.evaluate(TestRuleMarkFailure.java:48)
	at org.apache.lucene.util.TestRuleIgnoreAfterMaxFailures$1.evaluate(TestRuleIgnoreAfterMaxFailures.java:65)
	at org.apache.lucene.util.TestRuleIgnoreTestSuites$1.evaluate(TestRuleIgnoreTestSuites.java:55)
	at com.carrotsearch.randomizedtesting.rules.StatementAdapter.evaluate(StatementAdapter.java:36)
	at com.carrotsearch.randomizedtesting.ThreadLeakControl$StatementRunner.run(ThreadLeakControl.java:365)
	at java.lang.Thread.run(Thread.java:745)




Build Log:
[...truncated 10014 lines...]
   [junit4] Suite: org.apache.solr.cloud.TestRandomRequestDistribution
   [junit4]   2> Creating dataDir: /home/jenkins/workspace/Lucene-Solr-5.x-Linux/solr/build/solr-core/test/J1/temp/solr.cloud.TestRandomRequestDistribution_F34AEF95DCD41CE0-001/init-core-data-001
   [junit4]   2> 333616 INFO  (SUITE-TestRandomRequestDistribution-seed#[F34AEF95DCD41CE0]-worker) [    ] o.a.s.BaseDistributedSearchTestCase Setting hostContext system property: /nq_ch/
   [junit4]   2> 333618 INFO  (TEST-TestRandomRequestDistribution.testRequestTracking-seed#[F34AEF95DCD41CE0]) [    ] o.a.s.c.ZkTestServer STARTING ZK TEST SERVER
   [junit4]   2> 333619 INFO  (Thread-1559) [    ] o.a.s.c.ZkTestServer client port:0.0.0.0/0.0.0.0:0
   [junit4]   2> 333619 INFO  (Thread-1559) [    ] o.a.s.c.ZkTestServer Starting server
   [junit4]   2> 333719 INFO  (TEST-TestRandomRequestDistribution.testRequestTracking-seed#[F34AEF95DCD41CE0]) [    ] o.a.s.c.ZkTestServer start zk server on port:44207
   [junit4]   2> 333719 INFO  (TEST-TestRandomRequestDistribution.testRequestTracking-seed#[F34AEF95DCD41CE0]) [    ] o.a.s.c.c.SolrZkClient Using default ZkCredentialsProvider
   [junit4]   2> 333721 INFO  (TEST-TestRandomRequestDistribution.testRequestTracking-seed#[F34AEF95DCD41CE0]) [    ] o.a.s.c.c.ConnectionManager Waiting for client to connect to ZooKeeper
   [junit4]   2> 333723 INFO  (zkCallback-339-thread-1) [    ] o.a.s.c.c.ConnectionManager Watcher org.apache.solr.common.cloud.ConnectionManager@3d4457 name:ZooKeeperConnection Watcher:127.0.0.1:44207 got event WatchedEvent state:SyncConnected type:None path:null path:null type:None
   [junit4]   2> 333723 INFO  (TEST-TestRandomRequestDistribution.testRequestTracking-seed#[F34AEF95DCD41CE0]) [    ] o.a.s.c.c.ConnectionManager Client is connected to ZooKeeper
   [junit4]   2> 333724 INFO  (TEST-TestRandomRequestDistribution.testRequestTracking-seed#[F34AEF95DCD41CE0]) [    ] o.a.s.c.c.SolrZkClient Using default ZkACLProvider
   [junit4]   2> 333724 INFO  (TEST-TestRandomRequestDistribution.testRequestTracking-seed#[F34AEF95DCD41CE0]) [    ] o.a.s.c.c.SolrZkClient makePath: /solr
   [junit4]   2> 333732 INFO  (TEST-TestRandomRequestDistribution.testRequestTracking-seed#[F34AEF95DCD41CE0]) [    ] o.a.s.c.c.SolrZkClient Using default ZkCredentialsProvider
   [junit4]   2> 333735 INFO  (TEST-TestRandomRequestDistribution.testRequestTracking-seed#[F34AEF95DCD41CE0]) [    ] o.a.s.c.c.ConnectionManager Waiting for client to connect to ZooKeeper
   [junit4]   2> 333735 INFO  (zkCallback-340-thread-1) [    ] o.a.s.c.c.ConnectionManager Watcher org.apache.solr.common.cloud.ConnectionManager@731c68 name:ZooKeeperConnection Watcher:127.0.0.1:44207/solr got event WatchedEvent state:SyncConnected type:None path:null path:null type:None
   [junit4]   2> 333735 INFO  (TEST-TestRandomRequestDistribution.testRequestTracking-seed#[F34AEF95DCD41CE0]) [    ] o.a.s.c.c.ConnectionManager Client is connected to ZooKeeper
   [junit4]   2> 333736 INFO  (TEST-TestRandomRequestDistribution.testRequestTracking-seed#[F34AEF95DCD41CE0]) [    ] o.a.s.c.c.SolrZkClient Using default ZkACLProvider
   [junit4]   2> 333736 INFO  (TEST-TestRandomRequestDistribution.testRequestTracking-seed#[F34AEF95DCD41CE0]) [    ] o.a.s.c.c.SolrZkClient makePath: /collections/collection1
   [junit4]   2> 333739 INFO  (TEST-TestRandomRequestDistribution.testRequestTracking-seed#[F34AEF95DCD41CE0]) [    ] o.a.s.c.c.SolrZkClient makePath: /collections/collection1/shards
   [junit4]   2> 333742 INFO  (TEST-TestRandomRequestDistribution.testRequestTracking-seed#[F34AEF95DCD41CE0]) [    ] o.a.s.c.c.SolrZkClient makePath: /collections/control_collection
   [junit4]   2> 333745 INFO  (TEST-TestRandomRequestDistribution.testRequestTracking-seed#[F34AEF95DCD41CE0]) [    ] o.a.s.c.c.SolrZkClient makePath: /collections/control_collection/shards
   [junit4]   2> 333749 INFO  (TEST-TestRandomRequestDistribution.testRequestTracking-seed#[F34AEF95DCD41CE0]) [    ] o.a.s.c.AbstractZkTestCase put /home/jenkins/workspace/Lucene-Solr-5.x-Linux/solr/core/src/test-files/solr/collection1/conf/solrconfig-tlog.xml to /configs/conf1/solrconfig.xml
   [junit4]   2> 333749 INFO  (TEST-TestRandomRequestDistribution.testRequestTracking-seed#[F34AEF95DCD41CE0]) [    ] o.a.s.c.c.SolrZkClient makePath: /configs/conf1/solrconfig.xml
   [junit4]   2> 333752 INFO  (TEST-TestRandomRequestDistribution.testRequestTracking-seed#[F34AEF95DCD41CE0]) [    ] o.a.s.c.AbstractZkTestCase put /home/jenkins/workspace/Lucene-Solr-5.x-Linux/solr/core/src/test-files/solr/collection1/conf/schema.xml to /configs/conf1/schema.xml
   [junit4]   2> 333752 INFO  (TEST-TestRandomRequestDistribution.testRequestTracking-seed#[F34AEF95DCD41CE0]) [    ] o.a.s.c.c.SolrZkClient makePath: /configs/conf1/schema.xml
   [junit4]   2> 333757 INFO  (TEST-TestRandomRequestDistribution.testRequestTracking-seed#[F34AEF95DCD41CE0]) [    ] o.a.s.c.AbstractZkTestCase put /home/jenkins/workspace/Lucene-Solr-5.x-Linux/solr/core/src/test-files/solr/collection1/conf/solrconfig.snippet.randomindexconfig.xml to /configs/conf1/solrconfig.snippet.randomindexconfig.xml
   [junit4]   2> 333757 INFO  (TEST-TestRandomRequestDistribution.testRequestTracking-seed#[F34AEF95DCD41CE0]) [    ] o.a.s.c.c.SolrZkClient makePath: /configs/conf1/solrconfig.snippet.randomindexconfig.xml
   [junit4]   2> 333759 INFO  (TEST-TestRandomRequestDistribution.testRequestTracking-seed#[F34AEF95DCD41CE0]) [    ] o.a.s.c.AbstractZkTestCase put /home/jenkins/workspace/Lucene-Solr-5.x-Linux/solr/core/src/test-files/solr/collection1/conf/stopwords.txt to /configs/conf1/stopwords.txt
   [junit4]   2> 333759 INFO  (TEST-TestRandomRequestDistribution.testRequestTracking-seed#[F34AEF95DCD41CE0]) [    ] o.a.s.c.c.SolrZkClient makePath: /configs/conf1/stopwords.txt
   [junit4]   2> 333761 INFO  (TEST-TestRandomRequestDistribution.testRequestTracking-seed#[F34AEF95DCD41CE0]) [    ] o.a.s.c.AbstractZkTestCase put /home/jenkins/workspace/Lucene-Solr-5.x-Linux/solr/core/src/test-files/solr/collection1/conf/protwords.txt to /configs/conf1/protwords.txt
   [junit4]   2> 333761 INFO  (TEST-TestRandomRequestDistribution.testRequestTracking-seed#[F34AEF95DCD41CE0]) [    ] o.a.s.c.c.SolrZkClient makePath: /configs/conf1/protwords.txt
   [junit4]   2> 333763 INFO  (TEST-TestRandomRequestDistribution.testRequestTracking-seed#[F34AEF95DCD41CE0]) [    ] o.a.s.c.AbstractZkTestCase put /home/jenkins/workspace/Lucene-Solr-5.x-Linux/solr/core/src/test-files/solr/collection1/conf/currency.xml to /configs/conf1/currency.xml
   [junit4]   2> 333764 INFO  (TEST-TestRandomRequestDistribution.testRequestTracking-seed#[F34AEF95DCD41CE0]) [    ] o.a.s.c.c.SolrZkClient makePath: /configs/conf1/currency.xml
   [junit4]   2> 333769 INFO  (TEST-TestRandomRequestDistribution.testRequestTracking-seed#[F34AEF95DCD41CE0]) [    ] o.a.s.c.AbstractZkTestCase put /home/jenkins/workspace/Lucene-Solr-5.x-Linux/solr/core/src/test-files/solr/collection1/conf/enumsConfig.xml to /configs/conf1/enumsConfig.xml
   [junit4]   2> 333770 INFO  (TEST-TestRandomRequestDistribution.testRequestTracking-seed#[F34AEF95DCD41CE0]) [    ] o.a.s.c.c.SolrZkClient makePath: /configs/conf1/enumsConfig.xml
   [junit4]   2> 333773 INFO  (TEST-TestRandomRequestDistribution.testRequestTracking-seed#[F34AEF95DCD41CE0]) [    ] o.a.s.c.AbstractZkTestCase put /home/jenkins/workspace/Lucene-Solr-5.x-Linux/solr/core/src/test-files/solr/collection1/conf/open-exchange-rates.json to /configs/conf1/open-exchange-rates.json
   [junit4]   2> 333774 INFO  (TEST-TestRandomRequestDistribution.testRequestTracking-seed#[F34AEF95DCD41CE0]) [    ] o.a.s.c.c.SolrZkClient makePath: /configs/conf1/open-exchange-rates.json
   [junit4]   2> 333776 INFO  (TEST-TestRandomRequestDistribution.testRequestTracking-seed#[F34AEF95DCD41CE0]) [    ] o.a.s.c.AbstractZkTestCase put /home/jenkins/workspace/Lucene-Solr-5.x-Linux/solr/core/src/test-files/solr/collection1/conf/mapping-ISOLatin1Accent.txt to /configs/conf1/mapping-ISOLatin1Accent.txt
   [junit4]   2> 333776 INFO  (TEST-TestRandomRequestDistribution.testRequestTracking-seed#[F34AEF95DCD41CE0]) [    ] o.a.s.c.c.SolrZkClient makePath: /configs/conf1/mapping-ISOLatin1Accent.txt
   [junit4]   2> 333778 INFO  (TEST-TestRandomRequestDistribution.testRequestTracking-seed#[F34AEF95DCD41CE0]) [    ] o.a.s.c.AbstractZkTestCase put /home/jenkins/workspace/Lucene-Solr-5.x-Linux/solr/core/src/test-files/solr/collection1/conf/old_synonyms.txt to /configs/conf1/old_synonyms.txt
   [junit4]   2> 333778 INFO  (TEST-TestRandomRequestDistribution.testRequestTracking-seed#[F34AEF95DCD41CE0]) [    ] o.a.s.c.c.SolrZkClient makePath: /configs/conf1/old_synonyms.txt
   [junit4]   2> 333785 INFO  (TEST-TestRandomRequestDistribution.testRequestTracking-seed#[F34AEF95DCD41CE0]) [    ] o.a.s.c.AbstractZkTestCase put /home/jenkins/workspace/Lucene-Solr-5.x-Linux/solr/core/src/test-files/solr/collection1/conf/synonyms.txt to /configs/conf1/synonyms.txt
   [junit4]   2> 333786 INFO  (TEST-TestRandomRequestDistribution.testRequestTracking-seed#[F34AEF95DCD41CE0]) [    ] o.a.s.c.c.SolrZkClient makePath: /configs/conf1/synonyms.txt
   [junit4]   2> 333856 INFO  (TEST-TestRandomRequestDistribution.testRequestTracking-seed#[F34AEF95DCD41CE0]) [    ] o.a.s.SolrTestCaseJ4 Writing core.properties file to /home/jenkins/workspace/Lucene-Solr-5.x-Linux/solr/build/solr-core/test/J1/temp/solr.cloud.TestRandomRequestDistribution_F34AEF95DCD41CE0-001/control-001/cores/collection1
   [junit4]   2> 333857 INFO  (TEST-TestRandomRequestDistribution.testRequestTracking-seed#[F34AEF95DCD41CE0]) [    ] o.e.j.s.Server jetty-9.2.13.v20150730
   [junit4]   2> 333859 INFO  (TEST-TestRandomRequestDistribution.testRequestTracking-seed#[F34AEF95DCD41CE0]) [    ] o.e.j.s.h.ContextHandler Started o.e.j.s.ServletContextHandler@1a87057{/nq_ch,null,AVAILABLE}
   [junit4]   2> 333869 INFO  (TEST-TestRandomRequestDistribution.testRequestTracking-seed#[F34AEF95DCD41CE0]) [    ] o.e.j.s.ServerConnector Started ServerConnector@556645{HTTP/1.1}{127.0.0.1:42608}
   [junit4]   2> 333869 INFO  (TEST-TestRandomRequestDistribution.testRequestTracking-seed#[F34AEF95DCD41CE0]) [    ] o.e.j.s.Server Started @335357ms
   [junit4]   2> 333869 INFO  (TEST-TestRandomRequestDistribution.testRequestTracking-seed#[F34AEF95DCD41CE0]) [    ] o.a.s.c.s.e.JettySolrRunner Jetty properties: {solr.data.dir=/home/jenkins/workspace/Lucene-Solr-5.x-Linux/solr/build/solr-core/test/J1/temp/solr.cloud.TestRandomRequestDistribution_F34AEF95DCD41CE0-001/tempDir-001/control/data, hostContext=/nq_ch, hostPort=42608, coreRootDirectory=/home/jenkins/workspace/Lucene-Solr-5.x-Linux/solr/build/solr-core/test/J1/../../../../../../../../../home/jenkins/workspace/Lucene-Solr-5.x-Linux/solr/build/solr-core/test/J1/temp/solr.cloud.TestRandomRequestDistribution_F34AEF95DCD41CE0-001/control-001/cores}
   [junit4]   2> 333870 INFO  (TEST-TestRandomRequestDistribution.testRequestTracking-seed#[F34AEF95DCD41CE0]) [    ] o.a.s.s.SolrDispatchFilter SolrDispatchFilter.init(): sun.misc.Launcher$AppClassLoader@e2f2a
   [junit4]   2> 333871 INFO  (TEST-TestRandomRequestDistribution.testRequestTracking-seed#[F34AEF95DCD41CE0]) [    ] o.a.s.c.SolrResourceLoader new SolrResourceLoader for directory: '/home/jenkins/workspace/Lucene-Solr-5.x-Linux/solr/build/solr-core/test/J1/../../../../../../../../../home/jenkins/workspace/Lucene-Solr-5.x-Linux/solr/build/solr-core/test/J1/temp/solr.cloud.TestRandomRequestDistribution_F34AEF95DCD41CE0-001/control-001/'
   [junit4]   2> 333903 INFO  (TEST-TestRandomRequestDistribution.testRequestTracking-seed#[F34AEF95DCD41CE0]) [    ] o.a.s.c.c.SolrZkClient Using default ZkCredentialsProvider
   [junit4]   2> 333903 INFO  (TEST-TestRandomRequestDistribution.testRequestTracking-seed#[F34AEF95DCD41CE0]) [    ] o.a.s.c.c.ConnectionManager Waiting for client to connect to ZooKeeper
   [junit4]   2> 333905 INFO  (zkCallback-341-thread-1) [    ] o.a.s.c.c.ConnectionManager Watcher org.apache.solr.common.cloud.ConnectionManager@1314500 name:ZooKeeperConnection Watcher:127.0.0.1:44207/solr got event WatchedEvent state:SyncConnected type:None path:null path:null type:None
   [junit4]   2> 333905 INFO  (TEST-TestRandomRequestDistribution.testRequestTracking-seed#[F34AEF95DCD41CE0]) [    ] o.a.s.c.c.ConnectionManager Client is connected to ZooKeeper
   [junit4]   2> 333906 INFO  (TEST-TestRandomRequestDistribution.testRequestTracking-seed#[F34AEF95DCD41CE0]) [    ] o.a.s.c.c.SolrZkClient Using default ZkACLProvider
   [junit4]   2> 333908 INFO  (TEST-TestRandomRequestDistribution.testRequestTracking-seed#[F34AEF95DCD41CE0]) [    ] o.a.s.s.SolrDispatchFilter Loading solr.xml from SolrHome (not found in ZooKeeper)
   [junit4]   2> 333908 INFO  (TEST-TestRandomRequestDistribution.testRequestTracking-seed#[F34AEF95DCD41CE0]) [    ] o.a.s.c.SolrXmlConfig Loading container configuration from /home/jenkins/workspace/Lucene-Solr-5.x-Linux/solr/build/solr-core/test/J1/../../../../../../../../../home/jenkins/workspace/Lucene-Solr-5.x-Linux/solr/build/solr-core/test/J1/temp/solr.cloud.TestRandomRequestDistribution_F34AEF95DCD41CE0-001/control-001/solr.xml
   [junit4]   2> 333917 INFO  (TEST-TestRandomRequestDistribution.testRequestTracking-seed#[F34AEF95DCD41CE0]) [    ] o.a.s.c.CoresLocator Config-defined core root directory: /home/jenkins/workspace/Lucene-Solr-5.x-Linux/solr/build/solr-core/test/J1/../../../../../../../../../home/jenkins/workspace/Lucene-Solr-5.x-Linux/solr/build/solr-core/test/J1/temp/solr.cloud.TestRandomRequestDistribution_F34AEF95DCD41CE0-001/control-001/cores
   [junit4]   2> 333918 INFO  (TEST-TestRandomRequestDistribution.testRequestTracking-seed#[F34AEF95DCD41CE0]) [    ] o.a.s.c.CoreContainer New CoreContainer 10202725
   [junit4]   2> 333918 INFO  (TEST-TestRandomRequestDistribution.testRequestTracking-seed#[F34AEF95DCD41CE0]) [    ] o.a.s.c.CoreContainer Loading cores into CoreContainer [instanceDir=/home/jenkins/workspace/Lucene-Solr-5.x-Linux/solr/build/solr-core/test/J1/../../../../../../../../../home/jenkins/workspace/Lucene-Solr-5.x-Linux/solr/build/solr-core/test/J1/temp/solr.cloud.TestRandomRequestDistribution_F34AEF95DCD41CE0-001/control-001/]
   [junit4]   2> 333918 INFO  (TEST-TestRandomRequestDistribution.testRequestTracking-seed#[F34AEF95DCD41CE0]) [    ] o.a.s.c.CoreContainer loading shared library: /home/jenkins/workspace/Lucene-Solr-5.x-Linux/solr/build/solr-core/test/J1/../../../../../../../../../home/jenkins/workspace/Lucene-Solr-5.x-Linux/solr/build/solr-core/test/J1/temp/solr.cloud.TestRandomRequestDistribution_F34AEF95DCD41CE0-001/control-001/lib
   [junit4]   2> 333918 WARN  (TEST-TestRandomRequestDistribution.testRequestTracking-seed#[F34AEF95DCD41CE0]) [    ] o.a.s.c.SolrResourceLoader Can't find (or read) directory to add to classloader: lib (resolved as: /home/jenkins/workspace/Lucene-Solr-5.x-Linux/solr/build/solr-core/test/J1/../../../../../../../../../home/jenkins/workspace/Lucene-Solr-5.x-Linux/solr/build/solr-core/test/J1/temp/solr.cloud.TestRandomRequestDistribution_F34AEF95DCD41CE0-001/control-001/lib).
   [junit4]   2> 333929 INFO  (TEST-TestRandomRequestDistribution.testRequestTracking-seed#[F34AEF95DCD41CE0]) [    ] o.a.s.h.c.HttpShardHandlerFactory created with socketTimeout : 90000,urlScheme : ,connTimeout : 15000,maxConnectionsPerHost : 20,maxConnections : 10000,corePoolSize : 0,maximumPoolSize : 2147483647,maxThreadIdleTime : 5,sizeOfQueue : -1,fairnessPolicy : false,useRetries : false,
   [junit4]   2> 333930 INFO  (TEST-TestRandomRequestDistribution.testRequestTracking-seed#[F34AEF95DCD41CE0]) [    ] o.a.s.u.UpdateShardHandler Creating UpdateShardHandler HTTP client with params: socketTimeout=340000&connTimeout=45000&retry=true
   [junit4]   2> 333931 INFO  (TEST-TestRandomRequestDistribution.testRequestTracking-seed#[F34AEF95DCD41CE0]) [    ] o.a.s.l.LogWatcher SLF4J impl is org.slf4j.impl.Log4jLoggerFactory
   [junit4]   2> 333931 INFO  (TEST-TestRandomRequestDistribution.testRequestTracking-seed#[F34AEF95DCD41CE0]) [    ] o.a.s.l.LogWatcher Registering Log Listener [Log4j (org.slf4j.impl.Log4jLoggerFactory)]
   [junit4]   2> 333931 INFO  (TEST-TestRandomRequestDistribution.testRequestTracking-seed#[F34AEF95DCD41CE0]) [    ] o.a.s.c.ZkContainer Zookeeper client=127.0.0.1:44207/solr
   [junit4]   2> 333931 INFO  (TEST-TestRandomRequestDistribution.testRequestTracking-seed#[F34AEF95DCD41CE0]) [    ] o.a.s.c.ZkController zkHost includes chroot
   [junit4]   2> 333931 INFO  (TEST-TestRandomRequestDistribution.testRequestTracking-seed#[F34AEF95DCD41CE0]) [    ] o.a.s.c.c.SolrZkClient Using default ZkCredentialsProvider
   [junit4]   2> 333932 INFO  (TEST-TestRandomRequestDistribution.testRequestTracking-seed#[F34AEF95DCD41CE0]) [    ] o.a.s.c.c.ConnectionManager Waiting for client to connect to ZooKeeper
   [junit4]   2> 333933 INFO  (zkCallback-343-thread-1) [    ] o.a.s.c.c.ConnectionManager Watcher org.apache.solr.common.cloud.ConnectionManager@2c3d6c name:ZooKeeperConnection Watcher:127.0.0.1:44207 got event WatchedEvent state:SyncConnected type:None path:null path:null type:None
   [junit4]   2> 333934 INFO  (TEST-TestRandomRequestDistribution.testRequestTracking-seed#[F34AEF95DCD41CE0]) [    ] o.a.s.c.c.ConnectionManager Client is connected to ZooKeeper
   [junit4]   2> 333934 INFO  (TEST-TestRandomRequestDistribution.testRequestTracking-seed#[F34AEF95DCD41CE0]) [    ] o.a.s.c.c.SolrZkClient Using default ZkACLProvider
   [junit4]   2> 333937 INFO  (TEST-TestRandomRequestDistribution.testRequestTracking-seed#[F34AEF95DCD41CE0]) [n:127.0.0.1:42608_nq_ch    ] o.a.s.c.c.ConnectionManager Waiting for client to connect to ZooKeeper
   [junit4]   2> 333938 INFO  (zkCallback-344-thread-1-processing-n:127.0.0.1:42608_nq_ch) [n:127.0.0.1:42608_nq_ch    ] o.a.s.c.c.ConnectionManager Watcher org.apache.solr.common.cloud.ConnectionManager@1a437c name:ZooKeeperConnection Watcher:127.0.0.1:44207/solr got event WatchedEvent state:SyncConnected type:None path:null path:null type:None
   [junit4]   2> 333938 INFO  (TEST-TestRandomRequestDistribution.testRequestTracking-seed#[F34AEF95DCD41CE0]) [n:127.0.0.1:42608_nq_ch    ] o.a.s.c.c.ConnectionManager Client is connected to ZooKeeper
   [junit4]   2> 333940 INFO  (TEST-TestRandomRequestDistribution.testRequestTracking-seed#[F34AEF95DCD41CE0]) [n:127.0.0.1:42608_nq_ch    ] o.a.s.c.c.SolrZkClient makePath: /overseer/queue
   [junit4]   2> 333942 INFO  (TEST-TestRandomRequestDistribution.testRequestTracking-seed#[F34AEF95DCD41CE0]) [n:127.0.0.1:42608_nq_ch    ] o.a.s.c.c.SolrZkClient makePath: /overseer/collection-queue-work
   [junit4]   2> 333945 INFO  (TEST-TestRandomRequestDistribution.testRequestTracking-seed#[F34AEF95DCD41CE0]) [n:127.0.0.1:42608_nq_ch    ] o.a.s.c.c.SolrZkClient makePath: /overseer/collection-map-running
   [junit4]   2> 333950 INFO  (TEST-TestRandomRequestDistribution.testRequestTracking-seed#[F34AEF95DCD41CE0]) [n:127.0.0.1:42608_nq_ch    ] o.a.s.c.c.SolrZkClient makePath: /overseer/collection-map-completed
   [junit4]   2> 333952 INFO  (TEST-TestRandomRequestDistribution.testRequestTracking-seed#[F34AEF95DCD41CE0]) [n:127.0.0.1:42608_nq_ch    ] o.a.s.c.c.SolrZkClient makePath: /overseer/collection-map-failure
   [junit4]   2> 333955 INFO  (TEST-TestRandomRequestDistribution.testRequestTracking-seed#[F34AEF95DCD41CE0]) [n:127.0.0.1:42608_nq_ch    ] o.a.s.c.c.SolrZkClient makePath: /live_nodes
   [junit4]   2> 333958 INFO  (TEST-TestRandomRequestDistribution.testRequestTracking-seed#[F34AEF95DCD41CE0]) [n:127.0.0.1:42608_nq_ch    ] o.a.s.c.c.SolrZkClient makePath: /aliases.json
   [junit4]   2> 333959 INFO  (TEST-TestRandomRequestDistribution.testRequestTracking-seed#[F34AEF95DCD41CE0]) [n:127.0.0.1:42608_nq_ch    ] o.a.s.c.c.SolrZkClient makePath: /clusterstate.json
   [junit4]   2> 333961 INFO  (TEST-TestRandomRequestDistribution.testRequestTracking-seed#[F34AEF95DCD41CE0]) [n:127.0.0.1:42608_nq_ch    ] o.a.s.c.c.SolrZkClient makePath: /security.json
   [junit4]   2> 333961 INFO  (TEST-TestRandomRequestDistribution.testRequestTracking-seed#[F34AEF95DCD41CE0]) [n:127.0.0.1:42608_nq_ch    ] o.a.s.c.ZkController Register node as live in ZooKeeper:/live_nodes/127.0.0.1:42608_nq_ch
   [junit4]   2> 333962 INFO  (TEST-TestRandomRequestDistribution.testRequestTracking-seed#[F34AEF95DCD41CE0]) [n:127.0.0.1:42608_nq_ch    ] o.a.s.c.c.SolrZkClient makePath: /live_nodes/127.0.0.1:42608_nq_ch
   [junit4]   2> 333963 INFO  (TEST-TestRandomRequestDistribution.testRequestTracking-seed#[F34AEF95DCD41CE0]) [n:127.0.0.1:42608_nq_ch    ] o.a.s.c.c.SolrZkClient makePath: /overseer_elect
   [junit4]   2> 333964 INFO  (TEST-TestRandomRequestDistribution.testRequestTracking-seed#[F34AEF95DCD41CE0]) [n:127.0.0.1:42608_nq_ch    ] o.a.s.c.c.SolrZkClient makePath: /overseer_elect/election
   [junit4]   2> 333966 INFO  (TEST-TestRandomRequestDistribution.testRequestTracking-seed#[F34AEF95DCD41CE0]) [n:127.0.0.1:42608_nq_ch    ] o.a.s.c.Overseer Overseer (id=null) closing
   [junit4]   2> 333966 INFO  (TEST-TestRandomRequestDistribution.testRequestTracking-seed#[F34AEF95DCD41CE0]) [n:127.0.0.1:42608_nq_ch    ] o.a.s.c.LeaderElector Joined leadership election with path: /overseer_elect/election/94416925615259652-127.0.0.1:42608_nq_ch-n_0000000000
   [junit4]   2> 333967 INFO  (TEST-TestRandomRequestDistribution.testRequestTracking-seed#[F34AEF95DCD41CE0]) [n:127.0.0.1:42608_nq_ch    ] o.a.s.c.OverseerElectionContext I am going to be the leader 127.0.0.1:42608_nq_ch
   [junit4]   2> 333967 INFO  (TEST-TestRandomRequestDistribution.testRequestTracking-seed#[F34AEF95DCD41CE0]) [n:127.0.0.1:42608_nq_ch    ] o.a.s.c.c.SolrZkClient makePath: /overseer_elect/leader
   [junit4]   2> 333968 INFO  (TEST-TestRandomRequestDistribution.testRequestTracking-seed#[F34AEF95DCD41CE0]) [n:127.0.0.1:42608_nq_ch    ] o.a.s.c.Overseer Overseer (id=94416925615259652-127.0.0.1:42608_nq_ch-n_0000000000) starting
   [junit4]   2> 333970 INFO  (TEST-TestRandomRequestDistribution.testRequestTracking-seed#[F34AEF95DCD41CE0]) [n:127.0.0.1:42608_nq_ch    ] o.a.s.c.c.SolrZkClient makePath: /overseer/queue-work
   [junit4]   2> 333975 INFO  (TEST-TestRandomRequestDistribution.testRequestTracking-seed#[F34AEF95DCD41CE0]) [n:127.0.0.1:42608_nq_ch    ] o.a.s.c.OverseerAutoReplicaFailoverThread Starting OverseerAutoReplicaFailoverThread autoReplicaFailoverWorkLoopDelay=10000 autoReplicaFailoverWaitAfterExpiration=30000 autoReplicaFailoverBadNodeExpiration=60000
   [junit4]   2> 333976 INFO  (OverseerCollectionConfigSetProcessor-94416925615259652-127.0.0.1:42608_nq_ch-n_0000000000) [n:127.0.0.1:42608_nq_ch    ] o.a.s.c.OverseerTaskProcessor Process current queue of overseer operations
   [junit4]   2> 333976 INFO  (TEST-TestRandomRequestDistribution.testRequestTracking-seed#[F34AEF95DCD41CE0]) [n:127.0.0.1:42608_nq_ch    ] o.a.s.c.c.ZkStateReader Updating cluster state from ZooKeeper... 
   [junit4]   2> 333976 INFO  (OverseerStateUpdate-94416925615259652-127.0.0.1:42608_nq_ch-n_0000000000) [n:127.0.0.1:42608_nq_ch    ] o.a.s.c.Overseer Starting to work on the main queue
   [junit4]   2> 334024 INFO  (TEST-TestRandomRequestDistribution.testRequestTracking-seed#[F34AEF95DCD41CE0]) [n:127.0.0.1:42608_nq_ch    ] o.a.s.c.CoreContainer Security conf doesn't exist. Skipping setup for authorization module.
   [junit4]   2> 334024 INFO  (TEST-TestRandomRequestDistribution.testRequestTracking-seed#[F34AEF95DCD41CE0]) [n:127.0.0.1:42608_nq_ch    ] o.a.s.c.CoreContainer No authentication plugin used.
   [junit4]   2> 334025 INFO  (TEST-TestRandomRequestDistribution.testRequestTracking-seed#[F34AEF95DCD41CE0]) [n:127.0.0.1:42608_nq_ch    ] o.a.s.c.CoresLocator Looking for core definitions underneath /home/jenkins/workspace/Lucene-Solr-5.x-Linux/solr/build/solr-core/test/J1/../../../../../../../../../home/jenkins/workspace/Lucene-Solr-5.x-Linux/solr/build/solr-core/test/J1/temp/solr.cloud.TestRandomRequestDistribution_F34AEF95DCD41CE0-001/control-001/cores
   [junit4]   2> 334026 INFO  (TEST-TestRandomRequestDistribution.testRequestTracking-seed#[F34AEF95DCD41CE0]) [n:127.0.0.1:42608_nq_ch    ] o.a.s.c.SolrCore Created CoreDescriptor: {name=collection1, config=solrconfig.xml, transient=false, schema=schema.xml, loadOnStartup=true, configSetProperties=configsetprops.json, instanceDir=/home/jenkins/workspace/Lucene-Solr-5.x-Linux/solr/build/solr-core/test/J1/../../../../../../../../../home/jenkins/workspace/Lucene-Solr-5.x-Linux/solr/build/solr-core/test/J1/temp/solr.cloud.TestRandomRequestDistribution_F34AEF95DCD41CE0-001/control-001/cores/collection1, collection=control_collection, absoluteInstDir=/home/jenkins/workspace/Lucene-Solr-5.x-Linux/solr/build/solr-core/test/J1/../../../../../../../../../home/jenkins/workspace/Lucene-Solr-5.x-Linux/solr/build/solr-core/test/J1/temp/solr.cloud.TestRandomRequestDistribution_F34AEF95DCD41CE0-001/control-001/cores/collection1/, coreNodeName=, dataDir=data/, shard=}
   [junit4]   2> 334027 INFO  (TEST-TestRandomRequestDistribution.testRequestTracking-seed#[F34AEF95DCD41CE0]) [n:127.0.0.1:42608_nq_ch    ] o.a.s.c.CoresLocator Found core collection1 in /home/jenkins/workspace/Lucene-Solr-5.x-Linux/solr/build/solr-core/test/J1/../../../../../../../../../home/jenkins/workspace/Lucene-Solr-5.x-Linux/solr/build/solr-core/test/J1/temp/solr.cloud.TestRandomRequestDistribution_F34AEF95DCD41CE0-001/control-001/cores/collection1/
   [junit4]   2> 334027 INFO  (TEST-TestRandomRequestDistribution.testRequestTracking-seed#[F34AEF95DCD41CE0]) [n:127.0.0.1:42608_nq_ch    ] o.a.s.c.CoresLocator Found 1 core definitions
   [junit4]   2> 334028 INFO  (TEST-TestRandomRequestDistribution.testRequestTracking-seed#[F34AEF95DCD41CE0]) [n:127.0.0.1:42608_nq_ch    ] o.a.s.s.SolrDispatchFilter user.dir=/home/jenkins/workspace/Lucene-Solr-5.x-Linux/solr/build/solr-core/test/J1
   [junit4]   2> 334028 INFO  (TEST-TestRandomRequestDistribution.testRequestTracking-seed#[F34AEF95DCD41CE0]) [n:127.0.0.1:42608_nq_ch    ] o.a.s.s.SolrDispatchFilter SolrDispatchFilter.init() done
   [junit4]   2> 334028 INFO  (coreLoadExecutor-1547-thread-1-processing-n:127.0.0.1:42608_nq_ch) [n:127.0.0.1:42608_nq_ch c:control_collection   x:collection1] o.a.s.c.ZkController publishing state=down
   [junit4]   2> 334028 INFO  (coreLoadExecutor-1547-thread-1-processing-n:127.0.0.1:42608_nq_ch) [n:127.0.0.1:42608_nq_ch c:control_collection   x:collection1] o.a.s.c.ZkController numShards not found on descriptor - reading it from system property
   [junit4]   2> 334029 INFO  (OverseerStateUpdate-94416925615259652-127.0.0.1:42608_nq_ch-n_0000000000) [n:127.0.0.1:42608_nq_ch    ] o.a.s.c.Overseer processMessage: queueSize: 1, message = {
   [junit4]   2>   "core":"collection1",
   [junit4]   2>   "roles":null,
   [junit4]   2>   "base_url":"http://127.0.0.1:42608/nq_ch",
   [junit4]   2>   "node_name":"127.0.0.1:42608_nq_ch",
   [junit4]   2>   "numShards":"1",
   [junit4]   2>   "state":"down",
   [junit4]   2>   "shard":null,
   [junit4]   2>   "collection":"control_collection",
   [junit4]   2>   "operation":"state"} current state version: 0
   [junit4]   2> 334030 INFO  (coreLoadExecutor-1547-thread-1-processing-n:127.0.0.1:42608_nq_ch) [n:127.0.0.1:42608_nq_ch c:control_collection   x:collection1] o.a.s.c.ZkController look for our core node name
   [junit4]   2> 334030 INFO  (OverseerStateUpdate-94416925615259652-127.0.0.1:42608_nq_ch-n_0000000000) [n:127.0.0.1:42608_nq_ch    ] o.a.s.c.o.ReplicaMutator Update state numShards=1 message={
   [junit4]   2>   "core":"collection1",
   [junit4]   2>   "roles":null,
   [junit4]   2>   "base_url":"http://127.0.0.1:42608/nq_ch",
   [junit4]   2>   "node_name":"127.0.0.1:42608_nq_ch",
   [junit4]   2>   "numShards":"1",
   [junit4]   2>   "state":"down",
   [junit4]   2>   "shard":null,
   [junit4]   2>   "collection":"control_collection",
   [junit4]   2>   "operation":"state"}
   [junit4]   2> 334030 INFO  (OverseerStateUpdate-94416925615259652-127.0.0.1:42608_nq_ch-n_0000000000) [n:127.0.0.1:42608_nq_ch    ] o.a.s.c.o.ClusterStateMutator building a new cName: control_collection
   [junit4]   2> 334031 INFO  (OverseerStateUpdate-94416925615259652-127.0.0.1:42608_nq_ch-n_0000000000) [n:127.0.0.1:42608_nq_ch    ] o.a.s.c.o.ReplicaMutator Assigning new node to shard shard=shard1
   [junit4]   2> 334033 INFO  (zkCallback-344-thread-1-processing-n:127.0.0.1:42608_nq_ch) [n:127.0.0.1:42608_nq_ch    ] o.a.s.c.c.ZkStateReader A cluster state change: WatchedEvent state:SyncConnected type:NodeDataChanged path:/clusterstate.json, has occurred - updating... (live nodes size: 1)
   [junit4]   2> 335030 INFO  (coreLoadExecutor-1547-thread-1-processing-n:127.0.0.1:42608_nq_ch) [n:127.0.0.1:42608_nq_ch c:control_collection   x:collection1] o.a.s.c.ZkController waiting to find shard id in clusterstate for collection1
   [junit4]   2> 335031 INFO  (coreLoadExecutor-1547-thread-1-processing-n:127.0.0.1:42608_nq_ch) [n:127.0.0.1:42608_nq_ch c:control_collection   x:collection1] o.a.s.c.ZkController Check for collection zkNode:control_collection
   [junit4]   2> 335031 INFO  (coreLoadExecutor-1547-thread-1-processing-n:127.0.0.1:42608_nq_ch) [n:127.0.0.1:42608_nq_ch c:control_collection   x:collection1] o.a.s.c.ZkController Collection zkNode exists
   [junit4]   2> 335031 INFO  (coreLoadExecutor-1547-thread-1-processing-n:127.0.0.1:42608_nq_ch) [n:127.0.0.1:42608_nq_ch c:control_collection   x:collection1] o.a.s.c.c.ZkStateReader Load collection config from:/collections/control_collection
   [junit4]   2> 335032 INFO  (coreLoadExecutor-1547-thread-1-processing-n:127.0.0.1:42608_nq_ch) [n:127.0.0.1:42608_nq_ch c:control_collection   x:collection1] o.a.s.c.c.ZkStateReader path=/collections/control_collection configName=conf1 specified config exists in ZooKeeper
   [junit4]   2> 335032 INFO  (coreLoadExecutor-1547-thread-1-processing-n:127.0.0.1:42608_nq_ch) [n:127.0.0.1:42608_nq_ch c:control_collection   x:collection1] o.a.s.c.SolrResourceLoader new SolrResourceLoader for directory: '/home/jenkins/workspace/Lucene-Solr-5.x-Linux/solr/build/solr-core/test/J1/../../../../../../../../../home/jenkins/workspace/Lucene-Solr-5.x-Linux/solr/build/solr-core/test/J1/temp/solr.cloud.TestRandomRequestDistribution_F34AEF95DCD41CE0-001/control-001/cores/collection1/'
   [junit4]   2> 335051 INFO  (coreLoadExecutor-1547-thread-1-processing-n:127.0.0.1:42608_nq_ch) [n:127.0.0.1:42608_nq_ch c:control_collection   x:collection1] o.a.s.c.Config loaded config solrconfig.xml with version 0 
   [junit4]   2> 335060 INFO  (coreLoadExecutor-1547-thread-1-processing-n:127.0.0.1:42608_nq_ch) [n:127.0.0.1:42608_nq_ch c:control_collection   x:collection1] o.a.s.c.SolrConfig current version of requestparams : -1
   [junit4]   2> 335067 INFO  (coreLoadExecutor-1547-thread-1-processing-n:127.0.0.1:42608_nq_ch) [n:127.0.0.1:42608_nq_ch c:control_collection   x:collection1] o.a.s.c.SolrConfig Using Lucene MatchVersion: 5.4.0
   [junit4]   2> 335080 INFO  (coreLoadExecutor-1547-thread-1-processing-n:127.0.0.1:42608_nq_ch) [n:127.0.0.1:42608_nq_ch c:control_collection   x:collection1] o.a.s.c.Config Loaded SolrConfig: solrconfig.xml
   [junit4]   2> 335081 INFO  (coreLoadExecutor-1547-thread-1-processing-n:127.0.0.1:42608_nq_ch) [n:127.0.0.1:42608_nq_ch c:control_collection   x:collection1] o.a.s.s.IndexSchema Reading Solr Schema from /configs/conf1/schema.xml
   [junit4]   2> 335110 INFO  (coreLoadExecutor-1547-thread-1-processing-n:127.0.0.1:42608_nq_ch) [n:127.0.0.1:42608_nq_ch c:control_collection   x:collection1] o.a.s.s.IndexSchema [collection1] Schema name=test
   [junit4]   2> 335323 INFO  (coreLoadExecutor-1547-thread-1-processing-n:127.0.0.1:42608_nq_ch) [n:127.0.0.1:42608_nq_ch c:control_collection   x:collection1] o.a.s.s.OpenExchangeRatesOrgProvider Initialized with rates=open-exchange-rates.json, refreshInterval=1440.
   [junit4]   2> 335348 INFO  (coreLoadExecutor-1547-thread-1-processing-n:127.0.0.1:42608_nq_ch) [n:127.0.0.1:42608_nq_ch c:control_collection   x:collection1] o.a.s.s.IndexSchema default search field in schema is text
   [junit4]   2> 335349 INFO  (coreLoadExecutor-1547-thread-1-processing-n:127.0.0.1:42608_nq_ch) [n:127.0.0.1:42608_nq_ch c:control_collection   x:collection1] o.a.s.s.IndexSchema unique key field: id
   [junit4]   2> 335368 INFO  (coreLoadExecutor-1547-thread-1-processing-n:127.0.0.1:42608_nq_ch) [n:127.0.0.1:42608_nq_ch c:control_collection   x:collection1] o.a.s.s.FileExchangeRateProvider Reloading exchange rates from file currency.xml
   [junit4]   2> 335371 INFO  (coreLoadExecutor-1547-thread-1-processing-n:127.0.0.1:42608_nq_ch) [n:127.0.0.1:42608_nq_ch c:control_collection   x:collection1] o.a.s.s.FileExchangeRateProvider Reloading exchange rates from file currency.xml
   [junit4]   2> 335374 INFO  (coreLoadExecutor-1547-thread-1-processing-n:127.0.0.1:42608_nq_ch) [n:127.0.0.1:42608_nq_ch c:control_collection   x:collection1] o.a.s.s.OpenExchangeRatesOrgProvider Reloading exchange rates from open-exchange-rates.json
   [junit4]   2> 335374 WARN  (coreLoadExecutor-1547-thread-1-processing-n:127.0.0.1:42608_nq_ch) [n:127.0.0.1:42608_nq_ch c:control_collection   x:collection1] o.a.s.s.OpenExchangeRatesOrgProvider Unknown key IMPORTANT NOTE
   [junit4]   2> 335374 WARN  (coreLoadExecutor-1547-thread-1-processing-n:127.0.0.1:42608_nq_ch) [n:127.0.0.1:42608_nq_ch c:control_collection   x:collection1] o.a.s.s.OpenExchangeRatesOrgProvider Expected key, got STRING
   [junit4]   2> 335375 INFO  (coreLoadExecutor-1547-thread-1-processing-n:127.0.0.1:42608_nq_ch) [n:127.0.0.1:42608_nq_ch c:control_collection   x:collection1] o.a.s.s.OpenExchangeRatesOrgProvider Reloading exchange rates from open-exchange-rates.json
   [junit4]   2> 335376 WARN  (coreLoadExecutor-1547-thread-1-processing-n:127.0.0.1:42608_nq_ch) [n:127.0.0.1:42608_nq_ch c:control_collection   x:collection1] o.a.s.s.OpenExchangeRatesOrgProvider Unknown key IMPORTANT NOTE
   [junit4]   2> 335377 WARN  (coreLoadExecutor-1547-thread-1-processing-n:127.0.0.1:42608_nq_ch) [n:127.0.0.1:42608_nq_ch c:control_collection   x:collection1] o.a.s.s.OpenExchangeRatesOrgProvider Expected key, got STRING
   [junit4]   2> 335378 INFO  (coreLoadExecutor-1547-thread-1-processing-n:127.0.0.1:42608_nq_ch) [n:127.0.0.1:42608_nq_ch c:control_collection   x:collection1] o.a.s.c.ConfigSetProperties Did not find ConfigSet properties, assuming default properties: Can't find resource 'configsetprops.json' in classpath or '/configs/conf1', cwd=/home/jenkins/workspace/Lucene-Solr-5.x-Linux/solr/build/solr-core/test/J1
   [junit4]   2> 335378 INFO  (coreLoadExecutor-1547-thread-1-processing-n:127.0.0.1:42608_nq_ch) [n:127.0.0.1:42608_nq_ch c:control_collection   x:collection1] o.a.s.c.CoreContainer Creating SolrCore 'collection1' using configuration from collection control_collection
   [junit4]   2> 335378 INFO  (coreLoadExecutor-1547-thread-1-processing-n:127.0.0.1:42608_nq_ch) [n:127.0.0.1:42608_nq_ch c:control_collection s:shard1 r:core_node1 x:collection1] o.a.s.c.SolrCore org.apache.solr.core.MockDirectoryFactory
   [junit4]   2> 335378 INFO  (coreLoadExecutor-1547-thread-1-processing-n:127.0.0.1:42608_nq_ch) [n:127.0.0.1:42608_nq_ch c:control_collection s:shard1 r:core_node1 x:collection1] o.a.s.c.SolrCore [[collection1] ] Opening new SolrCore at [/home/jenkins/workspace/Lucene-Solr-5.x-Linux/solr/build/solr-core/test/J1/../../../../../../../../../home/jenkins/workspace/Lucene-Solr-5.x-Linux/solr/build/solr-core/test/J1/temp/solr.cloud.TestRandomRequestDistribution_F34AEF95DCD41CE0-001/control-001/cores/collection1/], dataDir=[null]
   [junit4]   2> 335379 INFO  (coreLoadExecutor-1547-thread-1-processing-n:127.0.0.1:42608_nq_ch) [n:127.0.0.1:42608_nq_ch c:control_collection s:shard1 r:core_node1 x:collection1] o.a.s.c.JmxMonitoredMap JMX monitoring is enabled. Adding Solr mbeans to JMX Server: com.sun.jmx.mbeanserver.JmxMBeanServer@14eba42
   [junit4]   2> 335380 INFO  (coreLoadExecutor-1547-thread-1-processing-n:127.0.0.1:42608_nq_ch) [n:127.0.0.1:42608_nq_ch c:control_collection s:shard1 r:core_node1 x:collection1] o.a.s.c.CachingDirectoryFactory return new directory for /home/jenkins/workspace/Lucene-Solr-5.x-Linux/solr/build/solr-core/test/J1/../../../../../../../../../home/jenkins/workspace/Lucene-Solr-5.x-Linux/solr/build/solr-core/test/J1/temp/solr.cloud.TestRandomRequestDistribution_F34AEF95DCD41CE0-001/control-001/cores/collection1/data
   [junit4]   2> 335380 INFO  (coreLoadExecutor-1547-thread-1-processing-n:127.0.0.1:42608_nq_ch) [n:127.0.0.1:42608_nq_ch c:control_collection s:shard1 r:core_node1 x:collection1] o.a.s.c.SolrCore New index directory detected: old=null new=/home/jenkins/workspace/Lucene-Solr-5.x-Linux/solr/build/solr-core/test/J1/../../../../../../../../../home/jenkins/workspace/Lucene-Solr-5.x-Linux/solr/build/solr-core/test/J1/temp/solr.cloud.TestRandomRequestDistribution_F34AEF95DCD41CE0-001/control-001/cores/collection1/data/index/
   [junit4]   2> 335380 WARN  (coreLoadExecutor-1547-thread-1-processing-n:127.0.0.1:42608_nq_ch) [n:127.0.0.1:42608_nq_ch c:control_collection s:shard1 r:core_node1 x:collection1] o.a.s.c.SolrCore [collection1] Solr index directory '/home/jenkins/workspace/Lucene-Solr-5.x-Linux/solr/build/solr-core/test/J1/../../../../../../../../../home/jenkins/workspace/Lucene-Solr-5.x-Linux/solr/build/solr-core/test/J1/temp/solr.cloud.TestRandomRequestDistribution_F34AEF95DCD41CE0-001/control-001/cores/collection1/data/index' doesn't exist. Creating new index...
   [junit4]   2> 335381 INFO  (coreLoadExecutor-1547-thread-1-processing-n:127.0.0.1:42608_nq_ch) [n:127.0.0.1:42608_nq_ch c:control_collection s:shard1 r:core_node1 x:collection1] o.a.s.c.CachingDirectoryFactory return new directory for /home/jenkins/workspace/Lucene-Solr-5.x-Linux/solr/build/solr-core/test/J1/../../../../../../../../../home/jenkins/workspace/Lucene-Solr-5.x-Linux/solr/build/solr-core/test/J1/temp/solr.cloud.TestRandomRequestDistribution_F34AEF95DCD41CE0-001/control-001/cores/collection1/data/index
   [junit4]   2> 335381 INFO  (coreLoadExecutor-1547-thread-1-processing-n:127.0.0.1:42608_nq_ch) [n:127.0.0.1:42608_nq_ch c:control_collection s:shard1 r:core_node1 x:collection1] o.a.s.u.RandomMergePolicy RandomMergePolicy wrapping class org.apache.lucene.index.LogByteSizeMergePolicy: [LogByteSizeMergePolicy: minMergeSize=1677721, mergeFactor=6, maxMergeSize=2147483648, maxMergeSizeForForcedMerge=9223372036854775807, calibrateSizeByDeletes=true, maxMergeDocs=2147483647, maxCFSSegmentSizeMB=8.796093022207999E12, noCFSRatio=0.0]
   [junit4]   2> 335381 INFO  (coreLoadExecutor-1547-thread-1-processing-n:127.0.0.1:42608_nq_ch) [n:127.0.0.1:42608_nq_ch c:control_collection s:shard1 r:core_node1 x:collection1] o.a.s.c.SolrCore SolrDeletionPolicy.onCommit: commits: num=1
   [junit4]   2> 	commit{dir=MockDirectoryWrapper(RAMDirectory@8d2e23 lockFactory=org.apache.lucene.store.SingleInstanceLockFactory@1f61f4f),segFN=segments_1,generation=1}
   [junit4]   2> 335382 INFO  (coreLoadExecutor-1547-thread-1-processing-n:127.0.0.1:42608_nq_ch) [n:127.0.0.1:42608_nq_ch c:control_collection s:shard1 r:core_node1 x:collection1] o.a.s.c.SolrCore newest commit generation = 1
   [junit4]   2> 335384 INFO  (OldIndexDirectoryCleanupThreadForCore-collection1) [n:127.0.0.1:42608_nq_ch c:control_collection s:shard1 r:core_node1 x:collection1] o.a.s.c.SolrCore Looking for old index directories to cleanup for core collection1 in /home/jenkins/workspace/Lucene-Solr-5.x-Linux/solr/build/solr-core/test/J1/../../../../../../../../../home/jenkins/workspace/Lucene-Solr-5.x-Linux/solr/build/solr-core/test/J1/temp/solr.cloud.TestRandomRequestDistribution_F34AEF95DCD41CE0-001/control-001/cores/collection1/data/
   [junit4]   2> 335384 WARN  (OldIndexDirectoryCleanupThreadForCore-collection1) [n:127.0.0.1:42608_nq_ch c:control_collection s:shard1 r:core_node1 x:collection1] o.a.s.c.DirectoryFactory /home/jenkins/workspace/Lucene-Solr-5.x-Linux/solr/build/solr-core/test/J1/../../../../../../../../../home/jenkins/workspace/Lucene-Solr-5.x-Linux/solr/build/solr-core/test/J1/temp/solr.cloud.TestRandomRequestDistribution_F34AEF95DCD41CE0-001/control-001/cores/collection1/data/ does not point to a valid data directory; skipping clean-up of old index directories.
   [junit4]   2> 335389 INFO  (coreLoadExecutor-1547-thread-1-processing-n:127.0.0.1:42608_nq_ch) [n:127.0.0.1:42608_nq_ch c:control_collection s:shard1 r:core_node1 x:collection1] o.a.s.u.p.UpdateRequestProcessorChain creating updateRequestProcessorChain "nodistrib"
   [junit4]   2> 335389 INFO  (coreLoadExecutor-1547-thread-1-processing-n:127.0.0.1:42608_nq_ch) [n:127.0.0.1:42608_nq_ch c:control_collection s:shard1 r:core_node1 x:collection1] o.a.s.u.p.UpdateRequestProcessorChain creating updateRequestProcessorChain "dedupe"
   [junit4]   2> 335389 INFO  (coreLoadExecutor-1547-thread-1-processing-n:127.0.0.1:42608_nq_ch) [n:127.0.0.1:42608_nq_ch c:control_collection s:shard1 r:core_node1 x:collection1] o.a.s.u.p.UpdateRequestProcessorChain inserting DistributedUpdateProcessorFactory into updateRequestProcessorChain "dedupe"
   [junit4]   2> 335390 INFO  (coreLoadExecutor-1547-thread-1-processing-n:127.0.0.1:42608_nq_ch) [n:127.0.0.1:42608_nq_ch c:control_collection s:shard1 r:core_node1 x:collection1] o.a.s.u.p.UpdateRequestProcessorChain creating updateRequestProcessorChain "stored_sig"
   [junit4]   2> 335390 INFO  (coreLoadExecutor-1547-thread-1-processing-n:127.0.0.1:42608_nq_ch) [n:127.0.0.1:42608_nq_ch c:control_collection s:shard1 r:core_node1 x:collection1] o.a.s.u.p.UpdateRequestProcessorChain inserting DistributedUpdateProcessorFactory into updateRequestProcessorChain "stored_sig"
   [junit4]   2> 335390 INFO  (coreLoadExecutor-1547-thread-1-processing-n:127.0.0.1:42608_nq_ch) [n:127.0.0.1:42608_nq_ch c:control_collection s:shard1 r:core_node1 x:collection1] o.a.s.u.p.UpdateRequestProcessorChain creating updateRequestProcessorChain "distrib-dup-test-chain-explicit"
   [junit4]   2> 335390 INFO  (coreLoadExecutor-1547-thread-1-processing-n:127.0.0.1:42608_nq_ch) [n:127.0.0.1:42608_nq_ch c:control_collection s:shard1 r:core_node1 x:collection1] o.a.s.u.p.UpdateRequestProcessorChain creating updateRequestProcessorChain "distrib-dup-test-chain-implicit"
   [junit4]   2> 335390 INFO  (coreLoadExecutor-1547-thread-1-processing-n:127.0.0.1:42608_nq_ch) [n:127.0.0.1:42608_nq_ch c:control_collection s:shard1 r:core_node1 x:collection1] o.a.s.u.p.UpdateRequestProcessorChain inserting DistributedUpdateProcessorFactory into updateRequestProcessorChain "distrib-dup-test-chain-implicit"
   [junit4]   2> 335390 INFO  (coreLoadExecutor-1547-thread-1-processing-n:127.0.0.1:42608_nq_ch) [n:127.0.0.1:42608_nq_ch c:control_collection s:shard1 r:core_node1 x:collection1] o.a.s.c.SolrCore no updateRequestProcessorChain defined as default, creating implicit default
   [junit4]   2> 335393 INFO  (coreLoadExecutor-1547-thread-1-processing-n:127.0.0.1:42608_nq_ch) [n:127.0.0.1:42608_nq_ch c:control_collection s:shard1 r:core_node1 x:collection1] o.a.s.h.l.XMLLoader xsltCacheLifetimeSeconds=60
   [junit4]   2> 335394 INFO  (coreLoadExecutor-1547-thread-1-processing-n:127.0.0.1:42608_nq_ch) [n:127.0.0.1:42608_nq_ch c:control_collection s:shard1 r:core_node1 x:collection1] o.a.s.h.l.XMLLoader xsltCacheLifetimeSeconds=60
   [junit4]   2> 335395 INFO  (coreLoadExecutor-1547-thread-1-processing-n:127.0.0.1:42608_nq_ch) [n:127.0.0.1:42608_nq_ch c:control_collection s:shard1 r:core_node1 x:collection1] o.a.s.h.l.XMLLoader xsltCacheLifetimeSeconds=60
   [junit4]   2> 335397 INFO  (coreLoadExecutor-1547-thread-1-processing-n:127.0.0.1:42608_nq_ch) [n:127.0.0.1:42608_nq_ch c:control_collection s:shard1 r:core_node1 x:collection1] o.a.s.h.l.XMLLoader xsltCacheLifetimeSeconds=60
   [junit4]   2> 335403 INFO  (coreLoadExecutor-1547-thread-1-processing-n:127.0.0.1:42608_nq_ch) [n:127.0.0.1:42608_nq_ch c:control_collection s:shard1 r:core_node1 x:collection1] o.a.s.c.RequestHandlers Registered paths: /admin/mbeans,standard,/update/csv,/update/json/docs,/admin/luke,/admin/segments,/get,/admin/system,/replication,/admin/properties,/config,/schema,/admin/plugins,/admin/logging,/update/json,/admin/threads,/admin/ping,/update,/admin/file
   [junit4]   2> 335406 INFO  (coreLoadExecutor-1547-thread-1-processing-n:127.0.0.1:42608_nq_ch) [n:127.0.0.1:42608_nq_ch c:control_collection s:shard1 r:core_node1 x:collection1] o.a.s.c.SolrCore Using default statsCache cache: org.apache.solr.search.stats.LocalStatsCache
   [junit4]   2> 335406 INFO  (coreLoadExecutor-1547-thread-1-processing-n:127.0.0.1:42608_nq_ch) [n:127.0.0.1:42608_nq_ch c:control_collection s:shard1 r:core_node1 x:collection1] o.a.s.u.UpdateHandler Using UpdateLog implementation: org.apache.solr.update.UpdateLog
   [junit4]   2> 335406 INFO  (coreLoadExecutor-1547-thread-1-processing-n:127.0.0.1:42608_nq_ch) [n:127.0.0.1:42608_nq_ch c:control_collection s:shard1 r:core_node1 x:collection1] o.a.s.u.UpdateLog Initializing UpdateLog: dataDir= defaultSyncLevel=FLUSH numRecordsToKeep=100 maxNumLogsToKeep=10 numVersionBuckets=65536
   [junit4]   2> 335408 INFO  (coreLoadExecutor-1547-thread-1-processing-n:127.0.0.1:42608_nq_ch) [n:127.0.0.1:42608_nq_ch c:control_collection s:shard1 r:core_node1 x:collection1] o.a.s.c.SolrCore Hard AutoCommit: disabled
   [junit4]   2> 335408 INFO  (coreLoadExecutor-1547-thread-1-processing-n:127.0.0.1:42608_nq_ch) [n:127.0.0.1:42608_nq_ch c:control_collection s:shard1 r:core_node1 x:collection1] o.a.s.c.SolrCore Soft AutoCommit: disabled
   [junit4]   2> 335409 INFO  (coreLoadExecutor-1547-thread-1-processing-n:127.0.0.1:42608_nq_ch) [n:127.0.0.1:42608_nq_ch c:control_collection s:shard1 r:core_node1 x:collection1] o.a.s.u.RandomMergePolicy RandomMergePolicy wrapping class org.apache.lucene.index.LogDocMergePolicy: [LogDocMergePolicy: minMergeSize=1000, mergeFactor=43, maxMergeSize=9223372036854775807, maxMergeSizeForForcedMerge=9223372036854775807, calibrateSizeByDeletes=true, maxMergeDocs=2147483647, maxCFSSegmentSizeMB=8.796093022207999E12, noCFSRatio=0.5390478089015844]
   [junit4]   2> 335409 INFO  (coreLoadExecutor-1547-thread-1-processing-n:127.0.0.1:42608_nq_ch) [n:127.0.0.1:42608_nq_ch c:control_collection s:shard1 r:core_node1 x:collection1] o.a.s.c.SolrCore SolrDeletionPolicy.onInit: commits: num=1
   [junit4]   2> 	commit{dir=MockDirectoryWrapper(RAMDirectory@8d2e23 lockFactory=org.apache.lucene.store.SingleInstanceLockFactory@1f61f4f),segFN=segments_1,generation=1}
   [junit4]   2> 335409 INFO  (coreLoadExecutor-1547-thread-1-processing-n:127.0.0.1:42608_nq_ch) [n:127.0.0.1:42608_nq_ch c:control_collection s:shard1 r:core_node1 x:collection1] o.a.s.c.SolrCore newest commit generation = 1
   [junit4]   2> 335410 INFO  (coreLoadExecutor-1547-thread-1-processing-n:127.0.0.1:42608_nq_ch) [n:127.0.0.1:42608_nq_ch c:control_collection s:shard1 r:core_node1 x:collection1] o.a.s.s.SolrIndexSearcher Opening Searcher@ec3fe8[collection1] main
   [junit4]   2> 335410 INFO  (coreLoadExecutor-1547-thread-1-processing-n:127.0.0.1:42608_nq_ch) [n:127.0.0.1:42608_nq_ch c:control_collection s:shard1 r:core_node1 x:collection1] o.a.s.c.c.ZkStateReader Load collection config from:/collections/control_collection
   [junit4]   2> 335411 INFO  (coreLoadExecutor-1547-thread-1-processing-n:127.0.0.1:42608_nq_ch) [n:127.0.0.1:42608_nq_ch c:control_collection s:shard1 r:core_node1 x:collection1] o.a.s.c.c.ZkStateReader path=/collections/control_collection configName=conf1 specified config exists in ZooKeeper
   [junit4]   2> 335411 INFO  (coreLoadExecutor-1547-thread-1-processing-n:127.0.0.1:42608_nq_ch) [n:127.0.0.1:42608_nq_ch c:control_collection s:shard1 r:core_node1 x:collection1] o.a.s.r.ManagedResourceStorage Setting up ZooKeeper-based storage for the RestManager with znodeBase: /configs/conf1
   [junit4]   2> 335412 INFO  (coreLoadExecutor-1547-thread-1-processing-n:127.0.0.1:42608_nq_ch) [n:127.0.0.1:42608_nq_ch c:control_collection s:shard1 r:core_node1 x:collection1] o.a.s.r.ManagedResourceStorage Configured ZooKeeperStorageIO with znodeBase: /configs/conf1
   [junit4]   2> 335412 INFO  (coreLoadExecutor-1547-thread-1-processing-n:127.0.0.1:42608_nq_ch) [n:127.0.0.1:42608_nq_ch c:control_collection s:shard1 r:core_node1 x:collection1] o.a.s.r.RestManager Initializing RestManager with initArgs: {}
   [junit4]   2> 335412 INFO  (coreLoadExecutor-1547-thread-1-processing-n:127.0.0.1:42608_nq_ch) [n:127.0.0.1:42608_nq_ch c:control_collection s:shard1 r:core_node1 x:collection1] o.a.s.r.ManagedResourceStorage Reading _rest_managed.json using ZooKeeperStorageIO:path=/configs/conf1
   [junit4]   2> 335413 INFO  (coreLoadExecutor-1547-thread-1-processing-n:127.0.0.1:42608_nq_ch) [n:127.0.0.1:42608_nq_ch c:control_collection s:shard1 r:core_node1 x:collection1] o.a.s.r.ManagedResourceStorage No data found for znode /configs/conf1/_rest_managed.json
   [junit4]   2> 335413 INFO  (coreLoadExecutor-1547-thread-1-processing-n:127.0.0.1:42608_nq_ch) [n:127.0.0.1:42608_nq_ch c:control_collection s:shard1 r:core_node1 x:collection1] o.a.s.r.ManagedResourceStorage Loaded null at path _rest_managed.json using ZooKeeperStorageIO:path=/configs/conf1
   [junit4]   2> 335413 INFO  (coreLoadExecutor-1547-thread-1-processing-n:127.0.0.1:42608_nq_ch) [n:127.0.0.1:42608_nq_ch c:control_collection s:shard1 r:core_node1 x:collection1] o.a.s.r.RestManager Initializing 0 registered ManagedResources
   [junit4]   2> 335413 INFO  (coreLoadExecutor-1547-thread-1-processing-n:127.0.0.1:42608_nq_ch) [n:127.0.0.1:42608_nq_ch c:control_collection s:shard1 r:core_node1 x:collection1] o.a.s.h.ReplicationHandler Commits will be reserved for  10000
   [junit4]   2> 335414 INFO  (searcherExecutor-1548-thread-1-processing-n:127.0.0.1:42608_nq_ch x:collection1 s:shard1 c:control_collection r:core_node1) [n:127.0.0.1:42608_nq_ch c:control_collection s:shard1 r:core_node1 x:collection1] o.a.s.c.SolrCore [collection1] Registered new searcher Searcher@ec3fe8[collection1] main{ExitableDirectoryReader(UninvertingDirectoryReader())}
   [junit4]   2> 335414 INFO  (coreLoadExecutor-1547-thread-1-processing-n:127.0.0.1:42608_nq_ch) [n:127.0.0.1:42608_nq_ch c:control_collection s:shard1 r:core_node1 x:collection1] o.a.s.u.UpdateLog Looking up max value of version field to seed version buckets
   [junit4]   2> 335414 INFO  (coreLoadExecutor-1547-thread-1-processing-n:127.0.0.1:42608_nq_ch) [n:127.0.0.1:42608_nq_ch c:control_collection s:shard1 r:core_node1 x:collection1] o.a.s.u.VersionInfo Refreshing highest value of _version_ for 65536 version buckets from index
   [junit4]   2> 335414 INFO  (coreLoadExecutor-1547-thread-1-processing-n:127.0.0.1:42608_nq_ch) [n:127.0.0.1:42608_nq_ch c:control_collection s:shard1 r:core_node1 x:collection1] o.a.s.u.VersionInfo No terms found for _version_, cannot seed version bucket highest value from index
   [junit4]   2> 335414 INFO  (coreLoadExecutor-1547-thread-1-processing-n:127.0.0.1:42608_nq_ch) [n:127.0.0.1:42608_nq_ch c:control_collection s:shard1 r:core_node1 x:collection1] o.a.s.u.UpdateLog Could not find max version in index or recent updates, using new clock 1510670811721105408
   [junit4]   2> 335417 INFO  (coreLoadExecutor-1547-thread-1-processing-n:127.0.0.1:42608_nq_ch) [n:127.0.0.1:42608_nq_ch c:control_collection s:shard1 r:core_node1 x:collection1] o.a.s.u.UpdateLog Took 2.0ms to seed version buckets with highest version 1510670811721105408
   [junit4]   2> 335417 INFO  (coreLoadExecutor-1547-thread-1-processing-n:127.0.0.1:42608_nq_ch) [n:127.0.0.1:42608_nq_ch c:control_collection s:shard1 r:core_node1 x:collection1] o.a.s.c.ZkController watch zkdir /configs/conf1
   [junit4]   2> 335418 INFO  (coreLoadExecutor-1547-thread-1-processing-n:127.0.0.1:42608_nq_ch) [n:127.0.0.1:42608_nq_ch c:control_collection s:shard1 r:core_node1 x:collection1] o.a.s.c.CoreContainer registering core: collection1
   [junit4]   2> 335418 INFO  (coreZkRegister-1541-thread-1-processing-n:127.0.0.1:42608_nq_ch x:collection1 s:shard1 c:control_collection r:core_node1) [n:127.0.0.1:42608_nq_ch c:control_collection s:shard1 r:core_node1 x:collection1] o.a.s.c.ZkController Register replica - core:collection1 address:http://127.0.0.1:42608/nq_ch collection:control_collection shard:shard1
   [junit4]   2> 335419 INFO  (coreZkRegister-1541-thread-1-processing-n:127.0.0.1:42608_nq_ch x:collection1 s:shard1 c:control_collection r:core_node1) [n:127.0.0.1:42608_nq_ch c:control_collection s:shard1 r:core_node1 x:collection1] o.a.s.c.c.SolrZkClient makePath: /collections/control_collection/leader_elect/shard1/election
   [junit4]   2> 335422 INFO  (coreZkRegister-1541-thread-1-processing-n:127.0.0.1:42608_nq_ch x:collection1 s:shard1 c:control_collection r:core_node1) [n:127.0.0.1:42608_nq_ch c:control_collection s:shard1 r:core_node1 x:collection1] o.a.s.c.LeaderElector Joined leadership election with path: /collections/control_collection/leader_elect/shard1/election/94416925615259652-core_node1-n_0000000000
   [junit4]   2> 335423 INFO  (coreZkRegister-1541-thread-1-processing-n:127.0.0.1:42608_nq_ch x:collection1 s:shard1 c:control_collection r:core_node1) [n:127.0.0.1:42608_nq_ch c:control_collection s:shard1 r:core_node1 x:collection1] o.a.s.c.ShardLeaderElectionContext Running the leader process for shard shard1
   [junit4]   2> 335425 INFO  (coreZkRegister-1541-thread-1-processing-n:127.0.0.1:42608_nq_ch x:collection1 s:shard1 c:control_collection r:core_node1) [n:127.0.0.1:42608_nq_ch c:control_collection s:shard1 r:core_node1 x:collection1] o.a.s.c.ShardLeaderElectionContext Enough replicas found to continue.
   [junit4]   2> 335425 INFO  (coreZkRegister-1541-thread-1-processing-n:127.0.0.1:42608_nq_ch x:collection1 s:shard1 c:control_collection r:core_node1) [n:127.0.0.1:42608_nq_ch c:control_collection s:shard1 r:core_node1 x:collection1] o.a.s.c.ShardLeaderElectionContext I may be the new leader - try and sync
   [junit4]   2> 335425 INFO  (OverseerStateUpdate-94416925615259652-127.0.0.1:42608_nq_ch-n_0000000000) [n:127.0.0.1:42608_nq_ch    ] o.a.s.c.Overseer processMessage: queueSize: 1, message = {
   [junit4]   2>   "operation":"leader",
   [junit4]   2>   "shard":"shard1",
   [junit4]   2>   "collection":"control_collection"} current state version: 1
   [junit4]   2> 335425 INFO  (coreZkRegister-1541-thread-1-processing-n:127.0.0.1:42608_nq_ch x:collection1 s:shard1 c:control_collection r:core_node1) [n:127.0.0.1:42608_nq_ch c:control_collection s:shard1 r:core_node1 x:collection1] o.a.s.c.SyncStrategy Sync replicas to http://127.0.0.1:42608/nq_ch/collection1/
   [junit4]   2> 335426 INFO  (coreZkRegister-1541-thread-1-processing-n:127.0.0.1:42608_nq_ch x:collection1 s:shard1 c:control_collection r:core_node1) [n:127.0.0.1:42608_nq_ch c:control_collection s:shard1 r:core_node1 x:collection1] o.a.s.c.SyncStrategy Sync Success - now sync replicas to me
   [junit4]   2> 335426 INFO  (coreZkRegister-1541-thread-1-processing-n:127.0.0.1:42608_nq_ch x:collection1 s:shard1 c:control_collection r:core_node1) [n:127.0.0.1:42608_nq_ch c:control_collection s:shard1 r:core_node1 x:collection1] o.a.s.c.SyncStrategy http://127.0.0.1:42608/nq_ch/collection1/ has no replicas
   [junit4]   2> 335426 INFO  (coreZkRegister-1541-thread-1-processing-n:127.0.0.1:42608_nq_ch x:collection1 s:shard1 c:control_collection r:core_node1) [n:127.0.0.1:42608_nq_ch c:control_collection s:shard1 r:core_node1 x:collection1] o.a.s.c.ShardLeaderElectionContext I am the new leader: http://127.0.0.1:42608/nq_ch/collection1/ shard1
   [junit4]   2> 335426 INFO  (coreZkRegister-1541-thread-1-processing-n:127.0.0.1:42608_nq_ch x:collection1 s:shard1 c:control_collection r:core_node1) [n:127.0.0.1:42608_nq_ch c:control_collection s:shard1 r:core_node1 x:collection1] o.a.s.c.c.SolrZkClient makePath: /collections/control_collection/leaders/shard1
   [junit4]   2> 335430 INFO  (OverseerStateUpdate-94416925615259652-127.0.0.1:42608_nq_ch-n_0000000000) [n:127.0.0.1:42608_nq_ch    ] o.a.s.c.Overseer processMessage: queueSize: 1, message = {
   [junit4]   2>   "operation":"leader",
   [junit4]   2>   "shard":"shard1",
   [junit4]   2>   "collection":"control_collection",
   [junit4]   2>   "base_url":"http://127.0.0.1:42608/nq_ch",
   [junit4]   2>   "core":"collection1",
   [junit4]   2>   "state":"active"} current state version: 1
   [junit4]   2> 335530 INFO  (TEST-TestRandomRequestDistribution.testRequestTracking-seed#[F34AEF95DCD41CE0]) [    ] o.a.s.c.c.SolrZkClient Using default ZkCredentialsProvider
   [junit4]   2> 335531 INFO  (TEST-TestRandomRequestDistribution.testRequestTracking-seed#[F34AEF95DCD41CE0]) [    ] o.a.s.c.c.ConnectionManager Waiting for client to connect to ZooKeeper
   [junit4]   2> 335532 INFO  (zkCallback-346-thread-1) [    ] o.a.s.c.c.ConnectionManager Watcher org.apache.solr.common.cloud.ConnectionManager@16239c5 name:ZooKeeperConnection Watcher:127.0.0.1:44207/solr got event WatchedEvent state:SyncConnected type:None path:null path:null type:None
   [junit4]   2> 335532 INFO  (zkCallback-344-thread-1-processing-n:127.0.0.1:42608_nq_ch) [n:127.0.0.1:42608_nq_ch    ] o.a.s.c.c.ZkStateReader A cluster state change: WatchedEvent state:SyncConnected type:NodeDataChanged path:/clusterstate.json, has occurred - updating... (live nodes size: 1)
   [junit4]   2> 335532 INFO  (TEST-TestRandomRequestDistribution.testRequestTracking-seed#[F34AEF95DCD41CE0]) [    ] o.a.s.c.c.ConnectionManager Client is connected to ZooKeeper
   [junit4]   2> 335533 INFO  (TEST-TestRandomRequestDistribution.testRequestTracking-seed#[F34AEF95DCD41CE0]) [    ] o.a.s.c.c.SolrZkClient Using default ZkACLProvider
   [junit4]   2> 335533 INFO  (TEST-TestRandomRequestDistribution.testRequestTracking-seed#[F34AEF95DCD41CE0]) [    ] o.a.s.c.c.ZkStateReader Updating cluster state from ZooKeeper... 
   [junit4]   2> 335536 INFO  (TEST-TestRandomRequestDistribution.testRequestTracking-seed#[F34AEF95DCD41CE0]) [    ] o.a.s.c.ChaosMonkey monkey: init - expire sessions:false cause connection loss:false
   [junit4]   2> 335536 INFO  (TEST-TestRandomRequestDistribution.testRequestTracking-seed#[F34AEF95DCD41CE0]) [    ] o.a.s.c.AbstractFullDistribZkTestBase Creating collection1 with stateFormat=2
   [junit4]   2> 335536 INFO  (TEST-TestRandomRequestDistribution.testRequestTracking-seed#[F34AEF95DCD41CE0]) [    ] o.a.s.c.c.SolrZkClient Using default ZkCredentialsProvider
   [junit4]   2> 335536 INFO  (TEST-TestRandomRequestDistribution.testRequestTracking-seed#[F34AEF95DCD41CE0]) [    ] o.a.s.c.c.ConnectionManager Waiting for client to connect to ZooKeeper
   [junit4]   2> 335537 INFO  (zkCallback-347-thread-1) [    ] o.a.s.c.c.ConnectionManager Watcher org.apache.solr.common.cloud.ConnectionManager@f7d9ac name:ZooKeeperConnection Watcher:127.0.0.1:44207/solr got event WatchedEvent state:SyncConnected type:None path:null path:null type:None
   [junit4]   2> 335538 INFO  (TEST-TestRandomRequestDistribution.testRequestTracking-seed#[F34AEF95DCD41CE0]) [    ] o.a.s.c.c.ConnectionManager Client is connected to ZooKeeper
   [junit4]   2> 335538 INFO  (TEST-TestRandomRequestDistribution.testRequestTracking-seed#[F34AEF95DCD41CE0]) [    ] o.a.s.c.c.SolrZkClient Using default ZkACLProvider
   [junit4]   2> 335541 INFO  (OverseerStateUpdate-94416925615259652-127.0.0.1:42608_nq_ch-n_0000000000) [n:127.0.0.1:42608_nq_ch    ] o.a.s.c.Overseer processMessage: queueSize: 1, message = {
   [junit4]   2>   "operation":"create",
   [junit4]   2>   "name":"collection1",
   [junit4]   2>   "numShards":"2",
   [junit4]   2>   "stateFormat":"2"} current state version: 2
   [junit4]   2> 335541 INFO  (OverseerStateUpdate-94416925615259652-127.0.0.1:42608_nq_ch-n_0000000000) [n:127.0.0.1:42608_nq_ch    ] o.a.s.c.o.ClusterStateMutator building a new cName: collection1
   [junit4]   2> 335580 INFO  (coreZkRegister-1541-thread-1-processing-n:127.0.0.1:42608_nq_ch x:collection1 s:shard1 c:control_collection r:core_node1) [n:127.0.0.1:42608_nq_ch c:control_collection s:shard1 r:core_node1 x:collection1] o.a.s.c.ZkController We are http://127.0.0.1:42608/nq_ch/collection1/ and leader is http://127.0.0.1:42608/nq_ch/collection1/
   [junit4]   2> 335580 INFO  (coreZkRegister-1541-thread-1-processing-n:127.0.0.1:42608_nq_ch x:collection1 s:shard1 c:control_collection r:core_node1) [n:127.0.0.1:42608_nq_ch c:control_collection s:shard1 r:core_node1 x:collection1] o.a.s.c.ZkController No LogReplay needed for core=collection1 baseURL=http://127.0.0.1:42608/nq_ch
   [junit4]   2> 335581 INFO  (coreZkRegister-1541-thread-1-processing-n:127.0.0.1:42608_nq_ch x:collection1 s:shard1 c:control_collection r:core_node1) [n:127.0.0.1:42608_nq_ch c:control_collection s:shard1 r:core_node1 x:collection1] o.a.s.c.ZkController I am the leader, no recovery necessary
   [junit4]   2> 335581 INFO  (coreZkRegister-1541-thread-1-processing-n:127.0.0.1:42608_nq_ch x:collection1 s:shard1 c:control_collection r:core_node1) [n:127.0.0.1:42608_nq_ch c:control_collection s:shard1 r:core_node1 x:collection1] o.a.s.c.ZkController publishing state=active
   [junit4]   2> 335581 INFO  (coreZkRegister-1541-thread-1-processing-n:127.0.0.1:42608_nq_ch x:collection1 s:shard1 c:control_collection r:core_node1) [n:127.0.0.1:42608_nq_ch c:control_collection s:shard1 r:core_node1 x:collection1] o.a.s.c.ZkController numShards not found on descriptor - reading it from system property
   [junit4]   2> 335583 INFO  (OverseerStateUpdate-94416925615259652-127.0.0.1:42608_nq_ch-n_0000000000) [n:127.0.0.1:42608_nq_ch    ] o.a.s.c.Overseer processMessage: queueSize: 1, message = {
   [junit4]   2>   "core":"collection1",
   [junit4]   2>   "core_node_name":"core_node1",
   [junit4]   2>   "roles":null,
   [junit4]   2>   "base_url":"http://127.0.0.1:42608/nq_ch",
   [junit4]   2>   "node_name":"127.0.0.1:42608_nq_ch",
   [junit4]   2>   "numShards":"2",
   [junit4]   2>   "state":"active",
   [junit4]   2>   "shard":"shard1",
   [junit4]   2>   "collection":"control_collection",
   [junit4]   2>   "operation":"state"} current state version: 2
   [junit4]   2> 335584 INFO  (OverseerStateUpdate-94416925615259652-127.0.0.1:42608_nq_ch-n_0000000000) [n:127.0.0.1:42608_nq_ch    ] o.a.s.c.o.ReplicaMutator Update state numShards=2 message={
   [junit4]   2>   "core":"collection1",
   [junit4]   2>   "core_node_name":"core_node1",
   [junit4]   2>   "roles":null,
   [junit4]   2>   "base_url":"http://127.0.0.1:42608/nq_ch",
   [junit4]   2>   "node_name":"127.0.0.1:42608_nq_ch",
   [junit4]   2>   "numShards":"2",
   [junit4]   2>   "state":"active",
   [junit4]   2>   "shard":"shard1",
   [junit4]   2>   "collection":"control_collection",
   [junit4]   2>   "operation":"state"}
   [junit4]   2> 335584 INFO  (OverseerStateUpdate-94416925615259652-127.0.0.1:42608_nq_ch-n_0000000000) [n:127.0.0.1:42608_nq_ch    ] o.a.s.c.o.ZkStateWriter going to create_collection /collections/collection1/state.json
   [junit4]   2> 335610 INFO  (TEST-TestRandomRequestDistribution.testRequestTracking-seed#[F34AEF95DCD41CE0]) [    ] o.a.s.SolrTestCaseJ4 Writing core.properties file to /home/jenkins/workspace/Lucene-Solr-5.x-Linux/solr/build/solr-core/test/J1/temp/solr.cloud.TestRandomRequestDistribution_F34AEF95DCD41CE0-001/shard-1-001/cores/collection1
   [junit4]   2> 335611 INFO  (TEST-TestRandomRequestDistribution.testRequestTracking-seed#[F34AEF95DCD41CE0]) [    ] o.a.s.c.AbstractFullDistribZkTestBase create jetty 1 in directory /home/jenkins/workspace/Lucene-Solr-5.x-Linux/solr/build/solr-core/test/J1/temp/solr.cloud.TestRandomRequestDistribution_F34AEF95DCD41CE0-001/shard-1-001
   [junit4]   2> 335612 INFO  (TEST-TestRandomRequestDistribution.testRequestTracking-seed#[F34AEF95DCD41CE0]) [    ] o.e.j.s.Server jetty-9.2.13.v20150730
   [junit4]   2> 335613 INFO  (TEST-TestRandomRequestDistribution.testRequestTracking-seed#[F34AEF95DCD41CE0]) [    ] o.e.j.s.h.ContextHandler Started o.e.j.s.ServletContextHandler@1df0afe{/nq_ch,null,AVAILABLE}
   [junit4]   2> 335614 INFO  (TEST-TestRandomRequestDistribution.testRequestTracking-seed#[F34AEF95DCD41CE0]) [    ] o.e.j.s.ServerConnector Started ServerConnector@1c06af1{HTTP/1.1}{127.0.0.1:48083}
   [junit4]   2> 335614 INFO  (TEST-TestRandomRequestDistribution.testRequestTracking-seed#[F34AEF95DCD41CE0]) [    ] o.e.j.s.Server Started @337102ms
   [junit4]   2> 335614 INFO  (TEST-TestRandomRequestDistribution.testRequestTracking-seed#[F34AEF95DCD41CE0]) [    ] o.a.s.c.s.e.JettySolrRunner Jetty properties: {solr.data.dir=/home/jenkins/workspace/Lucene-Solr-5.x-Linux/solr/build/solr-core/test/J1/temp/solr.cloud.TestRandomRequestDistribution_F34AEF95DCD41CE0-001/tempDir-001/jetty1, solrconfig=solrconfig.xml, hostContext=/nq_ch, hostPort=48083, coreRootDirectory=/home/jenkins/workspace/Lucene-Solr-5.x-Linux/solr/build/solr-core/test/J1/temp/solr.cloud.TestRandomRequestDistribution_F34AEF95DCD41CE0-001/shard-1-001/cores}
   [junit4]   2> 335614 INFO  (TEST-TestRandomRequestDistribution.testRequestTracking-seed#[F34AEF95DCD41CE0]) [    ] o.a.s.s.SolrDispatchFilter SolrDispatchFilter.init(): sun.misc.Launcher$AppClassLoader@e2f2a
   [junit4]   2> 335614 INFO  (TEST-TestRandomRequestDistribution.testRequestTracking-seed#[F34AEF95DCD41CE0]) [    ] o.a.s.c.SolrResourceLoader new SolrResourceLoader for directory: '/home/jenkins/workspace/Lucene-Solr-5.x-Linux/solr/build/solr-core/test/J1/temp/solr.cloud.TestRandomRequestDistribution_F34AEF95DCD41CE0-001/shard-1-001/'
   [junit4]   2> 335635 INFO  (TEST-TestRandomRequestDistribution.testRequestTracking-seed#[F34AEF95DCD41CE0]) [    ] o.a.s.c.c.SolrZkClient Using default ZkCredentialsProvider
   [junit4]   2> 335635 INFO  (TEST-TestRandomRequestDistribution.testRequestTracking-seed#[F34AEF95DCD41CE0]) [    ] o.a.s.c.c.ConnectionManager Waiting for client to connect to ZooKeeper
   [junit4]   2> 335636 INFO  (zkCallback-348-thread-1) [    ] o.a.s.c.c.ConnectionManager Watcher org.apache.solr.common.cloud.ConnectionManager@1769ab0 name:ZooKeeperConnection Watcher:127.0.0.1:44207/solr got event WatchedEvent state:SyncConnected type:None path:null path:null type:None
   [junit4]   2> 335637 INFO  (TEST-TestRandomRequestDistribution.testRequestTracking-seed#[F34AEF95DCD41CE0]) [    ] o.a.s.c.c.ConnectionManager Client is connected to ZooKeeper
   [junit4]   2> 335637 INFO  (TEST-TestRandomRequestDistribution.testRequestTracking-seed#[F34AEF95DCD41CE0]) [    ] o.a.s.c.c.SolrZkClient Using default ZkACLProvider
   [junit4]   2> 335638 INFO  (TEST-TestRandomRequestDistribution.testRequestTracking-seed#[F34AEF95DCD41CE0]) [    ] o.a.s.s.SolrDispatchFilter Loading solr.xml from SolrHome (not found in ZooKeeper)
   [junit4]   2> 335638 INFO  (TEST-TestRandomRequestDistribution.testRequestTracking-seed#[F34AEF95DCD41CE0]) [    ] o.a.s.c.SolrXmlConfig Loading container configuration from /home/jenkins/workspace/Lucene-Solr-5.x-Linux/solr/build/solr-core/test/J1/temp/solr.cloud.TestRandomRequestDistribution_F34AEF95DCD41CE0-001/shard-1-001/solr.xml
   [junit4]   2> 335649 INFO  (TEST-TestRandomRequestDistribution.testRequestTracking-seed#[F34AEF95DCD41CE0]) [    ] o.a.s.c.CoresLocator Config-defined core root directory: /home/jenkins/workspace/Lucene-Solr-5.x-Linux/solr/build/solr-core/test/J1/temp/solr.cloud.TestRandomRequestDistribution_F34AEF95DCD41CE0-001/shard-1-001/cores
   [junit4]   2> 335649 INFO  (TEST-TestRandomRequestDistribution.testRequestTracking-seed#[F34AEF95DCD41CE0]) [    ] o.a.s.c.CoreContainer New CoreContainer 13958661
   [junit4]   2> 335649 INFO  (TEST-TestRandomRequestDistribution.testRequestTracking-seed#[F34AEF95DCD41CE0]) [    ] o.a.s.c.CoreContainer Loading cores into CoreContainer [instanceDir=/home/jenkins/workspace/Lucene-Solr-5.x-Linux/solr/build/solr-core/test/J1/temp/solr.cloud.TestRandomRequestDistribution_F34AEF95DCD41CE0-001/shard-1-001/]
   [junit4]   2> 335649 INFO  (TEST-TestRandomRequestDistribution.testRequestTracking-seed#[F34AEF95DCD41CE0]) [    ] o.a.s.c.CoreContainer loading shared library: /home/jenkins/workspace/Lucene-Solr-5.x-Linux/solr/build/solr-core/test/J1/temp/solr.cloud.TestRandomRequestDistribution_F34AEF95DCD41CE0-001/shard-1-001/lib
   [junit4]   2> 335649 WARN  (TEST-TestRandomRequestDistribution.testRequestTracking-seed#[F34AEF95DCD41CE0]) [    ] o.a.s.c.SolrResourceLoader Can't find (or read) directory to add to classloader: lib (resolved as: /home/jenkins/workspace/Lucene-Solr-5.x-Linux/solr/build/solr-core/test/J1/temp/solr.cloud.TestRandomRequestDistribution_F34AEF95DCD41CE0-001/shard-1-001/lib).
   [junit4]   2> 335658 INFO  (TEST-TestRandomRequestDistribution.testRequestTracking-seed#[F34AEF95DCD41CE0]) [    ] o.a.s.h.c.HttpShardHandlerFactory created with socketTimeout : 90000,urlScheme : ,connTimeout : 15000,maxConnectionsPerHost : 20,maxConnections : 10000,corePoolSize : 0,maximumPoolSize : 2147483647,maxThreadIdleTime : 5,sizeOfQueue : -1,fairnessPolicy : false,useRetries : false,
   [junit4]   2> 335659 INFO  (TEST-TestRandomRequestDistribution.testRequestTracking-seed#[F34AEF95DCD41CE0]) [    ] o.a.s.u.UpdateShardHandler Creating UpdateShardHandler HTTP client with params: socketTimeout=340000&connTimeout=45000&retry=true
   [junit4]   2> 335660 INFO  (TEST-TestRandomRequestDistribution.testRequestTracking-seed#[F34AEF95DCD41CE0]) [    ] o.a.s.l.LogWatcher SLF4J impl is org.slf4j.impl.Log4jLoggerFactory
   [junit4]   2> 335660 INFO  (TEST-TestRandomRequestDistribution.testRequestTracking-seed#[F34AEF95DCD41CE0]) [    ] o.a.s.l.LogWatcher Registering Log Listener [Log4j (org.slf4j.impl.Log4jLoggerFactory)]
   [junit4]   2> 335660 INFO  (TEST-TestRandomRequestDistribution.testRequestTracking-seed#[F34AEF95DCD41CE0]) [    ] o.a.s.c.ZkContainer Zookeeper client=127.0.0.1:44207/solr
   [junit4]   2> 335660 INFO  (TEST-TestRandomRequestDistribution.testRequestTracking-seed#[F34AEF95DCD41CE0]) [    ] o.a.s.c.ZkController zkHost includes chroot
   [junit4]   2> 335660 INFO  (TEST-TestRandomRequestDistribution.testRequestTracking-seed#[F34AEF95DCD41CE0]) [    ] o.a.s.c.c.SolrZkClient Using default ZkCredentialsProvider
   [junit4]   2> 335661 INFO  (TEST-TestRandomRequestDistribution.testRequestTracking-seed#[F34AEF95DCD41CE0]) [    ] o.a.s.c.c.ConnectionManager Waiting for client to connect to ZooKeeper
   [junit4]   2> 335662 INFO  (zkCallback-350-thread-1) [    ] o.a.s.c.c.ConnectionManager Watcher org.apache.solr.common.cloud.ConnectionManager@f8e2a6 name:ZooKeeperConnection Watcher:127.0.0.1:44207 got event WatchedEvent state:SyncConnected type:None path:null path:null type:None
   [junit4]   2> 335662 INFO  (TEST-TestRandomRequestDistribution.testRequestTracking-seed#[F34AEF95DCD41CE0]) [    ] o.a.s.c.c.ConnectionManager Client is connected to ZooKeeper
   [junit4]   2> 335662 INFO  (TEST-TestRandomRequestDistribution.testRequestTracking-seed#[F34AEF95DCD41CE0]) [    ] o.a.s.c.c.SolrZkClient Using default ZkACLProvider
   [junit4]   2> 335666 INFO  (TEST-TestRandomRequestDistribution.testRequestTracking-seed#[F34AEF95DCD41CE0]) [n:127.0.0.1:48083_nq_ch    ] o.a.s.c.c.ConnectionManager Waiting for client to connect to ZooKeeper
   [junit4]   2> 335667 INFO  (zkCallback-351-thread-1-processing-n:127.0.0.1:48083_nq_ch) [n:127.0.0.1:48083_nq_ch    ] o.a.s.c.c.ConnectionManager Watcher org.apache.solr.common.cloud.ConnectionManager@26f00f name:ZooKeeperConnection Watcher:127.0.0.1:44207/solr got event WatchedEvent state:SyncConnected type:None path:null path:null type:None
   [junit4]   2> 335668 INFO  (TEST-TestRandomRequestDistribution.testRequestTracking-seed#[F34AEF95DCD41CE0]) [n:127.0.0.1:48083_nq_ch    ] o.a.s.c.c.ConnectionManager Client is connected to ZooKeeper
   [junit4]   2> 335672 INFO  (TEST-TestRandomRequestDistribution.testRequestTracking-seed#[F34AEF95DCD41CE0]) [n:127.0.0.1:48083_nq_ch    ] o.a.s.c.c.ZkStateReader Updating cluster state from ZooKeeper... 
   [junit4]   2> 335688 INFO  (zkCallback-346-thread-1) [    ] o.a.s.c.c.ZkStateReader A cluster state change: WatchedEvent state:SyncConnected type:NodeDataChanged path:/clusterstate.json, has occurred - updating... (live nodes size: 1)
   [junit4]   2> 335688 INFO  (zkCallback-344-thread-2-processing-n:127.0.0.1:42608_nq_ch) [n:127.0.0.1:42608_nq_ch    ] o.a.s.c.c.ZkStateReader A cluster state change: WatchedEvent state:SyncConnected type:NodeDataChanged path:/clusterstate.json, has occurred - updating... (live nodes size: 1)
   [junit4]   2> 335688 INFO  (zkCallback-351-thread-1-processing-n:127.0.0.1:48083_nq_ch) [n:127.0.0.1:48083_nq_ch    ] o.a.s.c.c.ZkStateReader A cluster state change: WatchedEvent state:SyncConnected type:NodeDataChanged path:/clusterstate.json, has occurred - updating... (live nodes size: 1)
   [junit4]   2> 336678 INFO  (TEST-TestRandomRequestDistribution.testRequestTracking-seed#[F34AEF95DCD41CE0]) [n:127.0.0.1:48083_nq_ch    ] o.a.s.c.ZkController Register node as live in ZooKeeper:/live_nodes/127.0.0.1:48083_nq_ch
   [junit4]   2> 336678 INFO  (TEST-TestRandomRequestDistribution.testRequestTracking-seed#[F34AEF95DCD41CE0]) [n:127.0.0.1:48083_nq_ch    ] o.a.s.c.c.SolrZkClient makePath: /live_nodes/127.0.0.1:48083_nq_ch
   [junit4]   2> 336680 INFO  (zkCallback-344-thread-2-processing-n:127.0.0.1:42608_nq_ch) [n:127.0.0.1:42608_nq_ch    ] o.a.s.c.c.ZkStateReader A live node change: WatchedEvent state:SyncConnected type:NodeChildrenChanged path:/live_nodes, has occurred - updating... (live nodes size: 1)
   [junit4]   2> 336680 INFO  (zkCallback-346-thread-1) [    ] o.a.s.c.c.ZkStateReader A live node change: WatchedEvent state:SyncConnected type:NodeChildrenChanged path:/live_nodes, has occurred - updating... (live nodes size: 1)
   [junit4]   2> 336680 INFO  (zkCallback-351-thread-1-processing-n:127.0.0.1:48083_nq_ch) [n:127.0.0.1:48083_nq_ch    ] o.a.s.c.c.ZkStateReader A live node change: WatchedEvent state:SyncConnected type:NodeChildrenChanged path:/live_nodes, has occurred - updating... (live nodes size: 1)
   [junit4]   2> 336680 INFO  (TEST-TestRandomRequestDistribution.testRequestTracking-seed#[F34AEF95DCD41CE0]) [n:127.0.0.1:48083_nq_ch    ] o.a.s.c.Overseer Overseer (id=null) closing
   [junit4]   2> 336681 INFO  (TEST-TestRandomRequestDistribution.testRequestTracking-seed#[F34AEF95DCD41CE0]) [n:127.0.0.1:48083_nq_ch    ] o.a.s.c.LeaderElector Joined leadership election with path: /overseer_elect/election/94416925615259657-127.0.0.1:48083_nq_ch-n_0000000001
   [junit4]   2> 336682 INFO  (TEST-TestRandomRequestDistribution.testRequestTracking-seed#[F34AEF95DCD41CE0]) [n:127.0.0.1:48083_nq_ch    ] o.a.s.c.LeaderElector Watching path /overseer_elect/election/94416925615259652-127.0.0.1:42608_nq_ch-n_0000000000 to know if I could be the leader
   [junit4]   2> 336723 INFO  (TEST-TestRandomRequestDistribution.testRequestTracking-seed#[F34AEF95DCD41CE0]) [n:127.0.0.1:48083_nq_ch    ] o.a.s.c.CoreContainer Security conf doesn't exist. Skipping setup for authorization module.
   [junit4]   2> 336724 INFO  (TEST-TestRandomRequestDistribution.testRequestTracking-seed#[F34AEF95DCD41CE0]) [n:127.0.0.1:48083_nq_ch    ] o.a.s.c.CoreContainer No authentication plugin used.
   [junit4]   2> 336725 INFO  (TEST-TestRandomRequestDistribution.testRequestTracking-seed#[F34AEF95DCD41CE0]) [n:127.0.0.1:48083_nq_ch    ] o.a.s.c.CoresLocator Looking for core definitions underneath /home/jenkins/workspace/Lucene-Solr-5.x-Linux/solr/build/solr-core/test/J1/temp/solr.cloud.TestRandomRequestDistribution_F34AEF95DCD41CE0-001/shard-1-001/cores
   [junit4]   2> 336726 INFO  (TEST-TestRandomRequestDistribution.testRequestTracking-seed#[F34AEF95DCD41CE0]) [n:127.0.0.1:48083_nq_ch    ] o.a.s.c.SolrCore Created CoreDescriptor: {name=collection1, config=solrconfig.xml, transient=false, schema=schema.xml, loadOnStartup=true, configSetProperties=configsetprops.json, instanceDir=/home/jenkins/workspace/Lucene-Solr-5.x-Linux/solr/build/solr-core/test/J1/temp/solr.cloud.TestRandomRequestDistribution_F34AEF95DCD41CE0-001/shard-1-001/cores/collection1, collection=collection1, absoluteInstDir=/home/jenkins/workspace/Lucene-Solr-5.x-Linux/solr/build/solr-core/test/J1/temp/solr.cloud.TestRandomRequestDistribution_F34AEF95DCD41CE0-001/shard-1-001/cores/collection1/, coreNodeName=, dataDir=data/, shard=}
   [junit4]   2> 336726 INFO  (TEST-TestRandomRequestDistribution.testRequestTracking-seed#[F34AEF95DCD41CE0]) [n:127.0.0.1:48083_nq_ch    ] o.a.s.c.CoresLocator Found core collection1 in /home/jenkins/workspace/Lucene-Solr-5.x-Linux/solr/build/solr-core/test/J1/temp/solr.cloud.TestRandomRequestDistribution_F34AEF95DCD41CE0-001/shard-1-001/cores/collection1/
   [junit4]   2> 336726 INFO  (TEST-TestRandomRequestDistribution.testRequestTracking-seed#[F34AEF95DCD41CE0]) [n:127.0.0.1:48083_nq_ch    ] o.a.s.c.CoresLocator Found 1 core definitions
   [junit4]   2> 336727 INFO  (TEST-TestRandomRequestDistribution.testRequestTracking-seed#[F34AEF95DCD41CE0]) [n:127.0.0.1:48083_nq_ch    ] o.a.s.s.SolrDispatchFilter user.dir=/home/jenkins/workspace/Lucene-Solr-5.x-Linux/solr/build/solr-core/test/J1
   [junit4]   2> 336728 INFO  (TEST-TestRandomRequestDistribution.testRequestTracking-seed#[F34AEF95DCD41CE0]) [n:127.0.0.1:48083_nq_ch    ] o.a.s.s.SolrDispatchFilter SolrDispatchFilter.init() done
   [junit4]   2> 336728 INFO  (coreLoadExecutor-1558-thread-1-processing-n:127.0.0.1:48083_nq_ch) [n:127.0.0.1:48083_nq_ch c:collection1   x:collection1] o.a.s.c.ZkController publishing state=down
   [junit4]   2> 336728 INFO  (coreLoadExecutor-1558-thread-1-processing-n:127.0.0.1:48083_nq_ch) [n:127.0.0.1:48083_nq_ch c:collection1   x:collection1] o.a.s.c.ZkController numShards not found on descriptor - reading it from system property
   [junit4]   2> 336729 INFO  (coreLoadExecutor-1558-thread-1-processing-n:127.0.0.1:48083_nq_ch) [n:127.0.0.1:48083_nq_ch c:collection1   x:collection1] o.a.s.c.ZkController Registering watch for external collection collection1
   [junit4]   2> 336730 INFO  (coreLoadExecutor-1558-thread-1-processing-n:127.0.0.1:48083_nq_ch) [n:127.0.0.1:48083_nq_ch c:collection1   x:collection1] o.a.s.c.c.ZkStateReader addZkWatch collection1
   [junit4]   2> 336730 INFO  (OverseerStateUpdate-94416925615259652-127.0.0.1:42608_nq_ch-n_0000000000) [n:127.0.0.1:42608_nq_ch    ] o.a.s.c.Overseer processMessage: queueSize: 1, message = {
   [junit4]   2>   "core":"collection1",
   [junit4]   2>   "roles":null,
   [junit4]   2>   "base_url":"http://127.0.0.1:48083/nq_ch",
   [junit4]   2>   "node_name":"127.0.0.1:48083_nq_ch",
   [junit4]   2>   "numShards":"2",
   [junit4]   2>   "state":"down",
   [junit4]   2>   "shard":null,
   [junit4]   2>   "collection":"collection1",
   [junit4]   2>   "operation":"state"} current state version: 3
   [junit4]   2> 336730 INFO  (coreLoadExecutor-1558-thread-1-processing-n:127.0.0.1:48083_nq_ch) [n:127.0.0.1:48083_nq_ch c:collection1   x:collection1] o.a.s.c.c.ZkStateReader Add data for collection1 ver 0 
   [junit4]   2> 336730 INFO  (coreLoadExecutor-1558-thread-1-processing-n:127.0.0.1:48083_nq_ch) [n:127.0.0.1:48083_nq_ch c:collection1   x:collection1] o.a.s.c.ZkController look for our core node name
   [junit4]   2> 336730 INFO  (OverseerStateUpdate-94416925615259652-127.0.0.1:42608_nq_ch-n_0000000000) [n:127.0.0.1:42608_nq_ch    ] o.a.s.c.o.ReplicaMutator Update state numShards=2 message={
   [junit4]   2>   "core":"collection1",
   [junit4]   2>   "roles":null,
   [junit4]   2>   "base_url":"http://127.0.0.1:48083/nq_ch",
   [junit4]   2>   "node_name":"127.0.0.1:48083_nq_ch",
   [junit4]   2>   "numShards":"2",
   [junit4]   2>   "state":"down",
   [junit4]   2>   "shard":null,
   [junit4]   2>   "collection":"collection1",
   [junit4]   2>   "operation":"state"}
   [junit4]   2> 336731 INFO  (OverseerStateUpdate-94416925615259652-127.0.0.1:42608_nq_ch-n_0000000000) [n:127.0.0.1:42608_nq_ch    ] o.a.s.c.o.ReplicaMutator Collection already exists with numShards=2
   [junit4]   2> 336731 INFO  (OverseerStateUpdate-94416925615259652-127.0.0.1:42608_nq_ch-n_0000000000) [n:127.0.0.1:42608_nq_ch    ] o.a.s.c.o.ReplicaMutator Assigning new node to shard shard=shard2
   [junit4]   2> 336834 INFO  (OverseerStateUpdate-94416925615259652-127.0.0.1:42608_nq_ch-n_0000000000) [n:127.0.0.1:42608_nq_ch    ] o.a.s.c.o.ZkStateWriter going to update_collection /collections/collection1/state.json version: 0
   [junit4]   2> 336834 INFO  (zkCallback-351-thread-1-processing-n:127.0.0.1:48083_nq_ch) [n:127.0.0.1:48083_nq_ch    ] o.a.s.c.c.ZkStateReader A cluster state change: WatchedEvent state:SyncConnected type:NodeDataChanged path:/collections/collection1/state.json for collection collection1 has occurred - updating... (live nodes size: 2)
   [junit4]   2> 336835 INFO  (zkCallback-351-thread-1-processing-n:127.0.0.1:48083_nq_ch) [n:127.0.0.1:48083_nq_ch    ] o.a.s.c.c.ZkStateReader Updating data for collection1 from 0 to 1 
   [junit4]   2> 337730 INFO  (coreLoadExecutor-1558-thread-1-processing-n:127.0.0.1:48083_nq_ch) [n:127.0.0.1:48083_nq_ch c:collection1   x:collection1] o.a.s.c.ZkController waiting to find shard id in clusterstate for collection1
   [junit4]   2> 337731 INFO  (coreLoadExecutor-1558-thread-1-processing-n:127.0.0.1:48083_nq_ch) [n:127.0.0.1:48083_nq_ch c:collection1   x:collection1] o.a.s.c.ZkController Check for collection zkNode:collection1
   [junit4]   2> 337731 INFO  (coreLoadExecutor-1558-thread-1-processing-n:127.0.0.1:48083_nq_ch) [n:127.0.0.1:48083_nq_ch c:collection1   x:collection1] o.a.s.c.ZkController Collection zkNode exists
   [junit4]   2> 337731 INFO  (coreLoadExecutor-1558-thread-1-processing-n:127.0.0.1:48083_nq_ch) [n:127.0.0.1:48083_nq_ch c:collection1   x:collection1] o.a.s.c.c.ZkStateReader Load collection config from:/collections/collection1
   [junit4]   2> 337732 INFO  (coreLoadExecutor-1558-thread-1-processing-n:127.0.0.1:48083_nq_ch) [n:127.0.0.1:48083_nq_ch c:collection1   x:collection1] o.a.s.c.c.ZkStateReader path=/collections/collection1 configName=conf1 specified config exists in ZooKeeper
   [junit4]   2> 337732 INFO  (coreLoadExecutor-1558-thread-1-processing-n:127.0.0.1:48083_nq_ch) [n:127.0.0.1:48083_nq_ch c:collection1   x:collection1] o.a.s.c.SolrResourceLoader new SolrResourceLoader for directory: '/home/jenkins/workspace/Lucene-Solr-5.x-Linux/solr/build/solr-core/test/J1/temp/solr.cloud.TestRandomRequestDistribution_F34AEF95DCD41CE0-001/shard-1-001/cores/collection1/'
   [junit4]   2> 337750 INFO  (coreLoadExecutor-1558-thread-1-processing-n:127.0.0.1:48083_nq_ch) [n:127.0.0.1:48083_nq_ch c:collection1   x:collection1] o.a.s.c.Config loaded config solrconfig.xml with version 0 
   [junit4]   2> 337756 INFO  (coreLoadExecutor-1558-thread-1-processing-n:127.0.0.1:48083_nq_ch) [n:127.0.0.1:48083_nq_ch c:collection1   x:collection1] o.a.s.c.SolrConfig current version of requestparams : -1
   [junit4]   2> 337765 INFO  (coreLoadExecutor-1558-thread-1-processing-n:127.0.0.1:48083_nq_ch) [n:127.0.0.1:48083_nq_ch c:collection1   x:collection1] o.a.s.c.SolrConfig Using Lucene MatchVersion: 5.4.0
   [junit4]   2> 337778 INFO  (coreLoadExecutor-1558-thread-1-processing-n:127.0.0.1:48083_nq_ch) [n:127.0.0.1:48083_nq_ch c:collection1   x:collection1] o.a.s.c.Config Loaded SolrConfig: solrconfig.xml
   [junit4]   2> 337780 INFO  (coreLoadExecutor-1558-thread-1-processing-n:127.0.0.1:48083_nq_ch) [n:127.0.0.1:48083_nq_ch c:collection1   x:collection1] o.a.s.s.IndexSchema Reading Solr Schema from /configs/conf1/schema.xml
   [junit4]   2> 337789 INFO  (coreLoadExecutor-1558-thread-1-processing-n:127.0.0.1:48083_nq_ch) [n:127.0.0.1:48083_nq_ch c:collection1   x:collection1] o.a.s.s.IndexSchema [collection1] Schema name=test
   [junit4]   2> 338045 INFO  (coreLoadExecutor-1558-thread-1-processing-n:127.0.0.1:48083_nq_ch) [n:127.0.0.1:48083_nq_ch c:collection1   x:collection1] o.a.s.s.OpenExchangeRatesOrgProvider Initialized with rates=open-exchange-rates.json, refreshInterval=1440.
   [junit4]   2> 338052 INFO  (coreLoadExecutor-1558-thread-1-processing-n:127.0.0.1:48083_nq_ch) [n:127.0.0.1:48083_nq_ch c:collection1   x:collection1] o.a.s.s.IndexSchema default search field in schema is text
   [junit4]   2> 338053 INFO  (coreLoadExecutor-1558-thread-1-processing-n:127.0.0.1:48083_nq_ch) [n:127.0.0.1:48083_nq_ch c:collection1   x:collection1] o.a.s.s.IndexSchema unique key field: id
   [junit4]   2> 338088 INFO  (coreLoadExecutor-1558-thread-1-processing-n:127.0.0.1:48083_nq_ch) [n:127.0.0.1:48083_nq_ch c:collection1   x:collection1] o.a.s.s.FileExchangeRateProvider Reloading exchange rates from file currency.xml
   [junit4]   2> 338091 INFO  (coreLoadExecutor-1558-thread-1-processing-n:127.0.0.1:48083_nq_ch) [n:127.0.0.1:48083_nq_ch c:collection1   x:collection1] o.a.s.s.FileExchangeRateProvider Reloading exchange rates from file currency.xml
   [junit4]   2> 338093 INFO  (coreLoadExecutor-1558-thread-1-processing-n:127.0.0.1:48083_nq_ch) [n:127.0.0.1:48083_nq_ch c:collection1   x:collection1] o.a.s.s.OpenExchangeRatesOrgProvider Reloading exch

[...truncated too long message...]

lse>>]
   [junit4]   2> 367075 INFO  (zkCallback-359-thread-2-processing-n:127.0.0.1:57933_nq_ch) [n:127.0.0.1:57933_nq_ch c:collection1 s:shard2 r:core_node3 x:collection1] o.a.s.c.CachingDirectoryFactory Closing directory: /home/jenkins/workspace/Lucene-Solr-5.x-Linux/solr/build/solr-core/test/J1/../../../../../../../../../home/jenkins/workspace/Lucene-Solr-5.x-Linux/solr/build/solr-core/test/J1/temp/solr.cloud.TestRandomRequestDistribution_F34AEF95DCD41CE0-001/shard-3-001/cores/collection1/data/index
   [junit4]   2> 367076 INFO  (zkCallback-359-thread-2-processing-n:127.0.0.1:57933_nq_ch) [n:127.0.0.1:57933_nq_ch c:collection1 s:shard2 r:core_node3 x:collection1] o.a.s.c.c.SolrZkClient makePath: /collections/collection1/leaders/shard2
   [junit4]   2> 367078 ERROR (zkCallback-359-thread-2-processing-n:127.0.0.1:57933_nq_ch) [n:127.0.0.1:57933_nq_ch c:collection1 s:shard2 r:core_node3 x:collection1] o.a.s.c.ShardLeaderElectionContext There was a problem trying to register as the leader:org.apache.solr.common.SolrException: Could not register as the leader because creating the ephemeral registration node in ZooKeeper failed
   [junit4]   2> 	at org.apache.solr.cloud.ShardLeaderElectionContextBase.runLeaderProcess(ElectionContext.java:149)
   [junit4]   2> 	at org.apache.solr.cloud.ShardLeaderElectionContext.runLeaderProcess(ElectionContext.java:316)
   [junit4]   2> 	at org.apache.solr.cloud.LeaderElector.runIamLeaderProcess(LeaderElector.java:199)
   [junit4]   2> 	at org.apache.solr.cloud.LeaderElector.checkIfIamLeader(LeaderElector.java:159)
   [junit4]   2> 	at org.apache.solr.cloud.LeaderElector.access$200(LeaderElector.java:56)
   [junit4]   2> 	at org.apache.solr.cloud.LeaderElector$ElectionWatcher.process(LeaderElector.java:390)
   [junit4]   2> 	at org.apache.solr.common.cloud.SolrZkClient$3$1.run(SolrZkClient.java:264)
   [junit4]   2> 	at java.util.concurrent.Executors$RunnableAdapter.call(Executors.java:511)
   [junit4]   2> 	at java.util.concurrent.FutureTask.run(FutureTask.java:266)
   [junit4]   2> 	at org.apache.solr.common.util.ExecutorUtil$MDCAwareThreadPoolExecutor$1.run(ExecutorUtil.java:210)
   [junit4]   2> 	at java.util.concurrent.ThreadPoolExecutor.runWorker(ThreadPoolExecutor.java:1142)
   [junit4]   2> 	at java.util.concurrent.ThreadPoolExecutor$Worker.run(ThreadPoolExecutor.java:617)
   [junit4]   2> 	at java.lang.Thread.run(Thread.java:745)
   [junit4]   2> Caused by: org.apache.zookeeper.KeeperException$SessionExpiredException: KeeperErrorCode = Session expired for /collections
   [junit4]   2> 	at org.apache.zookeeper.KeeperException.create(KeeperException.java:127)
   [junit4]   2> 	at org.apache.zookeeper.KeeperException.create(KeeperException.java:51)
   [junit4]   2> 	at org.apache.zookeeper.ZooKeeper.exists(ZooKeeper.java:1045)
   [junit4]   2> 	at org.apache.solr.common.cloud.SolrZkClient$4.execute(SolrZkClient.java:294)
   [junit4]   2> 	at org.apache.solr.common.cloud.SolrZkClient$4.execute(SolrZkClient.java:291)
   [junit4]   2> 	at org.apache.solr.common.cloud.ZkCmdExecutor.retryOperation(ZkCmdExecutor.java:61)
   [junit4]   2> 	at org.apache.solr.common.cloud.SolrZkClient.exists(SolrZkClient.java:291)
   [junit4]   2> 	at org.apache.solr.common.cloud.SolrZkClient.makePath(SolrZkClient.java:486)
   [junit4]   2> 	at org.apache.solr.common.cloud.SolrZkClient.makePath(SolrZkClient.java:455)
   [junit4]   2> 	at org.apache.solr.common.cloud.SolrZkClient.makePath(SolrZkClient.java:442)
   [junit4]   2> 	at org.apache.solr.cloud.ShardLeaderElectionContextBase$1.execute(ElectionContext.java:141)
   [junit4]   2> 	at org.apache.solr.common.util.RetryUtil.retryOnThrowable(RetryUtil.java:31)
   [junit4]   2> 	at org.apache.solr.cloud.ShardLeaderElectionContextBase.runLeaderProcess(ElectionContext.java:137)
   [junit4]   2> 	... 12 more
   [junit4]   2> 
   [junit4]   2> 367081 INFO  (TEST-TestRandomRequestDistribution.testRequestTracking-seed#[F34AEF95DCD41CE0]) [    ] o.e.j.s.ServerConnector Stopped ServerConnector@52710{HTTP/1.1}{127.0.0.1:0}
   [junit4]   2> 367081 INFO  (TEST-TestRandomRequestDistribution.testRequestTracking-seed#[F34AEF95DCD41CE0]) [    ] o.e.j.s.h.ContextHandler Stopped o.e.j.s.ServletContextHandler@1c318ac{/nq_ch,null,UNAVAILABLE}
   [junit4]   2> 367082 INFO  (TEST-TestRandomRequestDistribution.testRequestTracking-seed#[F34AEF95DCD41CE0]) [n:127.0.0.1:57933_nq_ch c:b1x1 s:shard1 r:core_node1 x:b1x1_shard1_replica1] o.a.s.c.ZkTestServer connecting to 127.0.0.1:44207 44207
   [junit4]   2> 367089 INFO  (Thread-1559) [    ] o.a.s.c.ZkTestServer connecting to 127.0.0.1:44207 44207
   [junit4]   2> 367090 WARN  (Thread-1559) [    ] o.a.s.c.ZkTestServer Watch limit violations: 
   [junit4]   2> Maximum concurrent create/delete watches above limit:
   [junit4]   2> 
   [junit4]   2> 	5	/solr/aliases.json
   [junit4]   2> 	4	/solr/security.json
   [junit4]   2> 	4	/solr/configs/conf1
   [junit4]   2> 
   [junit4]   2> Maximum concurrent data watches above limit:
   [junit4]   2> 
   [junit4]   2> 	5	/solr/clusterstate.json
   [junit4]   2> 	3	/solr/collections/collection1/state.json
   [junit4]   2> 	2	/solr/collections/a1x2/state.json
   [junit4]   2> 
   [junit4]   2> Maximum concurrent children watches above limit:
   [junit4]   2> 
   [junit4]   2> 	5	/solr/live_nodes
   [junit4]   2> 	5	/solr/collections
   [junit4]   2> 	4	/solr/overseer/queue
   [junit4]   2> 	4	/solr/overseer/collection-queue-work
   [junit4]   2> 
   [junit4]   2> NOTE: reproduce with: ant test  -Dtestcase=TestRandomRequestDistribution -Dtests.method=testRequestTracking -Dtests.seed=F34AEF95DCD41CE0 -Dtests.multiplier=3 -Dtests.slow=true -Dtests.locale=fr_CH -Dtests.timezone=Africa/Timbuktu -Dtests.asserts=true -Dtests.file.encoding=UTF-8
   [junit4] FAILURE 33.5s J1 | TestRandomRequestDistribution.testRequestTracking <<<
   [junit4]    > Throwable #1: java.lang.AssertionError: Shard a1x2_shard1_replica2 received all 10 requests
   [junit4]    > 	at __randomizedtesting.SeedInfo.seed([F34AEF95DCD41CE0:BB76B65528DF0D76]:0)
   [junit4]    > 	at org.apache.solr.cloud.TestRandomRequestDistribution.testRequestTracking(TestRandomRequestDistribution.java:109)
   [junit4]    > 	at org.apache.solr.BaseDistributedSearchTestCase$ShardsRepeatRule$ShardsFixedStatement.callStatement(BaseDistributedSearchTestCase.java:963)
   [junit4]    > 	at org.apache.solr.BaseDistributedSearchTestCase$ShardsRepeatRule$ShardsStatement.evaluate(BaseDistributedSearchTestCase.java:938)
   [junit4]    > 	at java.lang.Thread.run(Thread.java:745)
   [junit4]   2> 367114 INFO  (SUITE-TestRandomRequestDistribution-seed#[F34AEF95DCD41CE0]-worker) [n:127.0.0.1:57933_nq_ch c:b1x1 s:shard1 r:core_node1 x:b1x1_shard1_replica1] o.a.s.SolrTestCaseJ4 ###deleteCore
   [junit4]   2> NOTE: leaving temporary files on disk at: /home/jenkins/workspace/Lucene-Solr-5.x-Linux/solr/build/solr-core/test/J1/temp/solr.cloud.TestRandomRequestDistribution_F34AEF95DCD41CE0-001
   [junit4]   2> Aug 27, 2015 3:06:25 PM com.carrotsearch.randomizedtesting.ThreadLeakControl checkThreadLeaks
   [junit4]   2> WARNING: Will linger awaiting termination of 1 leaked thread(s).
   [junit4]   2> NOTE: test params are: codec=Asserting(Lucene53): {}, docValues:{}, sim=RandomSimilarityProvider(queryNorm=true,coord=yes): {}, locale=fr_CH, timezone=Africa/Timbuktu
   [junit4]   2> NOTE: Linux 3.19.0-26-generic i386/Oracle Corporation 1.8.0_60 (32-bit)/cpus=12,threads=1,free=51486664,total=171450368
   [junit4]   2> NOTE: All tests run in this JVM: [DateRangeFieldTest, QueryResultKeyTest, AnalyticsMergeStrategyTest, TestSolrCloudWithKerberosAlt, DeleteShardTest, TestImplicitCoreProperties, SolrTestCaseJ4Test, TestDistribIDF, TestRandomMergePolicy, DocumentBuilderTest, SpatialHeatmapFacetsTest, SpellCheckComponentTest, VersionInfoTest, TestCollationFieldDocValues, MinimalSchemaTest, FastVectorHighlighterTest, MBeansHandlerTest, DOMUtilTest, TestBlobHandler, RequestLoggingTest, TestRestManager, TestDFRSimilarityFactory, SimpleCollectionCreateDeleteTest, TestQueryUtils, TestNoOpRegenerator, TestHashQParserPlugin, PKIAuthenticationIntegrationTest, SolrIndexSplitterTest, SuggesterFSTTest, TestManagedSchemaFieldResource, TestSchemaSimilarityResource, TestJmxMonitoredMap, TestSurroundQueryParser, SolrPluginUtilsTest, TestRebalanceLeaders, WordBreakSolrSpellCheckerTest, TestReloadAndDeleteDocs, TestReplicaProperties, SoftAutoCommitTest, TestHighlightDedupGrouping, SolrIndexConfigTest, SpellCheckCollatorTest, TestCloudInspectUtil, TestMiniSolrCloudClusterSSL, NotRequiredUniqueKeyTest, TestAddFieldRealTimeGet, TestCrossCoreJoin, InfoHandlerTest, TestSerializedLuceneMatchVersion, TestRandomRequestDistribution]
   [junit4] Completed [129/536] on J1 in 34.29s, 1 test, 1 failure <<< FAILURES!

[...truncated 1291 lines...]
BUILD FAILED
/home/jenkins/workspace/Lucene-Solr-5.x-Linux/build.xml:785: The following error occurred while executing this line:
/home/jenkins/workspace/Lucene-Solr-5.x-Linux/build.xml:729: The following error occurred while executing this line:
/home/jenkins/workspace/Lucene-Solr-5.x-Linux/build.xml:59: The following error occurred while executing this line:
/home/jenkins/workspace/Lucene-Solr-5.x-Linux/solr/build.xml:233: The following error occurred while executing this line:
/home/jenkins/workspace/Lucene-Solr-5.x-Linux/solr/common-build.xml:524: The following error occurred while executing this line:
/home/jenkins/workspace/Lucene-Solr-5.x-Linux/lucene/common-build.xml:1452: The following error occurred while executing this line:
/home/jenkins/workspace/Lucene-Solr-5.x-Linux/lucene/common-build.xml:1006: There were test failures: 536 suites, 2128 tests, 1 failure, 70 ignored (34 assumptions)

Total time: 59 minutes 59 seconds
Build step 'Invoke Ant' marked build as failure
Archiving artifacts
[WARNINGS] Skipping publisher since build result is FAILURE
Recording test results
Email was triggered for: Failure - Any
Sending email for trigger: Failure - Any



Mime
View raw message