lucene-dev mailing list archives

Site index · List index
Message view « Date » · « Thread »
Top « Date » · « Thread »
From Steve Rowe <sar...@gmail.com>
Subject Re: [JENKINS] Lucene-Solr-NightlyTests-trunk - Build # 770 - Still Failing
Date Thu, 20 Aug 2015 15:10:15 GMT
https://issues.apache.org/jira/browse/LUCENE-6751

> On Aug 20, 2015, at 7:26 AM, Apache Jenkins Server <jenkins@builds.apache.org>
wrote:
> 
> Build: https://builds.apache.org/job/Lucene-Solr-NightlyTests-trunk/770/
> 
> 1 tests failed.
> REGRESSION:  org.apache.lucene.search.similarities.TestSimilarity2.testNoFieldSkew
> 
> Error Message:
> expected:<0.21697770059108734> but was:<0.0>
> 
> Stack Trace:
> java.lang.AssertionError: expected:<0.21697770059108734> but was:<0.0>
> 	at __randomizedtesting.SeedInfo.seed([216F1F3C38561BEF:89FA6BFD1F67BF87]:0)
> 	at org.junit.Assert.fail(Assert.java:93)
> 	at org.junit.Assert.failNotEquals(Assert.java:647)
> 	at org.junit.Assert.assertEquals(Assert.java:443)
> 	at org.junit.Assert.assertEquals(Assert.java:512)
> 	at org.apache.lucene.search.similarities.TestSimilarity2.testNoFieldSkew(TestSimilarity2.java:198)
> 	at sun.reflect.NativeMethodAccessorImpl.invoke0(Native Method)
> 	at sun.reflect.NativeMethodAccessorImpl.invoke(NativeMethodAccessorImpl.java:62)
> 	at sun.reflect.DelegatingMethodAccessorImpl.invoke(DelegatingMethodAccessorImpl.java:43)
> 	at java.lang.reflect.Method.invoke(Method.java:497)
> 	at com.carrotsearch.randomizedtesting.RandomizedRunner.invoke(RandomizedRunner.java:1627)
> 	at com.carrotsearch.randomizedtesting.RandomizedRunner$6.evaluate(RandomizedRunner.java:836)
> 	at com.carrotsearch.randomizedtesting.RandomizedRunner$7.evaluate(RandomizedRunner.java:872)
> 	at com.carrotsearch.randomizedtesting.RandomizedRunner$8.evaluate(RandomizedRunner.java:886)
> 	at org.apache.lucene.util.TestRuleSetupTeardownChained$1.evaluate(TestRuleSetupTeardownChained.java:50)
> 	at org.apache.lucene.util.AbstractBeforeAfterRule$1.evaluate(AbstractBeforeAfterRule.java:46)
> 	at org.apache.lucene.util.TestRuleThreadAndTestName$1.evaluate(TestRuleThreadAndTestName.java:49)
> 	at org.apache.lucene.util.TestRuleIgnoreAfterMaxFailures$1.evaluate(TestRuleIgnoreAfterMaxFailures.java:65)
> 	at org.apache.lucene.util.TestRuleMarkFailure$1.evaluate(TestRuleMarkFailure.java:48)
> 	at com.carrotsearch.randomizedtesting.rules.StatementAdapter.evaluate(StatementAdapter.java:36)
> 	at com.carrotsearch.randomizedtesting.ThreadLeakControl$StatementRunner.run(ThreadLeakControl.java:365)
> 	at com.carrotsearch.randomizedtesting.ThreadLeakControl.forkTimeoutingTask(ThreadLeakControl.java:798)
> 	at com.carrotsearch.randomizedtesting.ThreadLeakControl$3.evaluate(ThreadLeakControl.java:458)
> 	at com.carrotsearch.randomizedtesting.RandomizedRunner.runSingleTest(RandomizedRunner.java:845)
> 	at com.carrotsearch.randomizedtesting.RandomizedRunner$3.evaluate(RandomizedRunner.java:747)
> 	at com.carrotsearch.randomizedtesting.RandomizedRunner$4.evaluate(RandomizedRunner.java:781)
> 	at com.carrotsearch.randomizedtesting.RandomizedRunner$5.evaluate(RandomizedRunner.java:792)
> 	at org.apache.lucene.util.AbstractBeforeAfterRule$1.evaluate(AbstractBeforeAfterRule.java:46)
> 	at com.carrotsearch.randomizedtesting.rules.StatementAdapter.evaluate(StatementAdapter.java:36)
> 	at org.apache.lucene.util.TestRuleStoreClassName$1.evaluate(TestRuleStoreClassName.java:42)
> 	at com.carrotsearch.randomizedtesting.rules.NoShadowingOrOverridesOnMethodsRule$1.evaluate(NoShadowingOrOverridesOnMethodsRule.java:39)
> 	at com.carrotsearch.randomizedtesting.rules.NoShadowingOrOverridesOnMethodsRule$1.evaluate(NoShadowingOrOverridesOnMethodsRule.java:39)
> 	at com.carrotsearch.randomizedtesting.rules.StatementAdapter.evaluate(StatementAdapter.java:36)
> 	at com.carrotsearch.randomizedtesting.rules.StatementAdapter.evaluate(StatementAdapter.java:36)
> 	at com.carrotsearch.randomizedtesting.rules.StatementAdapter.evaluate(StatementAdapter.java:36)
> 	at org.apache.lucene.util.TestRuleAssertionsRequired$1.evaluate(TestRuleAssertionsRequired.java:54)
> 	at org.apache.lucene.util.TestRuleMarkFailure$1.evaluate(TestRuleMarkFailure.java:48)
> 	at org.apache.lucene.util.TestRuleIgnoreAfterMaxFailures$1.evaluate(TestRuleIgnoreAfterMaxFailures.java:65)
> 	at org.apache.lucene.util.TestRuleIgnoreTestSuites$1.evaluate(TestRuleIgnoreTestSuites.java:55)
> 	at com.carrotsearch.randomizedtesting.rules.StatementAdapter.evaluate(StatementAdapter.java:36)
> 	at com.carrotsearch.randomizedtesting.ThreadLeakControl$StatementRunner.run(ThreadLeakControl.java:365)
> 	at java.lang.Thread.run(Thread.java:745)
> 
> 
> 
> 
> Build Log:
> [...truncated 1143 lines...]
>   [junit4] Suite: org.apache.lucene.search.similarities.TestSimilarity2
>   [junit4]   2> NOTE: download the large Jenkins line-docs file by running 'ant get-jenkins-line-docs'
in the lucene directory.
>   [junit4]   2> NOTE: reproduce with: ant test  -Dtestcase=TestSimilarity2 -Dtests.method=testNoFieldSkew
-Dtests.seed=216F1F3C38561BEF -Dtests.multiplier=2 -Dtests.nightly=true -Dtests.slow=true
-Dtests.linedocsfile=/x1/jenkins/lucene-data/enwiki.random.lines.txt -Dtests.locale=es_ES
-Dtests.timezone=America/Catamarca -Dtests.asserts=true -Dtests.file.encoding=UTF-8
>   [junit4] FAILURE 0.21s J0 | TestSimilarity2.testNoFieldSkew <<<
>   [junit4]    > Throwable #1: java.lang.AssertionError: expected:<0.21697770059108734>
but was:<0.0>
>   [junit4]    > 	at __randomizedtesting.SeedInfo.seed([216F1F3C38561BEF:89FA6BFD1F67BF87]:0)
>   [junit4]    > 	at org.apache.lucene.search.similarities.TestSimilarity2.testNoFieldSkew(TestSimilarity2.java:198)
>   [junit4]    > 	at java.lang.Thread.run(Thread.java:745)
>   [junit4]   2> NOTE: leaving temporary files on disk at: /x1/jenkins/jenkins-slave/workspace/Lucene-Solr-NightlyTests-trunk/lucene/build/core/test/J0/temp/lucene.search.similarities.TestSimilarity2_216F1F3C38561BEF-001
>   [junit4]   2> NOTE: test params are: codec=DummyCompressingStoredFields(storedFieldsFormat=CompressingStoredFieldsFormat(compressionMode=DUMMY,
chunkSize=16060, maxDocsPerChunk=1, blockSize=6), termVectorsFormat=CompressingTermVectorsFormat(compressionMode=DUMMY,
chunkSize=16060, blockSize=6)), sim=DefaultSimilarity, locale=es_ES, timezone=America/Catamarca
>   [junit4]   2> NOTE: Linux 3.13.0-52-generic amd64/Oracle Corporation 1.8.0_45 (64-bit)/cpus=4,threads=1,free=192996984,total=288882688
>   [junit4]   2> NOTE: All tests run in this JVM: [TestNewestSegment, TestIndexWriterOnJRECrash,
TestSizeBoundedForceMerge, TestLogMergePolicy, TestLockFactory, TestMaxPosition, TestNeverDelete,
TestMultiTermQueryRewrites, TestToken, TestIndexInput, TestDocValues, TestSimpleExplanationsOfNonMatches,
TestVirtualMethod, TestAllFilesHaveChecksumFooter, TestHighCompressionMode, TestFilterLeafReader,
TestHugeRamFile, TestSearcherManager, TestIndexWriterCommit, TestTrackingDirectoryWrapper,
Test4GBStoredFields, TestCachingCollector, TestIsCurrent, TestApproximationSearchEquivalence,
Test2BPostings, TestRoaringDocIdSet, TestIndexWriterFromReader, TestNumericDocValuesUpdates,
TestExitableDirectoryReader, TestTermScorer, TestDirectPacked, TestLazyProxSkipping, TestIndexWriterUnicode,
TestSimilarity2]
>   [junit4] Completed [229/401] on J0 in 0.58s, 8 tests, 1 failure <<< FAILURES!
> 
> [...truncated 591 lines...]
> BUILD FAILED
> /x1/jenkins/jenkins-slave/workspace/Lucene-Solr-NightlyTests-trunk/build.xml:782: The
following error occurred while executing this line:
> /x1/jenkins/jenkins-slave/workspace/Lucene-Solr-NightlyTests-trunk/build.xml:719: The
following error occurred while executing this line:
> /x1/jenkins/jenkins-slave/workspace/Lucene-Solr-NightlyTests-trunk/build.xml:59: The
following error occurred while executing this line:
> /x1/jenkins/jenkins-slave/workspace/Lucene-Solr-NightlyTests-trunk/lucene/build.xml:50:
The following error occurred while executing this line:
> /x1/jenkins/jenkins-slave/workspace/Lucene-Solr-NightlyTests-trunk/lucene/common-build.xml:1431:
The following error occurred while executing this line:
> /x1/jenkins/jenkins-slave/workspace/Lucene-Solr-NightlyTests-trunk/lucene/common-build.xml:986:
There were test failures: 401 suites, 3226 tests, 1 failure, 26 ignored (22 assumptions)
> 
> Total time: 73 minutes 42 seconds
> Build step 'Invoke Ant' marked build as failure
> Archiving artifacts
> No prior successful build to compare, so performing full copy of artifacts
> Recording test results
> Email was triggered for: Failure
> Sending email for trigger: Failure
> 
> 
> 
> ---------------------------------------------------------------------
> To unsubscribe, e-mail: dev-unsubscribe@lucene.apache.org
> For additional commands, e-mail: dev-help@lucene.apache.org


---------------------------------------------------------------------
To unsubscribe, e-mail: dev-unsubscribe@lucene.apache.org
For additional commands, e-mail: dev-help@lucene.apache.org


Mime
View raw message