lucene-dev mailing list archives

Site index · List index
Message view « Date » · « Thread »
Top « Date » · « Thread »
From Shalin Shekhar Mangar <shalinman...@gmail.com>
Subject Re: [JENKINS-EA] Lucene-Solr-trunk-Linux (32bit/jdk1.9.0-ea-b60) - Build # 13854 - Failure!
Date Fri, 14 Aug 2015 14:20:21 GMT
These failures are also likely due to SOLR-5756

On Fri, Aug 14, 2015 at 6:04 PM, Policeman Jenkins Server
<jenkins@thetaphi.de> wrote:
> Build: http://jenkins.thetaphi.de/job/Lucene-Solr-trunk-Linux/13854/
> Java: 32bit/jdk1.9.0-ea-b60 -server -XX:+UseSerialGC -Djava.locale.providers=JRE,SPI
>
> 1 tests failed.
> FAILED:  org.apache.solr.cloud.CollectionsAPIDistributedZkTest.test
>
> Error Message:
> Error from server at http://127.0.0.1:45554/_zsp/p: Could not fully remove collection: halfdeletedcollection2
>
> Stack Trace:
> org.apache.solr.client.solrj.impl.HttpSolrClient$RemoteSolrException: Error from server at http://127.0.0.1:45554/_zsp/p: Could not fully remove collection: halfdeletedcollection2
>         at __randomizedtesting.SeedInfo.seed([3B9EA98D5C3FBD18:B3CA9657F2C3D0E0]:0)
>         at org.apache.solr.client.solrj.impl.HttpSolrClient.executeMethod(HttpSolrClient.java:560)
>         at org.apache.solr.client.solrj.impl.HttpSolrClient.request(HttpSolrClient.java:234)
>         at org.apache.solr.client.solrj.impl.HttpSolrClient.request(HttpSolrClient.java:226)
>         at org.apache.solr.client.solrj.SolrClient.request(SolrClient.java:1220)
>         at org.apache.solr.cloud.CollectionsAPIDistributedZkTest.makeRequest(CollectionsAPIDistributedZkTest.java:302)
>         at org.apache.solr.cloud.CollectionsAPIDistributedZkTest.deleteCollectionWithDownNodes(CollectionsAPIDistributedZkTest.java:283)
>         at org.apache.solr.cloud.CollectionsAPIDistributedZkTest.test(CollectionsAPIDistributedZkTest.java:175)
>         at sun.reflect.NativeMethodAccessorImpl.invoke0(Native Method)
>         at sun.reflect.NativeMethodAccessorImpl.invoke(NativeMethodAccessorImpl.java:62)
>         at sun.reflect.DelegatingMethodAccessorImpl.invoke(DelegatingMethodAccessorImpl.java:43)
>         at java.lang.reflect.Method.invoke(Method.java:502)
>         at com.carrotsearch.randomizedtesting.RandomizedRunner.invoke(RandomizedRunner.java:1627)
>         at com.carrotsearch.randomizedtesting.RandomizedRunner$6.evaluate(RandomizedRunner.java:836)
>         at com.carrotsearch.randomizedtesting.RandomizedRunner$7.evaluate(RandomizedRunner.java:872)
>         at com.carrotsearch.randomizedtesting.RandomizedRunner$8.evaluate(RandomizedRunner.java:886)
>         at org.apache.solr.BaseDistributedSearchTestCase$ShardsRepeatRule$ShardsFixedStatement.callStatement(BaseDistributedSearchTestCase.java:963)
>         at org.apache.solr.BaseDistributedSearchTestCase$ShardsRepeatRule$ShardsStatement.evaluate(BaseDistributedSearchTestCase.java:938)
>         at com.carrotsearch.randomizedtesting.rules.SystemPropertiesRestoreRule$1.evaluate(SystemPropertiesRestoreRule.java:57)
>         at org.apache.lucene.util.TestRuleSetupTeardownChained$1.evaluate(TestRuleSetupTeardownChained.java:50)
>         at org.apache.lucene.util.AbstractBeforeAfterRule$1.evaluate(AbstractBeforeAfterRule.java:46)
>         at org.apache.lucene.util.TestRuleThreadAndTestName$1.evaluate(TestRuleThreadAndTestName.java:49)
>         at org.apache.lucene.util.TestRuleIgnoreAfterMaxFailures$1.evaluate(TestRuleIgnoreAfterMaxFailures.java:65)
>         at org.apache.lucene.util.TestRuleMarkFailure$1.evaluate(TestRuleMarkFailure.java:48)
>         at com.carrotsearch.randomizedtesting.rules.StatementAdapter.evaluate(StatementAdapter.java:36)
>         at com.carrotsearch.randomizedtesting.ThreadLeakControl$StatementRunner.run(ThreadLeakControl.java:365)
>         at com.carrotsearch.randomizedtesting.ThreadLeakControl.forkTimeoutingTask(ThreadLeakControl.java:798)
>         at com.carrotsearch.randomizedtesting.ThreadLeakControl$3.evaluate(ThreadLeakControl.java:458)
>         at com.carrotsearch.randomizedtesting.RandomizedRunner.runSingleTest(RandomizedRunner.java:845)
>         at com.carrotsearch.randomizedtesting.RandomizedRunner$3.evaluate(RandomizedRunner.java:747)
>         at com.carrotsearch.randomizedtesting.RandomizedRunner$4.evaluate(RandomizedRunner.java:781)
>         at com.carrotsearch.randomizedtesting.RandomizedRunner$5.evaluate(RandomizedRunner.java:792)
>         at com.carrotsearch.randomizedtesting.rules.StatementAdapter.evaluate(StatementAdapter.java:36)
>         at com.carrotsearch.randomizedtesting.rules.SystemPropertiesRestoreRule$1.evaluate(SystemPropertiesRestoreRule.java:57)
>         at org.apache.lucene.util.AbstractBeforeAfterRule$1.evaluate(AbstractBeforeAfterRule.java:46)
>         at com.carrotsearch.randomizedtesting.rules.StatementAdapter.evaluate(StatementAdapter.java:36)
>         at org.apache.lucene.util.TestRuleStoreClassName$1.evaluate(TestRuleStoreClassName.java:42)
>         at com.carrotsearch.randomizedtesting.rules.NoShadowingOrOverridesOnMethodsRule$1.evaluate(NoShadowingOrOverridesOnMethodsRule.java:39)
>         at com.carrotsearch.randomizedtesting.rules.NoShadowingOrOverridesOnMethodsRule$1.evaluate(NoShadowingOrOverridesOnMethodsRule.java:39)
>         at com.carrotsearch.randomizedtesting.rules.StatementAdapter.evaluate(StatementAdapter.java:36)
>         at com.carrotsearch.randomizedtesting.rules.StatementAdapter.evaluate(StatementAdapter.java:36)
>         at com.carrotsearch.randomizedtesting.rules.StatementAdapter.evaluate(StatementAdapter.java:36)
>         at org.apache.lucene.util.TestRuleAssertionsRequired$1.evaluate(TestRuleAssertionsRequired.java:54)
>         at org.apache.lucene.util.TestRuleMarkFailure$1.evaluate(TestRuleMarkFailure.java:48)
>         at org.apache.lucene.util.TestRuleIgnoreAfterMaxFailures$1.evaluate(TestRuleIgnoreAfterMaxFailures.java:65)
>         at org.apache.lucene.util.TestRuleIgnoreTestSuites$1.evaluate(TestRuleIgnoreTestSuites.java:55)
>         at com.carrotsearch.randomizedtesting.rules.StatementAdapter.evaluate(StatementAdapter.java:36)
>         at com.carrotsearch.randomizedtesting.ThreadLeakControl$StatementRunner.run(ThreadLeakControl.java:365)
>         at java.lang.Thread.run(Thread.java:745)
>
>
>
>
> Build Log:
> [...truncated 10450 lines...]
>    [junit4] Suite: org.apache.solr.cloud.CollectionsAPIDistributedZkTest
>    [junit4]   2> Creating dataDir: /home/jenkins/workspace/Lucene-Solr-trunk-Linux/solr/build/solr-core/test/J1/temp/solr.cloud.CollectionsAPIDistributedZkTest_3B9EA98D5C3FBD18-001/init-core-data-001
>    [junit4]   2> 829902 INFO  (SUITE-CollectionsAPIDistributedZkTest-seed#[3B9EA98D5C3FBD18]-worker) [    ] o.a.s.SolrTestCaseJ4 Randomized ssl (false) and clientAuth (false)
>    [junit4]   2> 829902 INFO  (SUITE-CollectionsAPIDistributedZkTest-seed#[3B9EA98D5C3FBD18]-worker) [    ] o.a.s.BaseDistributedSearchTestCase Setting hostContext system property: /_zsp/p
>    [junit4]   2> 829904 INFO  (TEST-CollectionsAPIDistributedZkTest.test-seed#[3B9EA98D5C3FBD18]) [    ] o.a.s.c.ZkTestServer STARTING ZK TEST SERVER
>    [junit4]   2> 829904 INFO  (Thread-2189) [    ] o.a.s.c.ZkTestServer client port:0.0.0.0/0.0.0.0:0
>    [junit4]   2> 829904 INFO  (Thread-2189) [    ] o.a.s.c.ZkTestServer Starting server
>    [junit4]   2> 830004 INFO  (TEST-CollectionsAPIDistributedZkTest.test-seed#[3B9EA98D5C3FBD18]) [    ] o.a.s.c.ZkTestServer start zk server on port:44077
>    [junit4]   2> 830004 INFO  (TEST-CollectionsAPIDistributedZkTest.test-seed#[3B9EA98D5C3FBD18]) [    ] o.a.s.c.c.SolrZkClient Using default ZkCredentialsProvider
>    [junit4]   2> 830005 INFO  (TEST-CollectionsAPIDistributedZkTest.test-seed#[3B9EA98D5C3FBD18]) [    ] o.a.s.c.c.ConnectionManager Waiting for client to connect to ZooKeeper
>    [junit4]   2> 830006 INFO  (zkCallback-835-thread-1) [    ] o.a.s.c.c.ConnectionManager Watcher org.apache.solr.common.cloud.ConnectionManager@be2b02 name:ZooKeeperConnection Watcher:127.0.0.1:44077 got event WatchedEvent state:SyncConnected type:None path:null path:null type:None
>    [junit4]   2> 830006 INFO  (TEST-CollectionsAPIDistributedZkTest.test-seed#[3B9EA98D5C3FBD18]) [    ] o.a.s.c.c.ConnectionManager Client is connected to ZooKeeper
>    [junit4]   2> 830006 INFO  (TEST-CollectionsAPIDistributedZkTest.test-seed#[3B9EA98D5C3FBD18]) [    ] o.a.s.c.c.SolrZkClient Using default ZkACLProvider
>    [junit4]   2> 830006 INFO  (TEST-CollectionsAPIDistributedZkTest.test-seed#[3B9EA98D5C3FBD18]) [    ] o.a.s.c.c.SolrZkClient makePath: /solr
>    [junit4]   2> 830007 INFO  (TEST-CollectionsAPIDistributedZkTest.test-seed#[3B9EA98D5C3FBD18]) [    ] o.a.s.c.c.SolrZkClient Using default ZkCredentialsProvider
>    [junit4]   2> 830008 INFO  (TEST-CollectionsAPIDistributedZkTest.test-seed#[3B9EA98D5C3FBD18]) [    ] o.a.s.c.c.ConnectionManager Waiting for client to connect to ZooKeeper
>    [junit4]   2> 830008 INFO  (zkCallback-836-thread-1) [    ] o.a.s.c.c.ConnectionManager Watcher org.apache.solr.common.cloud.ConnectionManager@156aaf0 name:ZooKeeperConnection Watcher:127.0.0.1:44077/solr got event WatchedEvent state:SyncConnected type:None path:null path:null type:None
>    [junit4]   2> 830008 INFO  (TEST-CollectionsAPIDistributedZkTest.test-seed#[3B9EA98D5C3FBD18]) [    ] o.a.s.c.c.ConnectionManager Client is connected to ZooKeeper
>    [junit4]   2> 830009 INFO  (TEST-CollectionsAPIDistributedZkTest.test-seed#[3B9EA98D5C3FBD18]) [    ] o.a.s.c.c.SolrZkClient Using default ZkACLProvider
>    [junit4]   2> 830009 INFO  (TEST-CollectionsAPIDistributedZkTest.test-seed#[3B9EA98D5C3FBD18]) [    ] o.a.s.c.c.SolrZkClient makePath: /collections/collection1
>    [junit4]   2> 830009 INFO  (TEST-CollectionsAPIDistributedZkTest.test-seed#[3B9EA98D5C3FBD18]) [    ] o.a.s.c.c.SolrZkClient makePath: /collections/collection1/shards
>    [junit4]   2> 830010 INFO  (TEST-CollectionsAPIDistributedZkTest.test-seed#[3B9EA98D5C3FBD18]) [    ] o.a.s.c.c.SolrZkClient makePath: /collections/control_collection
>    [junit4]   2> 830011 INFO  (TEST-CollectionsAPIDistributedZkTest.test-seed#[3B9EA98D5C3FBD18]) [    ] o.a.s.c.c.SolrZkClient makePath: /collections/control_collection/shards
>    [junit4]   2> 830011 INFO  (TEST-CollectionsAPIDistributedZkTest.test-seed#[3B9EA98D5C3FBD18]) [    ] o.a.s.c.AbstractZkTestCase put /home/jenkins/workspace/Lucene-Solr-trunk-Linux/solr/core/src/test-files/solr/collection1/conf/solrconfig-tlog.xml to /configs/conf1/solrconfig.xml
>    [junit4]   2> 830011 INFO  (TEST-CollectionsAPIDistributedZkTest.test-seed#[3B9EA98D5C3FBD18]) [    ] o.a.s.c.c.SolrZkClient makePath: /configs/conf1/solrconfig.xml
>    [junit4]   2> 830012 INFO  (TEST-CollectionsAPIDistributedZkTest.test-seed#[3B9EA98D5C3FBD18]) [    ] o.a.s.c.AbstractZkTestCase put /home/jenkins/workspace/Lucene-Solr-trunk-Linux/solr/core/src/test-files/solr/collection1/conf/schema.xml to /configs/conf1/schema.xml
>    [junit4]   2> 830012 INFO  (TEST-CollectionsAPIDistributedZkTest.test-seed#[3B9EA98D5C3FBD18]) [    ] o.a.s.c.c.SolrZkClient makePath: /configs/conf1/schema.xml
>    [junit4]   2> 830013 INFO  (TEST-CollectionsAPIDistributedZkTest.test-seed#[3B9EA98D5C3FBD18]) [    ] o.a.s.c.AbstractZkTestCase put /home/jenkins/workspace/Lucene-Solr-trunk-Linux/solr/core/src/test-files/solr/collection1/conf/solrconfig.snippet.randomindexconfig.xml to /configs/conf1/solrconfig.snippet.randomindexconfig.xml
>    [junit4]   2> 830013 INFO  (TEST-CollectionsAPIDistributedZkTest.test-seed#[3B9EA98D5C3FBD18]) [    ] o.a.s.c.c.SolrZkClient makePath: /configs/conf1/solrconfig.snippet.randomindexconfig.xml
>    [junit4]   2> 830014 INFO  (TEST-CollectionsAPIDistributedZkTest.test-seed#[3B9EA98D5C3FBD18]) [    ] o.a.s.c.AbstractZkTestCase put /home/jenkins/workspace/Lucene-Solr-trunk-Linux/solr/core/src/test-files/solr/collection1/conf/stopwords.txt to /configs/conf1/stopwords.txt
>    [junit4]   2> 830014 INFO  (TEST-CollectionsAPIDistributedZkTest.test-seed#[3B9EA98D5C3FBD18]) [    ] o.a.s.c.c.SolrZkClient makePath: /configs/conf1/stopwords.txt
>    [junit4]   2> 830014 INFO  (TEST-CollectionsAPIDistributedZkTest.test-seed#[3B9EA98D5C3FBD18]) [    ] o.a.s.c.AbstractZkTestCase put /home/jenkins/workspace/Lucene-Solr-trunk-Linux/solr/core/src/test-files/solr/collection1/conf/protwords.txt to /configs/conf1/protwords.txt
>    [junit4]   2> 830015 INFO  (TEST-CollectionsAPIDistributedZkTest.test-seed#[3B9EA98D5C3FBD18]) [    ] o.a.s.c.c.SolrZkClient makePath: /configs/conf1/protwords.txt
>    [junit4]   2> 830015 INFO  (TEST-CollectionsAPIDistributedZkTest.test-seed#[3B9EA98D5C3FBD18]) [    ] o.a.s.c.AbstractZkTestCase put /home/jenkins/workspace/Lucene-Solr-trunk-Linux/solr/core/src/test-files/solr/collection1/conf/currency.xml to /configs/conf1/currency.xml
>    [junit4]   2> 830015 INFO  (TEST-CollectionsAPIDistributedZkTest.test-seed#[3B9EA98D5C3FBD18]) [    ] o.a.s.c.c.SolrZkClient makePath: /configs/conf1/currency.xml
>    [junit4]   2> 830016 INFO  (TEST-CollectionsAPIDistributedZkTest.test-seed#[3B9EA98D5C3FBD18]) [    ] o.a.s.c.AbstractZkTestCase put /home/jenkins/workspace/Lucene-Solr-trunk-Linux/solr/core/src/test-files/solr/collection1/conf/enumsConfig.xml to /configs/conf1/enumsConfig.xml
>    [junit4]   2> 830016 INFO  (TEST-CollectionsAPIDistributedZkTest.test-seed#[3B9EA98D5C3FBD18]) [    ] o.a.s.c.c.SolrZkClient makePath: /configs/conf1/enumsConfig.xml
>    [junit4]   2> 830016 INFO  (TEST-CollectionsAPIDistributedZkTest.test-seed#[3B9EA98D5C3FBD18]) [    ] o.a.s.c.AbstractZkTestCase put /home/jenkins/workspace/Lucene-Solr-trunk-Linux/solr/core/src/test-files/solr/collection1/conf/open-exchange-rates.json to /configs/conf1/open-exchange-rates.json
>    [junit4]   2> 830017 INFO  (TEST-CollectionsAPIDistributedZkTest.test-seed#[3B9EA98D5C3FBD18]) [    ] o.a.s.c.c.SolrZkClient makePath: /configs/conf1/open-exchange-rates.json
>    [junit4]   2> 830017 INFO  (TEST-CollectionsAPIDistributedZkTest.test-seed#[3B9EA98D5C3FBD18]) [    ] o.a.s.c.AbstractZkTestCase put /home/jenkins/workspace/Lucene-Solr-trunk-Linux/solr/core/src/test-files/solr/collection1/conf/mapping-ISOLatin1Accent.txt to /configs/conf1/mapping-ISOLatin1Accent.txt
>    [junit4]   2> 830017 INFO  (TEST-CollectionsAPIDistributedZkTest.test-seed#[3B9EA98D5C3FBD18]) [    ] o.a.s.c.c.SolrZkClient makePath: /configs/conf1/mapping-ISOLatin1Accent.txt
>    [junit4]   2> 830018 INFO  (TEST-CollectionsAPIDistributedZkTest.test-seed#[3B9EA98D5C3FBD18]) [    ] o.a.s.c.AbstractZkTestCase put /home/jenkins/workspace/Lucene-Solr-trunk-Linux/solr/core/src/test-files/solr/collection1/conf/old_synonyms.txt to /configs/conf1/old_synonyms.txt
>    [junit4]   2> 830018 INFO  (TEST-CollectionsAPIDistributedZkTest.test-seed#[3B9EA98D5C3FBD18]) [    ] o.a.s.c.c.SolrZkClient makePath: /configs/conf1/old_synonyms.txt
>    [junit4]   2> 830019 INFO  (TEST-CollectionsAPIDistributedZkTest.test-seed#[3B9EA98D5C3FBD18]) [    ] o.a.s.c.AbstractZkTestCase put /home/jenkins/workspace/Lucene-Solr-trunk-Linux/solr/core/src/test-files/solr/collection1/conf/synonyms.txt to /configs/conf1/synonyms.txt
>    [junit4]   2> 830019 INFO  (TEST-CollectionsAPIDistributedZkTest.test-seed#[3B9EA98D5C3FBD18]) [    ] o.a.s.c.c.SolrZkClient makePath: /configs/conf1/synonyms.txt
>    [junit4]   2> 830020 INFO  (TEST-CollectionsAPIDistributedZkTest.test-seed#[3B9EA98D5C3FBD18]) [    ] o.a.s.c.c.SolrZkClient Using default ZkCredentialsProvider
>    [junit4]   2> 830020 INFO  (TEST-CollectionsAPIDistributedZkTest.test-seed#[3B9EA98D5C3FBD18]) [    ] o.a.s.c.c.ConnectionManager Waiting for client to connect to ZooKeeper
>    [junit4]   2> 830020 INFO  (zkCallback-837-thread-1) [    ] o.a.s.c.c.ConnectionManager Watcher org.apache.solr.common.cloud.ConnectionManager@ec8030 name:ZooKeeperConnection Watcher:127.0.0.1:44077 got event WatchedEvent state:SyncConnected type:None path:null path:null type:None
>    [junit4]   2> 830020 INFO  (TEST-CollectionsAPIDistributedZkTest.test-seed#[3B9EA98D5C3FBD18]) [    ] o.a.s.c.c.ConnectionManager Client is connected to ZooKeeper
>    [junit4]   2> 830021 INFO  (TEST-CollectionsAPIDistributedZkTest.test-seed#[3B9EA98D5C3FBD18]) [    ] o.a.s.c.c.SolrZkClient Using default ZkACLProvider
>    [junit4]   2> 830021 INFO  (TEST-CollectionsAPIDistributedZkTest.test-seed#[3B9EA98D5C3FBD18]) [    ] o.a.s.c.c.SolrZkClient makePath: /solr
>    [junit4]   2> 830021 INFO  (TEST-CollectionsAPIDistributedZkTest.test-seed#[3B9EA98D5C3FBD18]) [    ] o.a.s.c.c.SolrZkClient Using default ZkCredentialsProvider
>    [junit4]   2> 830022 INFO  (TEST-CollectionsAPIDistributedZkTest.test-seed#[3B9EA98D5C3FBD18]) [    ] o.a.s.c.c.ConnectionManager Waiting for client to connect to ZooKeeper
>    [junit4]   2> 830023 INFO  (zkCallback-838-thread-1) [    ] o.a.s.c.c.ConnectionManager Watcher org.apache.solr.common.cloud.ConnectionManager@18a72ca name:ZooKeeperConnection Watcher:127.0.0.1:44077/solr got event WatchedEvent state:SyncConnected type:None path:null path:null type:None
>    [junit4]   2> 830023 INFO  (TEST-CollectionsAPIDistributedZkTest.test-seed#[3B9EA98D5C3FBD18]) [    ] o.a.s.c.c.ConnectionManager Client is connected to ZooKeeper
>    [junit4]   2> 830023 INFO  (TEST-CollectionsAPIDistributedZkTest.test-seed#[3B9EA98D5C3FBD18]) [    ] o.a.s.c.c.SolrZkClient Using default ZkACLProvider
>    [junit4]   2> 830023 INFO  (TEST-CollectionsAPIDistributedZkTest.test-seed#[3B9EA98D5C3FBD18]) [    ] o.a.s.c.AbstractZkTestCase put /home/jenkins/workspace/Lucene-Solr-trunk-Linux/solr/core/src/test-files/solr/collection1/conf/solrconfig-tlog.xml to /configs/conf2/solrconfig.xml
>    [junit4]   2> 830023 INFO  (TEST-CollectionsAPIDistributedZkTest.test-seed#[3B9EA98D5C3FBD18]) [    ] o.a.s.c.c.SolrZkClient makePath: /configs/conf2/solrconfig.xml
>    [junit4]   2> 830024 INFO  (TEST-CollectionsAPIDistributedZkTest.test-seed#[3B9EA98D5C3FBD18]) [    ] o.a.s.c.AbstractZkTestCase put /home/jenkins/workspace/Lucene-Solr-trunk-Linux/solr/core/src/test-files/solr/collection1/conf/schema.xml to /configs/conf2/schema.xml
>    [junit4]   2> 830024 INFO  (TEST-CollectionsAPIDistributedZkTest.test-seed#[3B9EA98D5C3FBD18]) [    ] o.a.s.c.c.SolrZkClient makePath: /configs/conf2/schema.xml
>    [junit4]   2> 830025 INFO  (TEST-CollectionsAPIDistributedZkTest.test-seed#[3B9EA98D5C3FBD18]) [    ] o.a.s.c.AbstractZkTestCase put /home/jenkins/workspace/Lucene-Solr-trunk-Linux/solr/core/src/test-files/solr/collection1/conf/enumsConfig.xml to /configs/conf2/enumsConfig.xml
>    [junit4]   2> 830025 INFO  (TEST-CollectionsAPIDistributedZkTest.test-seed#[3B9EA98D5C3FBD18]) [    ] o.a.s.c.c.SolrZkClient makePath: /configs/conf2/enumsConfig.xml
>    [junit4]   2> 830026 INFO  (TEST-CollectionsAPIDistributedZkTest.test-seed#[3B9EA98D5C3FBD18]) [    ] o.a.s.c.AbstractZkTestCase put /home/jenkins/workspace/Lucene-Solr-trunk-Linux/solr/core/src/test-files/solr/collection1/conf/solrconfig.snippet.randomindexconfig.xml to /configs/conf2/solrconfig.snippet.randomindexconfig.xml
>    [junit4]   2> 830026 INFO  (TEST-CollectionsAPIDistributedZkTest.test-seed#[3B9EA98D5C3FBD18]) [    ] o.a.s.c.c.SolrZkClient makePath: /configs/conf2/solrconfig.snippet.randomindexconfig.xml
>    [junit4]   2> 830026 INFO  (TEST-CollectionsAPIDistributedZkTest.test-seed#[3B9EA98D5C3FBD18]) [    ] o.a.s.c.AbstractZkTestCase put /home/jenkins/workspace/Lucene-Solr-trunk-Linux/solr/core/src/test-files/solr/collection1/conf/stopwords.txt to /configs/conf2/stopwords.txt
>    [junit4]   2> 830027 INFO  (TEST-CollectionsAPIDistributedZkTest.test-seed#[3B9EA98D5C3FBD18]) [    ] o.a.s.c.c.SolrZkClient makePath: /configs/conf2/stopwords.txt
>    [junit4]   2> 830027 INFO  (TEST-CollectionsAPIDistributedZkTest.test-seed#[3B9EA98D5C3FBD18]) [    ] o.a.s.c.AbstractZkTestCase put /home/jenkins/workspace/Lucene-Solr-trunk-Linux/solr/core/src/test-files/solr/collection1/conf/protwords.txt to /configs/conf2/protwords.txt
>    [junit4]   2> 830027 INFO  (TEST-CollectionsAPIDistributedZkTest.test-seed#[3B9EA98D5C3FBD18]) [    ] o.a.s.c.c.SolrZkClient makePath: /configs/conf2/protwords.txt
>    [junit4]   2> 830028 INFO  (TEST-CollectionsAPIDistributedZkTest.test-seed#[3B9EA98D5C3FBD18]) [    ] o.a.s.c.AbstractZkTestCase put /home/jenkins/workspace/Lucene-Solr-trunk-Linux/solr/core/src/test-files/solr/collection1/conf/currency.xml to /configs/conf2/currency.xml
>    [junit4]   2> 830028 INFO  (TEST-CollectionsAPIDistributedZkTest.test-seed#[3B9EA98D5C3FBD18]) [    ] o.a.s.c.c.SolrZkClient makePath: /configs/conf2/currency.xml
>    [junit4]   2> 830028 INFO  (TEST-CollectionsAPIDistributedZkTest.test-seed#[3B9EA98D5C3FBD18]) [    ] o.a.s.c.AbstractZkTestCase put /home/jenkins/workspace/Lucene-Solr-trunk-Linux/solr/core/src/test-files/solr/collection1/conf/open-exchange-rates.json to /configs/conf2/open-exchange-rates.json
>    [junit4]   2> 830029 INFO  (TEST-CollectionsAPIDistributedZkTest.test-seed#[3B9EA98D5C3FBD18]) [    ] o.a.s.c.c.SolrZkClient makePath: /configs/conf2/open-exchange-rates.json
>    [junit4]   2> 830029 INFO  (TEST-CollectionsAPIDistributedZkTest.test-seed#[3B9EA98D5C3FBD18]) [    ] o.a.s.c.AbstractZkTestCase put /home/jenkins/workspace/Lucene-Solr-trunk-Linux/solr/core/src/test-files/solr/collection1/conf/mapping-ISOLatin1Accent.txt to /configs/conf2/mapping-ISOLatin1Accent.txt
>    [junit4]   2> 830029 INFO  (TEST-CollectionsAPIDistributedZkTest.test-seed#[3B9EA98D5C3FBD18]) [    ] o.a.s.c.c.SolrZkClient makePath: /configs/conf2/mapping-ISOLatin1Accent.txt
>    [junit4]   2> 830030 INFO  (TEST-CollectionsAPIDistributedZkTest.test-seed#[3B9EA98D5C3FBD18]) [    ] o.a.s.c.AbstractZkTestCase put /home/jenkins/workspace/Lucene-Solr-trunk-Linux/solr/core/src/test-files/solr/collection1/conf/old_synonyms.txt to /configs/conf2/old_synonyms.txt
>    [junit4]   2> 830030 INFO  (TEST-CollectionsAPIDistributedZkTest.test-seed#[3B9EA98D5C3FBD18]) [    ] o.a.s.c.c.SolrZkClient makePath: /configs/conf2/old_synonyms.txt
>    [junit4]   2> 830030 INFO  (TEST-CollectionsAPIDistributedZkTest.test-seed#[3B9EA98D5C3FBD18]) [    ] o.a.s.c.AbstractZkTestCase put /home/jenkins/workspace/Lucene-Solr-trunk-Linux/solr/core/src/test-files/solr/collection1/conf/synonyms.txt to /configs/conf2/synonyms.txt
>    [junit4]   2> 830031 INFO  (TEST-CollectionsAPIDistributedZkTest.test-seed#[3B9EA98D5C3FBD18]) [    ] o.a.s.c.c.SolrZkClient makePath: /configs/conf2/synonyms.txt
>    [junit4]   2> 830031 INFO  (TEST-CollectionsAPIDistributedZkTest.test-seed#[3B9EA98D5C3FBD18]) [    ] o.a.s.c.AbstractZkTestCase put /home/jenkins/workspace/Lucene-Solr-trunk-Linux/solr/core/src/test-files/solr/collection1/conf/elevate.xml to /configs/conf2/elevate.xml
>    [junit4]   2> 830031 INFO  (TEST-CollectionsAPIDistributedZkTest.test-seed#[3B9EA98D5C3FBD18]) [    ] o.a.s.c.c.SolrZkClient makePath: /configs/conf2/elevate.xml
>    [junit4]   2> 830105 INFO  (TEST-CollectionsAPIDistributedZkTest.test-seed#[3B9EA98D5C3FBD18]) [    ] o.a.s.SolrTestCaseJ4 Writing core.properties file to /home/jenkins/workspace/Lucene-Solr-trunk-Linux/solr/build/solr-core/test/J1/temp/solr.cloud.CollectionsAPIDistributedZkTest_3B9EA98D5C3FBD18-001/control-001/cores/collection1
>    [junit4]   2> 830107 INFO  (TEST-CollectionsAPIDistributedZkTest.test-seed#[3B9EA98D5C3FBD18]) [    ] o.e.j.s.Server jetty-9.2.11.v20150529
>    [junit4]   2> 830108 INFO  (TEST-CollectionsAPIDistributedZkTest.test-seed#[3B9EA98D5C3FBD18]) [    ] o.e.j.s.h.ContextHandler Started o.e.j.s.ServletContextHandler@16b16c6{/_zsp/p,null,AVAILABLE}
>    [junit4]   2> 830108 INFO  (TEST-CollectionsAPIDistributedZkTest.test-seed#[3B9EA98D5C3FBD18]) [    ] o.e.j.s.ServerConnector Started ServerConnector@1dbe759{HTTP/1.1}{127.0.0.1:54920}
>    [junit4]   2> 830108 INFO  (TEST-CollectionsAPIDistributedZkTest.test-seed#[3B9EA98D5C3FBD18]) [    ] o.e.j.s.Server Started @831841ms
>    [junit4]   2> 830109 INFO  (TEST-CollectionsAPIDistributedZkTest.test-seed#[3B9EA98D5C3FBD18]) [    ] o.a.s.c.s.e.JettySolrRunner Jetty properties: {solr.data.dir=/home/jenkins/workspace/Lucene-Solr-trunk-Linux/solr/build/solr-core/test/J1/temp/solr.cloud.CollectionsAPIDistributedZkTest_3B9EA98D5C3FBD18-001/tempDir-001/control/data, hostContext=/_zsp/p, hostPort=54920, coreRootDirectory=/home/jenkins/workspace/Lucene-Solr-trunk-Linux/solr/build/solr-core/test/J1/../../../../../../../../../home/jenkins/workspace/Lucene-Solr-trunk-Linux/solr/build/solr-core/test/J1/temp/solr.cloud.CollectionsAPIDistributedZkTest_3B9EA98D5C3FBD18-001/control-001/cores}
>    [junit4]   2> 830109 INFO  (TEST-CollectionsAPIDistributedZkTest.test-seed#[3B9EA98D5C3FBD18]) [    ] o.a.s.s.SolrDispatchFilter SolrDispatchFilter.init(): sun.misc.Launcher$AppClassLoader@19ebb3d
>    [junit4]   2> 830109 INFO  (TEST-CollectionsAPIDistributedZkTest.test-seed#[3B9EA98D5C3FBD18]) [    ] o.a.s.c.SolrResourceLoader new SolrResourceLoader for directory: '/home/jenkins/workspace/Lucene-Solr-trunk-Linux/solr/build/solr-core/test/J1/../../../../../../../../../home/jenkins/workspace/Lucene-Solr-trunk-Linux/solr/build/solr-core/test/J1/temp/solr.cloud.CollectionsAPIDistributedZkTest_3B9EA98D5C3FBD18-001/control-001/'
>    [junit4]   2> 830118 INFO  (TEST-CollectionsAPIDistributedZkTest.test-seed#[3B9EA98D5C3FBD18]) [    ] o.a.s.c.c.SolrZkClient Using default ZkCredentialsProvider
>    [junit4]   2> 830118 INFO  (TEST-CollectionsAPIDistributedZkTest.test-seed#[3B9EA98D5C3FBD18]) [    ] o.a.s.c.c.ConnectionManager Waiting for client to connect to ZooKeeper
>    [junit4]   2> 830119 INFO  (zkCallback-839-thread-1) [    ] o.a.s.c.c.ConnectionManager Watcher org.apache.solr.common.cloud.ConnectionManager@1ae6537 name:ZooKeeperConnection Watcher:127.0.0.1:44077/solr got event WatchedEvent state:SyncConnected type:None path:null path:null type:None
>    [junit4]   2> 830119 INFO  (TEST-CollectionsAPIDistributedZkTest.test-seed#[3B9EA98D5C3FBD18]) [    ] o.a.s.c.c.ConnectionManager Client is connected to ZooKeeper
>    [junit4]   2> 830119 INFO  (TEST-CollectionsAPIDistributedZkTest.test-seed#[3B9EA98D5C3FBD18]) [    ] o.a.s.c.c.SolrZkClient Using default ZkACLProvider
>    [junit4]   2> 830120 INFO  (TEST-CollectionsAPIDistributedZkTest.test-seed#[3B9EA98D5C3FBD18]) [    ] o.a.s.s.SolrDispatchFilter Loading solr.xml from SolrHome (not found in ZooKeeper)
>    [junit4]   2> 830120 INFO  (TEST-CollectionsAPIDistributedZkTest.test-seed#[3B9EA98D5C3FBD18]) [    ] o.a.s.c.SolrXmlConfig Loading container configuration from /home/jenkins/workspace/Lucene-Solr-trunk-Linux/solr/build/solr-core/test/J1/../../../../../../../../../home/jenkins/workspace/Lucene-Solr-trunk-Linux/solr/build/solr-core/test/J1/temp/solr.cloud.CollectionsAPIDistributedZkTest_3B9EA98D5C3FBD18-001/control-001/solr.xml
>    [junit4]   2> 830144 INFO  (TEST-CollectionsAPIDistributedZkTest.test-seed#[3B9EA98D5C3FBD18]) [    ] o.a.s.c.CoresLocator Config-defined core root directory: /home/jenkins/workspace/Lucene-Solr-trunk-Linux/solr/build/solr-core/test/J1/../../../../../../../../../home/jenkins/workspace/Lucene-Solr-trunk-Linux/solr/build/solr-core/test/J1/temp/solr.cloud.CollectionsAPIDistributedZkTest_3B9EA98D5C3FBD18-001/control-001/cores
>    [junit4]   2> 830144 INFO  (TEST-CollectionsAPIDistributedZkTest.test-seed#[3B9EA98D5C3FBD18]) [    ] o.a.s.c.CoreContainer New CoreContainer 12587294
>    [junit4]   2> 830145 INFO  (TEST-CollectionsAPIDistributedZkTest.test-seed#[3B9EA98D5C3FBD18]) [    ] o.a.s.c.CoreContainer Loading cores into CoreContainer [instanceDir=/home/jenkins/workspace/Lucene-Solr-trunk-Linux/solr/build/solr-core/test/J1/../../../../../../../../../home/jenkins/workspace/Lucene-Solr-trunk-Linux/solr/build/solr-core/test/J1/temp/solr.cloud.CollectionsAPIDistributedZkTest_3B9EA98D5C3FBD18-001/control-001/]
>    [junit4]   2> 830145 INFO  (TEST-CollectionsAPIDistributedZkTest.test-seed#[3B9EA98D5C3FBD18]) [    ] o.a.s.c.CoreContainer loading shared library: /home/jenkins/workspace/Lucene-Solr-trunk-Linux/solr/build/solr-core/test/J1/../../../../../../../../../home/jenkins/workspace/Lucene-Solr-trunk-Linux/solr/build/solr-core/test/J1/temp/solr.cloud.CollectionsAPIDistributedZkTest_3B9EA98D5C3FBD18-001/control-001/lib
>    [junit4]   2> 830145 WARN  (TEST-CollectionsAPIDistributedZkTest.test-seed#[3B9EA98D5C3FBD18]) [    ] o.a.s.c.SolrResourceLoader Can't find (or read) directory to add to classloader: lib (resolved as: /home/jenkins/workspace/Lucene-Solr-trunk-Linux/solr/build/solr-core/test/J1/../../../../../../../../../home/jenkins/workspace/Lucene-Solr-trunk-Linux/solr/build/solr-core/test/J1/temp/solr.cloud.CollectionsAPIDistributedZkTest_3B9EA98D5C3FBD18-001/control-001/lib).
>    [junit4]   2> 830151 INFO  (TEST-CollectionsAPIDistributedZkTest.test-seed#[3B9EA98D5C3FBD18]) [    ] o.a.s.h.c.HttpShardHandlerFactory created with socketTimeout : 90000,urlScheme : ,connTimeout : 15000,maxConnectionsPerHost : 20,maxConnections : 10000,corePoolSize : 0,maximumPoolSize : 2147483647,maxThreadIdleTime : 5,sizeOfQueue : -1,fairnessPolicy : false,useRetries : false,
>    [junit4]   2> 830152 INFO  (TEST-CollectionsAPIDistributedZkTest.test-seed#[3B9EA98D5C3FBD18]) [    ] o.a.s.u.UpdateShardHandler Creating UpdateShardHandler HTTP client with params: socketTimeout=340000&connTimeout=45000&retry=true
>    [junit4]   2> 830153 INFO  (TEST-CollectionsAPIDistributedZkTest.test-seed#[3B9EA98D5C3FBD18]) [    ] o.a.s.l.LogWatcher SLF4J impl is org.slf4j.impl.Log4jLoggerFactory
>    [junit4]   2> 830153 INFO  (TEST-CollectionsAPIDistributedZkTest.test-seed#[3B9EA98D5C3FBD18]) [    ] o.a.s.l.LogWatcher Registering Log Listener [Log4j (org.slf4j.impl.Log4jLoggerFactory)]
>    [junit4]   2> 830153 INFO  (TEST-CollectionsAPIDistributedZkTest.test-seed#[3B9EA98D5C3FBD18]) [    ] o.a.s.c.ZkContainer Zookeeper client=127.0.0.1:44077/solr
>    [junit4]   2> 830153 INFO  (TEST-CollectionsAPIDistributedZkTest.test-seed#[3B9EA98D5C3FBD18]) [    ] o.a.s.c.ZkController zkHost includes chroot
>    [junit4]   2> 830153 INFO  (TEST-CollectionsAPIDistributedZkTest.test-seed#[3B9EA98D5C3FBD18]) [    ] o.a.s.c.c.SolrZkClient Using default ZkCredentialsProvider
>    [junit4]   2> 830153 INFO  (TEST-CollectionsAPIDistributedZkTest.test-seed#[3B9EA98D5C3FBD18]) [    ] o.a.s.c.c.ConnectionManager Waiting for client to connect to ZooKeeper
>    [junit4]   2> 830154 INFO  (zkCallback-841-thread-1) [    ] o.a.s.c.c.ConnectionManager Watcher org.apache.solr.common.cloud.ConnectionManager@1a07261 name:ZooKeeperConnection Watcher:127.0.0.1:44077 got event WatchedEvent state:SyncConnected type:None path:null path:null type:None
>    [junit4]   2> 830154 INFO  (TEST-CollectionsAPIDistributedZkTest.test-seed#[3B9EA98D5C3FBD18]) [    ] o.a.s.c.c.ConnectionManager Client is connected to ZooKeeper
>    [junit4]   2> 830155 INFO  (TEST-CollectionsAPIDistributedZkTest.test-seed#[3B9EA98D5C3FBD18]) [    ] o.a.s.c.c.SolrZkClient Using default ZkACLProvider
>    [junit4]   2> 830155 INFO  (TEST-CollectionsAPIDistributedZkTest.test-seed#[3B9EA98D5C3FBD18]) [n:127.0.0.1:54920__zsp%2Fp    ] o.a.s.c.c.ConnectionManager Waiting for client to connect to ZooKeeper
>    [junit4]   2> 830156 INFO  (zkCallback-842-thread-1-processing-n:127.0.0.1:54920__zsp%2Fp) [n:127.0.0.1:54920__zsp%2Fp    ] o.a.s.c.c.ConnectionManager Watcher org.apache.solr.common.cloud.ConnectionManager@1a5deee name:ZooKeeperConnection Watcher:127.0.0.1:44077/solr got event WatchedEvent state:SyncConnected type:None path:null path:null type:None
>    [junit4]   2> 830156 INFO  (TEST-CollectionsAPIDistributedZkTest.test-seed#[3B9EA98D5C3FBD18]) [n:127.0.0.1:54920__zsp%2Fp    ] o.a.s.c.c.ConnectionManager Client is connected to ZooKeeper
>    [junit4]   2> 830156 INFO  (TEST-CollectionsAPIDistributedZkTest.test-seed#[3B9EA98D5C3FBD18]) [n:127.0.0.1:54920__zsp%2Fp    ] o.a.s.c.c.SolrZkClient makePath: /overseer/queue
>    [junit4]   2> 830157 INFO  (TEST-CollectionsAPIDistributedZkTest.test-seed#[3B9EA98D5C3FBD18]) [n:127.0.0.1:54920__zsp%2Fp    ] o.a.s.c.c.SolrZkClient makePath: /overseer/collection-queue-work
>    [junit4]   2> 830158 INFO  (TEST-CollectionsAPIDistributedZkTest.test-seed#[3B9EA98D5C3FBD18]) [n:127.0.0.1:54920__zsp%2Fp    ] o.a.s.c.c.SolrZkClient makePath: /overseer/collection-map-running
>    [junit4]   2> 830159 INFO  (TEST-CollectionsAPIDistributedZkTest.test-seed#[3B9EA98D5C3FBD18]) [n:127.0.0.1:54920__zsp%2Fp    ] o.a.s.c.c.SolrZkClient makePath: /overseer/collection-map-completed
>    [junit4]   2> 830159 INFO  (TEST-CollectionsAPIDistributedZkTest.test-seed#[3B9EA98D5C3FBD18]) [n:127.0.0.1:54920__zsp%2Fp    ] o.a.s.c.c.SolrZkClient makePath: /overseer/collection-map-failure
>    [junit4]   2> 830160 INFO  (TEST-CollectionsAPIDistributedZkTest.test-seed#[3B9EA98D5C3FBD18]) [n:127.0.0.1:54920__zsp%2Fp    ] o.a.s.c.c.SolrZkClient makePath: /live_nodes
>    [junit4]   2> 830161 INFO  (TEST-CollectionsAPIDistributedZkTest.test-seed#[3B9EA98D5C3FBD18]) [n:127.0.0.1:54920__zsp%2Fp    ] o.a.s.c.c.SolrZkClient makePath: /aliases.json
>    [junit4]   2> 830161 INFO  (TEST-CollectionsAPIDistributedZkTest.test-seed#[3B9EA98D5C3FBD18]) [n:127.0.0.1:54920__zsp%2Fp    ] o.a.s.c.c.SolrZkClient makePath: /clusterstate.json
>    [junit4]   2> 830161 INFO  (TEST-CollectionsAPIDistributedZkTest.test-seed#[3B9EA98D5C3FBD18]) [n:127.0.0.1:54920__zsp%2Fp    ] o.a.s.c.c.SolrZkClient makePath: /security.json
>    [junit4]   2> 830162 INFO  (TEST-CollectionsAPIDistributedZkTest.test-seed#[3B9EA98D5C3FBD18]) [n:127.0.0.1:54920__zsp%2Fp    ] o.a.s.c.ZkController Register node as live in ZooKeeper:/live_nodes/127.0.0.1:54920__zsp%2Fp
>    [junit4]   2> 830162 INFO  (TEST-CollectionsAPIDistributedZkTest.test-seed#[3B9EA98D5C3FBD18]) [n:127.0.0.1:54920__zsp%2Fp    ] o.a.s.c.c.SolrZkClient makePath: /live_nodes/127.0.0.1:54920__zsp%2Fp
>    [junit4]   2> 830163 INFO  (TEST-CollectionsAPIDistributedZkTest.test-seed#[3B9EA98D5C3FBD18]) [n:127.0.0.1:54920__zsp%2Fp    ] o.a.s.c.c.SolrZkClient makePath: /overseer_elect
>    [junit4]   2> 830163 INFO  (TEST-CollectionsAPIDistributedZkTest.test-seed#[3B9EA98D5C3FBD18]) [n:127.0.0.1:54920__zsp%2Fp    ] o.a.s.c.c.SolrZkClient makePath: /overseer_elect/election
>    [junit4]   2> 830164 INFO  (TEST-CollectionsAPIDistributedZkTest.test-seed#[3B9EA98D5C3FBD18]) [n:127.0.0.1:54920__zsp%2Fp    ] o.a.s.c.Overseer Overseer (id=null) closing
>    [junit4]   2> 830164 INFO  (TEST-CollectionsAPIDistributedZkTest.test-seed#[3B9EA98D5C3FBD18]) [n:127.0.0.1:54920__zsp%2Fp    ] o.a.s.c.LeaderElector Joined leadership election with path: /overseer_elect/election/94342668370182150-127.0.0.1:54920__zsp%2Fp-n_0000000000
>    [junit4]   2> 830164 INFO  (TEST-CollectionsAPIDistributedZkTest.test-seed#[3B9EA98D5C3FBD18]) [n:127.0.0.1:54920__zsp%2Fp    ] o.a.s.c.OverseerElectionContext I am going to be the leader 127.0.0.1:54920__zsp%2Fp
>    [junit4]   2> 830164 INFO  (TEST-CollectionsAPIDistributedZkTest.test-seed#[3B9EA98D5C3FBD18]) [n:127.0.0.1:54920__zsp%2Fp    ] o.a.s.c.c.SolrZkClient makePath: /overseer_elect/leader
>    [junit4]   2> 830165 INFO  (TEST-CollectionsAPIDistributedZkTest.test-seed#[3B9EA98D5C3FBD18]) [n:127.0.0.1:54920__zsp%2Fp    ] o.a.s.c.Overseer Overseer (id=94342668370182150-127.0.0.1:54920__zsp%2Fp-n_0000000000) starting
>    [junit4]   2> 830165 INFO  (TEST-CollectionsAPIDistributedZkTest.test-seed#[3B9EA98D5C3FBD18]) [n:127.0.0.1:54920__zsp%2Fp    ] o.a.s.c.c.SolrZkClient makePath: /overseer/queue-work
>    [junit4]   2> 830167 INFO  (TEST-CollectionsAPIDistributedZkTest.test-seed#[3B9EA98D5C3FBD18]) [n:127.0.0.1:54920__zsp%2Fp    ] o.a.s.c.OverseerAutoReplicaFailoverThread Starting OverseerAutoReplicaFailoverThread autoReplicaFailoverWorkLoopDelay=10000 autoReplicaFailoverWaitAfterExpiration=10000 autoReplicaFailoverBadNodeExpiration=60000
>    [junit4]   2> 830167 INFO  (OverseerCollectionProcessor-94342668370182150-127.0.0.1:54920__zsp%2Fp-n_0000000000) [n:127.0.0.1:54920__zsp%2Fp    ] o.a.s.c.OverseerProcessor Process current queue of overseer operations
>    [junit4]   2> 830167 INFO  (TEST-CollectionsAPIDistributedZkTest.test-seed#[3B9EA98D5C3FBD18]) [n:127.0.0.1:54920__zsp%2Fp    ] o.a.s.c.c.ZkStateReader Updating cluster state from ZooKeeper...
>    [junit4]   2> 830167 INFO  (OverseerStateUpdate-94342668370182150-127.0.0.1:54920__zsp%2Fp-n_0000000000) [n:127.0.0.1:54920__zsp%2Fp    ] o.a.s.c.Overseer Starting to work on the main queue
>    [junit4]   2> 830184 INFO  (TEST-CollectionsAPIDistributedZkTest.test-seed#[3B9EA98D5C3FBD18]) [n:127.0.0.1:54920__zsp%2Fp    ] o.a.s.c.CoreContainer Security conf doesn't exist. Skipping setup for authorization module.
>    [junit4]   2> 830184 INFO  (TEST-CollectionsAPIDistributedZkTest.test-seed#[3B9EA98D5C3FBD18]) [n:127.0.0.1:54920__zsp%2Fp    ] o.a.s.c.CoreContainer No authentication plugin used.
>    [junit4]   2> 830185 INFO  (TEST-CollectionsAPIDistributedZkTest.test-seed#[3B9EA98D5C3FBD18]) [n:127.0.0.1:54920__zsp%2Fp    ] o.a.s.c.CoresLocator Looking for core definitions underneath /home/jenkins/workspace/Lucene-Solr-trunk-Linux/solr/build/solr-core/test/J1/../../../../../../../../../home/jenkins/workspace/Lucene-Solr-trunk-Linux/solr/build/solr-core/test/J1/temp/solr.cloud.CollectionsAPIDistributedZkTest_3B9EA98D5C3FBD18-001/control-001/cores
>    [junit4]   2> 830185 INFO  (TEST-CollectionsAPIDistributedZkTest.test-seed#[3B9EA98D5C3FBD18]) [n:127.0.0.1:54920__zsp%2Fp    ] o.a.s.c.SolrCore Created CoreDescriptor: {name=collection1, config=solrconfig.xml, transient=false, schema=schema.xml, loadOnStartup=true, configSetProperties=configsetprops.json, instanceDir=/home/jenkins/workspace/Lucene-Solr-trunk-Linux/solr/build/solr-core/test/J1/../../../../../../../../../home/jenkins/workspace/Lucene-Solr-trunk-Linux/solr/build/solr-core/test/J1/temp/solr.cloud.CollectionsAPIDistributedZkTest_3B9EA98D5C3FBD18-001/control-001/cores/collection1, collection=control_collection, absoluteInstDir=/home/jenkins/workspace/Lucene-Solr-trunk-Linux/solr/build/solr-core/test/J1/../../../../../../../../../home/jenkins/workspace/Lucene-Solr-trunk-Linux/solr/build/solr-core/test/J1/temp/solr.cloud.CollectionsAPIDistributedZkTest_3B9EA98D5C3FBD18-001/control-001/cores/collection1/, coreNodeName=, dataDir=data/, shard=}
>    [junit4]   2> 830185 INFO  (TEST-CollectionsAPIDistributedZkTest.test-seed#[3B9EA98D5C3FBD18]) [n:127.0.0.1:54920__zsp%2Fp    ] o.a.s.c.CoresLocator Found core collection1 in /home/jenkins/workspace/Lucene-Solr-trunk-Linux/solr/build/solr-core/test/J1/../../../../../../../../../home/jenkins/workspace/Lucene-Solr-trunk-Linux/solr/build/solr-core/test/J1/temp/solr.cloud.CollectionsAPIDistributedZkTest_3B9EA98D5C3FBD18-001/control-001/cores/collection1/
>    [junit4]   2> 830186 INFO  (TEST-CollectionsAPIDistributedZkTest.test-seed#[3B9EA98D5C3FBD18]) [n:127.0.0.1:54920__zsp%2Fp    ] o.a.s.c.CoresLocator Found 1 core definitions
>    [junit4]   2> 830186 INFO  (coreLoadExecutor-2846-thread-1-processing-n:127.0.0.1:54920__zsp%2Fp) [n:127.0.0.1:54920__zsp%2Fp c:control_collection   x:collection1] o.a.s.c.ZkController publishing state=down
>    [junit4]   2> 830186 INFO  (coreLoadExecutor-2846-thread-1-processing-n:127.0.0.1:54920__zsp%2Fp) [n:127.0.0.1:54920__zsp%2Fp c:control_collection   x:collection1] o.a.s.c.ZkController numShards not found on descriptor - reading it from system property
>    [junit4]   2> 830186 INFO  (TEST-CollectionsAPIDistributedZkTest.test-seed#[3B9EA98D5C3FBD18]) [n:127.0.0.1:54920__zsp%2Fp    ] o.a.s.s.SolrDispatchFilter user.dir=/home/jenkins/workspace/Lucene-Solr-trunk-Linux/solr/build/solr-core/test/J1
>    [junit4]   2> 830186 INFO  (TEST-CollectionsAPIDistributedZkTest.test-seed#[3B9EA98D5C3FBD18]) [n:127.0.0.1:54920__zsp%2Fp    ] o.a.s.s.SolrDispatchFilter SolrDispatchFilter.init() done
>    [junit4]   2> 830188 INFO  (coreLoadExecutor-2846-thread-1-processing-n:127.0.0.1:54920__zsp%2Fp) [n:127.0.0.1:54920__zsp%2Fp c:control_collection   x:collection1] o.a.s.c.ZkController look for our core node name
>    [junit4]   2> 830188 INFO  (zkCallback-842-thread-1-processing-n:127.0.0.1:54920__zsp%2Fp) [n:127.0.0.1:54920__zsp%2Fp    ] o.a.s.c.DistributedQueue NodeChildrenChanged fired on path /overseer/queue state SyncConnected
>    [junit4]   2> 830189 INFO  (OverseerStateUpdate-94342668370182150-127.0.0.1:54920__zsp%2Fp-n_0000000000) [n:127.0.0.1:54920__zsp%2Fp    ] o.a.s.c.Overseer processMessage: queueSize: 1, message = {
>    [junit4]   2>   "core":"collection1",
>    [junit4]   2>   "roles":null,
>    [junit4]   2>   "base_url":"http://127.0.0.1:54920/_zsp/p",
>    [junit4]   2>   "node_name":"127.0.0.1:54920__zsp%2Fp",
>    [junit4]   2>   "numShards":"1",
>    [junit4]   2>   "state":"down",
>    [junit4]   2>   "shard":null,
>    [junit4]   2>   "collection":"control_collection",
>    [junit4]   2>   "operation":"state"} current state version: 0
>    [junit4]   2> 830189 INFO  (OverseerStateUpdate-94342668370182150-127.0.0.1:54920__zsp%2Fp-n_0000000000) [n:127.0.0.1:54920__zsp%2Fp    ] o.a.s.c.o.ReplicaMutator Update state numShards=1 message={
>    [junit4]   2>   "core":"collection1",
>    [junit4]   2>   "roles":null,
>    [junit4]   2>   "base_url":"http://127.0.0.1:54920/_zsp/p",
>    [junit4]   2>   "node_name":"127.0.0.1:54920__zsp%2Fp",
>    [junit4]   2>   "numShards":"1",
>    [junit4]   2>   "state":"down",
>    [junit4]   2>   "shard":null,
>    [junit4]   2>   "collection":"control_collection",
>    [junit4]   2>   "operation":"state"}
>    [junit4]   2> 830189 INFO  (OverseerStateUpdate-94342668370182150-127.0.0.1:54920__zsp%2Fp-n_0000000000) [n:127.0.0.1:54920__zsp%2Fp    ] o.a.s.c.o.ClusterStateMutator building a new cName: control_collection
>    [junit4]   2> 830189 INFO  (OverseerStateUpdate-94342668370182150-127.0.0.1:54920__zsp%2Fp-n_0000000000) [n:127.0.0.1:54920__zsp%2Fp    ] o.a.s.c.o.ReplicaMutator Assigning new node to shard shard=shard1
>    [junit4]   2> 830189 INFO  (zkCallback-842-thread-1-processing-n:127.0.0.1:54920__zsp%2Fp) [n:127.0.0.1:54920__zsp%2Fp    ] o.a.s.c.c.ZkStateReader A cluster state change: WatchedEvent state:SyncConnected type:NodeDataChanged path:/clusterstate.json, has occurred - updating... (live nodes size: 1)
>    [junit4]   2> 831188 INFO  (coreLoadExecutor-2846-thread-1-processing-n:127.0.0.1:54920__zsp%2Fp) [n:127.0.0.1:54920__zsp%2Fp c:control_collection   x:collection1] o.a.s.c.ZkController waiting to find shard id in clusterstate for collection1
>    [junit4]   2> 831188 INFO  (coreLoadExecutor-2846-thread-1-processing-n:127.0.0.1:54920__zsp%2Fp) [n:127.0.0.1:54920__zsp%2Fp c:control_collection   x:collection1] o.a.s.c.ZkController Check for collection zkNode:control_collection
>    [junit4]   2> 831189 INFO  (coreLoadExecutor-2846-thread-1-processing-n:127.0.0.1:54920__zsp%2Fp) [n:127.0.0.1:54920__zsp%2Fp c:control_collection   x:collection1] o.a.s.c.ZkController Collection zkNode exists
>    [junit4]   2> 831189 INFO  (coreLoadExecutor-2846-thread-1-processing-n:127.0.0.1:54920__zsp%2Fp) [n:127.0.0.1:54920__zsp%2Fp c:control_collection   x:collection1] o.a.s.c.c.ZkStateReader Load collection config from:/collections/control_collection
>    [junit4]   2> 831189 INFO  (coreLoadExecutor-2846-thread-1-processing-n:127.0.0.1:54920__zsp%2Fp) [n:127.0.0.1:54920__zsp%2Fp c:control_collection   x:collection1] o.a.s.c.c.ZkStateReader path=/collections/control_collection configName=conf1 specified config exists in ZooKeeper
>    [junit4]   2> 831189 INFO  (coreLoadExecutor-2846-thread-1-processing-n:127.0.0.1:54920__zsp%2Fp) [n:127.0.0.1:54920__zsp%2Fp c:control_collection   x:collection1] o.a.s.c.SolrResourceLoader new SolrResourceLoader for directory: '/home/jenkins/workspace/Lucene-Solr-trunk-Linux/solr/build/solr-core/test/J1/../../../../../../../../../home/jenkins/workspace/Lucene-Solr-trunk-Linux/solr/build/solr-core/test/J1/temp/solr.cloud.CollectionsAPIDistributedZkTest_3B9EA98D5C3FBD18-001/control-001/cores/collection1/'
>    [junit4]   2> 831196 INFO  (coreLoadExecutor-2846-thread-1-processing-n:127.0.0.1:54920__zsp%2Fp) [n:127.0.0.1:54920__zsp%2Fp c:control_collection   x:collection1] o.a.s.c.Config loaded config solrconfig.xml with version 0
>    [junit4]   2> 831199 INFO  (coreLoadExecutor-2846-thread-1-processing-n:127.0.0.1:54920__zsp%2Fp) [n:127.0.0.1:54920__zsp%2Fp c:control_collection   x:collection1] o.a.s.c.SolrConfig current version of requestparams : -1
>    [junit4]   2> 831201 INFO  (coreLoadExecutor-2846-thread-1-processing-n:127.0.0.1:54920__zsp%2Fp) [n:127.0.0.1:54920__zsp%2Fp c:control_collection   x:collection1] o.a.s.c.SolrConfig Using Lucene MatchVersion: 6.0.0
>    [junit4]   2> 831206 INFO  (coreLoadExecutor-2846-thread-1-processing-n:127.0.0.1:54920__zsp%2Fp) [n:127.0.0.1:54920__zsp%2Fp c:control_collection   x:collection1] o.a.s.c.Config Loaded SolrConfig: solrconfig.xml
>    [junit4]   2> 831207 INFO  (coreLoadExecutor-2846-thread-1-processing-n:127.0.0.1:54920__zsp%2Fp) [n:127.0.0.1:54920__zsp%2Fp c:control_collection   x:collection1] o.a.s.s.IndexSchema Reading Solr Schema from /configs/conf1/schema.xml
>    [junit4]   2> 831210 INFO  (coreLoadExecutor-2846-thread-1-processing-n:127.0.0.1:54920__zsp%2Fp) [n:127.0.0.1:54920__zsp%2Fp c:control_collection   x:collection1] o.a.s.s.IndexSchema [collection1] Schema name=test
>    [junit4]   2> 831281 INFO  (coreLoadExecutor-2846-thread-1-processing-n:127.0.0.1:54920__zsp%2Fp) [n:127.0.0.1:54920__zsp%2Fp c:control_collection   x:collection1] o.a.s.s.OpenExchangeRatesOrgProvider Initialized with rates=open-exchange-rates.json, refreshInterval=1440.
>    [junit4]   2> 831284 INFO  (coreLoadExecutor-2846-thread-1-processing-n:127.0.0.1:54920__zsp%2Fp) [n:127.0.0.1:54920__zsp%2Fp c:control_collection   x:collection1] o.a.s.s.IndexSchema default search field in schema is text
>    [junit4]   2> 831285 INFO  (coreLoadExecutor-2846-thread-1-processing-n:127.0.0.1:54920__zsp%2Fp) [n:127.0.0.1:54920__zsp%2Fp c:control_collection   x:collection1] o.a.s.s.IndexSchema unique key field: id
>    [junit4]   2> 831289 INFO  (coreLoadExecutor-2846-thread-1-processing-n:127.0.0.1:54920__zsp%2Fp) [n:127.0.0.1:54920__zsp%2Fp c:control_collection   x:collection1] o.a.s.s.FileExchangeRateProvider Reloading exchange rates from file currency.xml
>    [junit4]   2> 831290 INFO  (coreLoadExecutor-2846-thread-1-processing-n:127.0.0.1:54920__zsp%2Fp) [n:127.0.0.1:54920__zsp%2Fp c:control_collection   x:collection1] o.a.s.s.FileExchangeRateProvider Reloading exchange rates from file currency.xml
>    [junit4]   2> 831291 INFO  (coreLoadExecutor-2846-thread-1-processing-n:127.0.0.1:54920__zsp%2Fp) [n:127.0.0.1:54920__zsp%2Fp c:control_collection   x:collection1] o.a.s.s.OpenExchangeRatesOrgProvider Reloading exchange rates from open-exchange-rates.json
>    [junit4]   2> 831292 WARN  (coreLoadExecutor-2846-thread-1-processing-n:127.0.0.1:54920__zsp%2Fp) [n:127.0.0.1:54920__zsp%2Fp c:control_collection   x:collection1] o.a.s.s.OpenExchangeRatesOrgProvider Unknown key IMPORTANT NOTE
>    [junit4]   2> 831292 WARN  (coreLoadExecutor-2846-thread-1-processing-n:127.0.0.1:54920__zsp%2Fp) [n:127.0.0.1:54920__zsp%2Fp c:control_collection   x:collection1] o.a.s.s.OpenExchangeRatesOrgProvider Expected key, got STRING
>    [junit4]   2> 831292 INFO  (coreLoadExecutor-2846-thread-1-processing-n:127.0.0.1:54920__zsp%2Fp) [n:127.0.0.1:54920__zsp%2Fp c:control_collection   x:collection1] o.a.s.s.OpenExchangeRatesOrgProvider Reloading exchange rates from open-exchange-rates.json
>    [junit4]   2> 831292 WARN  (coreLoadExecutor-2846-thread-1-processing-n:127.0.0.1:54920__zsp%2Fp) [n:127.0.0.1:54920__zsp%2Fp c:control_collection   x:collection1] o.a.s.s.OpenExchangeRatesOrgProvider Unknown key IMPORTANT NOTE
>    [junit4]   2> 831292 WARN  (coreLoadExecutor-2846-thread-1-processing-n:127.0.0.1:54920__zsp%2Fp) [n:127.0.0.1:54920__zsp%2Fp c:control_collection   x:collection1] o.a.s.s.OpenExchangeRatesOrgProvider Expected key, got STRING
>    [junit4]   2> 831293 INFO  (coreLoadExecutor-2846-thread-1-processing-n:127.0.0.1:54920__zsp%2Fp) [n:127.0.0.1:54920__zsp%2Fp c:control_collection   x:collection1] o.a.s.c.ConfigSetProperties Did not find ConfigSet properties, assuming default properties: Can't find resource 'configsetprops.json' in classpath or '/configs/conf1', cwd=/home/jenkins/workspace/Lucene-Solr-trunk-Linux/solr/build/solr-core/test/J1
>    [junit4]   2> 831293 INFO  (coreLoadExecutor-2846-thread-1-processing-n:127.0.0.1:54920__zsp%2Fp) [n:127.0.0.1:54920__zsp%2Fp c:control_collection   x:collection1] o.a.s.c.CoreContainer Creating SolrCore 'collection1' using configuration from collection control_collection
>    [junit4]   2> 831293 INFO  (coreLoadExecutor-2846-thread-1-processing-n:127.0.0.1:54920__zsp%2Fp) [n:127.0.0.1:54920__zsp%2Fp c:control_collection s:shard1 r:core_node1 x:collection1] o.a.s.c.SolrCore org.apache.solr.core.MockDirectoryFactory
>    [junit4]   2> 831293 INFO  (coreLoadExecutor-2846-thread-1-processing-n:127.0.0.1:54920__zsp%2Fp) [n:127.0.0.1:54920__zsp%2Fp c:control_collection s:shard1 r:core_node1 x:collection1] o.a.s.c.SolrCore [[collection1] ] Opening new SolrCore at [/home/jenkins/workspace/Lucene-Solr-trunk-Linux/solr/build/solr-core/test/J1/../../../../../../../../../home/jenkins/workspace/Lucene-Solr-trunk-Linux/solr/build/solr-core/test/J1/temp/solr.cloud.CollectionsAPIDistributedZkTest_3B9EA98D5C3FBD18-001/control-001/cores/collection1/], dataDir=[null]
>    [junit4]   2> 831293 INFO  (coreLoadExecutor-2846-thread-1-processing-n:127.0.0.1:54920__zsp%2Fp) [n:127.0.0.1:54920__zsp%2Fp c:control_collection s:shard1 r:core_node1 x:collection1] o.a.s.c.JmxMonitoredMap JMX monitoring is enabled. Adding Solr mbeans to JMX Server: com.sun.jmx.mbeanserver.JmxMBeanServer@a2346e
>    [junit4]   2> 831294 INFO  (coreLoadExecutor-2846-thread-1-processing-n:127.0.0.1:54920__zsp%2Fp) [n:127.0.0.1:54920__zsp%2Fp c:control_collection s:shard1 r:core_node1 x:collection1] o.a.s.c.CachingDirectoryFactory return new directory for /home/jenkins/workspace/Lucene-Solr-trunk-Linux/solr/build/solr-core/test/J1/../../../../../../../../../home/jenkins/workspace/Lucene-Solr-trunk-Linux/solr/build/solr-core/test/J1/temp/solr.cloud.CollectionsAPIDistributedZkTest_3B9EA98D5C3FBD18-001/control-001/cores/collection1/data
>    [junit4]   2> 831294 INFO  (coreLoadExecutor-2846-thread-1-processing-n:127.0.0.1:54920__zsp%2Fp) [n:127.0.0.1:54920__zsp%2Fp c:control_collection s:shard1 r:core_node1 x:collection1] o.a.s.c.SolrCore New index directory detected: old=null new=/home/jenkins/workspace/Lucene-Solr-trunk-Linux/solr/build/solr-core/test/J1/../../../../../../../../../home/jenkins/workspace/Lucene-Solr-trunk-Linux/solr/build/solr-core/test/J1/temp/solr.cloud.CollectionsAPIDistributedZkTest_3B9EA98D5C3FBD18-001/control-001/cores/collection1/data/index/
>    [junit4]   2> 831294 WARN  (coreLoadExecutor-2846-thread-1-processing-n:127.0.0.1:54920__zsp%2Fp) [n:127.0.0.1:54920__zsp%2Fp c:control_collection s:shard1 r:core_node1 x:collection1] o.a.s.c.SolrCore [collection1] Solr index directory '/home/jenkins/workspace/Lucene-Solr-trunk-Linux/solr/build/solr-core/test/J1/../../../../../../../../../home/jenkins/workspace/Lucene-Solr-trunk-Linux/solr/build/solr-core/test/J1/temp/solr.cloud.CollectionsAPIDistributedZkTest_3B9EA98D5C3FBD18-001/control-001/cores/collection1/data/index' doesn't exist. Creating new index...
>    [junit4]   2> 831294 INFO  (coreLoadExecutor-2846-thread-1-processing-n:127.0.0.1:54920__zsp%2Fp) [n:127.0.0.1:54920__zsp%2Fp c:control_collection s:shard1 r:core_node1 x:collection1] o.a.s.c.CachingDirectoryFactory return new directory for /home/jenkins/workspace/Lucene-Solr-trunk-Linux/solr/build/solr-core/test/J1/../../../../../../../../../home/jenkins/workspace/Lucene-Solr-trunk-Linux/solr/build/solr-core/test/J1/temp/solr.cloud.CollectionsAPIDistributedZkTest_3B9EA98D5C3FBD18-001/control-001/cores/collection1/data/index
>    [junit4]   2> 831295 INFO  (coreLoadExecutor-2846-thread-1-processing-n:127.0.0.1:54920__zsp%2Fp) [n:127.0.0.1:54920__zsp%2Fp c:control_collection s:shard1 r:core_node1 x:collection1] o.a.s.u.RandomMergePolicy RandomMergePolicy wrapping class org.apache.lucene.index.TieredMergePolicy: [TieredMergePolicy: maxMergeAtOnce=31, maxMergeAtOnceExplicit=47, maxMergedSegmentMB=55.46484375, floorSegmentMB=1.3828125, forceMergeDeletesPctAllowed=2.677485432138298, segmentsPerTier=11.0, maxCFSSegmentSizeMB=8.796093022207999E12, noCFSRatio=1.0
>    [junit4]   2> 831295 INFO  (coreLoadExecutor-2846-thread-1-processing-n:127.0.0.1:54920__zsp%2Fp) [n:127.0.0.1:54920__zsp%2Fp c:control_collection s:shard1 r:core_node1 x:collection1] o.a.s.c.SolrCore SolrDeletionPolicy.onCommit: commits: num=1
>    [junit4]   2>        commit{dir=MockDirectoryWrapper(RAMDirectory@264e7f lockFactory=org.apache.lucene.store.SingleInstanceLockFactory@91c9f4),segFN=segments_1,generation=1}
>    [junit4]   2> 831295 INFO  (coreLoadExecutor-2846-thread-1-processing-n:127.0.0.1:54920__zsp%2Fp) [n:127.0.0.1:54920__zsp%2Fp c:control_collection s:shard1 r:core_node1 x:collection1] o.a.s.c.SolrCore newest commit generation = 1
>    [junit4]   2> 831295 INFO  (OldIndexDirectoryCleanupThreadForCore-collection1) [n:127.0.0.1:54920__zsp%2Fp c:control_collection s:shard1 r:core_node1 x:collection1] o.a.s.c.SolrCore Looking for old index directories to cleanup for core collection1 in /home/jenkins/workspace/Lucene-Solr-trunk-Linux/solr/build/solr-core/test/J1/../../../../../../../../../home/jenkins/workspace/Lucene-Solr-trunk-Linux/solr/build/solr-core/test/J1/temp/solr.cloud.CollectionsAPIDistributedZkTest_3B9EA98D5C3FBD18-001/control-001/cores/collection1/data/
>    [junit4]   2> 831296 WARN  (OldIndexDirectoryCleanupThreadForCore-collection1) [n:127.0.0.1:54920__zsp%2Fp c:control_collection s:shard1 r:core_node1 x:collection1] o.a.s.c.DirectoryFactory /home/jenkins/workspace/Lucene-Solr-trunk-Linux/solr/build/solr-core/test/J1/../../../../../../../../../home/jenkins/workspace/Lucene-Solr-trunk-Linux/solr/build/solr-core/test/J1/temp/solr.cloud.CollectionsAPIDistributedZkTest_3B9EA98D5C3FBD18-001/control-001/cores/collection1/data/ does not point to a valid data directory; skipping clean-up of old index directories.
>    [junit4]   2> 831297 INFO  (coreLoadExecutor-2846-thread-1-processing-n:127.0.0.1:54920__zsp%2Fp) [n:127.0.0.1:54920__zsp%2Fp c:control_collection s:shard1 r:core_node1 x:collection1] o.a.s.u.p.UpdateRequestProcessorChain creating updateRequestProcessorChain "nodistrib"
>    [junit4]   2> 831297 INFO  (coreLoadExecutor-2846-thread-1-processing-n:127.0.0.1:54920__zsp%2Fp) [n:127.0.0.1:54920__zsp%2Fp c:control_collection s:shard1 r:core_node1 x:collection1] o.a.s.u.p.UpdateRequestProcessorChain creating updateRequestProcessorChain "dedupe"
>    [junit4]   2> 831297 INFO  (coreLoadExecutor-2846-thread-1-processing-n:127.0.0.1:54920__zsp%2Fp) [n:127.0.0.1:54920__zsp%2Fp c:control_collection s:shard1 r:core_node1 x:collection1] o.a.s.u.p.UpdateRequestProcessorChain inserting DistributedUpdateProcessorFactory into updateRequestProcessorChain "dedupe"
>    [junit4]   2> 831297 INFO  (coreLoadExecutor-2846-thread-1-processing-n:127.0.0.1:54920__zsp%2Fp) [n:127.0.0.1:54920__zsp%2Fp c:control_collection s:shard1 r:core_node1 x:collection1] o.a.s.u.p.UpdateRequestProcessorChain creating updateRequestProcessorChain "stored_sig"
>    [junit4]   2> 831298 INFO  (coreLoadExecutor-2846-thread-1-processing-n:127.0.0.1:54920__zsp%2Fp) [n:127.0.0.1:54920__zsp%2Fp c:control_collection s:shard1 r:core_node1 x:collection1] o.a.s.u.p.UpdateRequestProcessorChain inserting DistributedUpdateProcessorFactory into updateRequestProcessorChain "stored_sig"
>    [junit4]   2> 831298 INFO  (coreLoadExecutor-2846-thread-1-processing-n:127.0.0.1:54920__zsp%2Fp) [n:127.0.0.1:54920__zsp%2Fp c:control_collection s:shard1 r:core_node1 x:collection1] o.a.s.u.p.UpdateRequestProcessorChain creating updateRequestProcessorChain "distrib-dup-test-chain-explicit"
>    [junit4]   2> 831298 INFO  (coreLoadExecutor-2846-thread-1-processing-n:127.0.0.1:54920__zsp%2Fp) [n:127.0.0.1:54920__zsp%2Fp c:control_collection s:shard1 r:core_node1 x:collection1] o.a.s.u.p.UpdateRequestProcessorChain creating updateRequestProcessorChain "distrib-dup-test-chain-implicit"
>    [junit4]   2> 831298 INFO  (coreLoadExecutor-2846-thread-1-processing-n:127.0.0.1:54920__zsp%2Fp) [n:127.0.0.1:54920__zsp%2Fp c:control_collection s:shard1 r:core_node1 x:collection1] o.a.s.u.p.UpdateRequestProcessorChain inserting DistributedUpdateProcessorFactory into updateRequestProcessorChain "distrib-dup-test-chain-implicit"
>    [junit4]   2> 831298 INFO  (coreLoadExecutor-2846-thread-1-processing-n:127.0.0.1:54920__zsp%2Fp) [n:127.0.0.1:54920__zsp%2Fp c:control_collection s:shard1 r:core_node1 x:collection1] o.a.s.c.SolrCore no updateRequestProcessorChain defined as default, creating implicit default
>    [junit4]   2> 831299 INFO  (coreLoadExecutor-2846-thread-1-processing-n:127.0.0.1:54920__zsp%2Fp) [n:127.0.0.1:54920__zsp%2Fp c:control_collection s:shard1 r:core_node1 x:collection1] o.a.s.h.l.XMLLoader xsltCacheLifetimeSeconds=60
>    [junit4]   2> 831300 INFO  (coreLoadExecutor-2846-thread-1-processing-n:127.0.0.1:54920__zsp%2Fp) [n:127.0.0.1:54920__zsp%2Fp c:control_collection s:shard1 r:core_node1 x:collection1] o.a.s.h.l.XMLLoader xsltCacheLifetimeSeconds=60
>    [junit4]   2> 831300 INFO  (coreLoadExecutor-2846-thread-1-processing-n:127.0.0.1:54920__zsp%2Fp) [n:127.0.0.1:54920__zsp%2Fp c:control_collection s:shard1 r:core_node1 x:collection1] o.a.s.h.l.XMLLoader xsltCacheLifetimeSeconds=60
>    [junit4]   2> 831301 INFO  (coreLoadExecutor-2846-thread-1-processing-n:127.0.0.1:54920__zsp%2Fp) [n:127.0.0.1:54920__zsp%2Fp c:control_collection s:shard1 r:core_node1 x:collection1] o.a.s.h.l.XMLLoader xsltCacheLifetimeSeconds=60
>    [junit4]   2> 831302 INFO  (coreLoadExecutor-2846-thread-1-processing-n:127.0.0.1:54920__zsp%2Fp) [n:127.0.0.1:54920__zsp%2Fp c:control_collection s:shard1 r:core_node1 x:collection1] o.a.s.c.RequestHandlers Registered paths: /admin/mbeans,standard,/update/csv,/update/json/docs,/admin/luke,/admin/segments,/get,/admin/system,/replication,/admin/properties,/config,/schema,/admin/plugins,/admin/logging,/update/json,/admin/threads,/admin/ping,/update,/admin/file
>    [junit4]   2> 831302 INFO  (coreLoadExecutor-2846-thread-1-processing-n:127.0.0.1:54920__zsp%2Fp) [n:127.0.0.1:54920__zsp%2Fp c:control_collection s:shard1 r:core_node1 x:collection1] o.a.s.c.SolrCore Using default statsCache cache: org.apache.solr.search.stats.LocalStatsCache
>    [junit4]   2> 831303 INFO  (coreLoadExecutor-2846-thread-1-processing-n:127.0.0.1:54920__zsp%2Fp) [n:127.0.0.1:54920__zsp%2Fp c:control_collection s:shard1 r:core_node1 x:collection1] o.a.s.u.UpdateHandler Using UpdateLog implementation: org.apache.solr.update.UpdateLog
>    [junit4]   2> 831303 INFO  (coreLoadExecutor-2846-thread-1-processing-n:127.0.0.1:54920__zsp%2Fp) [n:127.0.0.1:54920__zsp%2Fp c:control_collection s:shard1 r:core_node1 x:collection1] o.a.s.u.UpdateLog Initializing UpdateLog: dataDir= defaultSyncLevel=FLUSH numRecordsToKeep=100 maxNumLogsToKeep=10 numVersionBuckets=65536
>    [junit4]   2> 831303 INFO  (coreLoadExecutor-2846-thread-1-processing-n:127.0.0.1:54920__zsp%2Fp) [n:127.0.0.1:54920__zsp%2Fp c:control_collection s:shard1 r:core_node1 x:collection1] o.a.s.c.SolrCore Hard AutoCommit: disabled
>    [junit4]   2> 831304 INFO  (coreLoadExecutor-2846-thread-1-processing-n:127.0.0.1:54920__zsp%2Fp) [n:127.0.0.1:54920__zsp%2Fp c:control_collection s:shard1 r:core_node1 x:collection1] o.a.s.c.SolrCore Soft AutoCommit: disabled
>    [junit4]   2> 831304 INFO  (coreLoadExecutor-2846-thread-1-processing-n:127.0.0.1:54920__zsp%2Fp) [n:127.0.0.1:54920__zsp%2Fp c:control_collection s:shard1 r:core_node1 x:collection1] o.a.s.u.RandomMergePolicy RandomMergePolicy wrapping class org.apache.lucene.index.LogDocMergePolicy: [LogDocMergePolicy: minMergeSize=1000, mergeFactor=27, maxMergeSize=9223372036854775807, maxMergeSizeForForcedMerge=9223372036854775807, calibrateSizeByDeletes=false, maxMergeDocs=2147483647, maxCFSSegmentSizeMB=8.796093022207999E12, noCFSRatio=0.7479182997078994]
>    [junit4]   2> 831304 INFO  (coreLoadExecutor-2846-thread-1-processing-n:127.0.0.1:54920__zsp%2Fp) [n:127.0.0.1:54920__zsp%2Fp c:control_collection s:shard1 r:core_node1 x:collection1] o.a.s.c.SolrCore SolrDeletionPolicy.onInit: commits: num=1
>    [junit4]   2>        commit{dir=MockDirectoryWrapper(RAMDirectory@264e7f lockFactory=org.apache.lucene.store.SingleInstanceLockFactory@91c9f4),segFN=segments_1,generation=1}
>    [junit4]   2> 831304 INFO  (coreLoadExecutor-2846-thread-1-processing-n:127.0.0.1:54920__zsp%2Fp) [n:127.0.0.1:54920__zsp%2Fp c:control_collection s:shard1 r:core_node1 x:collection1] o.a.s.c.SolrCore newest commit generation = 1
>    [junit4]   2> 831304 INFO  (coreLoadExecutor-2846-thread-1-processing-n:127.0.0.1:54920__zsp%2Fp) [n:127.0.0.1:54920__zsp%2Fp c:control_collection s:shard1 r:core_node1 x:collection1] o.a.s.s.SolrIndexSearcher Opening Searcher@122463f[collection1] main
>    [junit4]   2> 831304 INFO  (coreLoadExecutor-2846-thread-1-processing-n:127.0.0.1:54920__zsp%2Fp) [n:127.0.0.1:54920__zsp%2Fp c:control_collection s:shard1 r:core_node1 x:collection1] o.a.s.c.c.ZkStateReader Load collection config from:/collections/control_collection
>    [junit4]   2> 831305 INFO  (coreLoadExecutor-2846-thread-1-processing-n:127.0.0.1:54920__zsp%2Fp) [n:127.0.0.1:54920__zsp%2Fp c:control_collection s:shard1 r:core_node1 x:collection1] o.a.s.c.c.ZkStateReader path=/collections/control_collection configName=conf1 specified config exists in ZooKeeper
>    [junit4]   2> 831305 INFO  (coreLoadExecutor-2846-thread-1-processing-n:127.0.0.1:54920__zsp%2Fp) [n:127.0.0.1:54920__zsp%2Fp c:control_collection s:shard1 r:core_node1 x:collection1] o.a.s.r.ManagedResourceStorage Setting up ZooKeeper-based storage for the RestManager with znodeBase: /configs/conf1
>    [junit4]   2> 831305 INFO  (coreLoadExecutor-2846-thread-1-processing-n:127.0.0.1:54920__zsp%2Fp) [n:127.0.0.1:54920__zsp%2Fp c:control_collection s:shard1 r:core_node1 x:collection1] o.a.s.r.ManagedResourceStorage Configured ZooKeeperStorageIO with znodeBase: /configs/conf1
>    [junit4]   2> 831305 INFO  (coreLoadExecutor-2846-thread-1-processing-n:127.0.0.1:54920__zsp%2Fp) [n:127.0.0.1:54920__zsp%2Fp c:control_collection s:shard1 r:core_node1 x:collection1] o.a.s.r.RestManager Initializing RestManager with initArgs: {}
>    [junit4]   2> 831305 INFO  (coreLoadExecutor-2846-thread-1-processing-n:127.0.0.1:54920__zsp%2Fp) [n:127.0.0.1:54920__zsp%2Fp c:control_collection s:shard1 r:core_node1 x:collection1] o.a.s.r.ManagedResourceStorage Reading _rest_managed.json using ZooKeeperStorageIO:path=/configs/conf1
>    [junit4]   2> 831305 INFO  (coreLoadExecutor-2846-thread-1-processing-n:127.0.0.1:54920__zsp%2Fp) [n:127.0.0.1:54920__zsp%2Fp c:control_collection s:shard1 r:core_node1 x:collection1] o.a.s.r.ManagedResourceStorage No data found for znode /configs/conf1/_rest_managed.json
>    [junit4]   2> 831305 INFO  (coreLoadExecutor-2846-thread-1-processing-n:127.0.0.1:54920__zsp%2Fp) [n:127.0.0.1:54920__zsp%2Fp c:control_collection s:shard1 r:core_node1 x:collection1] o.a.s.r.ManagedResourceStorage Loaded null at path _rest_managed.json using ZooKeeperStorageIO:path=/configs/conf1
>    [junit4]   2> 831306 INFO  (coreLoadExecutor-2846-thread-1-processing-n:127.0.0.1:54920__zsp%2Fp) [n:127.0.0.1:54920__zsp%2Fp c:control_collection s:shard1 r:core_node1 x:collection1] o.a.s.r.RestManager Initializing 0 registered ManagedResources
>    [junit4]   2> 831306 INFO  (coreLoadExecutor-2846-thread-1-processing-n:127.0.0.1:54920__zsp%2Fp) [n:127.0.0.1:54920__zsp%2Fp c:control_collection s:shard1 r:core_node1 x:collection1] o.a.s.h.ReplicationHandler Commits will be reserved for  10000
>    [junit4]   2> 831306 INFO  (searcherExecutor-2847-thread-1-processing-n:127.0.0.1:54920__zsp%2Fp x:collection1 s:shard1 c:control_collection r:core_node1) [n:127.0.0.1:54920__zsp%2Fp c:control_collection s:shard1 r:core_node1 x:collection1] o.a.s.c.SolrCore [collection1] Registered new searcher Searcher@122463f[collection1] main{ExitableDirectoryReader(UninvertingDirectoryReader())}
>    [junit4]   2> 831306 INFO  (coreLoadExecutor-2846-thread-1-processing-n:127.0.0.1:54920__zsp%2Fp) [n:127.0.0.1:54920__zsp%2Fp c:control_collection s:shard1 r:core_node1 x:collection1] o.a.s.u.UpdateLog Looking up max value of version field to seed version buckets
>    [junit4]   2> 831306 INFO  (coreLoadExecutor-2846-thread-1-processing-n:127.0.0.1:54920__zsp%2Fp) [n:127.0.0.1:54920__zsp%2Fp c:control_collection s:shard1 r:core_node1 x:collection1] o.a.s.u.VersionInfo Refreshing highest value of _version_ for 65536 version buckets from index
>    [junit4]   2> 831306 INFO  (coreLoadExecutor-2846-thread-1-processing-n:127.0.0.1:54920__zsp%2Fp) [n:127.0.0.1:54920__zsp%2Fp c:control_collection s:shard1 r:core_node1 x:collection1] o.a.s.u.VersionInfo No terms found for _version_, cannot seed version bucket highest value from index
>    [junit4]   2> 831306 INFO  (coreLoadExecutor-2846-thread-1-processing-n:127.0.0.1:54920__zsp%2Fp) [n:127.0.0.1:54920__zsp%2Fp c:control_collection s:shard1 r:core_node1 x:collection1] o.a.s.u.UpdateLog Could not find max version in index or recent updates, using new clock 1509482695391969280
>    [junit4]   2> 831308 INFO  (coreLoadExecutor-2846-thread-1-processing-n:127.0.0.1:54920__zsp%2Fp) [n:127.0.0.1:54920__zsp%2Fp c:control_collection s:shard1 r:core_node1 x:collection1] o.a.s.u.UpdateLog Took 1.0ms to seed version buckets with highest version 1509482695391969280
>    [junit4]   2> 831308 INFO  (coreLoadExecutor-2846-thread-1-processing-n:127.0.0.1:54920__zsp%2Fp) [n:127.0.0.1:54920__zsp%2Fp c:control_collection s:shard1 r:core_node1 x:collection1] o.a.s.c.ZkController watch zkdir /configs/conf1
>    [junit4]   2> 831308 INFO  (coreLoadExecutor-2846-thread-1-processing-n:127.0.0.1:54920__zsp%2Fp) [n:127.0.0.1:54920__zsp%2Fp c:control_collection s:shard1 r:core_node1 x:collection1] o.a.s.c.CoreContainer registering core: collection1
>    [junit4]   2> 831309 INFO  (coreZkRegister-2840-thread-1-processing-n:127.0.0.1:54920__zsp%2Fp x:collection1 s:shard1 c:control_collection r:core_node1) [n:127.0.0.1:54920__zsp%2Fp c:control_collection s:shard1 r:core_node1 x:collection1] o.a.s.c.ZkController Register replica - core:collection1 address:http://127.0.0.1:54920/_zsp/p collection:control_collection shard:shard1
>    [junit4]   2> 831309 INFO  (coreZkRegister-2840-thread-1-processing-n:127.0.0.1:54920__zsp%2Fp x:collection1 s:shard1 c:control_collection r:core_node1) [n:127.0.0.1:54920__zsp%2Fp c:control_collection s:shard1 r:core_node1 x:collection1] o.a.s.c.c.SolrZkClient makePath: /collections/control_collection/leader_elect/shard1/election
>    [junit4]   2> 831310 INFO  (coreZkRegister-2840-thread-1-processing-n:127.0.0.1:54920__zsp%2Fp x:collection1 s:shard1 c:control_collection r:core_node1) [n:127.0.0.1:54920__zsp%2Fp c:control_collection s:shard1 r:core_node1 x:collection1] o.a.s.c.LeaderElector Joined leadership election with path: /collections/control_collection/leader_elect/shard1/election/94342668370182150-core_node1-n_0000000000
>    [junit4]   2> 831310 INFO  (coreZkRegister-2840-thread-1-processing-n:127.0.0.1:54920__zsp%2Fp x:collection1 s:shard1 c:control_collection r:core_node1) [n:127.0.0.1:54920__zsp%2Fp c:control_collection s:shard1 r:core_node1 x:collection1] o.a.s.c.ShardLeaderElectionContext Running the leader process for shard shard1
>    [junit4]   2> 831311 INFO  (zkCallback-842-thread-1-processing-n:127.0.0.1:54920__zsp%2Fp) [n:127.0.0.1:54920__zsp%2Fp    ] o.a.s.c.DistributedQueue NodeChildrenChanged fired on path /overseer/queue state SyncConnected
>    [junit4]   2> 831311 INFO  (coreZkRegister-2840-thread-1-processing-n:127.0.0.1:54920__zsp%2Fp x:collection1 s:shard1 c:control_collection r:core_node1) [n:127.0.0.1:54920__zsp%2Fp c:control_collection s:shard1 r:core_node1 x:collection1] o.a.s.c.ShardLeaderElectionContext Enough replicas found to continue.
>    [junit4]   2> 831311 INFO  (coreZkRegister-2840-thread-1-processing-n:127.0.0.1:54920__zsp%2Fp x:collection1 s:shard1 c:control_collection r:core_node1) [n:127.0.0.1:54920__zsp%2Fp c:control_collection s:shard1 r:core_node1 x:collection1] o.a.s.c.ShardLeaderElectionContext I may be the new leader - try and sync
>    [junit4]   2> 831311 INFO  (coreZkRegister-2840-thread-1-processing-n:127.0.0.1:54920__zsp%2Fp x:collection1 s:shard1 c:control_collection r:core_node1) [n:127.0.0.1:54920__zsp%2Fp c:control_collection s:shard1 r:core_node1 x:collection1] o.a.s.c.SyncStrategy Sync replicas to http://127.0.0.1:54920/_zsp/p/collection1/
>    [junit4]   2> 831311 INFO  (OverseerStateUpdate-94342668370182150-127.0.0.1:54920__zsp%2Fp-n_0000000000) [n:127.0.0.1:54920__zsp%2Fp    ] o.a.s.c.Overseer processMessage: queueSize: 1, message = {
>    [junit4]   2>   "operation":"leader",
>    [junit4]   2>   "shard":"shard1",
>    [junit4]   2>   "collection":"control_collection"} current state version: 1
>    [junit4]   2> 831311 INFO  (coreZkRegister-2840-thread-1-processing-n:127.0.0.1:54920__zsp%2Fp x:collection1 s:shard1 c:control_collection r:core_node1) [n:127.0.0.1:54920__zsp%2Fp c:control_collection s:shard1 r:core_node1 x:collection1] o.a.s.c.SyncStrategy Sync Success - now sync replicas to me
>    [junit4]   2> 831311 INFO  (coreZkRegister-2840-thread-1-processing-n:127.0.0.1:54920__zsp%2Fp x:collection1 s:shard1 c:control_collection r:core_node1) [n:127.0.0.1:54920__zsp%2Fp c:control_collection s:shard1 r:core_node1 x:collection1] o.a.s.c.SyncStrategy http://127.0.0.1:54920/_zsp/p/collection1/ has no replicas
>    [junit4]   2> 831311 INFO  (coreZkRegister-2840-thread-1-processing-n:127.0.0.1:54920__zsp%2Fp x:collection1 s:shard1 c:control_collection r:core_node1) [n:127.0.0.1:54920__zsp%2Fp c:control_collection s:shard1 r:core_node1 x:collection1] o.a.s.c.ShardLeaderElectionContext I am the new leader: http://127.0.0.1:54920/_zsp/p/collection1/ shard1
>    [junit4]   2> 831312 INFO  (coreZkRegister-2840-thread-1-processing-n:127.0.0.1:54920__zsp%2Fp x:collection1 s:shard1 c:control_collection r:core_node1) [n:127.0.0.1:54920__zsp%2Fp c:control_collection s:shard1 r:core_node1 x:collection1] o.a.s.c.c.SolrZkClient makePath: /collections/control_collection/leaders/shard1
>    [junit4]   2> 831313 INFO  (zkCallback-842-thread-1-processing-n:127.0.0.1:54920__zsp%2Fp) [n:127.0.0.1:54920__zsp%2Fp    ] o.a.s.c.DistributedQueue NodeChildrenChanged fired on path /overseer/queue state SyncConnected
>    [junit4]   2> 831313 INFO  (OverseerStateUpdate-94342668370182150-127.0.0.1:54920__zsp%2Fp-n_0000000000) [n:127.0.0.1:54920__zsp%2Fp    ] o.a.s.c.Overseer processMessage: queueSize: 1, message = {
>    [junit4]   2>   "operation":"leader",
>    [junit4]   2>   "shard":"shard1",
>    [junit4]   2>   "collection":"control_collection",
>    [junit4]   2>   "base_url":"http://127.0.0.1:54920/_zsp/p",
>    [junit4]   2>   "core":"collection1",
>    [junit4]   2>   "state":"active"} current state version: 1
>    [junit4]   2> 831414 INFO  (zkCallback-842-thread-1-processing-n:127.0.0.1:54920__zsp%2Fp) [n:127.0.0.1:54920__zsp%2Fp    ] o.a.s.c.c.ZkStateReader A cluster state change: WatchedEvent state:SyncConnected type:NodeDataChanged path:/clusterstate.json, has occurred - updating... (live nodes size: 1)
>    [junit4]   2> 831463 INFO  (coreZkRegister-2840-thread-1-processing-n:127.0.0.1:54920__zsp%2Fp x:collection1 s:shard1 c:control_collection r:core_node1) [n:127.0.0.1:54920__zsp%2Fp c:control_collection s:shard1 r:core_node1 x:collection1] o.a.s.c.ZkController We are http://127.0.0.1:54920/_zsp/p/collection1/ and leader is http://127.0.0.1:54920/_zsp/p/collection1/
>    [junit4]   2> 831463 INFO  (coreZkRegister-2840-thread-1-processing-n:127.0.0.1:54920__zsp%2Fp x:collection1 s:shard1 c:control_collection r:core_node1) [n:127.0.0.1:54920__zsp%2Fp c:control_collection s:shard1 r:core_node1 x:collection1] o.a.s.c.ZkController No LogReplay needed for core=collection1 baseURL=http://127.0.0.1:54920/_zsp/p
>    [junit4]   2> 831463 INFO  (coreZkRegister-2840-thread-1-processing-n:127.0.0.1:54920__zsp%2Fp x:collection1 s:shard1 c:control_collection r:core_node1) [n:127.0.0.1:54920__zsp%2Fp c:control_collection s:shard1 r:core_node1 x:collection1] o.a.s.c.ZkController I am the leader, no recovery necessary
>    [junit4]   2> 831463 INFO  (coreZkRegister-2840-thread-1-processing-n:127.0.0.1:54920__zsp%2Fp x:collection1 s:shard1 c:control_collection r:core_node1) [n:127.0.0.1:54920__zsp%2Fp c:control_collection s:shard1 r:core_node1 x:collection1] o.a.s.c.ZkController publishing state=active
>    [junit4]   2> 831464 INFO  (coreZkRegister-2840-thread-1-processing-n:127.0.0.1:54920__zsp%2Fp x:collection1 s:shard1 c:control_collection r:core_node1) [n:127.0.0.1:54920__zsp%2Fp c:control_collection s:shard1 r:core_node1 x:collection1] o.a.s.c.ZkController numShards not found on descriptor - reading it from system property
>    [junit4]   2> 831464 INFO  (zkCallback-842-thread-1-processing-n:127.0.0.1:54920__zsp%2Fp) [n:127.0.0.1:54920__zsp%2Fp    ] o.a.s.c.DistributedQueue NodeChildrenChanged fired on path /overseer/queue state SyncConnected
>    [junit4]   2> 831465 INFO  (OverseerStateUpdate-94342668370182150-127.0.0.1:54920__zsp%2Fp-n_0000000000) [n:127.0.0.1:54920__zsp%2Fp    ] o.a.s.c.Overseer processMessage: queueSize: 1, message = {
>    [junit4]   2>   "core":"collection1",
>    [junit4]   2>   "core_node_name":"core_node1",
>    [junit4]   2>   "roles":null,
>    [junit4]   2>   "base_url":"http://127.0.0.1:54920/_zsp/p",
>    [junit4]   2>   "node_name":"127.0.0.1:54920__zsp%2Fp",
>    [junit4]   2>   "numShards":"1",
>    [junit4]   2>   "state":"active",
>    [junit4]   2>   "shard":"shard1",
>    [junit4]   2>   "collection":"control_collection",
>    [junit4]   2>   "operation":"state"} current state version: 2
>    [junit4]   2> 831465 INFO  (OverseerStateUpdate-94342668370182150-127.0.0.1:54920__zsp%2Fp-n_0000000000) [n:127.0.0.1:54920__zsp%2Fp    ] o.a.s.c.o.ReplicaMutator Update state numShards=1 message={
>    [junit4]   2>   "core":"collection1",
>    [junit4]   2>   "core_node_name":"core_node1",
>    [junit4]   2>   "roles":null,
>    [junit4]   2>   "base_url":"http://127.0.0.1:54920/_zsp/p",
>    [junit4]   2>   "node_name":"127.0.0.1:54920__zsp%2Fp",
>    [junit4]   2>   "numShards":"1",
>    [junit4]   2>   "state":"active",
>    [junit4]   2>   "shard":"shard1",
>    [junit4]   2>   "collection":"control_collection",
>    [junit4]   2>   "operation":"state"}
>    [junit4]   2> 831566 INFO  (zkCallback-842-thread-1-processing-n:127.0.0.1:54920__zsp%2Fp) [n:127.0.0.1:54920__zsp%2Fp    ] o.a.s.c.c.ZkStateReader A cluster state change: WatchedEvent state:SyncConnected type:NodeDataChanged path:/clusterstate.json, has occurred - updating... (live nodes size: 1)
>    [junit4]   2> 831688 INFO  (TEST-CollectionsAPIDistributedZkTest.test-seed#[3B9EA98D5C3FBD18]) [    ] o.a.s.c.c.SolrZkClient Using default ZkCredentialsProvider
>    [junit4]   2> 831688 INFO  (TEST-CollectionsAPIDistributedZkTest.test-seed#[3B9EA98D5C3FBD18]) [    ] o.a.s.c.c.ConnectionManager Waiting for client to connect to ZooKeeper
>    [junit4]   2> 831689 INFO  (zkCallback-844-thread-1) [    ] o.a.s.c.c.ConnectionManager Watcher org.apache.solr.common.cloud.ConnectionManager@d9b128 name:ZooKeeperConnection Watcher:127.0.0.1:44077/solr got event WatchedEvent state:SyncConnected type:None path:null path:null type:None
>    [junit4]   2> 831689 INFO  (TEST-CollectionsAPIDistributedZkTest.test-seed#[3B9EA98D5C3FBD18]) [    ] o.a.s.c.c.ConnectionManager Client is connected to ZooKeeper
>    [junit4]   2> 831689 INFO  (TEST-CollectionsAPIDistributedZkTest.test-seed#[3B9EA98D5C3FBD18]) [    ] o.a.s.c.c.SolrZkClient Using default ZkACLProvider
>    [junit4]   2> 831689 INFO  (TEST-CollectionsAPIDistributedZkTest.test-seed#[3B9EA98D5C3FBD18]) [    ] o.a.s.c.c.ZkStateReader Updating cluster state from ZooKeeper...
>    [junit4]   2> 831690 INFO  (TEST-CollectionsAPIDistributedZkTest.test-seed#[3B9EA98D5C3FBD18]) [    ] o.a.s.c.ChaosMonkey monkey: init - expire sessions:false cause connection loss:false
>    [junit4]   2> 831691 INFO  (TEST-CollectionsAPIDistributedZkTest.test-seed#[3B9EA98D5C3FBD18]) [    ] o.a.s.c.AbstractFullDistribZkTestBase Creating collection1 with stateFormat=2
>    [junit4]   2> 831691 INFO  (TEST-CollectionsAPIDistributedZkTest.test-seed#[3B9EA98D5C3FBD18]) [    ] o.a.s.c.c.SolrZkClient Using default ZkCredentialsProvider
>    [junit4]   2> 831691 INFO  (TEST-CollectionsAPIDistributedZkTest.test-seed#[3B9EA98D5C3FBD18]) [    ] o.a.s.c.c.ConnectionManager Waiting for client to connect to ZooKeeper
>    [junit4]   2> 831692 INFO  (zkCallback-845-thread-1) [    ] o.a.s.c.c.ConnectionManager Watcher org.apache.solr.common.cloud.ConnectionManager@324 name:ZooKeeperConnection Watcher:127.0.0.1:44077/solr got event WatchedEvent state:SyncConnected type:None path:null path:null type:None
>    [junit4]   2> 831692 INFO  (TEST-CollectionsAPIDistributedZkTest.test-seed#[3B9EA98D5C3FBD18]) [    ] o.a.s.c.c.ConnectionManager Client is connected to ZooKeeper
>    [junit4]   2> 831692 INFO  (TEST-CollectionsAPIDistributedZkTest.test-seed#[3B9EA98D5C3FBD18]) [    ] o.a.s.c.c.SolrZkClient Using default ZkACLProvider
>    [junit4]   2> 831693 INFO  (zkCallback-842-thread-1-processing-n:127.0.0.1:54920__zsp%2Fp) [n:127.0.0.1:54920__zsp%2Fp    ] o.a.s.c.DistributedQueue NodeChildrenChanged fired on path /overseer/queue state SyncConnected
>    [junit4]   2> 831693 INFO  (OverseerStateUpdate-94342668370182150-127.0.0.1:54920__zsp%2Fp-n_0000000000) [n:127.0.0.1:54920__zsp%2Fp    ] o.a.s.c.Overseer processMessage: queueSize: 1, message = {
>    [junit4]   2>   "operation":"create",
>    [junit4]   2>   "name":"collection1",
>    [junit4]   2>   "numShards":"2",
>    [junit4]   2>   "stateFormat":"2"} current state version: 3
>    [junit4]   2> 831693 INFO  (OverseerStateUpdate-94342668370182150-127.0.0.1:54920__zsp%2Fp-n_0000000000) [n:127.0.0.1:54920__zsp%2Fp    ] o.a.s.c.o.ClusterStateMutator building a new cName: collection1
>    [junit4]   2> 831743 INFO  (TEST-CollectionsAPIDistributedZkTest.test-seed#[3B9EA98D5C3FBD18]) [    ] o.a.s.SolrTestCaseJ4 Writing core.properties file to /home/jenkins/workspace/Lucene-Solr-trunk-Linux/solr/build/solr-core/test/J1/temp/solr.cloud.CollectionsAPIDistributedZkTest_3B9EA98D5C3FBD18-001/shard-1-001/cores/collection1
>    [junit4]   2> 831744 INFO  (TEST-CollectionsAPIDistributedZkTest.test-seed#[3B9EA98D5C3FBD18]) [    ] o.a.s.c.AbstractFullDistribZkTestBase create jetty 1 in directory /home/jenkins/workspace/Lucene-Solr-trunk-Linux/solr/build/solr-core/test/J1/temp/solr.cloud.CollectionsAPIDistributedZkTest_3B9EA98D5C3FBD18-001/shard-1-001
>    [junit4]   2> 831744 INFO  (TEST-CollectionsAPIDistributedZkTest.test-seed#[3B9EA98D5C3FBD18]) [    ] o.e.j.s.Server jetty-9.2.11.v20150529
>    [junit4]   2> 831745 INFO  (TEST-CollectionsAPIDistributedZkTest.test-seed#[3B9EA98D5C3FBD18]) [    ] o.e.j.s.h.ContextHandler Started o.e.j.s.ServletContextHandler@19145cb{/_zsp/p,null,AVAILABLE}
>    [junit4]   2> 831745 INFO  (TEST-CollectionsAPIDistributedZkTest.test-seed#[3B9EA98D5C3FBD18]) [    ] o.e.j.s.ServerConnector Started ServerConnector@743e19{HTTP/1.1}{127.0.0.1:33423}
>    [junit4]   2> 831746 INFO  (TEST-CollectionsAPIDistributedZkTest.test-seed#[3B9EA98D5C3FBD18]) [    ] o.e.j.s.Server Started @833478ms
>    [junit4]   2> 831746 INFO  (TEST-CollectionsAPIDistributedZkTest.test-seed#[3B9EA98D5C3FBD18]) [    ] o.a.s.c.s.e.JettySolrRunner Jetty properties: {solr.data.dir=/home/jenkins/workspace/Lucene-Solr-trunk-Linux/solr/build/solr-core/test/J1/temp/solr.cloud.CollectionsAPIDistributedZkTest_3B9EA98D5C3FBD18-001/tempDir-001/jetty1, solrconfig=solrconfig.xml, hostContext=/_zsp/p, hostPort=33423, coreRootDirectory=/home/jenkins/workspace/Lucene-Solr-trunk-Linux/solr/build/solr-core/test/J1/../../../../../../../../../home/jenkins/workspace/Lucene-Solr-trunk-Linux/solr/build/solr-core/test/J1/temp/solr.cloud.CollectionsAPIDistributedZkTest_3B9EA98D5C3FBD18-001/shard-1-001/cores}
>    [junit4]   2> 831746 INFO  (TEST-CollectionsAPIDistributedZkTest.test-seed#[3B9EA98D5C3FBD18]) [    ] o.a.s.s.SolrDispatchFilter SolrDispatchFilter.init(): sun.misc.Launcher$AppClassLoader@19ebb3d
>    [junit4]   2> 831746 INFO  (TEST-CollectionsAPIDistributedZkTest.test-seed#[3B9EA98D5C3FBD18]) [    ] o.a.s.c.SolrResourceLoader new SolrResourceLoader for directory: '/home/jenkins/workspace/Lucene-Solr-trunk-Linux/solr/build/solr-core/test/J1/../../../../../../../../../home/jenkins/workspace/Lucene-Solr-trunk-Linux/solr/build/solr-core/test/J1/temp/solr.cloud.CollectionsAPIDistributedZkTest_3B9EA98D5C3FBD18-001/shard-1-001/'
>    [junit4]   2> 831756 INFO  (TEST-CollectionsAPIDistributedZkTest.test-seed#[3B9EA98D5C3FBD18]) [    ] o.a.s.c.c.SolrZkClient Using default ZkCredentialsProvider
>    [junit4]   2> 831756 INFO  (TEST-CollectionsAPIDistributedZkTest.test-seed#[3B9EA98D5C3FBD18]) [    ] o.a.s.c.c.ConnectionManager Waiting for client to connect to ZooKeeper
>    [junit4]   2> 831757 INFO  (zkCallback-846-thread-1) [    ] o.a.s.c.c.ConnectionManager Watcher org.apache.solr.common.cloud.ConnectionManager@254442 name:ZooKeeperConnection Watcher:127.0.0.1:44077/solr got event WatchedEvent state:SyncConnected type:None path:null path:null type:None
>    [junit4]   2> 831757 INFO  (TEST-CollectionsAPIDistributedZkTest.test-seed#[3B9EA98D5C3FBD18]) [    ] o.a.s.c.c.ConnectionManager Client is connected to ZooKeeper
>    [junit4]   2> 831757 INFO  (TEST-CollectionsAPIDistributedZkTest.test-seed#[3B9EA98D5C3FBD18]) [    ] o.a.s.c.c.SolrZkClient Using default ZkACLProvider
>    [junit4]   2> 831758 INFO  (TEST-CollectionsAPIDistributedZkTest.test-seed#[3B9EA98D5C3FBD18]) [    ] o.a.s.s.SolrDispatchFilter Loading solr.xml from SolrHome (not found in ZooKeeper)
>    [junit4]   2> 831758 INFO  (TEST-CollectionsAPIDistributedZkTest.test-seed#[3B9EA98D5C3FBD18]) [    ] o.a.s.c.SolrXmlConfig Loading container configuration from /home/jenkins/workspace/Lucene-Solr-trunk-Linux/solr/build/solr-core/test/J1/../../../../../../../../../home/jenkins/workspace/Lucene-Solr-trunk-Linux/solr/build/solr-core/test/J1/temp/solr.cloud.CollectionsAPIDistributedZkTest_3B9EA98D5C3FBD18-001/shard-1-001/solr.xml
>    [junit4]   2> 831761 INFO  (TEST-CollectionsAPIDistributedZkTest.test-seed#[3B9EA98D5C3FBD18]) [    ] o.a.s.c.CoresLocator Config-defined core root directory: /home/jenkins/workspace/Lucene-Solr-trunk-Linux/solr/build/solr-core/test/J1/../../../../../../../../../home/jenkins/workspace/Lucene-Solr-trunk-Linux/solr/build/solr-core/test/J1/temp/solr.cloud.CollectionsAPIDistributedZkTest_3B9EA98D5C3FBD18-001/shard-1-001/cores
>    [junit4]   2> 831761 INFO  (TEST-CollectionsAPIDistributedZkTest.test-seed#[3B9EA98D5C3FBD18]) [    ] o.a.s.c.CoreContainer New CoreContainer 30421588
>    [junit4]   2> 831761 INFO  (TEST-CollectionsAPIDistributedZkTest.test-seed#[3B9EA98D5C3FBD18]) [    ] o.a.s.c.CoreContainer Loading cores into CoreContainer [instanceDir=/home/jenkins/workspace/Lucene-Solr-trunk-Linux/solr/build/solr-core/test/J1/../../../../../../../../../home/jenkins/workspace/Lucene-Solr-trunk-Linux/solr/build/solr-core/test/J1/temp/solr.cloud.CollectionsAPIDistributedZkTest_3B9EA98D5C3FBD18-001/shard-1-001/]
>    [junit4]   2> 831762 INFO  (TEST-CollectionsAPIDistributedZkTest.test-seed#[3B9EA98D5C3FBD18]) [    ] o.a.s.c.CoreContainer loading shared library: /home/jenkins/workspace/Lucene-Solr-trunk-Linux/solr/build/solr-core/test/J1/../../../../../../../../../home/jenkins/workspace/Lucene-Solr-trunk-Linux/solr/build/solr-core/test/J1/temp/solr.cloud.CollectionsAPIDistributedZkTest_3B9EA98D5C3FBD18-001/shard-1-001/lib
>    [junit4]   2> 831762 WARN  (TEST-CollectionsAPIDistributedZkTest.test-seed#[3B9EA98D5C3FBD18]) [    ] o.a.s.c.SolrResourceLoader Can't find (or read) directory to add to classloader: lib (resolved as: /home/jenkins/workspace/Lucene-Solr-trunk-Linux/solr/build/solr-core/test/J1/../../../../../../../../../home/jenkins/workspace/Lucene-Solr-trunk-Linux/solr/build/solr-core/test/J1/temp/solr.cloud.CollectionsAPIDistributedZkTest_3B9EA98D5C3FBD18-001/shard-1-001/lib).
>    [junit4]   2> 831767 INFO  (TEST-CollectionsAPIDistributedZkTest.test-seed#[3B9EA98D5C3FBD18]) [    ] o.a.s.h.c.HttpShardHandlerFactory created with socketTimeout : 90000,urlScheme : ,connTimeout : 15000,maxConnectionsPerHost : 20,maxConnections : 10000,corePoolSize : 0,maximumPoolSize : 2147483647,maxThreadIdleTime : 5,sizeOfQueue : -1,fairnessPolicy : false,useRetries : false,
>    [junit4]   2> 831767 INFO  (TEST-CollectionsAPIDistributedZkTest.test-seed#[3B9EA98D5C3FBD18]) [    ] o.a.s.u.UpdateShardHandler Creating UpdateShardHandler HTTP client with params: socketTimeout=340000&connTimeout=45000&retry=true
>    [junit4]   2> 831768 INFO  (TEST-CollectionsAPIDistributedZkTest.test-seed#[3B9EA98D5C3FBD18]) [    ] o.a.s.l.LogWatcher SLF4J impl is org.slf4j.impl.Log4jLoggerFactory
>    [junit4]   2> 831768 INFO  (TEST-CollectionsAPIDistributedZkTest.test-seed#[3B9EA98D5C3FBD18]) [    ] o.a.s.l.LogWatcher Registering Log Listener [Log4j (org.slf4j.impl.Log4jLoggerFactory)]
>    [junit4]   2> 831768 INFO  (TEST-CollectionsAPIDistributedZkTest.test-seed#[3B9EA98D5C3FBD18]) [    ] o.a.s.c.ZkContainer Zookeeper client=127.0.0.1:44077/solr
>    [junit4]   2> 831768 INFO  (TEST-CollectionsAPIDistributedZkTest.test-seed#[3B9EA98D5C3FBD18]) [    ] o.a.s.c.ZkController zkHost includes chroot
>    [junit4]   2> 831768 INFO  (TEST-CollectionsAPIDistributedZkTest.test-seed#[3B9EA98D5C3FBD18]) [    ] o.a.s.c.c.SolrZkClient Using default ZkCredentialsProvider
>    [junit4]   2> 831769 INFO  (TEST-CollectionsAPIDistributedZkTest.test-seed#[3B9EA98D5C3FBD18]) [    ] o.a.s.c.c.ConnectionManager Waiting for client to connect to ZooKeeper
>    [junit4]   2> 831769 INFO  (zkCallback-848-thread-1) [    ] o.a.s.c.c.ConnectionManager Watcher org.apache.solr.common.cloud.ConnectionManager@da2e73 name:ZooKeeperConnection Watcher:127.0.0.1:44077 got event WatchedEvent state:SyncConnected type:None path:null path:null type:None
>    [junit4]   2> 831769 INFO  (TEST-CollectionsAPIDistributedZkTest.test-seed#[3B9EA98D5C3FBD18]) [    ] o.a.s.c.c.ConnectionManager Client is connected to ZooKeeper
>    [junit4]   2> 831770 INFO  (TEST-CollectionsAPIDistributedZkTest.test-seed#[3B9EA98D5C3FBD18]) [    ] o.a.s.c.c.SolrZkClient Using default ZkACLProvider
>    [junit4]   2> 831770 INFO  (TEST-CollectionsAPIDistributedZkTest.test-seed#[3B9EA98D5C3FBD18]) [n:127.0.0.1:33423__zsp%2Fp    ] o.a.s.c.c.ConnectionManager Waiting for client to connect to ZooKeeper
>    [junit4]   2> 831771 INFO  (zkCallback-849-thread-1-processing-n:127.0.0.1:33423__zsp%2Fp) [n:127.0.0.1:33423__zsp%2Fp    ] o.a.s.c.c.ConnectionManager Watcher org.apache.solr.common.cloud.ConnectionManager@108efd3 name:ZooKeeperConnection Watcher:127.0.0.1:44077/solr got event WatchedEvent state:SyncConnected type:None path:null path:null type:None
>    [junit4]   2> 831771 INFO  (TEST-CollectionsAPIDistributedZkTest.test-seed#[3B9EA98D5C3FBD18]) [n:127.0.0.1:33423__zsp%2Fp    ] o.a.s.c.c.ConnectionManager Client is connected to ZooKeeper
>    [junit4]   2> 831773 INFO  (TEST-CollectionsAPIDistributedZkTest.test-seed#[3B9EA98D5C3FBD18]) [n:127.0.0.1:33423__zsp%2Fp    ] o.a.s.c.c.ZkStateReader Updating cluster state from ZooKeeper...
>    [junit4]   2> 831795 INFO  (OverseerStateUpdate-94342668370182150-127.0.0.1:54920__zsp%2Fp-n_0000000000) [n:127.0.0.1:54920__zsp%2Fp    ] o.a.s.c.o.ZkStateWriter going to create_collection /collections/collection1/state.json
>    [junit4]   2> 831795 INFO  (zkCallback-844-thread-1) [    ] o.a.s.c.c.ZkStateReader A cluster state change: WatchedEvent state:SyncConnected type:NodeDataChanged path:/clusterstate.json, has occurred - updating... (live nodes size: 1)
>    [junit4]   2> 831795 INFO  (zkCallback-849-thread-1-processing-n:127.0.0.1:33423__zsp%2Fp) [n:127.0.0.1:33423__zsp%2Fp    ] o.a.s.c.c.ZkStateReader A cluster state change: WatchedEvent state:SyncConnected type:NodeDataChanged path:/clusterstate.json, has occurred - updating... (live nodes size: 1)
>    [junit4]   2> 831795 INFO  (zkCallback-842-thread-1-processing-n:127.0.0.1:54920__zsp%2Fp) [n:127.0.0.1:54920__zsp%2Fp    ] o.a.s.c.c.ZkStateReader A cluster state change: WatchedEvent state:SyncConnected type:NodeDataChanged path:/clusterstate.json, has occurred - updating... (live nodes size: 1)
>    [junit4]   2> 832775 INFO  (TEST-CollectionsAPIDistributedZkTest.test-seed#[3B9EA98D5C3FBD18]) [n:127.0.0.1:33423__zsp%2Fp    ] o.a.s.c.ZkController Register node as live in ZooKeeper:/live_nodes/127.0.0.1:33423__zsp%2Fp
>    [junit4]   2> 832775 INFO  (TEST-CollectionsAPIDistributedZkTest.test-seed#[3B9EA98D5C3FBD18]) [n:127.0.0.1:33423__zsp%2Fp    ] o.a.s.c.c.SolrZkClient makePath: /live_nodes/127.0.0.1:33423__zsp%2Fp
>    [junit4]   2> 832775 INFO  (zkCallback-842-thread-1-processing-n:127.0.0.1:54920__zsp%2Fp) [n:127.0.0.1:54920__zsp%2Fp    ] o.a.s.c.c.ZkStateReader A live node change: WatchedEvent state:SyncConnected type:NodeChildrenChanged path:/live_nodes, has occurred - updating... (live nodes size: 1)
>    [junit4]   2> 832775 INFO  (zkCallback-844-thread-1) [    ] o.a.s.c.c.ZkStateReader A live node change: WatchedEvent state:SyncConnected type:NodeChildrenChanged path:/live_nodes, has occurred - updating... (live nodes size: 1)
>    [junit4]   2> 832776 INFO  (zkCallback-849-thread-1-processing-n:127.0.0.1:33423__zsp%2Fp) [n:127.0.0.1:33423__zsp%2Fp    ] o.a.s.c.c.ZkStateReader A live node change: WatchedEvent state:SyncConnected type:NodeChildrenChanged path:/live_nodes, has occurred - updating... (live nodes size: 1)
>    [junit4]   2> 832776 INFO  (TEST-CollectionsAPIDistributedZkTest.test-seed#[3B9EA98D5C3FBD18]) [n:127.0.0.1:33423__zsp%2Fp    ] o.a.s.c.Overseer Overseer (id=null) closing
>    [junit4]   2> 832776 INFO  (TEST-CollectionsAPIDistributedZkTest.test-seed#[3B9EA98D5C3FBD18]) [n:127.0.0.1:33423__zsp%2Fp    ] o.a.s.c.LeaderElector Joined leadership election with path: /overseer_elect/election/94342668370182155-127.0.0.1:33423__zsp%2Fp-n_0000000001
>    [junit4]   2> 832776 INFO  (TEST-CollectionsAPIDistributedZkTest.test-seed#[3B9EA98D5C3FBD18]) [n:127.0.0.1:33423__zsp%2Fp    ] o.a.s.c.LeaderElector Watching path /overseer_elect/election/94342668370182150-127.0.0.1:54920__zsp%2Fp-n_0000000000 to know if I could be the leader
>    [junit4]   2> 832787 INFO  (TEST-CollectionsAPIDistributedZkTest.test-seed#[3B9EA98D5C3FBD18]) [n:127.0.0.1:33423__zsp%2Fp    ] o.a.s.c.CoreContainer Security conf doesn't exist. Skipping setup for authorization module.
>    [junit4]   2> 832787 INFO  (TEST-CollectionsAPIDistributedZkTest.test-seed#[3B9EA98D5C3FBD18]) [n:127.0.0.1:33423__zsp%2Fp    ] o.a.s.c.CoreContainer No authentication plugin used.
>    [junit4]   2> 832787 INFO  (TEST-CollectionsAPIDistributedZkTest.test-seed#[3B9EA98D5C3FBD18]) [n:127.0.0.1:33423__zsp%2Fp    ] o.a.s.c.CoresLocator Looking for core definitions underneath /home/jenkins/workspace/Lucene-Solr-trunk-Linux/solr/build/sol
>
> [...truncated too long message...]
>
> ollection1] o.a.s.c.CachingDirectoryFactory Closing directory: /home/jenkins/workspace/Lucene-Solr-trunk-Linux/solr/build/solr-core/test/J1/temp/solr.cloud.CollectionsAPIDistributedZkTest_3B9EA98D5C3FBD18-001/shard-4-001/cores/collection1/data
>    [junit4]   2> 938048 INFO  (TEST-CollectionsAPIDistributedZkTest.test-seed#[3B9EA98D5C3FBD18]) [n:127.0.0.1:46096__zsp%2Fp c:collection1 s:shard1 r:core_node4 x:collection1] o.a.s.c.Overseer Overseer (id=94342668370182164-127.0.0.1:46096__zsp%2Fp-n_0000000004) closing
>    [junit4]   2> 938049 INFO  (OverseerStateUpdate-94342668370182164-127.0.0.1:46096__zsp%2Fp-n_0000000004) [n:127.0.0.1:46096__zsp%2Fp    ] o.a.s.c.Overseer Overseer Loop exiting : 127.0.0.1:46096__zsp%2Fp
>    [junit4]   2> 938060 INFO  (zkCallback-862-thread-2-processing-n:127.0.0.1:46096__zsp%2Fp) [n:127.0.0.1:46096__zsp%2Fp    ] o.a.s.c.c.ZkStateReader A live node change: WatchedEvent state:SyncConnected type:NodeChildrenChanged path:/live_nodes, has occurred - updating... (live nodes size: 1)
>    [junit4]   2> 938060 WARN  (zkCallback-862-thread-2-processing-n:127.0.0.1:46096__zsp%2Fp) [n:127.0.0.1:46096__zsp%2Fp    ] o.a.s.c.c.ZkStateReader ZooKeeper watch triggered, but Solr cannot talk to ZK
>    [junit4]   2> 938061 INFO  (TEST-CollectionsAPIDistributedZkTest.test-seed#[3B9EA98D5C3FBD18]) [    ] o.e.j.s.ServerConnector Stopped ServerConnector@1c49356{HTTP/1.1}{127.0.0.1:0}
>    [junit4]   2> 938061 INFO  (TEST-CollectionsAPIDistributedZkTest.test-seed#[3B9EA98D5C3FBD18]) [    ] o.e.j.s.h.ContextHandler Stopped o.e.j.s.ServletContextHandler@3d5398{/_zsp/p,null,UNAVAILABLE}
>    [junit4]   2> 938063 INFO  (TEST-CollectionsAPIDistributedZkTest.test-seed#[3B9EA98D5C3FBD18]) [n:127.0.0.1:46096__zsp%2Fp c:collection1 s:shard1 r:core_node4 x:collection1] o.a.s.c.ZkTestServer connecting to 127.0.0.1:44077 44077
>    [junit4]   2> 938079 INFO  (Thread-2273) [    ] o.a.s.c.ZkTestServer connecting to 127.0.0.1:44077 44077
>    [junit4]   2> 938080 WARN  (Thread-2273) [    ] o.a.s.c.ZkTestServer Watch limit violations:
>    [junit4]   2> Maximum concurrent create/delete watches above limit:
>    [junit4]   2>
>    [junit4]   2>        5       /solr/configs/conf2
>    [junit4]   2>        5       /solr/aliases.json
>    [junit4]   2>
>    [junit4]   2> Maximum concurrent data watches above limit:
>    [junit4]   2>
>    [junit4]   2>        5       /solr/collections/halfdeletedcollection2/state.json
>    [junit4]   2>        5       /solr/collections/awholynewstresscollection_collection0_0/state.json
>    [junit4]   2>        5       /solr/collections/awholynewstresscollection_collection1_0/state.json
>    [junit4]   2>        5       /solr/clusterstate.json
>    [junit4]   2>        2       /solr/collections/acollectionafterbaddelete/state.json
>    [junit4]   2>        2       /solr/collections/awholynewcollection_2/state.json
>    [junit4]   2>        2       /solr/overseer_elect/election/94342668370182150-127.0.0.1:54920__zsp%2Fp-n_0000000000
>    [junit4]   2>        2       /solr/collections/halfdeletedcollection/state.json
>    [junit4]   2>
>    [junit4]   2> Maximum concurrent children watches above limit:
>    [junit4]   2>
>    [junit4]   2>        5       /solr/live_nodes
>    [junit4]   2>        2       /solr/overseer/collection-queue-work
>    [junit4]   2>
>    [junit4]   2> NOTE: reproduce with: ant test  -Dtestcase=CollectionsAPIDistributedZkTest -Dtests.method=test -Dtests.seed=3B9EA98D5C3FBD18 -Dtests.multiplier=3 -Dtests.slow=true -Dtests.locale=mk -Dtests.timezone=Greenwich -Dtests.asserts=true -Dtests.file.encoding=UTF-8
>    [junit4] ERROR    108s J1 | CollectionsAPIDistributedZkTest.test <<<
>    [junit4]    > Throwable #1: org.apache.solr.client.solrj.impl.HttpSolrClient$RemoteSolrException: Error from server at http://127.0.0.1:45554/_zsp/p: Could not fully remove collection: halfdeletedcollection2
>    [junit4]    >        at __randomizedtesting.SeedInfo.seed([3B9EA98D5C3FBD18:B3CA9657F2C3D0E0]:0)
>    [junit4]    >        at org.apache.solr.client.solrj.impl.HttpSolrClient.executeMethod(HttpSolrClient.java:560)
>    [junit4]    >        at org.apache.solr.client.solrj.impl.HttpSolrClient.request(HttpSolrClient.java:234)
>    [junit4]    >        at org.apache.solr.client.solrj.impl.HttpSolrClient.request(HttpSolrClient.java:226)
>    [junit4]    >        at org.apache.solr.client.solrj.SolrClient.request(SolrClient.java:1220)
>    [junit4]    >        at org.apache.solr.cloud.CollectionsAPIDistributedZkTest.makeRequest(CollectionsAPIDistributedZkTest.java:302)
>    [junit4]    >        at org.apache.solr.cloud.CollectionsAPIDistributedZkTest.deleteCollectionWithDownNodes(CollectionsAPIDistributedZkTest.java:283)
>    [junit4]    >        at org.apache.solr.cloud.CollectionsAPIDistributedZkTest.test(CollectionsAPIDistributedZkTest.java:175)
>    [junit4]    >        at org.apache.solr.BaseDistributedSearchTestCase$ShardsRepeatRule$ShardsFixedStatement.callStatement(BaseDistributedSearchTestCase.java:963)
>    [junit4]    >        at org.apache.solr.BaseDistributedSearchTestCase$ShardsRepeatRule$ShardsStatement.evaluate(BaseDistributedSearchTestCase.java:938)
>    [junit4]    >        at java.lang.Thread.run(Thread.java:745)
>    [junit4]   2> 938085 INFO  (SUITE-CollectionsAPIDistributedZkTest-seed#[3B9EA98D5C3FBD18]-worker) [n:127.0.0.1:46096__zsp%2Fp c:collection1 s:shard1 r:core_node4 x:collection1] o.a.s.SolrTestCaseJ4 ###deleteCore
>    [junit4]   2> NOTE: leaving temporary files on disk at: /home/jenkins/workspace/Lucene-Solr-trunk-Linux/solr/build/solr-core/test/J1/temp/solr.cloud.CollectionsAPIDistributedZkTest_3B9EA98D5C3FBD18-001
>    [junit4]   2> Aug 14, 2015 7:23:04 AM com.carrotsearch.randomizedtesting.ThreadLeakControl checkThreadLeaks
>    [junit4]   2> WARNING: Will linger awaiting termination of 2 leaked thread(s).
>    [junit4]   2> NOTE: test params are: codec=Asserting(Lucene53): {other_tl1=PostingsFormat(name=Asserting), range_facet_l_dv=PostingsFormat(name=Memory doPackFST= true), _version_=PostingsFormat(name=Asserting), multiDefault=Lucene50(blocksize=128), a_t=PostingsFormat(name=Asserting), intDefault=PostingsFormat(name=Asserting), a_i1=PostingsFormat(name=Asserting), id=PostingsFormat(name=Memory doPackFST= true), range_facet_i_dv=PostingsFormat(name=Asserting), text=PostingsFormat(name=LuceneFixedGap), range_facet_l=PostingsFormat(name=Asserting), timestamp=PostingsFormat(name=Asserting)}, docValues:{range_facet_l_dv=DocValuesFormat(name=Direct), range_facet_i_dv=DocValuesFormat(name=Asserting), timestamp=DocValuesFormat(name=Asserting)}, sim=DefaultSimilarity, locale=mk, timezone=Greenwich
>    [junit4]   2> NOTE: Linux 3.16.0-44-generic i386/Oracle Corporation 1.9.0-ea (32-bit)/cpus=12,threads=1,free=203566336,total=409706496
>    [junit4]   2> NOTE: All tests run in this JVM: [TestValueSourceCache, BadComponentTest, SegmentsInfoRequestHandlerTest, AtomicUpdatesTest, TestStandardQParsers, JSONWriterTest, TestPivotHelperCode, CoreAdminHandlerTest, TestFieldCollectionResource, RequiredFieldsTest, ShowFileRequestHandlerTest, MigrateRouteKeyTest, TestHighlightDedupGrouping, TestSolrConfigHandlerConcurrent, DocumentBuilderTest, TestOmitPositions, BitVectorTest, TestSolrCloudWithKerberosAlt, AsyncMigrateRouteKeyTest, SmileWriterTest, ShardRoutingTest, DistributedMLTComponentTest, TestFreeTextSuggestions, HdfsThreadLeakTest, TestElisionMultitermQuery, TestManagedSchema, TestCoreDiscovery, RemoteQueryErrorTest, TestExceedMaxTermLength, TestSchemaResource, HdfsBasicDistributedZk2Test, HdfsChaosMonkeySafeLeaderTest, AlternateDirectoryTest, AssignTest, AnalysisAfterCoreReloadTest, TestJsonRequest, TestFoldingMultitermQuery, TestCollapseQParserPlugin, TestFuzzyAnalyzedSuggestions, ConcurrentDeleteAndCreateCollectionTest, CacheHeaderTest, SliceStateTest, BufferStoreTest, TestInitQParser, TestAnalyzedSuggestions, TestSimpleQParserPlugin, TestReRankQParserPlugin, SecurityConfHandlerTest, ShardSplitTest, TestLeaderElectionZkExpiry, TestStressUserVersions, RAMDirectoryFactoryTest, DataDrivenBlockJoinTest, CdcrReplicationHandlerTest, TestDefaultStatsCache, TestFastWriter, FacetPivotSmallTest, TestSolrXml, TestSolr4Spatial2, NoCacheHeaderTest, CollectionsAPIAsyncDistributedZkTest, TestImplicitCoreProperties, SuggesterTSTTest, DocumentAnalysisRequestHandlerTest, TestFastLRUCache, TestCoreContainer, TestIntervalFaceting, ReturnFieldsTest, TestSortByMinMaxFunction, TestSchemaManager, SolrCloudExampleTest, TestDocBasedVersionConstraints, TestLMJelinekMercerSimilarityFactory, DisMaxRequestHandlerTest, WordBreakSolrSpellCheckerTest, OpenCloseCoreStressTest, SaslZkACLProviderTest, CustomCollectionTest, TestReloadDeadlock, ChaosMonkeySafeLeaderTest, ResourceLoaderTest, SpellingQueryConverterTest, DeleteShardTest, SpellPossibilityIteratorTest, SolrPluginUtilsTest, IndexSchemaRuntimeFieldTest, TestNRTOpen, DistributedFacetPivotWhiteBoxTest, BasicDistributedZk2Test, CollectionsAPIDistributedZkTest]
>    [junit4] Completed [257/540] on J1 in 108.96s, 1 test, 1 error <<< FAILURES!
>
> [...truncated 891 lines...]
> BUILD FAILED
> /home/jenkins/workspace/Lucene-Solr-trunk-Linux/build.xml:775: The following error occurred while executing this line:
> /home/jenkins/workspace/Lucene-Solr-trunk-Linux/build.xml:719: The following error occurred while executing this line:
> /home/jenkins/workspace/Lucene-Solr-trunk-Linux/build.xml:59: The following error occurred while executing this line:
> /home/jenkins/workspace/Lucene-Solr-trunk-Linux/solr/build.xml:233: The following error occurred while executing this line:
> /home/jenkins/workspace/Lucene-Solr-trunk-Linux/solr/common-build.xml:514: The following error occurred while executing this line:
> /home/jenkins/workspace/Lucene-Solr-trunk-Linux/lucene/common-build.xml:1429: The following error occurred while executing this line:
> /home/jenkins/workspace/Lucene-Solr-trunk-Linux/lucene/common-build.xml:984: There were test failures: 540 suites, 2131 tests, 1 error, 67 ignored (32 assumptions)
>
> Total time: 46 minutes 6 seconds
> Build step 'Invoke Ant' marked build as failure
> Archiving artifacts
> [WARNINGS] Skipping publisher since build result is FAILURE
> Recording test results
> Email was triggered for: Failure - Any
> Sending email for trigger: Failure - Any
>
>
>
>
> ---------------------------------------------------------------------
> To unsubscribe, e-mail: dev-unsubscribe@lucene.apache.org
> For additional commands, e-mail: dev-help@lucene.apache.org



-- 
Regards,
Shalin Shekhar Mangar.

---------------------------------------------------------------------
To unsubscribe, e-mail: dev-unsubscribe@lucene.apache.org
For additional commands, e-mail: dev-help@lucene.apache.org


Mime
View raw message