lucene-dev mailing list archives

Site index · List index
Message view « Date » · « Thread »
Top « Date » · « Thread »
From Shalin Shekhar Mangar <sha...@apache.org>
Subject Re: [JENKINS] Lucene-Solr-trunk-MacOSX (64bit/jdk1.8.0) - Build # 2568 - Failure!
Date Sat, 01 Aug 2015 14:59:17 GMT
I just saw these ConnectionShutdownException during a local test run
as well. Is this related to SOLR-6625?

On Sat, Aug 1, 2015 at 6:49 PM, Policeman Jenkins Server
<jenkins@thetaphi.de> wrote:
> Build: http://jenkins.thetaphi.de/job/Lucene-Solr-trunk-MacOSX/2568/
> Java: 64bit/jdk1.8.0 -XX:+UseCompressedOops -XX:+UseSerialGC
>
> 2 tests failed.
> FAILED:  org.apache.solr.cloud.BasicDistributedZk2Test.test
>
> Error Message:
> IOException occured when talking to server at: http://127.0.0.1:62075/onenodecollection
>
> Stack Trace:
> org.apache.solr.client.solrj.SolrServerException: IOException occured when talking to server at: http://127.0.0.1:62075/onenodecollection
>         at __randomizedtesting.SeedInfo.seed([FDD716235CED2808:758329F9F21145F0]:0)
>         at org.apache.solr.client.solrj.impl.HttpSolrClient.executeMethod(HttpSolrClient.java:575)
>         at org.apache.solr.client.solrj.impl.HttpSolrClient.request(HttpSolrClient.java:234)
>         at org.apache.solr.client.solrj.impl.HttpSolrClient.request(HttpSolrClient.java:226)
>         at org.apache.solr.client.solrj.SolrRequest.process(SolrRequest.java:135)
>         at org.apache.solr.client.solrj.SolrClient.commit(SolrClient.java:485)
>         at org.apache.solr.client.solrj.SolrClient.commit(SolrClient.java:464)
>         at org.apache.solr.cloud.BasicDistributedZk2Test.addAndQueryDocs(BasicDistributedZk2Test.java:207)
>         at org.apache.solr.cloud.BasicDistributedZk2Test.testNodeWithoutCollectionForwarding(BasicDistributedZk2Test.java:173)
>         at org.apache.solr.cloud.BasicDistributedZk2Test.test(BasicDistributedZk2Test.java:71)
>         at sun.reflect.NativeMethodAccessorImpl.invoke0(Native Method)
>         at sun.reflect.NativeMethodAccessorImpl.invoke(NativeMethodAccessorImpl.java:62)
>         at sun.reflect.DelegatingMethodAccessorImpl.invoke(DelegatingMethodAccessorImpl.java:43)
>         at java.lang.reflect.Method.invoke(Method.java:497)
>         at com.carrotsearch.randomizedtesting.RandomizedRunner.invoke(RandomizedRunner.java:1627)
>         at com.carrotsearch.randomizedtesting.RandomizedRunner$6.evaluate(RandomizedRunner.java:836)
>         at com.carrotsearch.randomizedtesting.RandomizedRunner$7.evaluate(RandomizedRunner.java:872)
>         at com.carrotsearch.randomizedtesting.RandomizedRunner$8.evaluate(RandomizedRunner.java:886)
>         at org.apache.solr.BaseDistributedSearchTestCase$ShardsRepeatRule$ShardsFixedStatement.callStatement(BaseDistributedSearchTestCase.java:966)
>         at org.apache.solr.BaseDistributedSearchTestCase$ShardsRepeatRule$ShardsStatement.evaluate(BaseDistributedSearchTestCase.java:941)
>         at com.carrotsearch.randomizedtesting.rules.SystemPropertiesRestoreRule$1.evaluate(SystemPropertiesRestoreRule.java:57)
>         at org.apache.lucene.util.TestRuleSetupTeardownChained$1.evaluate(TestRuleSetupTeardownChained.java:50)
>         at org.apache.lucene.util.AbstractBeforeAfterRule$1.evaluate(AbstractBeforeAfterRule.java:46)
>         at org.apache.lucene.util.TestRuleThreadAndTestName$1.evaluate(TestRuleThreadAndTestName.java:49)
>         at org.apache.lucene.util.TestRuleIgnoreAfterMaxFailures$1.evaluate(TestRuleIgnoreAfterMaxFailures.java:65)
>         at org.apache.lucene.util.TestRuleMarkFailure$1.evaluate(TestRuleMarkFailure.java:48)
>         at com.carrotsearch.randomizedtesting.rules.StatementAdapter.evaluate(StatementAdapter.java:36)
>         at com.carrotsearch.randomizedtesting.ThreadLeakControl$StatementRunner.run(ThreadLeakControl.java:365)
>         at com.carrotsearch.randomizedtesting.ThreadLeakControl.forkTimeoutingTask(ThreadLeakControl.java:798)
>         at com.carrotsearch.randomizedtesting.ThreadLeakControl$3.evaluate(ThreadLeakControl.java:458)
>         at com.carrotsearch.randomizedtesting.RandomizedRunner.runSingleTest(RandomizedRunner.java:845)
>         at com.carrotsearch.randomizedtesting.RandomizedRunner$3.evaluate(RandomizedRunner.java:747)
>         at com.carrotsearch.randomizedtesting.RandomizedRunner$4.evaluate(RandomizedRunner.java:781)
>         at com.carrotsearch.randomizedtesting.RandomizedRunner$5.evaluate(RandomizedRunner.java:792)
>         at com.carrotsearch.randomizedtesting.rules.StatementAdapter.evaluate(StatementAdapter.java:36)
>         at com.carrotsearch.randomizedtesting.rules.SystemPropertiesRestoreRule$1.evaluate(SystemPropertiesRestoreRule.java:57)
>         at org.apache.lucene.util.AbstractBeforeAfterRule$1.evaluate(AbstractBeforeAfterRule.java:46)
>         at com.carrotsearch.randomizedtesting.rules.StatementAdapter.evaluate(StatementAdapter.java:36)
>         at org.apache.lucene.util.TestRuleStoreClassName$1.evaluate(TestRuleStoreClassName.java:42)
>         at com.carrotsearch.randomizedtesting.rules.NoShadowingOrOverridesOnMethodsRule$1.evaluate(NoShadowingOrOverridesOnMethodsRule.java:39)
>         at com.carrotsearch.randomizedtesting.rules.NoShadowingOrOverridesOnMethodsRule$1.evaluate(NoShadowingOrOverridesOnMethodsRule.java:39)
>         at com.carrotsearch.randomizedtesting.rules.StatementAdapter.evaluate(StatementAdapter.java:36)
>         at com.carrotsearch.randomizedtesting.rules.StatementAdapter.evaluate(StatementAdapter.java:36)
>         at com.carrotsearch.randomizedtesting.rules.StatementAdapter.evaluate(StatementAdapter.java:36)
>         at org.apache.lucene.util.TestRuleAssertionsRequired$1.evaluate(TestRuleAssertionsRequired.java:54)
>         at org.apache.lucene.util.TestRuleMarkFailure$1.evaluate(TestRuleMarkFailure.java:48)
>         at org.apache.lucene.util.TestRuleIgnoreAfterMaxFailures$1.evaluate(TestRuleIgnoreAfterMaxFailures.java:65)
>         at org.apache.lucene.util.TestRuleIgnoreTestSuites$1.evaluate(TestRuleIgnoreTestSuites.java:55)
>         at com.carrotsearch.randomizedtesting.rules.StatementAdapter.evaluate(StatementAdapter.java:36)
>         at com.carrotsearch.randomizedtesting.ThreadLeakControl$StatementRunner.run(ThreadLeakControl.java:365)
>         at java.lang.Thread.run(Thread.java:745)
> Caused by: java.io.InterruptedIOException: Connection has been shut down
>         at org.apache.http.impl.client.DefaultRequestDirector.execute(DefaultRequestDirector.java:579)
>         at org.apache.http.impl.client.AbstractHttpClient.doExecute(AbstractHttpClient.java:882)
>         at org.apache.http.impl.client.CloseableHttpClient.execute(CloseableHttpClient.java:82)
>         at org.apache.solr.util.SolrHttpClient$SolrSystemDefaultHttpClient.execute(SolrHttpClient.java:54)
>         at org.apache.solr.util.SolrHttpClient$SolrSystemDefaultHttpClient.execute(SolrHttpClient.java:45)
>         at org.apache.solr.client.solrj.impl.HttpSolrClient.executeMethod(HttpSolrClient.java:465)
>         ... 49 more
> Caused by: org.apache.http.impl.conn.ConnectionShutdownException
>         at org.apache.http.impl.conn.ManagedClientConnectionImpl.ensureConnection(ManagedClientConnectionImpl.java:115)
>         at org.apache.http.impl.conn.ManagedClientConnectionImpl.getSSLSession(ManagedClientConnectionImpl.java:247)
>         at org.apache.http.impl.client.DefaultUserTokenHandler.getUserToken(DefaultUserTokenHandler.java:81)
>         at org.apache.http.impl.client.DefaultRequestDirector.execute(DefaultRequestDirector.java:550)
>         ... 54 more
>
>
> FAILED:  org.apache.solr.cloud.CloudExitableDirectoryReaderTest.test
>
> Error Message:
> No live SolrServers available to handle this request
>
> Stack Trace:
> org.apache.solr.client.solrj.SolrServerException: No live SolrServers available to handle this request
>         at __randomizedtesting.SeedInfo.seed([FDD716235CED2808:758329F9F21145F0]:0)
>         at org.apache.solr.client.solrj.impl.LBHttpSolrClient.request(LBHttpSolrClient.java:353)
>         at org.apache.solr.client.solrj.impl.CloudSolrClient.sendRequest(CloudSolrClient.java:1086)
>         at org.apache.solr.client.solrj.impl.CloudSolrClient.requestWithRetryOnStaleState(CloudSolrClient.java:856)
>         at org.apache.solr.client.solrj.impl.CloudSolrClient.request(CloudSolrClient.java:799)
>         at org.apache.solr.client.solrj.SolrRequest.process(SolrRequest.java:135)
>         at org.apache.solr.client.solrj.SolrClient.query(SolrClient.java:943)
>         at org.apache.solr.client.solrj.SolrClient.query(SolrClient.java:958)
>         at org.apache.solr.cloud.AbstractFullDistribZkTestBase.queryServer(AbstractFullDistribZkTestBase.java:1376)
>         at org.apache.solr.cloud.CloudExitableDirectoryReaderTest.assertPartialResults(CloudExitableDirectoryReaderTest.java:102)
>         at org.apache.solr.cloud.CloudExitableDirectoryReaderTest.doTimeoutTests(CloudExitableDirectoryReaderTest.java:74)
>         at org.apache.solr.cloud.CloudExitableDirectoryReaderTest.test(CloudExitableDirectoryReaderTest.java:53)
>         at sun.reflect.NativeMethodAccessorImpl.invoke0(Native Method)
>         at sun.reflect.NativeMethodAccessorImpl.invoke(NativeMethodAccessorImpl.java:62)
>         at sun.reflect.DelegatingMethodAccessorImpl.invoke(DelegatingMethodAccessorImpl.java:43)
>         at java.lang.reflect.Method.invoke(Method.java:497)
>         at com.carrotsearch.randomizedtesting.RandomizedRunner.invoke(RandomizedRunner.java:1627)
>         at com.carrotsearch.randomizedtesting.RandomizedRunner$6.evaluate(RandomizedRunner.java:836)
>         at com.carrotsearch.randomizedtesting.RandomizedRunner$7.evaluate(RandomizedRunner.java:872)
>         at com.carrotsearch.randomizedtesting.RandomizedRunner$8.evaluate(RandomizedRunner.java:886)
>         at org.apache.solr.BaseDistributedSearchTestCase$ShardsRepeatRule$ShardsFixedStatement.callStatement(BaseDistributedSearchTestCase.java:966)
>         at org.apache.solr.BaseDistributedSearchTestCase$ShardsRepeatRule$ShardsStatement.evaluate(BaseDistributedSearchTestCase.java:941)
>         at com.carrotsearch.randomizedtesting.rules.SystemPropertiesRestoreRule$1.evaluate(SystemPropertiesRestoreRule.java:57)
>         at org.apache.lucene.util.TestRuleSetupTeardownChained$1.evaluate(TestRuleSetupTeardownChained.java:50)
>         at org.apache.lucene.util.AbstractBeforeAfterRule$1.evaluate(AbstractBeforeAfterRule.java:46)
>         at org.apache.lucene.util.TestRuleThreadAndTestName$1.evaluate(TestRuleThreadAndTestName.java:49)
>         at org.apache.lucene.util.TestRuleIgnoreAfterMaxFailures$1.evaluate(TestRuleIgnoreAfterMaxFailures.java:65)
>         at org.apache.lucene.util.TestRuleMarkFailure$1.evaluate(TestRuleMarkFailure.java:48)
>         at com.carrotsearch.randomizedtesting.rules.StatementAdapter.evaluate(StatementAdapter.java:36)
>         at com.carrotsearch.randomizedtesting.ThreadLeakControl$StatementRunner.run(ThreadLeakControl.java:365)
>         at com.carrotsearch.randomizedtesting.ThreadLeakControl.forkTimeoutingTask(ThreadLeakControl.java:798)
>         at com.carrotsearch.randomizedtesting.ThreadLeakControl$3.evaluate(ThreadLeakControl.java:458)
>         at com.carrotsearch.randomizedtesting.RandomizedRunner.runSingleTest(RandomizedRunner.java:845)
>         at com.carrotsearch.randomizedtesting.RandomizedRunner$3.evaluate(RandomizedRunner.java:747)
>         at com.carrotsearch.randomizedtesting.RandomizedRunner$4.evaluate(RandomizedRunner.java:781)
>         at com.carrotsearch.randomizedtesting.RandomizedRunner$5.evaluate(RandomizedRunner.java:792)
>         at com.carrotsearch.randomizedtesting.rules.StatementAdapter.evaluate(StatementAdapter.java:36)
>         at com.carrotsearch.randomizedtesting.rules.SystemPropertiesRestoreRule$1.evaluate(SystemPropertiesRestoreRule.java:57)
>         at org.apache.lucene.util.AbstractBeforeAfterRule$1.evaluate(AbstractBeforeAfterRule.java:46)
>         at com.carrotsearch.randomizedtesting.rules.StatementAdapter.evaluate(StatementAdapter.java:36)
>         at org.apache.lucene.util.TestRuleStoreClassName$1.evaluate(TestRuleStoreClassName.java:42)
>         at com.carrotsearch.randomizedtesting.rules.NoShadowingOrOverridesOnMethodsRule$1.evaluate(NoShadowingOrOverridesOnMethodsRule.java:39)
>         at com.carrotsearch.randomizedtesting.rules.NoShadowingOrOverridesOnMethodsRule$1.evaluate(NoShadowingOrOverridesOnMethodsRule.java:39)
>         at com.carrotsearch.randomizedtesting.rules.StatementAdapter.evaluate(StatementAdapter.java:36)
>         at com.carrotsearch.randomizedtesting.rules.StatementAdapter.evaluate(StatementAdapter.java:36)
>         at com.carrotsearch.randomizedtesting.rules.StatementAdapter.evaluate(StatementAdapter.java:36)
>         at org.apache.lucene.util.TestRuleAssertionsRequired$1.evaluate(TestRuleAssertionsRequired.java:54)
>         at org.apache.lucene.util.TestRuleMarkFailure$1.evaluate(TestRuleMarkFailure.java:48)
>         at org.apache.lucene.util.TestRuleIgnoreAfterMaxFailures$1.evaluate(TestRuleIgnoreAfterMaxFailures.java:65)
>         at org.apache.lucene.util.TestRuleIgnoreTestSuites$1.evaluate(TestRuleIgnoreTestSuites.java:55)
>         at com.carrotsearch.randomizedtesting.rules.StatementAdapter.evaluate(StatementAdapter.java:36)
>         at com.carrotsearch.randomizedtesting.ThreadLeakControl$StatementRunner.run(ThreadLeakControl.java:365)
>         at java.lang.Thread.run(Thread.java:745)
>
>
>
>
> Build Log:
> [...truncated 10435 lines...]
>    [junit4] Suite: org.apache.solr.cloud.BasicDistributedZk2Test
>    [junit4]   2> Creating dataDir: /Users/jenkins/workspace/Lucene-Solr-trunk-MacOSX/solr/build/solr-core/test/J0/temp/solr.cloud.BasicDistributedZk2Test_FDD716235CED2808-001/init-core-data-001
>    [junit4]   2> 1640040 INFO  (SUITE-BasicDistributedZk2Test-seed#[FDD716235CED2808]-worker) [    ] o.a.s.BaseDistributedSearchTestCase Setting hostContext system property: /
>    [junit4]   2> 1640046 INFO  (TEST-BasicDistributedZk2Test.test-seed#[FDD716235CED2808]) [    ] o.a.s.c.ZkTestServer STARTING ZK TEST SERVER
>    [junit4]   2> 1640047 INFO  (Thread-3379) [    ] o.a.s.c.ZkTestServer client port:0.0.0.0/0.0.0.0:0
>    [junit4]   2> 1640048 INFO  (Thread-3379) [    ] o.a.s.c.ZkTestServer Starting server
>    [junit4]   2> 1640148 INFO  (TEST-BasicDistributedZk2Test.test-seed#[FDD716235CED2808]) [    ] o.a.s.c.ZkTestServer start zk server on port:62045
>    [junit4]   2> 1640149 INFO  (TEST-BasicDistributedZk2Test.test-seed#[FDD716235CED2808]) [    ] o.a.s.c.c.SolrZkClient Using default ZkCredentialsProvider
>    [junit4]   2> 1640151 INFO  (TEST-BasicDistributedZk2Test.test-seed#[FDD716235CED2808]) [    ] o.a.s.c.c.ConnectionManager Waiting for client to connect to ZooKeeper
>    [junit4]   2> 1640153 INFO  (zkCallback-1312-thread-1) [    ] o.a.s.c.c.ConnectionManager Watcher org.apache.solr.common.cloud.ConnectionManager@2d5e152e name:ZooKeeperConnection Watcher:127.0.0.1:62045 got event WatchedEvent state:SyncConnected type:None path:null path:null type:None
>    [junit4]   2> 1640153 INFO  (TEST-BasicDistributedZk2Test.test-seed#[FDD716235CED2808]) [    ] o.a.s.c.c.ConnectionManager Client is connected to ZooKeeper
>    [junit4]   2> 1640153 INFO  (TEST-BasicDistributedZk2Test.test-seed#[FDD716235CED2808]) [    ] o.a.s.c.c.SolrZkClient Using default ZkACLProvider
>    [junit4]   2> 1640153 INFO  (TEST-BasicDistributedZk2Test.test-seed#[FDD716235CED2808]) [    ] o.a.s.c.c.SolrZkClient makePath: /solr
>    [junit4]   2> 1640176 INFO  (TEST-BasicDistributedZk2Test.test-seed#[FDD716235CED2808]) [    ] o.a.s.c.c.SolrZkClient Using default ZkCredentialsProvider
>    [junit4]   2> 1640179 INFO  (TEST-BasicDistributedZk2Test.test-seed#[FDD716235CED2808]) [    ] o.a.s.c.c.ConnectionManager Waiting for client to connect to ZooKeeper
>    [junit4]   2> 1640192 INFO  (zkCallback-1313-thread-1) [    ] o.a.s.c.c.ConnectionManager Watcher org.apache.solr.common.cloud.ConnectionManager@3020d200 name:ZooKeeperConnection Watcher:127.0.0.1:62045/solr got event WatchedEvent state:SyncConnected type:None path:null path:null type:None
>    [junit4]   2> 1640192 INFO  (TEST-BasicDistributedZk2Test.test-seed#[FDD716235CED2808]) [    ] o.a.s.c.c.ConnectionManager Client is connected to ZooKeeper
>    [junit4]   2> 1640193 INFO  (TEST-BasicDistributedZk2Test.test-seed#[FDD716235CED2808]) [    ] o.a.s.c.c.SolrZkClient Using default ZkACLProvider
>    [junit4]   2> 1640193 INFO  (TEST-BasicDistributedZk2Test.test-seed#[FDD716235CED2808]) [    ] o.a.s.c.c.SolrZkClient makePath: /collections/collection1
>    [junit4]   2> 1640199 INFO  (TEST-BasicDistributedZk2Test.test-seed#[FDD716235CED2808]) [    ] o.a.s.c.c.SolrZkClient makePath: /collections/collection1/shards
>    [junit4]   2> 1640202 INFO  (TEST-BasicDistributedZk2Test.test-seed#[FDD716235CED2808]) [    ] o.a.s.c.c.SolrZkClient makePath: /collections/control_collection
>    [junit4]   2> 1640204 INFO  (TEST-BasicDistributedZk2Test.test-seed#[FDD716235CED2808]) [    ] o.a.s.c.c.SolrZkClient makePath: /collections/control_collection/shards
>    [junit4]   2> 1640208 INFO  (TEST-BasicDistributedZk2Test.test-seed#[FDD716235CED2808]) [    ] o.a.s.c.AbstractZkTestCase put /Users/jenkins/workspace/Lucene-Solr-trunk-MacOSX/solr/core/src/test-files/solr/collection1/conf/solrconfig-tlog.xml to /configs/conf1/solrconfig.xml
>    [junit4]   2> 1640208 INFO  (TEST-BasicDistributedZk2Test.test-seed#[FDD716235CED2808]) [    ] o.a.s.c.c.SolrZkClient makePath: /configs/conf1/solrconfig.xml
>    [junit4]   2> 1640212 INFO  (TEST-BasicDistributedZk2Test.test-seed#[FDD716235CED2808]) [    ] o.a.s.c.AbstractZkTestCase put /Users/jenkins/workspace/Lucene-Solr-trunk-MacOSX/solr/core/src/test-files/solr/collection1/conf/schema.xml to /configs/conf1/schema.xml
>    [junit4]   2> 1640213 INFO  (TEST-BasicDistributedZk2Test.test-seed#[FDD716235CED2808]) [    ] o.a.s.c.c.SolrZkClient makePath: /configs/conf1/schema.xml
>    [junit4]   2> 1640216 INFO  (TEST-BasicDistributedZk2Test.test-seed#[FDD716235CED2808]) [    ] o.a.s.c.AbstractZkTestCase put /Users/jenkins/workspace/Lucene-Solr-trunk-MacOSX/solr/core/src/test-files/solr/collection1/conf/solrconfig.snippet.randomindexconfig.xml to /configs/conf1/solrconfig.snippet.randomindexconfig.xml
>    [junit4]   2> 1640216 INFO  (TEST-BasicDistributedZk2Test.test-seed#[FDD716235CED2808]) [    ] o.a.s.c.c.SolrZkClient makePath: /configs/conf1/solrconfig.snippet.randomindexconfig.xml
>    [junit4]   2> 1640219 INFO  (TEST-BasicDistributedZk2Test.test-seed#[FDD716235CED2808]) [    ] o.a.s.c.AbstractZkTestCase put /Users/jenkins/workspace/Lucene-Solr-trunk-MacOSX/solr/core/src/test-files/solr/collection1/conf/stopwords.txt to /configs/conf1/stopwords.txt
>    [junit4]   2> 1640220 INFO  (TEST-BasicDistributedZk2Test.test-seed#[FDD716235CED2808]) [    ] o.a.s.c.c.SolrZkClient makePath: /configs/conf1/stopwords.txt
>    [junit4]   2> 1640223 INFO  (TEST-BasicDistributedZk2Test.test-seed#[FDD716235CED2808]) [    ] o.a.s.c.AbstractZkTestCase put /Users/jenkins/workspace/Lucene-Solr-trunk-MacOSX/solr/core/src/test-files/solr/collection1/conf/protwords.txt to /configs/conf1/protwords.txt
>    [junit4]   2> 1640223 INFO  (TEST-BasicDistributedZk2Test.test-seed#[FDD716235CED2808]) [    ] o.a.s.c.c.SolrZkClient makePath: /configs/conf1/protwords.txt
>    [junit4]   2> 1640226 INFO  (TEST-BasicDistributedZk2Test.test-seed#[FDD716235CED2808]) [    ] o.a.s.c.AbstractZkTestCase put /Users/jenkins/workspace/Lucene-Solr-trunk-MacOSX/solr/core/src/test-files/solr/collection1/conf/currency.xml to /configs/conf1/currency.xml
>    [junit4]   2> 1640226 INFO  (TEST-BasicDistributedZk2Test.test-seed#[FDD716235CED2808]) [    ] o.a.s.c.c.SolrZkClient makePath: /configs/conf1/currency.xml
>    [junit4]   2> 1640230 INFO  (TEST-BasicDistributedZk2Test.test-seed#[FDD716235CED2808]) [    ] o.a.s.c.AbstractZkTestCase put /Users/jenkins/workspace/Lucene-Solr-trunk-MacOSX/solr/core/src/test-files/solr/collection1/conf/enumsConfig.xml to /configs/conf1/enumsConfig.xml
>    [junit4]   2> 1640230 INFO  (TEST-BasicDistributedZk2Test.test-seed#[FDD716235CED2808]) [    ] o.a.s.c.c.SolrZkClient makePath: /configs/conf1/enumsConfig.xml
>    [junit4]   2> 1640233 INFO  (TEST-BasicDistributedZk2Test.test-seed#[FDD716235CED2808]) [    ] o.a.s.c.AbstractZkTestCase put /Users/jenkins/workspace/Lucene-Solr-trunk-MacOSX/solr/core/src/test-files/solr/collection1/conf/open-exchange-rates.json to /configs/conf1/open-exchange-rates.json
>    [junit4]   2> 1640233 INFO  (TEST-BasicDistributedZk2Test.test-seed#[FDD716235CED2808]) [    ] o.a.s.c.c.SolrZkClient makePath: /configs/conf1/open-exchange-rates.json
>    [junit4]   2> 1640236 INFO  (TEST-BasicDistributedZk2Test.test-seed#[FDD716235CED2808]) [    ] o.a.s.c.AbstractZkTestCase put /Users/jenkins/workspace/Lucene-Solr-trunk-MacOSX/solr/core/src/test-files/solr/collection1/conf/mapping-ISOLatin1Accent.txt to /configs/conf1/mapping-ISOLatin1Accent.txt
>    [junit4]   2> 1640236 INFO  (TEST-BasicDistributedZk2Test.test-seed#[FDD716235CED2808]) [    ] o.a.s.c.c.SolrZkClient makePath: /configs/conf1/mapping-ISOLatin1Accent.txt
>    [junit4]   2> 1640239 INFO  (TEST-BasicDistributedZk2Test.test-seed#[FDD716235CED2808]) [    ] o.a.s.c.AbstractZkTestCase put /Users/jenkins/workspace/Lucene-Solr-trunk-MacOSX/solr/core/src/test-files/solr/collection1/conf/old_synonyms.txt to /configs/conf1/old_synonyms.txt
>    [junit4]   2> 1640240 INFO  (TEST-BasicDistributedZk2Test.test-seed#[FDD716235CED2808]) [    ] o.a.s.c.c.SolrZkClient makePath: /configs/conf1/old_synonyms.txt
>    [junit4]   2> 1640243 INFO  (TEST-BasicDistributedZk2Test.test-seed#[FDD716235CED2808]) [    ] o.a.s.c.AbstractZkTestCase put /Users/jenkins/workspace/Lucene-Solr-trunk-MacOSX/solr/core/src/test-files/solr/collection1/conf/synonyms.txt to /configs/conf1/synonyms.txt
>    [junit4]   2> 1640243 INFO  (TEST-BasicDistributedZk2Test.test-seed#[FDD716235CED2808]) [    ] o.a.s.c.c.SolrZkClient makePath: /configs/conf1/synonyms.txt
>    [junit4]   2> 1640537 INFO  (TEST-BasicDistributedZk2Test.test-seed#[FDD716235CED2808]) [    ] o.a.s.SolrTestCaseJ4 Writing core.properties file to /Users/jenkins/workspace/Lucene-Solr-trunk-MacOSX/solr/build/solr-core/test/J0/temp/solr.cloud.BasicDistributedZk2Test_FDD716235CED2808-001/control-001/cores/collection1
>    [junit4]   2> 1640539 INFO  (TEST-BasicDistributedZk2Test.test-seed#[FDD716235CED2808]) [    ] o.e.j.s.Server jetty-9.2.11.v20150529
>    [junit4]   2> 1640542 INFO  (TEST-BasicDistributedZk2Test.test-seed#[FDD716235CED2808]) [    ] o.e.j.s.h.ContextHandler Started o.e.j.s.ServletContextHandler@40604eda{/,null,AVAILABLE}
>    [junit4]   2> 1640544 INFO  (TEST-BasicDistributedZk2Test.test-seed#[FDD716235CED2808]) [    ] o.e.j.s.ServerConnector Started ServerConnector@3db15c5a{HTTP/1.1}{127.0.0.1:62063}
>    [junit4]   2> 1640544 INFO  (TEST-BasicDistributedZk2Test.test-seed#[FDD716235CED2808]) [    ] o.e.j.s.Server Started @1644460ms
>    [junit4]   2> 1640545 INFO  (TEST-BasicDistributedZk2Test.test-seed#[FDD716235CED2808]) [    ] o.a.s.c.s.e.JettySolrRunner Jetty properties: {solr.data.dir=/Users/jenkins/workspace/Lucene-Solr-trunk-MacOSX/solr/build/solr-core/test/J0/temp/solr.cloud.BasicDistributedZk2Test_FDD716235CED2808-001/tempDir-001/control/data, hostContext=/, hostPort=62063, coreRootDirectory=/Users/jenkins/workspace/Lucene-Solr-trunk-MacOSX/solr/build/solr-core/test/J0/../../../../../../../../../Users/jenkins/workspace/Lucene-Solr-trunk-MacOSX/solr/build/solr-core/test/J0/temp/solr.cloud.BasicDistributedZk2Test_FDD716235CED2808-001/control-001/cores}
>    [junit4]   2> 1640545 INFO  (TEST-BasicDistributedZk2Test.test-seed#[FDD716235CED2808]) [    ] o.a.s.s.SolrDispatchFilter SolrDispatchFilter.init(): sun.misc.Launcher$AppClassLoader@74a14482
>    [junit4]   2> 1640545 INFO  (TEST-BasicDistributedZk2Test.test-seed#[FDD716235CED2808]) [    ] o.a.s.c.SolrResourceLoader new SolrResourceLoader for directory: '/Users/jenkins/workspace/Lucene-Solr-trunk-MacOSX/solr/build/solr-core/test/J0/../../../../../../../../../Users/jenkins/workspace/Lucene-Solr-trunk-MacOSX/solr/build/solr-core/test/J0/temp/solr.cloud.BasicDistributedZk2Test_FDD716235CED2808-001/control-001/'
>    [junit4]   2> 1640572 INFO  (TEST-BasicDistributedZk2Test.test-seed#[FDD716235CED2808]) [    ] o.a.s.c.c.SolrZkClient Using default ZkCredentialsProvider
>    [junit4]   2> 1640573 INFO  (TEST-BasicDistributedZk2Test.test-seed#[FDD716235CED2808]) [    ] o.a.s.c.c.ConnectionManager Waiting for client to connect to ZooKeeper
>    [junit4]   2> 1640574 INFO  (zkCallback-1314-thread-1) [    ] o.a.s.c.c.ConnectionManager Watcher org.apache.solr.common.cloud.ConnectionManager@7641ccfc name:ZooKeeperConnection Watcher:127.0.0.1:62045/solr got event WatchedEvent state:SyncConnected type:None path:null path:null type:None
>    [junit4]   2> 1640575 INFO  (TEST-BasicDistributedZk2Test.test-seed#[FDD716235CED2808]) [    ] o.a.s.c.c.ConnectionManager Client is connected to ZooKeeper
>    [junit4]   2> 1640575 INFO  (TEST-BasicDistributedZk2Test.test-seed#[FDD716235CED2808]) [    ] o.a.s.c.c.SolrZkClient Using default ZkACLProvider
>    [junit4]   2> 1640577 INFO  (TEST-BasicDistributedZk2Test.test-seed#[FDD716235CED2808]) [    ] o.a.s.s.SolrDispatchFilter Loading solr.xml from SolrHome (not found in ZooKeeper)
>    [junit4]   2> 1640578 INFO  (TEST-BasicDistributedZk2Test.test-seed#[FDD716235CED2808]) [    ] o.a.s.c.SolrXmlConfig Loading container configuration from /Users/jenkins/workspace/Lucene-Solr-trunk-MacOSX/solr/build/solr-core/test/J0/../../../../../../../../../Users/jenkins/workspace/Lucene-Solr-trunk-MacOSX/solr/build/solr-core/test/J0/temp/solr.cloud.BasicDistributedZk2Test_FDD716235CED2808-001/control-001/solr.xml
>    [junit4]   2> 1640588 INFO  (TEST-BasicDistributedZk2Test.test-seed#[FDD716235CED2808]) [    ] o.a.s.c.CoresLocator Config-defined core root directory: /Users/jenkins/workspace/Lucene-Solr-trunk-MacOSX/solr/build/solr-core/test/J0/../../../../../../../../../Users/jenkins/workspace/Lucene-Solr-trunk-MacOSX/solr/build/solr-core/test/J0/temp/solr.cloud.BasicDistributedZk2Test_FDD716235CED2808-001/control-001/cores
>    [junit4]   2> 1640588 INFO  (TEST-BasicDistributedZk2Test.test-seed#[FDD716235CED2808]) [    ] o.a.s.c.CoreContainer New CoreContainer 482898332
>    [junit4]   2> 1640588 INFO  (TEST-BasicDistributedZk2Test.test-seed#[FDD716235CED2808]) [    ] o.a.s.c.CoreContainer Loading cores into CoreContainer [instanceDir=/Users/jenkins/workspace/Lucene-Solr-trunk-MacOSX/solr/build/solr-core/test/J0/../../../../../../../../../Users/jenkins/workspace/Lucene-Solr-trunk-MacOSX/solr/build/solr-core/test/J0/temp/solr.cloud.BasicDistributedZk2Test_FDD716235CED2808-001/control-001/]
>    [junit4]   2> 1640588 INFO  (TEST-BasicDistributedZk2Test.test-seed#[FDD716235CED2808]) [    ] o.a.s.c.CoreContainer loading shared library: /Users/jenkins/workspace/Lucene-Solr-trunk-MacOSX/solr/build/solr-core/test/J0/../../../../../../../../../Users/jenkins/workspace/Lucene-Solr-trunk-MacOSX/solr/build/solr-core/test/J0/temp/solr.cloud.BasicDistributedZk2Test_FDD716235CED2808-001/control-001/lib
>    [junit4]   2> 1640589 WARN  (TEST-BasicDistributedZk2Test.test-seed#[FDD716235CED2808]) [    ] o.a.s.c.SolrResourceLoader Can't find (or read) directory to add to classloader: lib (resolved as: /Users/jenkins/workspace/Lucene-Solr-trunk-MacOSX/solr/build/solr-core/test/J0/../../../../../../../../../Users/jenkins/workspace/Lucene-Solr-trunk-MacOSX/solr/build/solr-core/test/J0/temp/solr.cloud.BasicDistributedZk2Test_FDD716235CED2808-001/control-001/lib).
>    [junit4]   2> 1640596 INFO  (TEST-BasicDistributedZk2Test.test-seed#[FDD716235CED2808]) [    ] o.a.s.h.c.HttpShardHandlerFactory created with socketTimeout : 90000,urlScheme : ,connTimeout : 15000,maxConnectionsPerHost : 20,maxConnections : 10000,corePoolSize : 0,maximumPoolSize : 2147483647,maxThreadIdleTime : 5,sizeOfQueue : -1,fairnessPolicy : false,useRetries : false,
>    [junit4]   2> 1640599 INFO  (TEST-BasicDistributedZk2Test.test-seed#[FDD716235CED2808]) [    ] o.a.s.u.UpdateShardHandler Creating UpdateShardHandler HTTP client with params: socketTimeout=340000&connTimeout=45000&retry=true
>    [junit4]   2> 1640599 INFO  (TEST-BasicDistributedZk2Test.test-seed#[FDD716235CED2808]) [    ] o.a.s.l.LogWatcher SLF4J impl is org.slf4j.impl.Log4jLoggerFactory
>    [junit4]   2> 1640600 INFO  (TEST-BasicDistributedZk2Test.test-seed#[FDD716235CED2808]) [    ] o.a.s.l.LogWatcher Registering Log Listener [Log4j (org.slf4j.impl.Log4jLoggerFactory)]
>    [junit4]   2> 1640600 INFO  (TEST-BasicDistributedZk2Test.test-seed#[FDD716235CED2808]) [    ] o.a.s.c.ZkContainer Zookeeper client=127.0.0.1:62045/solr
>    [junit4]   2> 1640600 INFO  (TEST-BasicDistributedZk2Test.test-seed#[FDD716235CED2808]) [    ] o.a.s.c.ZkController zkHost includes chroot
>    [junit4]   2> 1640600 INFO  (TEST-BasicDistributedZk2Test.test-seed#[FDD716235CED2808]) [    ] o.a.s.c.c.SolrZkClient Using default ZkCredentialsProvider
>    [junit4]   2> 1640601 INFO  (TEST-BasicDistributedZk2Test.test-seed#[FDD716235CED2808]) [    ] o.a.s.c.c.ConnectionManager Waiting for client to connect to ZooKeeper
>    [junit4]   2> 1640603 INFO  (zkCallback-1316-thread-1) [    ] o.a.s.c.c.ConnectionManager Watcher org.apache.solr.common.cloud.ConnectionManager@3ef20060 name:ZooKeeperConnection Watcher:127.0.0.1:62045 got event WatchedEvent state:SyncConnected type:None path:null path:null type:None
>    [junit4]   2> 1640603 INFO  (TEST-BasicDistributedZk2Test.test-seed#[FDD716235CED2808]) [    ] o.a.s.c.c.ConnectionManager Client is connected to ZooKeeper
>    [junit4]   2> 1640604 INFO  (TEST-BasicDistributedZk2Test.test-seed#[FDD716235CED2808]) [    ] o.a.s.c.c.SolrZkClient Using default ZkACLProvider
>    [junit4]   2> 1640607 INFO  (TEST-BasicDistributedZk2Test.test-seed#[FDD716235CED2808]) [n:127.0.0.1:62063_    ] o.a.s.c.c.ConnectionManager Waiting for client to connect to ZooKeeper
>    [junit4]   2> 1640608 INFO  (zkCallback-1317-thread-1-processing-n:127.0.0.1:62063_) [n:127.0.0.1:62063_    ] o.a.s.c.c.ConnectionManager Watcher org.apache.solr.common.cloud.ConnectionManager@7d6b148e name:ZooKeeperConnection Watcher:127.0.0.1:62045/solr got event WatchedEvent state:SyncConnected type:None path:null path:null type:None
>    [junit4]   2> 1640608 INFO  (TEST-BasicDistributedZk2Test.test-seed#[FDD716235CED2808]) [n:127.0.0.1:62063_    ] o.a.s.c.c.ConnectionManager Client is connected to ZooKeeper
>    [junit4]   2> 1640610 INFO  (TEST-BasicDistributedZk2Test.test-seed#[FDD716235CED2808]) [n:127.0.0.1:62063_    ] o.a.s.c.c.SolrZkClient makePath: /overseer/queue
>    [junit4]   2> 1640614 INFO  (TEST-BasicDistributedZk2Test.test-seed#[FDD716235CED2808]) [n:127.0.0.1:62063_    ] o.a.s.c.c.SolrZkClient makePath: /overseer/collection-queue-work
>    [junit4]   2> 1640618 INFO  (TEST-BasicDistributedZk2Test.test-seed#[FDD716235CED2808]) [n:127.0.0.1:62063_    ] o.a.s.c.c.SolrZkClient makePath: /overseer/collection-map-running
>    [junit4]   2> 1640622 INFO  (TEST-BasicDistributedZk2Test.test-seed#[FDD716235CED2808]) [n:127.0.0.1:62063_    ] o.a.s.c.c.SolrZkClient makePath: /overseer/collection-map-completed
>    [junit4]   2> 1640626 INFO  (TEST-BasicDistributedZk2Test.test-seed#[FDD716235CED2808]) [n:127.0.0.1:62063_    ] o.a.s.c.c.SolrZkClient makePath: /overseer/collection-map-failure
>    [junit4]   2> 1640632 INFO  (TEST-BasicDistributedZk2Test.test-seed#[FDD716235CED2808]) [n:127.0.0.1:62063_    ] o.a.s.c.c.SolrZkClient makePath: /live_nodes
>    [junit4]   2> 1640635 INFO  (TEST-BasicDistributedZk2Test.test-seed#[FDD716235CED2808]) [n:127.0.0.1:62063_    ] o.a.s.c.c.SolrZkClient makePath: /aliases.json
>    [junit4]   2> 1640638 INFO  (TEST-BasicDistributedZk2Test.test-seed#[FDD716235CED2808]) [n:127.0.0.1:62063_    ] o.a.s.c.c.SolrZkClient makePath: /clusterstate.json
>    [junit4]   2> 1640642 INFO  (TEST-BasicDistributedZk2Test.test-seed#[FDD716235CED2808]) [n:127.0.0.1:62063_    ] o.a.s.c.ZkController Register node as live in ZooKeeper:/live_nodes/127.0.0.1:62063_
>    [junit4]   2> 1640645 INFO  (TEST-BasicDistributedZk2Test.test-seed#[FDD716235CED2808]) [n:127.0.0.1:62063_    ] o.a.s.c.c.SolrZkClient makePath: /live_nodes/127.0.0.1:62063_
>    [junit4]   2> 1640649 INFO  (TEST-BasicDistributedZk2Test.test-seed#[FDD716235CED2808]) [n:127.0.0.1:62063_    ] o.a.s.c.c.SolrZkClient makePath: /overseer_elect
>    [junit4]   2> 1640653 INFO  (TEST-BasicDistributedZk2Test.test-seed#[FDD716235CED2808]) [n:127.0.0.1:62063_    ] o.a.s.c.c.SolrZkClient makePath: /overseer_elect/election
>    [junit4]   2> 1640655 INFO  (TEST-BasicDistributedZk2Test.test-seed#[FDD716235CED2808]) [n:127.0.0.1:62063_    ] o.a.s.c.Overseer Overseer (id=null) closing
>    [junit4]   2> 1640656 INFO  (TEST-BasicDistributedZk2Test.test-seed#[FDD716235CED2808]) [n:127.0.0.1:62063_    ] o.a.s.c.LeaderElector Joined leadership election with path: /overseer_elect/election/94269195336941572-127.0.0.1:62063_-n_0000000000
>    [junit4]   2> 1640657 INFO  (TEST-BasicDistributedZk2Test.test-seed#[FDD716235CED2808]) [n:127.0.0.1:62063_    ] o.a.s.c.OverseerElectionContext I am going to be the leader 127.0.0.1:62063_
>    [junit4]   2> 1640657 INFO  (TEST-BasicDistributedZk2Test.test-seed#[FDD716235CED2808]) [n:127.0.0.1:62063_    ] o.a.s.c.c.SolrZkClient makePath: /overseer_elect/leader
>    [junit4]   2> 1640660 INFO  (TEST-BasicDistributedZk2Test.test-seed#[FDD716235CED2808]) [n:127.0.0.1:62063_    ] o.a.s.c.Overseer Overseer (id=94269195336941572-127.0.0.1:62063_-n_0000000000) starting
>    [junit4]   2> 1640663 INFO  (TEST-BasicDistributedZk2Test.test-seed#[FDD716235CED2808]) [n:127.0.0.1:62063_    ] o.a.s.c.c.SolrZkClient makePath: /overseer/queue-work
>    [junit4]   2> 1640675 INFO  (TEST-BasicDistributedZk2Test.test-seed#[FDD716235CED2808]) [n:127.0.0.1:62063_    ] o.a.s.c.OverseerAutoReplicaFailoverThread Starting OverseerAutoReplicaFailoverThread autoReplicaFailoverWorkLoopDelay=10000 autoReplicaFailoverWaitAfterExpiration=30000 autoReplicaFailoverBadNodeExpiration=60000
>    [junit4]   2> 1640676 INFO  (OverseerCollectionProcessor-94269195336941572-127.0.0.1:62063_-n_0000000000) [n:127.0.0.1:62063_    ] o.a.s.c.OverseerCollectionProcessor Process current queue of collection creations
>    [junit4]   2> 1640677 INFO  (TEST-BasicDistributedZk2Test.test-seed#[FDD716235CED2808]) [n:127.0.0.1:62063_    ] o.a.s.c.c.ZkStateReader Updating cluster state from ZooKeeper...
>    [junit4]   2> 1640678 INFO  (OverseerStateUpdate-94269195336941572-127.0.0.1:62063_-n_0000000000) [n:127.0.0.1:62063_    ] o.a.s.c.Overseer Starting to work on the main queue
>    [junit4]   2> 1640689 INFO  (TEST-BasicDistributedZk2Test.test-seed#[FDD716235CED2808]) [n:127.0.0.1:62063_    ] o.a.s.c.CoreContainer No authentication plugin used.
>    [junit4]   2> 1640689 INFO  (TEST-BasicDistributedZk2Test.test-seed#[FDD716235CED2808]) [n:127.0.0.1:62063_    ] o.a.s.c.CoreContainer Security conf doesn't exist. Skipping setup for authorization module.
>    [junit4]   2> 1640692 INFO  (TEST-BasicDistributedZk2Test.test-seed#[FDD716235CED2808]) [n:127.0.0.1:62063_    ] o.a.s.c.CoresLocator Looking for core definitions underneath /Users/jenkins/workspace/Lucene-Solr-trunk-MacOSX/solr/build/solr-core/test/J0/../../../../../../../../../Users/jenkins/workspace/Lucene-Solr-trunk-MacOSX/solr/build/solr-core/test/J0/temp/solr.cloud.BasicDistributedZk2Test_FDD716235CED2808-001/control-001/cores
>    [junit4]   2> 1640694 INFO  (TEST-BasicDistributedZk2Test.test-seed#[FDD716235CED2808]) [n:127.0.0.1:62063_    ] o.a.s.c.SolrCore Created CoreDescriptor: {name=collection1, config=solrconfig.xml, transient=false, schema=schema.xml, loadOnStartup=true, configSetProperties=configsetprops.json, instanceDir=/Users/jenkins/workspace/Lucene-Solr-trunk-MacOSX/solr/build/solr-core/test/J0/../../../../../../../../../Users/jenkins/workspace/Lucene-Solr-trunk-MacOSX/solr/build/solr-core/test/J0/temp/solr.cloud.BasicDistributedZk2Test_FDD716235CED2808-001/control-001/cores/collection1, collection=control_collection, absoluteInstDir=/Users/jenkins/workspace/Lucene-Solr-trunk-MacOSX/solr/build/solr-core/test/J0/../../../../../../../../../Users/jenkins/workspace/Lucene-Solr-trunk-MacOSX/solr/build/solr-core/test/J0/temp/solr.cloud.BasicDistributedZk2Test_FDD716235CED2808-001/control-001/cores/collection1/, coreNodeName=, dataDir=data/, shard=}
>    [junit4]   2> 1640695 INFO  (TEST-BasicDistributedZk2Test.test-seed#[FDD716235CED2808]) [n:127.0.0.1:62063_    ] o.a.s.c.CoresLocator Found core collection1 in /Users/jenkins/workspace/Lucene-Solr-trunk-MacOSX/solr/build/solr-core/test/J0/../../../../../../../../../Users/jenkins/workspace/Lucene-Solr-trunk-MacOSX/solr/build/solr-core/test/J0/temp/solr.cloud.BasicDistributedZk2Test_FDD716235CED2808-001/control-001/cores/collection1/
>    [junit4]   2> 1640695 INFO  (TEST-BasicDistributedZk2Test.test-seed#[FDD716235CED2808]) [n:127.0.0.1:62063_    ] o.a.s.c.CoresLocator Found 1 core definitions
>    [junit4]   2> 1640696 INFO  (coreLoadExecutor-4275-thread-1-processing-n:127.0.0.1:62063_) [n:127.0.0.1:62063_ c:control_collection   x:collection1] o.a.s.c.ZkController publishing state=down
>    [junit4]   2> 1640696 INFO  (coreLoadExecutor-4275-thread-1-processing-n:127.0.0.1:62063_) [n:127.0.0.1:62063_ c:control_collection   x:collection1] o.a.s.c.ZkController numShards not found on descriptor - reading it from system property
>    [junit4]   2> 1640696 INFO  (TEST-BasicDistributedZk2Test.test-seed#[FDD716235CED2808]) [n:127.0.0.1:62063_    ] o.a.s.s.SolrDispatchFilter user.dir=/Users/jenkins/workspace/Lucene-Solr-trunk-MacOSX/solr/build/solr-core/test/J0
>    [junit4]   2> 1640697 INFO  (TEST-BasicDistributedZk2Test.test-seed#[FDD716235CED2808]) [n:127.0.0.1:62063_    ] o.a.s.s.SolrDispatchFilter SolrDispatchFilter.init() done
>    [junit4]   2> 1640697 INFO  (coreLoadExecutor-4275-thread-1-processing-n:127.0.0.1:62063_) [n:127.0.0.1:62063_ c:control_collection   x:collection1] o.a.s.c.ZkController look for our core node name
>    [junit4]   2> 1640697 INFO  (zkCallback-1317-thread-1-processing-n:127.0.0.1:62063_) [n:127.0.0.1:62063_    ] o.a.s.c.DistributedQueue NodeChildrenChanged fired on path /overseer/queue state SyncConnected
>    [junit4]   2> 1640698 INFO  (OverseerStateUpdate-94269195336941572-127.0.0.1:62063_-n_0000000000) [n:127.0.0.1:62063_    ] o.a.s.c.Overseer processMessage: queueSize: 1, message = {
>    [junit4]   2>   "core":"collection1",
>    [junit4]   2>   "roles":null,
>    [junit4]   2>   "base_url":"http://127.0.0.1:62063",
>    [junit4]   2>   "node_name":"127.0.0.1:62063_",
>    [junit4]   2>   "numShards":"1",
>    [junit4]   2>   "state":"down",
>    [junit4]   2>   "shard":null,
>    [junit4]   2>   "collection":"control_collection",
>    [junit4]   2>   "operation":"state"} current state version: 0
>    [junit4]   2> 1640700 INFO  (OverseerStateUpdate-94269195336941572-127.0.0.1:62063_-n_0000000000) [n:127.0.0.1:62063_    ] o.a.s.c.o.ReplicaMutator Update state numShards=1 message={
>    [junit4]   2>   "core":"collection1",
>    [junit4]   2>   "roles":null,
>    [junit4]   2>   "base_url":"http://127.0.0.1:62063",
>    [junit4]   2>   "node_name":"127.0.0.1:62063_",
>    [junit4]   2>   "numShards":"1",
>    [junit4]   2>   "state":"down",
>    [junit4]   2>   "shard":null,
>    [junit4]   2>   "collection":"control_collection",
>    [junit4]   2>   "operation":"state"}
>    [junit4]   2> 1640700 INFO  (OverseerStateUpdate-94269195336941572-127.0.0.1:62063_-n_0000000000) [n:127.0.0.1:62063_    ] o.a.s.c.o.ClusterStateMutator building a new cName: control_collection
>    [junit4]   2> 1640701 INFO  (OverseerStateUpdate-94269195336941572-127.0.0.1:62063_-n_0000000000) [n:127.0.0.1:62063_    ] o.a.s.c.o.ReplicaMutator Assigning new node to shard shard=shard1
>    [junit4]   2> 1640703 INFO  (zkCallback-1317-thread-1-processing-n:127.0.0.1:62063_) [n:127.0.0.1:62063_    ] o.a.s.c.c.ZkStateReader A cluster state change: WatchedEvent state:SyncConnected type:NodeDataChanged path:/clusterstate.json, has occurred - updating... (live nodes size: 1)
>    [junit4]   2> 1640705 INFO  (zkCallback-1317-thread-1-processing-n:127.0.0.1:62063_) [n:127.0.0.1:62063_    ] o.a.s.c.c.ZkStateReader Updated cluster state version to 1
>    [junit4]   2> 1641698 INFO  (coreLoadExecutor-4275-thread-1-processing-n:127.0.0.1:62063_) [n:127.0.0.1:62063_ c:control_collection   x:collection1] o.a.s.c.ZkController waiting to find shard id in clusterstate for collection1
>    [junit4]   2> 1641698 INFO  (coreLoadExecutor-4275-thread-1-processing-n:127.0.0.1:62063_) [n:127.0.0.1:62063_ c:control_collection   x:collection1] o.a.s.c.ZkController Check for collection zkNode:control_collection
>    [junit4]   2> 1641700 INFO  (coreLoadExecutor-4275-thread-1-processing-n:127.0.0.1:62063_) [n:127.0.0.1:62063_ c:control_collection   x:collection1] o.a.s.c.ZkController Collection zkNode exists
>    [junit4]   2> 1641700 INFO  (coreLoadExecutor-4275-thread-1-processing-n:127.0.0.1:62063_) [n:127.0.0.1:62063_ c:control_collection   x:collection1] o.a.s.c.c.ZkStateReader Load collection config from:/collections/control_collection
>    [junit4]   2> 1641701 INFO  (coreLoadExecutor-4275-thread-1-processing-n:127.0.0.1:62063_) [n:127.0.0.1:62063_ c:control_collection   x:collection1] o.a.s.c.c.ZkStateReader path=/collections/control_collection configName=conf1 specified config exists in ZooKeeper
>    [junit4]   2> 1641701 INFO  (coreLoadExecutor-4275-thread-1-processing-n:127.0.0.1:62063_) [n:127.0.0.1:62063_ c:control_collection   x:collection1] o.a.s.c.SolrResourceLoader new SolrResourceLoader for directory: '/Users/jenkins/workspace/Lucene-Solr-trunk-MacOSX/solr/build/solr-core/test/J0/../../../../../../../../../Users/jenkins/workspace/Lucene-Solr-trunk-MacOSX/solr/build/solr-core/test/J0/temp/solr.cloud.BasicDistributedZk2Test_FDD716235CED2808-001/control-001/cores/collection1/'
>    [junit4]   2> 1641714 INFO  (coreLoadExecutor-4275-thread-1-processing-n:127.0.0.1:62063_) [n:127.0.0.1:62063_ c:control_collection   x:collection1] o.a.s.c.Config loaded config solrconfig.xml with version 0
>    [junit4]   2> 1641720 INFO  (coreLoadExecutor-4275-thread-1-processing-n:127.0.0.1:62063_) [n:127.0.0.1:62063_ c:control_collection   x:collection1] o.a.s.c.SolrConfig current version of requestparams : -1
>    [junit4]   2> 1641722 INFO  (coreLoadExecutor-4275-thread-1-processing-n:127.0.0.1:62063_) [n:127.0.0.1:62063_ c:control_collection   x:collection1] o.a.s.c.SolrConfig Using Lucene MatchVersion: 6.0.0
>    [junit4]   2> 1641727 INFO  (coreLoadExecutor-4275-thread-1-processing-n:127.0.0.1:62063_) [n:127.0.0.1:62063_ c:control_collection   x:collection1] o.a.s.c.Config Loaded SolrConfig: solrconfig.xml
>    [junit4]   2> 1641729 INFO  (coreLoadExecutor-4275-thread-1-processing-n:127.0.0.1:62063_) [n:127.0.0.1:62063_ c:control_collection   x:collection1] o.a.s.s.IndexSchema Reading Solr Schema from /configs/conf1/schema.xml
>    [junit4]   2> 1641732 INFO  (coreLoadExecutor-4275-thread-1-processing-n:127.0.0.1:62063_) [n:127.0.0.1:62063_ c:control_collection   x:collection1] o.a.s.s.IndexSchema [collection1] Schema name=test
>    [junit4]   2> 1641824 INFO  (coreLoadExecutor-4275-thread-1-processing-n:127.0.0.1:62063_) [n:127.0.0.1:62063_ c:control_collection   x:collection1] o.a.s.s.OpenExchangeRatesOrgProvider Initialized with rates=open-exchange-rates.json, refreshInterval=1440.
>    [junit4]   2> 1641830 INFO  (coreLoadExecutor-4275-thread-1-processing-n:127.0.0.1:62063_) [n:127.0.0.1:62063_ c:control_collection   x:collection1] o.a.s.s.IndexSchema default search field in schema is text
>    [junit4]   2> 1641830 INFO  (coreLoadExecutor-4275-thread-1-processing-n:127.0.0.1:62063_) [n:127.0.0.1:62063_ c:control_collection   x:collection1] o.a.s.s.IndexSchema unique key field: id
>    [junit4]   2> 1641845 INFO  (coreLoadExecutor-4275-thread-1-processing-n:127.0.0.1:62063_) [n:127.0.0.1:62063_ c:control_collection   x:collection1] o.a.s.s.FileExchangeRateProvider Reloading exchange rates from file currency.xml
>    [junit4]   2> 1641848 INFO  (coreLoadExecutor-4275-thread-1-processing-n:127.0.0.1:62063_) [n:127.0.0.1:62063_ c:control_collection   x:collection1] o.a.s.s.FileExchangeRateProvider Reloading exchange rates from file currency.xml
>    [junit4]   2> 1641851 INFO  (coreLoadExecutor-4275-thread-1-processing-n:127.0.0.1:62063_) [n:127.0.0.1:62063_ c:control_collection   x:collection1] o.a.s.s.OpenExchangeRatesOrgProvider Reloading exchange rates from open-exchange-rates.json
>    [junit4]   2> 1641853 WARN  (coreLoadExecutor-4275-thread-1-processing-n:127.0.0.1:62063_) [n:127.0.0.1:62063_ c:control_collection   x:collection1] o.a.s.s.OpenExchangeRatesOrgProvider Unknown key IMPORTANT NOTE
>    [junit4]   2> 1641853 WARN  (coreLoadExecutor-4275-thread-1-processing-n:127.0.0.1:62063_) [n:127.0.0.1:62063_ c:control_collection   x:collection1] o.a.s.s.OpenExchangeRatesOrgProvider Expected key, got STRING
>    [junit4]   2> 1641854 INFO  (coreLoadExecutor-4275-thread-1-processing-n:127.0.0.1:62063_) [n:127.0.0.1:62063_ c:control_collection   x:collection1] o.a.s.s.OpenExchangeRatesOrgProvider Reloading exchange rates from open-exchange-rates.json
>    [junit4]   2> 1641856 WARN  (coreLoadExecutor-4275-thread-1-processing-n:127.0.0.1:62063_) [n:127.0.0.1:62063_ c:control_collection   x:collection1] o.a.s.s.OpenExchangeRatesOrgProvider Unknown key IMPORTANT NOTE
>    [junit4]   2> 1641856 WARN  (coreLoadExecutor-4275-thread-1-processing-n:127.0.0.1:62063_) [n:127.0.0.1:62063_ c:control_collection   x:collection1] o.a.s.s.OpenExchangeRatesOrgProvider Expected key, got STRING
>    [junit4]   2> 1641859 INFO  (coreLoadExecutor-4275-thread-1-processing-n:127.0.0.1:62063_) [n:127.0.0.1:62063_ c:control_collection   x:collection1] o.a.s.c.ConfigSetProperties Did not find ConfigSet properties, assuming default properties: Can't find resource 'configsetprops.json' in classpath or '/configs/conf1', cwd=/Users/jenkins/workspace/Lucene-Solr-trunk-MacOSX/solr/build/solr-core/test/J0
>    [junit4]   2> 1641859 INFO  (coreLoadExecutor-4275-thread-1-processing-n:127.0.0.1:62063_) [n:127.0.0.1:62063_ c:control_collection   x:collection1] o.a.s.c.CoreContainer Creating SolrCore 'collection1' using configuration from collection control_collection
>    [junit4]   2> 1641859 INFO  (coreLoadExecutor-4275-thread-1-processing-n:127.0.0.1:62063_) [n:127.0.0.1:62063_ c:control_collection s:shard1 r:core_node1 x:collection1] o.a.s.c.SolrCore org.apache.solr.core.MockDirectoryFactory
>    [junit4]   2> 1641859 INFO  (coreLoadExecutor-4275-thread-1-processing-n:127.0.0.1:62063_) [n:127.0.0.1:62063_ c:control_collection s:shard1 r:core_node1 x:collection1] o.a.s.c.SolrCore [[collection1] ] Opening new SolrCore at [/Users/jenkins/workspace/Lucene-Solr-trunk-MacOSX/solr/build/solr-core/test/J0/../../../../../../../../../Users/jenkins/workspace/Lucene-Solr-trunk-MacOSX/solr/build/solr-core/test/J0/temp/solr.cloud.BasicDistributedZk2Test_FDD716235CED2808-001/control-001/cores/collection1/], dataDir=[null]
>    [junit4]   2> 1641859 INFO  (coreLoadExecutor-4275-thread-1-processing-n:127.0.0.1:62063_) [n:127.0.0.1:62063_ c:control_collection s:shard1 r:core_node1 x:collection1] o.a.s.c.JmxMonitoredMap JMX monitoring is enabled. Adding Solr mbeans to JMX Server: com.sun.jmx.mbeanserver.JmxMBeanServer@381b25d0
>    [junit4]   2> 1641860 INFO  (coreLoadExecutor-4275-thread-1-processing-n:127.0.0.1:62063_) [n:127.0.0.1:62063_ c:control_collection s:shard1 r:core_node1 x:collection1] o.a.s.c.CachingDirectoryFactory return new directory for /Users/jenkins/workspace/Lucene-Solr-trunk-MacOSX/solr/build/solr-core/test/J0/../../../../../../../../../Users/jenkins/workspace/Lucene-Solr-trunk-MacOSX/solr/build/solr-core/test/J0/temp/solr.cloud.BasicDistributedZk2Test_FDD716235CED2808-001/control-001/cores/collection1/data
>    [junit4]   2> 1641860 INFO  (coreLoadExecutor-4275-thread-1-processing-n:127.0.0.1:62063_) [n:127.0.0.1:62063_ c:control_collection s:shard1 r:core_node1 x:collection1] o.a.s.c.SolrCore New index directory detected: old=null new=/Users/jenkins/workspace/Lucene-Solr-trunk-MacOSX/solr/build/solr-core/test/J0/../../../../../../../../../Users/jenkins/workspace/Lucene-Solr-trunk-MacOSX/solr/build/solr-core/test/J0/temp/solr.cloud.BasicDistributedZk2Test_FDD716235CED2808-001/control-001/cores/collection1/data/index/
>    [junit4]   2> 1641860 WARN  (coreLoadExecutor-4275-thread-1-processing-n:127.0.0.1:62063_) [n:127.0.0.1:62063_ c:control_collection s:shard1 r:core_node1 x:collection1] o.a.s.c.SolrCore [collection1] Solr index directory '/Users/jenkins/workspace/Lucene-Solr-trunk-MacOSX/solr/build/solr-core/test/J0/../../../../../../../../../Users/jenkins/workspace/Lucene-Solr-trunk-MacOSX/solr/build/solr-core/test/J0/temp/solr.cloud.BasicDistributedZk2Test_FDD716235CED2808-001/control-001/cores/collection1/data/index' doesn't exist. Creating new index...
>    [junit4]   2> 1641861 INFO  (coreLoadExecutor-4275-thread-1-processing-n:127.0.0.1:62063_) [n:127.0.0.1:62063_ c:control_collection s:shard1 r:core_node1 x:collection1] o.a.s.c.CachingDirectoryFactory return new directory for /Users/jenkins/workspace/Lucene-Solr-trunk-MacOSX/solr/build/solr-core/test/J0/../../../../../../../../../Users/jenkins/workspace/Lucene-Solr-trunk-MacOSX/solr/build/solr-core/test/J0/temp/solr.cloud.BasicDistributedZk2Test_FDD716235CED2808-001/control-001/cores/collection1/data/index
>    [junit4]   2> 1641861 INFO  (coreLoadExecutor-4275-thread-1-processing-n:127.0.0.1:62063_) [n:127.0.0.1:62063_ c:control_collection s:shard1 r:core_node1 x:collection1] o.a.s.u.RandomMergePolicy RandomMergePolicy wrapping class org.apache.lucene.index.LogDocMergePolicy: [LogDocMergePolicy: minMergeSize=1000, mergeFactor=16, maxMergeSize=9223372036854775807, maxMergeSizeForForcedMerge=9223372036854775807, calibrateSizeByDeletes=true, maxMergeDocs=2147483647, maxCFSSegmentSizeMB=8.796093022207999E12, noCFSRatio=0.6117290737800547]
>    [junit4]   2> 1641861 INFO  (coreLoadExecutor-4275-thread-1-processing-n:127.0.0.1:62063_) [n:127.0.0.1:62063_ c:control_collection s:shard1 r:core_node1 x:collection1] o.a.s.c.SolrCore SolrDeletionPolicy.onCommit: commits: num=1
>    [junit4]   2>        commit{dir=MockDirectoryWrapper(RAMDirectory@56af7640 lockFactory=org.apache.lucene.store.SingleInstanceLockFactory@fb107c0),segFN=segments_1,generation=1}
>    [junit4]   2> 1641862 INFO  (coreLoadExecutor-4275-thread-1-processing-n:127.0.0.1:62063_) [n:127.0.0.1:62063_ c:control_collection s:shard1 r:core_node1 x:collection1] o.a.s.c.SolrCore newest commit generation = 1
>    [junit4]   2> 1641862 INFO  (OldIndexDirectoryCleanupThreadForCore-collection1) [n:127.0.0.1:62063_ c:control_collection s:shard1 r:core_node1 x:collection1] o.a.s.c.SolrCore Looking for old index directories to cleanup for core collection1 in /Users/jenkins/workspace/Lucene-Solr-trunk-MacOSX/solr/build/solr-core/test/J0/../../../../../../../../../Users/jenkins/workspace/Lucene-Solr-trunk-MacOSX/solr/build/solr-core/test/J0/temp/solr.cloud.BasicDistributedZk2Test_FDD716235CED2808-001/control-001/cores/collection1/data/
>    [junit4]   2> 1641863 WARN  (OldIndexDirectoryCleanupThreadForCore-collection1) [n:127.0.0.1:62063_ c:control_collection s:shard1 r:core_node1 x:collection1] o.a.s.c.DirectoryFactory /Users/jenkins/workspace/Lucene-Solr-trunk-MacOSX/solr/build/solr-core/test/J0/../../../../../../../../../Users/jenkins/workspace/Lucene-Solr-trunk-MacOSX/solr/build/solr-core/test/J0/temp/solr.cloud.BasicDistributedZk2Test_FDD716235CED2808-001/control-001/cores/collection1/data/ does not point to a valid data directory; skipping clean-up of old index directories.
>    [junit4]   2> 1641866 INFO  (coreLoadExecutor-4275-thread-1-processing-n:127.0.0.1:62063_) [n:127.0.0.1:62063_ c:control_collection s:shard1 r:core_node1 x:collection1] o.a.s.u.p.UpdateRequestProcessorChain creating updateRequestProcessorChain "nodistrib"
>    [junit4]   2> 1641866 INFO  (coreLoadExecutor-4275-thread-1-processing-n:127.0.0.1:62063_) [n:127.0.0.1:62063_ c:control_collection s:shard1 r:core_node1 x:collection1] o.a.s.u.p.UpdateRequestProcessorChain creating updateRequestProcessorChain "dedupe"
>    [junit4]   2> 1641866 INFO  (coreLoadExecutor-4275-thread-1-processing-n:127.0.0.1:62063_) [n:127.0.0.1:62063_ c:control_collection s:shard1 r:core_node1 x:collection1] o.a.s.u.p.UpdateRequestProcessorChain inserting DistributedUpdateProcessorFactory into updateRequestProcessorChain "dedupe"
>    [junit4]   2> 1641866 INFO  (coreLoadExecutor-4275-thread-1-processing-n:127.0.0.1:62063_) [n:127.0.0.1:62063_ c:control_collection s:shard1 r:core_node1 x:collection1] o.a.s.u.p.UpdateRequestProcessorChain creating updateRequestProcessorChain "stored_sig"
>    [junit4]   2> 1641866 INFO  (coreLoadExecutor-4275-thread-1-processing-n:127.0.0.1:62063_) [n:127.0.0.1:62063_ c:control_collection s:shard1 r:core_node1 x:collection1] o.a.s.u.p.UpdateRequestProcessorChain inserting DistributedUpdateProcessorFactory into updateRequestProcessorChain "stored_sig"
>    [junit4]   2> 1641866 INFO  (coreLoadExecutor-4275-thread-1-processing-n:127.0.0.1:62063_) [n:127.0.0.1:62063_ c:control_collection s:shard1 r:core_node1 x:collection1] o.a.s.u.p.UpdateRequestProcessorChain creating updateRequestProcessorChain "distrib-dup-test-chain-explicit"
>    [junit4]   2> 1641867 INFO  (coreLoadExecutor-4275-thread-1-processing-n:127.0.0.1:62063_) [n:127.0.0.1:62063_ c:control_collection s:shard1 r:core_node1 x:collection1] o.a.s.u.p.UpdateRequestProcessorChain creating updateRequestProcessorChain "distrib-dup-test-chain-implicit"
>    [junit4]   2> 1641867 INFO  (coreLoadExecutor-4275-thread-1-processing-n:127.0.0.1:62063_) [n:127.0.0.1:62063_ c:control_collection s:shard1 r:core_node1 x:collection1] o.a.s.u.p.UpdateRequestProcessorChain inserting DistributedUpdateProcessorFactory into updateRequestProcessorChain "distrib-dup-test-chain-implicit"
>    [junit4]   2> 1641867 INFO  (coreLoadExecutor-4275-thread-1-processing-n:127.0.0.1:62063_) [n:127.0.0.1:62063_ c:control_collection s:shard1 r:core_node1 x:collection1] o.a.s.c.SolrCore no updateRequestProcessorChain defined as default, creating implicit default
>    [junit4]   2> 1641870 INFO  (coreLoadExecutor-4275-thread-1-processing-n:127.0.0.1:62063_) [n:127.0.0.1:62063_ c:control_collection s:shard1 r:core_node1 x:collection1] o.a.s.h.l.XMLLoader xsltCacheLifetimeSeconds=60
>    [junit4]   2> 1641871 INFO  (coreLoadExecutor-4275-thread-1-processing-n:127.0.0.1:62063_) [n:127.0.0.1:62063_ c:control_collection s:shard1 r:core_node1 x:collection1] o.a.s.h.l.XMLLoader xsltCacheLifetimeSeconds=60
>    [junit4]   2> 1641872 INFO  (coreLoadExecutor-4275-thread-1-processing-n:127.0.0.1:62063_) [n:127.0.0.1:62063_ c:control_collection s:shard1 r:core_node1 x:collection1] o.a.s.h.l.XMLLoader xsltCacheLifetimeSeconds=60
>    [junit4]   2> 1641873 INFO  (coreLoadExecutor-4275-thread-1-processing-n:127.0.0.1:62063_) [n:127.0.0.1:62063_ c:control_collection s:shard1 r:core_node1 x:collection1] o.a.s.h.l.XMLLoader xsltCacheLifetimeSeconds=60
>    [junit4]   2> 1641876 INFO  (coreLoadExecutor-4275-thread-1-processing-n:127.0.0.1:62063_) [n:127.0.0.1:62063_ c:control_collection s:shard1 r:core_node1 x:collection1] o.a.s.c.RequestHandlers Registered paths: /admin/mbeans,standard,/update/csv,/update/json/docs,/admin/luke,/admin/segments,/get,/admin/system,/replication,/admin/properties,/config,/schema,/admin/plugins,/admin/logging,/update/json,/admin/threads,/admin/ping,/update,/admin/file
>    [junit4]   2> 1641876 INFO  (coreLoadExecutor-4275-thread-1-processing-n:127.0.0.1:62063_) [n:127.0.0.1:62063_ c:control_collection s:shard1 r:core_node1 x:collection1] o.a.s.c.SolrCore Using default statsCache cache: org.apache.solr.search.stats.LocalStatsCache
>    [junit4]   2> 1641877 INFO  (coreLoadExecutor-4275-thread-1-processing-n:127.0.0.1:62063_) [n:127.0.0.1:62063_ c:control_collection s:shard1 r:core_node1 x:collection1] o.a.s.u.UpdateHandler Using UpdateLog implementation: org.apache.solr.update.UpdateLog
>    [junit4]   2> 1641877 INFO  (coreLoadExecutor-4275-thread-1-processing-n:127.0.0.1:62063_) [n:127.0.0.1:62063_ c:control_collection s:shard1 r:core_node1 x:collection1] o.a.s.u.UpdateLog Initializing UpdateLog: dataDir= defaultSyncLevel=FLUSH numRecordsToKeep=100 maxNumLogsToKeep=10 numVersionBuckets=65536
>    [junit4]   2> 1641878 INFO  (coreLoadExecutor-4275-thread-1-processing-n:127.0.0.1:62063_) [n:127.0.0.1:62063_ c:control_collection s:shard1 r:core_node1 x:collection1] o.a.s.c.SolrCore Hard AutoCommit: disabled
>    [junit4]   2> 1641878 INFO  (coreLoadExecutor-4275-thread-1-processing-n:127.0.0.1:62063_) [n:127.0.0.1:62063_ c:control_collection s:shard1 r:core_node1 x:collection1] o.a.s.c.SolrCore Soft AutoCommit: disabled
>    [junit4]   2> 1641879 INFO  (coreLoadExecutor-4275-thread-1-processing-n:127.0.0.1:62063_) [n:127.0.0.1:62063_ c:control_collection s:shard1 r:core_node1 x:collection1] o.a.s.u.RandomMergePolicy RandomMergePolicy wrapping class org.apache.lucene.index.TieredMergePolicy: [TieredMergePolicy: maxMergeAtOnce=27, maxMergeAtOnceExplicit=31, maxMergedSegmentMB=69.453125, floorSegmentMB=0.3173828125, forceMergeDeletesPctAllowed=2.5705825740336707, segmentsPerTier=29.0, maxCFSSegmentSizeMB=8.796093022207999E12, noCFSRatio=0.0
>    [junit4]   2> 1641879 INFO  (coreLoadExecutor-4275-thread-1-processing-n:127.0.0.1:62063_) [n:127.0.0.1:62063_ c:control_collection s:shard1 r:core_node1 x:collection1] o.a.s.c.SolrCore SolrDeletionPolicy.onInit: commits: num=1
>    [junit4]   2>        commit{dir=MockDirectoryWrapper(RAMDirectory@56af7640 lockFactory=org.apache.lucene.store.SingleInstanceLockFactory@fb107c0),segFN=segments_1,generation=1}
>    [junit4]   2> 1641879 INFO  (coreLoadExecutor-4275-thread-1-processing-n:127.0.0.1:62063_) [n:127.0.0.1:62063_ c:control_collection s:shard1 r:core_node1 x:collection1] o.a.s.c.SolrCore newest commit generation = 1
>    [junit4]   2> 1641879 INFO  (coreLoadExecutor-4275-thread-1-processing-n:127.0.0.1:62063_) [n:127.0.0.1:62063_ c:control_collection s:shard1 r:core_node1 x:collection1] o.a.s.s.SolrIndexSearcher Opening Searcher@5b7b5f5d[collection1] main
>    [junit4]   2> 1641879 INFO  (coreLoadExecutor-4275-thread-1-processing-n:127.0.0.1:62063_) [n:127.0.0.1:62063_ c:control_collection s:shard1 r:core_node1 x:collection1] o.a.s.c.c.ZkStateReader Load collection config from:/collections/control_collection
>    [junit4]   2> 1641881 INFO  (coreLoadExecutor-4275-thread-1-processing-n:127.0.0.1:62063_) [n:127.0.0.1:62063_ c:control_collection s:shard1 r:core_node1 x:collection1] o.a.s.c.c.ZkStateReader path=/collections/control_collection configName=conf1 specified config exists in ZooKeeper
>    [junit4]   2> 1641881 INFO  (coreLoadExecutor-4275-thread-1-processing-n:127.0.0.1:62063_) [n:127.0.0.1:62063_ c:control_collection s:shard1 r:core_node1 x:collection1] o.a.s.r.ManagedResourceStorage Setting up ZooKeeper-based storage for the RestManager with znodeBase: /configs/conf1
>    [junit4]   2> 1641882 INFO  (coreLoadExecutor-4275-thread-1-processing-n:127.0.0.1:62063_) [n:127.0.0.1:62063_ c:control_collection s:shard1 r:core_node1 x:collection1] o.a.s.r.ManagedResourceStorage Configured ZooKeeperStorageIO with znodeBase: /configs/conf1
>    [junit4]   2> 1641882 INFO  (coreLoadExecutor-4275-thread-1-processing-n:127.0.0.1:62063_) [n:127.0.0.1:62063_ c:control_collection s:shard1 r:core_node1 x:collection1] o.a.s.r.RestManager Initializing RestManager with initArgs: {}
>    [junit4]   2> 1641882 INFO  (coreLoadExecutor-4275-thread-1-processing-n:127.0.0.1:62063_) [n:127.0.0.1:62063_ c:control_collection s:shard1 r:core_node1 x:collection1] o.a.s.r.ManagedResourceStorage Reading _rest_managed.json using ZooKeeperStorageIO:path=/configs/conf1
>    [junit4]   2> 1641883 INFO  (coreLoadExecutor-4275-thread-1-processing-n:127.0.0.1:62063_) [n:127.0.0.1:62063_ c:control_collection s:shard1 r:core_node1 x:collection1] o.a.s.r.ManagedResourceStorage No data found for znode /configs/conf1/_rest_managed.json
>    [junit4]   2> 1641883 INFO  (coreLoadExecutor-4275-thread-1-processing-n:127.0.0.1:62063_) [n:127.0.0.1:62063_ c:control_collection s:shard1 r:core_node1 x:collection1] o.a.s.r.ManagedResourceStorage Loaded null at path _rest_managed.json using ZooKeeperStorageIO:path=/configs/conf1
>    [junit4]   2> 1641883 INFO  (coreLoadExecutor-4275-thread-1-processing-n:127.0.0.1:62063_) [n:127.0.0.1:62063_ c:control_collection s:shard1 r:core_node1 x:collection1] o.a.s.r.RestManager Initializing 0 registered ManagedResources
>    [junit4]   2> 1641883 INFO  (coreLoadExecutor-4275-thread-1-processing-n:127.0.0.1:62063_) [n:127.0.0.1:62063_ c:control_collection s:shard1 r:core_node1 x:collection1] o.a.s.h.ReplicationHandler Commits will be reserved for  10000
>    [junit4]   2> 1641884 INFO  (searcherExecutor-4276-thread-1-processing-n:127.0.0.1:62063_ x:collection1 s:shard1 c:control_collection r:core_node1) [n:127.0.0.1:62063_ c:control_collection s:shard1 r:core_node1 x:collection1] o.a.s.c.SolrCore [collection1] Registered new searcher Searcher@5b7b5f5d[collection1] main{ExitableDirectoryReader(UninvertingDirectoryReader())}
>    [junit4]   2> 1641884 INFO  (coreLoadExecutor-4275-thread-1-processing-n:127.0.0.1:62063_) [n:127.0.0.1:62063_ c:control_collection s:shard1 r:core_node1 x:collection1] o.a.s.u.UpdateLog Looking up max value of version field to seed version buckets
>    [junit4]   2> 1641884 INFO  (coreLoadExecutor-4275-thread-1-processing-n:127.0.0.1:62063_) [n:127.0.0.1:62063_ c:control_collection s:shard1 r:core_node1 x:collection1] o.a.s.u.VersionInfo Refreshing highest value of _version_ for 65536 version buckets from index
>    [junit4]   2> 1641884 INFO  (coreLoadExecutor-4275-thread-1-processing-n:127.0.0.1:62063_) [n:127.0.0.1:62063_ c:control_collection s:shard1 r:core_node1 x:collection1] o.a.s.u.VersionInfo No terms found for _version_, cannot seed version bucket highest value from index
>    [junit4]   2> 1641884 INFO  (coreLoadExecutor-4275-thread-1-processing-n:127.0.0.1:62063_) [n:127.0.0.1:62063_ c:control_collection s:shard1 r:core_node1 x:collection1] o.a.s.u.UpdateLog Could not find max version in index or recent updates, using new clock 1508307127313104896
>    [junit4]   2> 1641887 INFO  (coreLoadExecutor-4275-thread-1-processing-n:127.0.0.1:62063_) [n:127.0.0.1:62063_ c:control_collection s:shard1 r:core_node1 x:collection1] o.a.s.u.UpdateLog Took 3 ms to seed version buckets with highest version 1508307127313104896
>    [junit4]   2> 1641887 INFO  (coreLoadExecutor-4275-thread-1-processing-n:127.0.0.1:62063_) [n:127.0.0.1:62063_ c:control_collection s:shard1 r:core_node1 x:collection1] o.a.s.c.ZkController watch zkdir /configs/conf1
>    [junit4]   2> 1641888 INFO  (coreLoadExecutor-4275-thread-1-processing-n:127.0.0.1:62063_) [n:127.0.0.1:62063_ c:control_collection s:shard1 r:core_node1 x:collection1] o.a.s.c.CoreContainer registering core: collection1
>    [junit4]   2> 1641889 INFO  (coreZkRegister-4269-thread-1-processing-n:127.0.0.1:62063_ x:collection1 s:shard1 c:control_collection r:core_node1) [n:127.0.0.1:62063_ c:control_collection s:shard1 r:core_node1 x:collection1] o.a.s.c.ZkController Register replica - core:collection1 address:http://127.0.0.1:62063 collection:control_collection shard:shard1
>    [junit4]   2> 1641891 INFO  (coreZkRegister-4269-thread-1-processing-n:127.0.0.1:62063_ x:collection1 s:shard1 c:control_collection r:core_node1) [n:127.0.0.1:62063_ c:control_collection s:shard1 r:core_node1 x:collection1] o.a.s.c.c.SolrZkClient makePath: /collections/control_collection/leader_elect/shard1/election
>    [junit4]   2> 1641898 INFO  (coreZkRegister-4269-thread-1-processing-n:127.0.0.1:62063_ x:collection1 s:shard1 c:control_collection r:core_node1) [n:127.0.0.1:62063_ c:control_collection s:shard1 r:core_node1 x:collection1] o.a.s.c.LeaderElector Joined leadership election with path: /collections/control_collection/leader_elect/shard1/election/94269195336941572-core_node1-n_0000000000
>    [junit4]   2> 1641900 INFO  (coreZkRegister-4269-thread-1-processing-n:127.0.0.1:62063_ x:collection1 s:shard1 c:control_collection r:core_node1) [n:127.0.0.1:62063_ c:control_collection s:shard1 r:core_node1 x:collection1] o.a.s.c.ShardLeaderElectionContext Running the leader process for shard shard1
>    [junit4]   2> 1641902 INFO  (zkCallback-1317-thread-1-processing-n:127.0.0.1:62063_) [n:127.0.0.1:62063_    ] o.a.s.c.DistributedQueue NodeChildrenChanged fired on path /overseer/queue state SyncConnected
>    [junit4]   2> 1641903 INFO  (coreZkRegister-4269-thread-1-processing-n:127.0.0.1:62063_ x:collection1 s:shard1 c:control_collection r:core_node1) [n:127.0.0.1:62063_ c:control_collection s:shard1 r:core_node1 x:collection1] o.a.s.c.ShardLeaderElectionContext Enough replicas found to continue.
>    [junit4]   2> 1641903 INFO  (coreZkRegister-4269-thread-1-processing-n:127.0.0.1:62063_ x:collection1 s:shard1 c:control_collection r:core_node1) [n:127.0.0.1:62063_ c:control_collection s:shard1 r:core_node1 x:collection1] o.a.s.c.ShardLeaderElectionContext I may be the new leader - try and sync
>    [junit4]   2> 1641903 INFO  (coreZkRegister-4269-thread-1-processing-n:127.0.0.1:62063_ x:collection1 s:shard1 c:control_collection r:core_node1) [n:127.0.0.1:62063_ c:control_collection s:shard1 r:core_node1 x:collection1] o.a.s.c.SyncStrategy Sync replicas to http://127.0.0.1:62063/collection1/
>    [junit4]   2> 1641903 INFO  (coreZkRegister-4269-thread-1-processing-n:127.0.0.1:62063_ x:collection1 s:shard1 c:control_collection r:core_node1) [n:127.0.0.1:62063_ c:control_collection s:shard1 r:core_node1 x:collection1] o.a.s.c.SyncStrategy Sync Success - now sync replicas to me
>    [junit4]   2> 1641904 INFO  (coreZkRegister-4269-thread-1-processing-n:127.0.0.1:62063_ x:collection1 s:shard1 c:control_collection r:core_node1) [n:127.0.0.1:62063_ c:control_collection s:shard1 r:core_node1 x:collection1] o.a.s.c.SyncStrategy http://127.0.0.1:62063/collection1/ has no replicas
>    [junit4]   2> 1641904 INFO  (coreZkRegister-4269-thread-1-processing-n:127.0.0.1:62063_ x:collection1 s:shard1 c:control_collection r:core_node1) [n:127.0.0.1:62063_ c:control_collection s:shard1 r:core_node1 x:collection1] o.a.s.c.ShardLeaderElectionContext I am the new leader: http://127.0.0.1:62063/collection1/ shard1
>    [junit4]   2> 1641904 INFO  (coreZkRegister-4269-thread-1-processing-n:127.0.0.1:62063_ x:collection1 s:shard1 c:control_collection r:core_node1) [n:127.0.0.1:62063_ c:control_collection s:shard1 r:core_node1 x:collection1] o.a.s.c.c.SolrZkClient makePath: /collections/control_collection/leaders/shard1
>    [junit4]   2> 1641904 INFO  (OverseerStateUpdate-94269195336941572-127.0.0.1:62063_-n_0000000000) [n:127.0.0.1:62063_    ] o.a.s.c.Overseer processMessage: queueSize: 1, message = {
>    [junit4]   2>   "operation":"leader",
>    [junit4]   2>   "shard":"shard1",
>    [junit4]   2>   "collection":"control_collection"} current state version: 1
>    [junit4]   2> 1641916 INFO  (zkCallback-1317-thread-1-processing-n:127.0.0.1:62063_) [n:127.0.0.1:62063_    ] o.a.s.c.DistributedQueue NodeChildrenChanged fired on path /overseer/queue state SyncConnected
>    [junit4]   2> 1641918 INFO  (OverseerStateUpdate-94269195336941572-127.0.0.1:62063_-n_0000000000) [n:127.0.0.1:62063_    ] o.a.s.c.Overseer processMessage: queueSize: 1, message = {
>    [junit4]   2>   "operation":"leader",
>    [junit4]   2>   "shard":"shard1",
>    [junit4]   2>   "collection":"control_collection",
>    [junit4]   2>   "base_url":"http://127.0.0.1:62063",
>    [junit4]   2>   "core":"collection1",
>    [junit4]   2>   "state":"active"} current state version: 1
>    [junit4]   2> 1642024 INFO  (zkCallback-1317-thread-1-processing-n:127.0.0.1:62063_) [n:127.0.0.1:62063_    ] o.a.s.c.c.ZkStateReader A cluster state change: WatchedEvent state:SyncConnected type:NodeDataChanged path:/clusterstate.json, has occurred - updating... (live nodes size: 1)
>    [junit4]   2> 1642027 INFO  (zkCallback-1317-thread-1-processing-n:127.0.0.1:62063_) [n:127.0.0.1:62063_    ] o.a.s.c.c.ZkStateReader Updated cluster state version to 2
>    [junit4]   2> 1642071 INFO  (coreZkRegister-4269-thread-1-processing-n:127.0.0.1:62063_ x:collection1 s:shard1 c:control_collection r:core_node1) [n:127.0.0.1:62063_ c:control_collection s:shard1 r:core_node1 x:collection1] o.a.s.c.ZkController We are http://127.0.0.1:62063/collection1/ and leader is http://127.0.0.1:62063/collection1/
>    [junit4]   2> 1642071 INFO  (coreZkRegister-4269-thread-1-processing-n:127.0.0.1:62063_ x:collection1 s:shard1 c:control_collection r:core_node1) [n:127.0.0.1:62063_ c:control_collection s:shard1 r:core_node1 x:collection1] o.a.s.c.ZkController No LogReplay needed for core=collection1 baseURL=http://127.0.0.1:62063
>    [junit4]   2> 1642071 INFO  (coreZkRegister-4269-thread-1-processing-n:127.0.0.1:62063_ x:collection1 s:shard1 c:control_collection r:core_node1) [n:127.0.0.1:62063_ c:control_collection s:shard1 r:core_node1 x:collection1] o.a.s.c.ZkController I am the leader, no recovery necessary
>    [junit4]   2> 1642071 INFO  (coreZkRegister-4269-thread-1-processing-n:127.0.0.1:62063_ x:collection1 s:shard1 c:control_collection r:core_node1) [n:127.0.0.1:62063_ c:control_collection s:shard1 r:core_node1 x:collection1] o.a.s.c.ZkController publishing state=active
>    [junit4]   2> 1642071 INFO  (coreZkRegister-4269-thread-1-processing-n:127.0.0.1:62063_ x:collection1 s:shard1 c:control_collection r:core_node1) [n:127.0.0.1:62063_ c:control_collection s:shard1 r:core_node1 x:collection1] o.a.s.c.ZkController numShards not found on descriptor - reading it from system property
>    [junit4]   2> 1642073 INFO  (zkCallback-1317-thread-1-processing-n:127.0.0.1:62063_) [n:127.0.0.1:62063_    ] o.a.s.c.DistributedQueue NodeChildrenChanged fired on path /overseer/queue state SyncConnected
>    [junit4]   2> 1642075 INFO  (OverseerStateUpdate-94269195336941572-127.0.0.1:62063_-n_0000000000) [n:127.0.0.1:62063_    ] o.a.s.c.Overseer processMessage: queueSize: 1, message = {
>    [junit4]   2>   "core":"collection1",
>    [junit4]   2>   "core_node_name":"core_node1",
>    [junit4]   2>   "roles":null,
>    [junit4]   2>   "base_url":"http://127.0.0.1:62063",
>    [junit4]   2>   "node_name":"127.0.0.1:62063_",
>    [junit4]   2>   "numShards":"1",
>    [junit4]   2>   "state":"active",
>    [junit4]   2>   "shard":"shard1",
>    [junit4]   2>   "collection":"control_collection",
>    [junit4]   2>   "operation":"state"} current state version: 2
>    [junit4]   2> 1642076 INFO  (OverseerStateUpdate-94269195336941572-127.0.0.1:62063_-n_0000000000) [n:127.0.0.1:62063_    ] o.a.s.c.o.ReplicaMutator Update state numShards=1 message={
>    [junit4]   2>   "core":"collection1",
>    [junit4]   2>   "core_node_name":"core_node1",
>    [junit4]   2>   "roles":null,
>    [junit4]   2>   "base_url":"http://127.0.0.1:62063",
>    [junit4]   2>   "node_name":"127.0.0.1:62063_",
>    [junit4]   2>   "numShards":"1",
>    [junit4]   2>   "state":"active",
>    [junit4]   2>   "shard":"shard1",
>    [junit4]   2>   "collection":"control_collection",
>    [junit4]   2>   "operation":"state"}
>    [junit4]   2> 1642182 INFO  (zkCallback-1317-thread-1-processing-n:127.0.0.1:62063_) [n:127.0.0.1:62063_    ] o.a.s.c.c.ZkStateReader A cluster state change: WatchedEvent state:SyncConnected type:NodeDataChanged path:/clusterstate.json, has occurred - updating... (live nodes size: 1)
>    [junit4]   2> 1642184 INFO  (zkCallback-1317-thread-1-processing-n:127.0.0.1:62063_) [n:127.0.0.1:62063_    ] o.a.s.c.c.ZkStateReader Updated cluster state version to 3
>    [junit4]   2> 1642203 INFO  (TEST-BasicDistributedZk2Test.test-seed#[FDD716235CED2808]) [    ] o.a.s.c.c.SolrZkClient Using default ZkCredentialsProvider
>    [junit4]   2> 1642204 INFO  (TEST-BasicDistributedZk2Test.test-seed#[FDD716235CED2808]) [    ] o.a.s.c.c.ConnectionManager Waiting for client to connect to ZooKeeper
>    [junit4]   2> 1642205 INFO  (zkCallback-1319-thread-1) [    ] o.a.s.c.c.ConnectionManager Watcher org.apache.solr.common.cloud.ConnectionManager@3920906b name:ZooKeeperConnection Watcher:127.0.0.1:62045/solr got event WatchedEvent state:SyncConnected type:None path:null path:null type:None
>    [junit4]   2> 1642205 INFO  (TEST-BasicDistributedZk2Test.test-seed#[FDD716235CED2808]) [    ] o.a.s.c.c.ConnectionManager Client is connected to ZooKeeper
>    [junit4]   2> 1642206 INFO  (TEST-BasicDistributedZk2Test.test-seed#[FDD716235CED2808]) [    ] o.a.s.c.c.SolrZkClient Using default ZkACLProvider
>    [junit4]   2> 1642206 INFO  (TEST-BasicDistributedZk2Test.test-seed#[FDD716235CED2808]) [    ] o.a.s.c.c.ZkStateReader Updating cluster state from ZooKeeper...
>    [junit4]   2> 1642212 INFO  (TEST-BasicDistributedZk2Test.test-seed#[FDD716235CED2808]) [    ] o.a.s.c.ChaosMonkey monkey: init - expire sessions:false cause connection loss:false
>    [junit4]   2> 1642499 INFO  (TEST-BasicDistributedZk2Test.test-seed#[FDD716235CED2808]) [    ] o.a.s.SolrTestCaseJ4 Writing core.properties file to /Users/jenkins/workspace/Lucene-Solr-trunk-MacOSX/solr/build/solr-core/test/J0/temp/solr.cloud.BasicDistributedZk2Test_FDD716235CED2808-001/shard-1-001/cores/collection1
>    [junit4]   2> 1642501 INFO  (TEST-BasicDistributedZk2Test.test-seed#[FDD716235CED2808]) [    ] o.a.s.c.AbstractFullDistribZkTestBase create jetty 1 in directory /Users/jenkins/workspace/Lucene-Solr-trunk-MacOSX/solr/build/solr-core/test/J0/temp/solr.cloud.BasicDistributedZk2Test_FDD716235CED2808-001/shard-1-001
>    [junit4]   2> 1642502 INFO  (TEST-BasicDistributedZk2Test.test-seed#[FDD716235CED2808]) [    ] o.e.j.s.Server jetty-9.2.11.v20150529
>    [junit4]   2> 1642505 INFO  (TEST-BasicDistributedZk2Test.test-seed#[FDD716235CED2808]) [    ] o.e.j.s.h.ContextHandler Started o.e.j.s.ServletContextHandler@522b1a76{/,null,AVAILABLE}
>    [junit4]   2> 1642506 INFO  (TEST-BasicDistributedZk2Test.test-seed#[FDD716235CED2808]) [    ] o.e.j.s.ServerConnector Started ServerConnector@1e8ff707{HTTP/1.1}{127.0.0.1:62071}
>    [junit4]   2> 1642506 INFO  (TEST-BasicDistributedZk2Test.test-seed#[FDD716235CED2808]) [    ] o.e.j.s.Server Started @1646422ms
>    [junit4]   2> 1642506 INFO  (TEST-BasicDistributedZk2Test.test-seed#[FDD716235CED2808]) [    ] o.a.s.c.s.e.JettySolrRunner Jetty properties: {solr.data.dir=/Users/jenkins/workspace/Lucene-Solr-trunk-MacOSX/solr/build/solr-core/test/J0/temp/solr.cloud.BasicDistributedZk2Test_FDD716235CED2808-001/tempDir-001/jetty1, solrconfig=solrconfig.xml, hostContext=/, hostPort=62071, coreRootDirectory=/Users/jenkins/workspace/Lucene-Solr-trunk-MacOSX/solr/build/solr-core/test/J0/temp/solr.cloud.BasicDistributedZk2Test_FDD716235CED2808-001/shard-1-001/cores}
>    [junit4]   2> 1642507 INFO  (TEST-BasicDistributedZk2Test.test-seed#[FDD716235CED2808]) [    ] o.a.s.s.SolrDispatchFilter SolrDispatchFilter.init(): sun.misc.Launcher$AppClassLoader@74a14482
>    [junit4]   2> 1642507 INFO  (TEST-BasicDistributedZk2Test.test-seed#[FDD716235CED2808]) [    ] o.a.s.c.SolrResourceLoader new SolrResourceLoader for directory: '/Users/jenkins/workspace/Lucene-Solr-trunk-MacOSX/solr/build/solr-core/test/J0/temp/solr.cloud.BasicDistributedZk2Test_FDD716235CED2808-001/shard-1-001/'
>    [junit4]   2> 1642535 INFO  (TEST-BasicDistributedZk2Test.test-seed#[FDD716235CED2808]) [    ] o.a.s.c.c.SolrZkClient Using default ZkCredentialsProvider
>    [junit4]   2> 1642538 INFO  (TEST-BasicDistributedZk2Test.test-seed#[FDD716235CED2808]) [    ] o.a.s.c.c.ConnectionManager Waiting for client to connect to ZooKeeper
>    [junit4]   2> 1642541 INFO  (zkCallback-1320-thread-1) [    ] o.a.s.c.c.ConnectionManager Watcher org.apache.solr.common.cloud.ConnectionManager@5cd9e5fe name:ZooKeeperConnection Watcher:127.0.0.1:62045/solr got event WatchedEvent state:SyncConnected type:None path:null path:null type:None
>    [junit4]   2> 1642542 INFO  (TEST-BasicDistributedZk2Test.test-seed#[FDD716235CED2808]) [    ] o.a.s.c.c.ConnectionManager Client is connected to ZooKeeper
>    [junit4]   2> 1642542 INFO  (TEST-BasicDistributedZk2Test.test-seed#[FDD716235CED2808]) [    ] o.a.s.c.c.SolrZkClient Using default ZkACLProvider
>    [junit4]   2> 1642544 INFO  (TEST-BasicDistributedZk2Test.test-seed#[FDD716235CED2808]) [    ] o.a.s.s.SolrDispatchFilter Loading solr.xml from SolrHome (not found in ZooKeeper)
>    [junit4]   2> 1642544 INFO  (TEST-BasicDistributedZk2Test.test-seed#[FDD716235CED2808]) [    ] o.a.s.c.SolrXmlConfig Loading container configuration from /Users/jenkins/workspace/Lucene-Solr-trunk-MacOSX/solr/build/solr-core/test/J0/temp/solr.cloud.BasicDistributedZk2Test_FDD716235CED2808-001/shard-1-001/solr.xml
>    [junit4]   2> 1642553 INFO  (TEST-BasicDistributedZk2Test.test-seed#[FDD716235CED2808]) [    ] o.a.s.c.CoresLocator Config-defined core root directory: /Users/jenkins/workspace/Lucene-Solr-trunk-MacOSX/solr/build/solr-core/test/J0/temp/solr.cloud.BasicDistributedZk2Test_FDD716235CED2808-001/shard-1-001/cores
>    [junit4]   2> 1642553 INFO  (TEST-BasicDistributedZk2Test.test-seed#[FDD716235CED2808]) [    ] o.a.s.c.CoreContainer New CoreContainer 1393063351
>    [junit4]   2> 1642554 INFO  (TEST-BasicDistributedZk2Test.test-seed#[FDD716235CED2808]) [    ] o.a.s.c.CoreContainer Loading cores into CoreContainer [instanceDir=/Users/jenkins/workspace/Lucene-Solr-trunk-MacOSX/solr/build/solr-core/test/J0/temp/solr.cloud.BasicDistributedZk2Test_FDD716235CED2808-001/shard-1-001/]
>    [junit4]   2> 1642554 INFO  (TEST-BasicDistributedZk2Test.test-seed#[FDD716235CED2808]) [    ] o.a.s.c.CoreContainer loading shared library: /Users/jenkins/workspace/Lucene-Solr-trunk-MacOSX/solr/build/solr-core/test/J0/temp/solr.cloud.BasicDistributedZk2Test_FDD716235CED2808-001/shard-1-001/lib
>    [junit4]   2> 1642554 WARN  (TEST-BasicDistributedZk2Test.test-seed#[FDD716235CED2808]) [    ] o.a.s.c.SolrResourceLoader Can't find (or read) directory to add to classloader: lib (resolved as: /Users/jenkins/workspace/Lucene-Solr-trunk-MacOSX/solr/build/solr-core/test/J0/temp/solr.cloud.BasicDistributedZk2Test_FDD716235CED2808-001/shard-1-001/lib).
>    [junit4]   2> 1642563 INFO  (TEST-BasicDistributedZk2Test.test-seed#[FDD716235CED2808]) [    ] o.a.s.h.c.HttpShardHandlerFactory created with socketTimeout : 90000,urlScheme : ,connTimeout : 15000,maxConnectionsPerHost : 20,maxConnections : 10000,corePoolSize : 0,maximumPoolSize : 2147483647,maxThreadIdleTime : 5,sizeOfQueue : -1,fairnessPolicy : false,useRetries : false,
>    [junit4]   2> 1642566 INFO  (TEST-BasicDistributedZk2Test.test-seed#[FDD716235CED2808]) [    ] o.a.s.u.UpdateShardHandler Creating UpdateShardHandler HTTP client with params: socketTimeout=340000&connTimeout=45000&retry=true
>    [junit4]   2> 1642567 INFO  (TEST-BasicDistributedZk2Test.test-seed#[FDD716235CED2808]) [    ] o.a.s.l.LogWatcher SLF4J impl is org.slf4j.impl.Log4jLoggerFactory
>    [junit4]   2> 1642567 INFO  (TEST-BasicDistributedZk2Test.test-seed#[FDD716235CED2808]) [    ] o.a.s.l.LogWatcher Registering Log Listener [Log4j (org.slf4j.impl.Log4jLoggerFactory)]
>    [junit4]   2> 1642567 INFO  (TEST-BasicDistributedZk2Test.test-seed#[FDD716235CED2808]) [    ] o.a.s.c.ZkContainer Zookeeper client=127.0.0.1:62045/solr
>    [junit4]   2> 1642567 INFO  (TEST-BasicDistributedZk2Test.test-seed#[FDD716235CED2808]) [    ] o.a.s.c.ZkController zkHost includes chroot
>    [junit4]   2> 1642568 INFO  (TEST-BasicDistributedZk2Test.test-seed#[FDD716235CED2808]) [    ] o.a.s.c.c.SolrZkClient Using default ZkCredentialsProvider
>    [junit4]   2> 1642569 INFO  (TEST-BasicDistributedZk2Test.test-seed#[FDD716235CED2808]) [    ] o.a.s.c.c.ConnectionManager Waiting for client to connect to ZooKeeper
>    [junit4]   2> 1642570 INFO  (zkCallback-1322-thread-1) [    ] o.a.s.c.c.ConnectionManager Watcher org.apache.solr.common.cloud.ConnectionManager@350a81a2 name:ZooKeeperConnection Watcher:127.0.0.1:62045 got event WatchedEvent state:SyncConnected type:None path:null path:null type:None
>    [junit4]   2> 1642571 INFO  (TEST-BasicDistributedZk2Test.test-seed#[FDD716235CED2808]) [    ] o.a.s.c.c.ConnectionManager Client is connected to ZooKeeper
>    [junit4]   2> 1642572 INFO  (TEST-BasicDistributedZk2Test.test-seed#[FDD716235CED2808]) [    ] o.a.s.c.c.SolrZkClient Using default ZkACLProvider
>    [junit4]   2> 1642574 INFO  (TEST-BasicDistributedZk2Test.test-seed#[FDD716235CED2808]) [n:127.0.0.1:62071_    ] o.a.s.c.c.ConnectionManager Waiting for client to connect to ZooKeeper
>    [junit4]   2> 1642576 INFO  (zkCallback-1323-thread-1-processing-n:127.0.0.1:62071_) [n:127.0.0.1:62071_    ] o.a.s.c.c.ConnectionManager Watcher org.apache.solr.common.cloud.ConnectionManager@6741ced5 name:ZooKeeperConnection Watcher:127.0.0.1:62045/solr got event WatchedEvent state:SyncConnected type:None path:null path:null type:None
>    [junit4]   2> 1642576 INFO  (TEST-BasicDistributedZk2Test.test-seed#[FDD716235CED2808]) [n:127.0.0.1:62071_    ] o.a.s.c.c.ConnectionManager Client is connected to ZooKeeper
>    [junit4]   2> 1642585 INFO  (TEST-BasicDistributedZk2Test.test-seed#[FDD716235CED2808]) [n:127.0.0.1:62071_    ] o.a.s.c.c.ZkStateReader Updating cluster state from ZooKeeper...
>    [junit4]   2> 1643594 INFO  (TEST-BasicDistributedZk2Test.test-seed#[FDD716235CED2808]) [n:127.0.0.1:62071_    ] o.a.s.c.ZkController Register node as live in ZooKeeper:/live_nodes/127.0.0.1:62071_
>    [junit4]   2> 1643595 INFO  (TEST-BasicDistributedZk2Test.test-seed#[FDD716235CED2808]) [n:127.0.0.1:62071_    ] o.a.s.c.c.SolrZkClient makePath: /live_nodes/127.0.0.1:62071_
>    [junit4]   2> 1643600 INFO  (TEST-BasicDistributedZk2Test.test-seed#[FDD716235CED2808]) [n:127.0.0.1:62071_    ] o.a.s.c.Overseer Overseer (id=null) closing
>    [junit4]   2> 1643601 INFO  (TEST-BasicDistributedZk2Test.test-seed#[FDD716235CED2808]) [n:127.0.0.1:62071_    ] o.a.s.c.LeaderElector Joined leadership election with path: /overseer_elect/election/94269195336941576-127.0.0.1:62071_-n_0000000001
>    [junit4]   2> 1643602 INFO  (TEST-BasicDistributedZk2Test.test-seed#[FDD716235CED2808]) [n:127.0.0.1:62071_    ] o.a.s.c.LeaderElector Watching path /overseer_elect/election/94269195336941572-127.0.0.1:62063_-n_0000000000 to know if I could be the leader
>    [junit4]   2> 1643603 INFO  (TEST-BasicDistributedZk2Test.test-seed#[FDD716235CED2808]) [n:127.0.0.1:62071_    ] o.a.s.c.CoreContainer No authentication plugin used.
>    [junit4]   2> 1643604 INFO  (TEST-BasicDistributedZk2Test.test-seed#[FDD716235CED2808]) [n:127.0.0.1:62071_    ] o.a.s.c.CoreContainer Security conf doesn't exist. Skipping setup for authorization module.
>    [junit4]   2> 1643605 INFO  (TEST-BasicDistributedZk2Test.test-seed#[FDD716235CED2808]) [n:127.0.0.1:62071_    ] o.a.s.c.CoresLocator Looking for core definitions underneath /Users/jenkins/workspace/Lucene-Solr-trunk-MacOSX/solr/build/solr-core/test/J0/temp/solr.cloud.BasicDistributedZk2Test_FDD716235CED2808-001/shard-1-001/cores
>    [junit4]   2> 1643607 INFO  (TEST-BasicDistributedZk2Test.test-seed#[FDD716235CED2808]) [n:127.0.0.1:62071_    ] o.a.s.c.SolrCore Created CoreDescriptor: {name=collection1, config=solrconfig.xml, transient=false, schema=schema.xml, loadOnStartup=true, configSetProperties=configsetprops.json, instanceDir=/Users/jenkins/workspace/Lucene-Solr-trunk-MacOSX/solr/build/solr-core/test/J0/temp/solr.cloud.BasicDistributedZk2Test_FDD716235CED2808-001/shard-1-001/cores/collection1, collection=collection1, absoluteInstDir=/Users/jenkins/workspace/Lucene-Solr-trunk-MacOSX/solr/build/solr-core/test/J0/temp/solr.cloud.BasicDistributedZk2Test_FDD716235CED2808-001/shard-1-001/cores/collection1/, coreNodeName=, dataDir=data/, shard=}
>    [junit4]   2> 1643607 INFO  (TEST-BasicDistributedZk2Test.test-seed#[FDD716235CED2808]) [n:127.0.0.1:62071_    ] o.a.s.c.CoresLocator Found core collection1 in /Users/jenkins/workspace/Lucene-Solr-trunk-MacOSX/solr/build/solr-core/test/J0/temp/solr.cloud.BasicDistributedZk2Test_FDD716235CED2808-001/shard-1-001/cores/collection1/
>    [junit4]   2> 1643607 INFO  (TEST-BasicDistributedZk2Test.test-seed#[FDD716235CED2808]) [n:127.0.0.1:62071_    ] o.a.s.c.CoresLocator Found 1 core definitions
>    [junit4]   2> 1643609 INFO  (coreLoadExecutor-4286-thread-1-processing-n:127.0.0.1:62071_) [n:127.0.0.1:62071_ c:collection1   x:collection1] o.a.s.c.ZkController publishing state=down
>    [junit4]   2> 1643609 INFO  (coreLoadExecutor-4286-thread-1-processing-n:127.0.0.1:62071_) [n:127.0.0.1:62071_ c:collection1   x:collection1] o.a.s.c.ZkController numShards not found on descriptor - reading it from system property
>    [junit4]   2> 1643609 INFO  (TEST-BasicDistributedZk2Test.test-seed#[FDD716235CED2808]) [n:127.0.0.1:62071_    ] o.a.s.s.SolrDispatchFilter user.dir=/Users/jenkins/workspace/Lucene-Solr-trunk-MacOSX/solr/build/solr-core/test/J0
>    [junit4]   2> 1643609 INFO  (TEST-BasicDistributedZk2Test.test-seed#[FDD716235CED2808]) [n:127.0.0.1:62071_    ] o.a.s.s.SolrDispatchFilter SolrDispatchFilter.init() done
>    [junit4]   2> 1643610 INFO  (coreLoadExecutor-4286-thread-1-processing-n:127.0.0.1:62071_) [n:127.0.0.1:62071_ c:collection1   x:collection1] o.a.s.c.ZkController look for our core node name
>    [junit4]   2> 1643610 INFO  (zkCallback-1317-thread-1-processing-n:127.0.0.1:62063_) [n:127.0.0.1:62063_    ] o.a.s.c.DistributedQueue NodeChildrenChanged fired on path /overseer/queue state SyncConnected
>    [junit4]   2> 1643611 INFO  (OverseerStateUpdate-94269195336941572-127.0.0.1:62063_-n_0000000000) [n:127.0.0.1:62063_    ] o.a.s.c.Overseer processMessage: queueSize: 1, message = {
>    [junit4]   2>   "core":"collection1",
>    [junit4]   2>   "roles":null,
>    [junit4]   2>   "base_url":"http://127.0.0.1:62071",
>    [junit4]   2>   "node_name":"127.0.0.1:62071_",
>    [junit4]   2>   "numShards":"2",
>    [junit4]   2>   "state":"down",
>    [junit4]   2>   "shard":null,
>    [junit4]   2>   "collection":"collection1",
>    [junit4]   2>   "operation":"state"} current state version: 3
>    [junit4]   2> 1643612 INFO  (OverseerStateUpdate-94269195336941572-127.0.0.1:62063_-n_0000000000) [n:127.0.0.1:62063_    ] o.a.s.c.o.ReplicaMutator Update state numShards=2 message={
>    [junit4]   2>   "core":"collection1",
>    [junit4]   2>   "roles":null,
>    [junit4]   2>   "base_url":"http://127.0.0.1:62071",
>    [junit4]   2>   "node_name":"127.0.0.1:62071_",
>    [junit4]   2>   "numShards":"2",
>    [junit4]   2>   "state":"down",
>    [junit4]   2>   "shard":null,
>    [junit4]   2>   "collection":"collection1",
>    [junit4]   2>   "operation":"state"}
>    [junit4]   2> 1643612 INFO  (OverseerStateUpdate-94269195336941572-127.0.0.1:62063_-n_0000000000) [n:127.0.0.1:62063_    ] o.a.s.c.o.ClusterStateMutator building a new cName: collection1
>    [junit4]   2> 1643613 INFO  (OverseerStateUpdate-94269195336941572-127.0.0.1:62063_-n_0000000000) [n:127.0.0.1:62063_    ] o.a.s.c.o.ReplicaMutator Assigning new node to shard shard=shard2
>    [junit4]   2> 1643720 INFO  (zkCallback-1319-thread-1) [    ] o.a.s.c.c.ZkStateReader A cluster state change: WatchedEvent state:SyncConnected type:NodeDataChanged path:/clusterstate.json, has occurred - updating... (live nodes size: 2)
>    [junit4]   2> 1643720 INFO  (zkCallback-1323-thread-1-processing-n:127.0.0.1:62071_) [n:127.0.0.1:62071_    ] o.a.s.c.c.ZkStateReader A cluster state change: WatchedEvent state:SyncConnected type:NodeDataChanged path:/clusterstate.json, has occurred - updating... (live nodes size: 2)
>    [junit4]   2> 1643721 INFO  (zkCallback-1317-thread-1-processing-n:127.0.0.1:62063_) [n:127.0.0.1:62063_    ] o.a.s.c.c.ZkStateReader A cluster state change: WatchedEvent state:SyncConnected type:NodeDataChanged path:/clusterstate.json, has occurred - updating... (live nodes size: 2)
>    [junit4]   2> 1643724 INFO  (zkCallback-1319-thread-1) [    ] o.a.s.c.c.ZkStateReader Updated cluster state version to 4
>    [junit4]   2> 1643724 INFO  (zkCallback-1323-thread-1-processing-n:127.0.0.1:62071_) [n:127.0.0.1:62071_    ] o.a.s.c.c.ZkStateReader Updated cluster state version to 4
>    [junit4]   2> 1643726 INFO  (zkCallback-1317-thread-1-processing-n:127.0.0.1:62063_) [n:127.0.0.1:62063_    ] o.a.s.c.c.ZkStateReader Updated cluster state version to 4
>    [junit4]   2> 1644614 INFO  (coreLoadExecutor-4286-thread-1-processing-n:127.0.0.1:62071_) [n:127.0.0.1:62071_ c:collection1   x:collection1] o.a.s.c.ZkController waiting to find shard id in clusterstate for collection1
>    [junit4]   2> 1644614 INFO  (coreLoadExecutor-4286-thread-1-processing-n:127.0.0.1:62071_) [n:127.0.0.1:62071_ c:collection1   x:collection1] o.a.s.c.ZkController Check for collection zkNode:collection1
>    [junit4]   2> 1644615 INFO  (coreLoadExecutor-4286-thread-1-processing-n:127.0.0.1:62071_) [n:127.0.0.1:62071_ c:collection1   x:collection1] o.a.s.c.ZkController Collection zkNode exists
>    [junit4]   2> 1644615 INFO  (coreLoadExecutor-4286-thread-1-processing-n:127.0.0.1:62071_) [n:127.0.0.1:62071_ c:collection1   x:collection1] o.a.s.c.c.ZkStateReader Load collection config from:/collections/collection1
>    [junit4]   2> 1644616 INFO  (coreLoadExecutor-4286-thread-1-processing-n:127.0.0.1:62071_) [n:127.0.0.1:62071_ c:collection1   x:collection1] o.a.s.c.c.ZkStateReader path=/collections/collection1 configName=conf1 specified config exists in ZooKeeper
>    [junit4]   2> 1644617 INFO  (coreLoadExecutor-4286-thread-1-processing-n:127.0.0.1:62071_) [n:127.0.0.1:62071_ c:collection1   x:collection1] o.a.s.c.SolrResourceLoader new SolrResourceLoader for directory: '/Users/jenkins/workspace/Lucene-Solr-trunk-MacOSX/solr/build/solr-core/test/J0/temp/solr.cloud.BasicDistributedZk2Test_FDD716235CED2808-001/shard-1-001/cores/collection1/'
>    [junit4]   2> 1644635 INFO  (coreLoadExecutor-4286-thread-1-processing-n:127.0.0.1:62071_) [n:127.0.0.1:62071_ c:collection1   x:collection1] o.a.s.c.Config loaded config solrconfig.xml with version 0
>    [junit4]   2> 1644641 INFO  (coreLoadExecutor-4286-thread-1-processing-n:127.0.0.1:62071_) [n:127.0.0.1:62071_ c:collection1   x:collection1] o.a.s.c.SolrConfig current version of requestparams : -1
>    [junit4]   2> 1644644 INFO  (coreLoadExecutor-4286-thread-1-processing-n:127.0.0.1:62071_) [n:127.0.0.1:62071_ c:collection1   x:collection1] o.a.s.c.SolrConfig Using Lucene MatchVersion: 6.0.0
>    [junit4]   2> 1644649 INFO  (coreLoadExecutor-4286-thread-1-processing-n:127.0.0.1:62071_) [n:127.0.0.1:62071_ c:collection1   x:collection1] o.a.s.c.Config Loaded SolrConfig: solrconfig.xml
>    [junit4]   2> 1644650 INFO  (coreLoadExecutor-4286-thread-1-processing-n:127.0.0.1:62071_) [n:127.0.0.1:62071_ c:collection1   x:collection1] o.a.s.s.IndexSchema Reading Solr Schema from /configs/conf1/schema.xml
>    [junit4]   2> 1644654 INFO  (coreLoadExecutor-4286-thread-1-processing-n:127.0.0.1:62071_) [n:127.0.0.1:62071_ c:collection1   x:collection1] o.a.s.s.IndexSchema [collection1] Schema name=test
>    [junit4]   2> 1644759 INFO  (coreLoadExecutor-4286-thread-1-processing-n:127.0.0.1:62071_) [n:127.0.0.1:62071_ c:collection1   x:collection1] o.a.s.s.OpenExchangeRatesOrgProvider Initialized with rates=open-exchange-rates.json, refreshInterval=1440.
>    [junit4]   2> 1644768 INFO  (coreLoadExecutor-4286-thread-1-processing-n:127.0.0.1:62071_) [n:127.0.0.1:62071_ c:collection1   x:collection1] o.a.s.s.IndexSchema default search field in schema is text
>    [junit4]   2> 1644769 INFO  (coreLoadExecutor-4286-thread-1-processing-n:127.0.0.1:62071_) [n:127.0.0.1:62071_ c:collection1   x:collection1] o.a.s.s.IndexSchema unique key
>
> [...truncated too long message...]
>
> D716235CED2808]) [    ] o.e.j.s.ServerConnector Stopped ServerConnector@3b815c57{HTTP/1.1}{127.0.0.1:0}
>    [junit4]   2> 2277303 INFO  (TEST-CloudExitableDirectoryReaderTest.test-seed#[FDD716235CED2808]) [    ] o.e.j.s.h.ContextHandler Stopped o.e.j.s.ServletContextHandler@5b1e251b{/,null,UNAVAILABLE}
>    [junit4]   2> 2277305 INFO  (TEST-CloudExitableDirectoryReaderTest.test-seed#[FDD716235CED2808]) [n:127.0.0.1:63716_ c:collection1 s:shard1 r:core_node4 x:collection1] o.a.s.c.ZkTestServer connecting to 127.0.0.1:63667 63667
>    [junit4]   2> 2277406 INFO  (Thread-4372) [    ] o.a.s.c.ZkTestServer connecting to 127.0.0.1:63667 63667
>    [junit4]   2> 2278459 WARN  (Thread-4372) [    ] o.a.s.c.ZkTestServer Watch limit violations:
>    [junit4]   2> Maximum concurrent create/delete watches above limit:
>    [junit4]   2>
>    [junit4]   2>        6       /solr/aliases.json
>    [junit4]   2>        6       /solr/clusterstate.json
>    [junit4]   2>        5       /solr/configs/conf1
>    [junit4]   2>
>    [junit4]   2> Maximum concurrent children watches above limit:
>    [junit4]   2>
>    [junit4]   2>        6       /solr/live_nodes
>    [junit4]   2>        3       /solr/overseer/collection-queue-work
>    [junit4]   2>        2       /solr/overseer/queue
>    [junit4]   2>
>    [junit4]   2> NOTE: reproduce with: ant test  -Dtestcase=CloudExitableDirectoryReaderTest -Dtests.method=test -Dtests.seed=FDD716235CED2808 -Dtests.slow=true -Dtests.locale=en_GB -Dtests.timezone=Antarctica/McMurdo -Dtests.asserts=true -Dtests.file.encoding=UTF-8
>    [junit4] ERROR   28.4s J1 | CloudExitableDirectoryReaderTest.test <<<
>    [junit4]    > Throwable #1: org.apache.solr.client.solrj.SolrServerException: No live SolrServers available to handle this request
>    [junit4]    >        at __randomizedtesting.SeedInfo.seed([FDD716235CED2808:758329F9F21145F0]:0)
>    [junit4]    >        at org.apache.solr.client.solrj.impl.LBHttpSolrClient.request(LBHttpSolrClient.java:353)
>    [junit4]    >        at org.apache.solr.client.solrj.impl.CloudSolrClient.sendRequest(CloudSolrClient.java:1086)
>    [junit4]    >        at org.apache.solr.client.solrj.impl.CloudSolrClient.requestWithRetryOnStaleState(CloudSolrClient.java:856)
>    [junit4]    >        at org.apache.solr.client.solrj.impl.CloudSolrClient.request(CloudSolrClient.java:799)
>    [junit4]    >        at org.apache.solr.client.solrj.SolrRequest.process(SolrRequest.java:135)
>    [junit4]    >        at org.apache.solr.client.solrj.SolrClient.query(SolrClient.java:943)
>    [junit4]    >        at org.apache.solr.client.solrj.SolrClient.query(SolrClient.java:958)
>    [junit4]    >        at org.apache.solr.cloud.AbstractFullDistribZkTestBase.queryServer(AbstractFullDistribZkTestBase.java:1376)
>    [junit4]    >        at org.apache.solr.cloud.CloudExitableDirectoryReaderTest.assertPartialResults(CloudExitableDirectoryReaderTest.java:102)
>    [junit4]    >        at org.apache.solr.cloud.CloudExitableDirectoryReaderTest.doTimeoutTests(CloudExitableDirectoryReaderTest.java:74)
>    [junit4]    >        at org.apache.solr.cloud.CloudExitableDirectoryReaderTest.test(CloudExitableDirectoryReaderTest.java:53)
>    [junit4]    >        at org.apache.solr.BaseDistributedSearchTestCase$ShardsRepeatRule$ShardsFixedStatement.callStatement(BaseDistributedSearchTestCase.java:966)
>    [junit4]    >        at org.apache.solr.BaseDistributedSearchTestCase$ShardsRepeatRule$ShardsStatement.evaluate(BaseDistributedSearchTestCase.java:941)
>    [junit4]    >        at java.lang.Thread.run(Thread.java:745)
>    [junit4]   2> 2278472 INFO  (SUITE-CloudExitableDirectoryReaderTest-seed#[FDD716235CED2808]-worker) [n:127.0.0.1:63716_ c:collection1 s:shard1 r:core_node4 x:collection1] o.a.s.SolrTestCaseJ4 ###deleteCore
>    [junit4]   2> NOTE: leaving temporary files on disk at: /Users/jenkins/workspace/Lucene-Solr-trunk-MacOSX/solr/build/solr-core/test/J1/temp/solr.cloud.CloudExitableDirectoryReaderTest_FDD716235CED2808-001
>    [junit4]   2> NOTE: test params are: codec=Asserting(Lucene53): {range_facet_l_dv=BlockTreeOrds(blocksize=128), _version_=FSTOrd50, multiDefault=PostingsFormat(name=MockRandom), name=BlockTreeOrds(blocksize=128), intDefault=FSTOrd50, id=BlockTreeOrds(blocksize=128), range_facet_i_dv=PostingsFormat(name=MockRandom), range_facet_l=PostingsFormat(name=MockRandom), timestamp=PostingsFormat(name=MockRandom)}, docValues:{range_facet_l_dv=DocValuesFormat(name=Asserting), range_facet_i_dv=DocValuesFormat(name=Lucene50), timestamp=DocValuesFormat(name=Lucene50)}, sim=DefaultSimilarity, locale=en_GB, timezone=Antarctica/McMurdo
>    [junit4]   2> NOTE: Mac OS X 10.8.5 x86_64/Oracle Corporation 1.8.0_51 (64-bit)/cpus=3,threads=1,free=103066576,total=482422784
>    [junit4]   2> NOTE: All tests run in this JVM: [DistributedTermsComponentTest, AnalyticsQueryTest, ExternalFileFieldSortTest, HdfsNNFailoverTest, DistributedQueryComponentOptimizationTest, TestDistributedGrouping, TestConfigSetProperties, CleanupOldIndexTest, DirectUpdateHandlerOptimizeTest, CollectionTooManyReplicasTest, UpdateParamsTest, TestRTGBase, MBeansHandlerTest, SolrCloudExampleTest, TestMissingGroups, CdcrReplicationDistributedZkTest, AtomicUpdatesTest, TestComplexPhraseQParserPlugin, OpenExchangeRatesOrgProviderTest, TestClusterStateMutator, SpatialFilterTest, BitVectorTest, TestRecoveryHdfs, TestRangeQuery, ResourceLoaderTest, TestLRUStatsCache, HdfsChaosMonkeySafeLeaderTest, UpdateRequestProcessorFactoryTest, SpellCheckCollatorTest, HighlighterMaxOffsetTest, TestSystemIdResolver, TestCodecSupport, CurrencyFieldOpenExchangeTest, TestCoreDiscovery, TestChildDocTransformer, MinimalSchemaTest, TestDefaultSimilarityFactory, OverseerCollectionProcessorTest, TestStressUserVersions, TestSolrQueryParserDefaultOperatorResource, TestJsonFacets, TestMiniSolrCloudCluster, TestFileDictionaryLookup, TestMiniSolrCloudClusterSSL, TestSolrCoreProperties, TestExactStatsCache, DateMathParserTest, DistribJoinFromCollectionTest, TestSolrJ, AutoCommitTest, TestFoldingMultitermQuery, TestManagedSynonymFilterFactory, ReturnFieldsTest, TestReplicaProperties, SmileWriterTest, LoggingHandlerTest, TestSchemaNameResource, IndexSchemaTest, AliasIntegrationTest, DisMaxRequestHandlerTest, FullHLLTest, TestConfigSetImmutable, CloudMLTQParserTest, TestNamedUpdateProcessors, TestSolrXml, TestCollectionAPI, TestAddFieldRealTimeGet, SuggesterTSTTest, TestMaxScoreQueryParser, CollectionReloadTest, RecoveryAfterSoftCommitTest, TermVectorComponentTest, SolrTestCaseJ4Test, CachingDirectoryFactoryTest, QueryParsingTest, DistanceUnitsTest, CollectionStateFormat2Test, ZkSolrClientTest, CollectionsAPIAsyncDistributedZkTest, TestDFRSimilarityFactory, TestLMJelinekMercerSimilarityFactory, TestDocSet, TestManagedResource, TestPivotHelperCode, DistribCursorPagingTest, TermsComponentTest, AssignTest, TestRealTimeGet, HdfsUnloadDistributedZkTest, ShardSplitTest, TestSchemaVersionResource, DateFieldTest, IndexBasedSpellCheckerTest, LeaderElectionIntegrationTest, DirectSolrSpellCheckerTest, TestFastOutputStream, TestFieldSortValues, FullSolrCloudDistribCmdsTest, SolrRequestParserTest, TestSolrDynamicMBean, TestMacros, TestLMDirichletSimilarityFactory, SchemaVersionSpecificBehaviorTest, TestConfigOverlay, TestSmileRequest, TestReversedWildcardFilterFactory, OpenCloseCoreStressTest, XsltUpdateRequestHandlerTest, CdcrReplicationHandlerTest, TestSuggestSpellingConverter, DistributedFacetPivotSmallAdvancedTest, TestNoOpRegenerator, HdfsThreadLeakTest, TestRemoteStreaming, DataDrivenBlockJoinTest, HdfsBasicDistributedZk2Test, TestDistributedStatsComponentCardinality, BinaryUpdateRequestHandlerTest, TestSolrDeletionPolicy2, CdcrVersionReplicationTest, TestHashQParserPlugin, TestFuzzyAnalyzedSuggestions, SuggestComponentTest, JavabinLoaderTest, SpatialRPTFieldTypeTest, TestOverriddenPrefixQueryForCustomFieldType, RegexBoostProcessorTest, TestHighlightDedupGrouping, TestScoreJoinQPNoScore, TestRandomDVFaceting, ShardRoutingCustomTest, TestFaceting, TestRecovery, TestHashPartitioner, ZkControllerTest, TestStressReorder, HardAutoCommitTest, TestCoreContainer, SimpleFacetsTest, StatsComponentTest, BadIndexSchemaTest, ConvertedLegacyTest, TestFiltering, BasicFunctionalityTest, TestBadConfig, SoftAutoCommitTest, SuggesterTest, TestTrie, PolyFieldTest, WordBreakSolrSpellCheckerTest, FieldMutatingUpdateProcessorTest, StatelessScriptUpdateProcessorFactoryTest, DebugComponentTest, TestSurroundQueryParser, StandardRequestHandlerTest, TestQueryTypes, PrimitiveFieldTypeTest, FileBasedSpellCheckerTest, RequestHandlersTest, TestValueSourceCache, TestIndexingPerformance, TestSolrQueryParser, SolrPluginUtilsTest, TestCollationField, JsonLoaderTest, CSVRequestHandlerTest, HighlighterConfigTest, AlternateDirectoryTest, TestQuerySenderNoQuery, ResponseLogComponentTest, TestStressRecovery, DistributedIntervalFacetingTest, AsyncMigrateRouteKeyTest, CloudExitableDirectoryReaderTest]
>    [junit4] Completed [412/529] on J1 in 28.43s, 1 test, 1 error <<< FAILURES!
>
> [...truncated 380 lines...]
> BUILD FAILED
> /Users/jenkins/workspace/Lucene-Solr-trunk-MacOSX/build.xml:716: The following error occurred while executing this line:
> /Users/jenkins/workspace/Lucene-Solr-trunk-MacOSX/build.xml:660: The following error occurred while executing this line:
> /Users/jenkins/workspace/Lucene-Solr-trunk-MacOSX/build.xml:59: The following error occurred while executing this line:
> /Users/jenkins/workspace/Lucene-Solr-trunk-MacOSX/solr/build.xml:230: The following error occurred while executing this line:
> /Users/jenkins/workspace/Lucene-Solr-trunk-MacOSX/solr/common-build.xml:514: The following error occurred while executing this line:
> /Users/jenkins/workspace/Lucene-Solr-trunk-MacOSX/lucene/common-build.xml:1429: The following error occurred while executing this line:
> /Users/jenkins/workspace/Lucene-Solr-trunk-MacOSX/lucene/common-build.xml:984: There were test failures: 529 suites, 2092 tests, 2 errors, 70 ignored (29 assumptions)
>
> Total time: 70 minutes 48 seconds
> Build step 'Invoke Ant' marked build as failure
> Archiving artifacts
> Recording test results
> Email was triggered for: Failure - Any
> Sending email for trigger: Failure - Any
>
>
>
>
> ---------------------------------------------------------------------
> To unsubscribe, e-mail: dev-unsubscribe@lucene.apache.org
> For additional commands, e-mail: dev-help@lucene.apache.org



-- 
Regards,
Shalin Shekhar Mangar.

---------------------------------------------------------------------
To unsubscribe, e-mail: dev-unsubscribe@lucene.apache.org
For additional commands, e-mail: dev-help@lucene.apache.org


Mime
View raw message